##TITLE=1H_DE-80H_X3
 200.13MHz, d2o
 8 sc
 
 19ns.26.2.2025
##JCAMPDX= 6.0         $$ Bruker NMR JCAMP-DX V2.0
##DATA TYPE= NMR FID
##DATA CLASS= NTUPLES
##ORIGIN= UXNMR, Bruker Analytische Messtechnik GmbH
##OWNER= pz
$$ XWIN-NMR		Version 3.5
$$ Wed Feb 11 10:52:43 2026 Russian Standard Time (UT+4h)  Yarkov@DPX200
##.OBSERVE FREQUENCY= 200.1313
##.OBSERVE NUCLEUS= ^1H
##.DELAY= (6, 6)
##.ACQUISITION MODE= SIMULTANEOUS
##.ACQUISITION SCHEME= undefined
##.AVERAGES= 8
##.DIGITISER RES= 18
##SPECTROMETER/DATA SYSTEM= spect
##.PULSE SEQUENCE= zg30
##.SOLVENT NAME= DMSO
##.SHIFT REFERENCE= (INTERNAL, DMSO, 0, 14.3821)
##AUDIT TRAIL= $$ (NUMBER, WHEN, WHO, WHERE, WHAT)
$$ ##TITLE= Audit trail, XWIN-NMR		Version 3.5
$$ ##JCAMPDX= 5.01
$$ ##ORIGIN= Bruker BioSpin GmbH
$$ ##OWNER= Yarkov
$$ C:/Bruker/XWIN-NMR/data/yarkov2/nmr/H-C/1/audita.txt
$$ ##AUDIT TRAIL=  $$ (NUMBER, WHEN, WHO, WHERE, WHAT)
(   1,<2026-02-11 10:51:46.78 +0400>,<Yarkov>,<DPX200>,
      <created by zg, POWCHK disabled, PULCHK disabled
       configuration hash MD5:
       00 E9 B6 7A A2 85 ED C7 34 08 36 98 17 FE 4E 26
       data hash MD5: 16K
       39 85 1A C4 E1 1A C2 06 1C ED 57 F0 AE F3 D1 0A>)
$$ ##END=
$$ 
$$ hash MD5
$$ 36 FA 19 DB 99 DF FE DF 0C 3D 2A 58 4D E4 D0 35
##$RELAX= 
##$RELAX= 
##$RELAX= 
##$RELAX= 
##$RELAX= 
##$RELAX= 
$$ Bruker specific parameters
$$ --------------------------
##$DU= <C:/Bruker/XWIN-NMR>
##$EXPNO= 1
##$NAME= <H-C>
##$PROCNO= 1
##$TYPE= <nmr>
##$USER= <yarkov2>
##$AMP= (0..31)
100 100 100 100 100 100 100 100 100 100 100 100 100 100 100 100 100 100 
100 100 100 100 100 100 100 100 100 100 100 100 100 100 
##$AQSEQ= 0
##$AQ_mod= 1
##$AUNM= <au_zg>
##$AUTOPOS= <>
##$BF1= 200.13
##$BF2= 200.13
##$BF3= 200.13
##$BF4= 200.13
##$BF5= 200.13
##$BF6= 200.13
##$BF7= 200.13
##$BF8= 200.13
##$BYTORDA= 1
##$CFDGTYP= 0
##$CFRGTYP= 5
##$CHEMSTR= <none>
##$CNST= (0..31)
1 1 145 1 1 1 1 1 1 1 1 1 1 1 1 1 1 1 1 1 1 1 1 1 1 1 1 1 1 1 1 1 
##$CPDPRG= <>
##$CPDPRG1= <>
##$CPDPRG2= <>
##$CPDPRG3= <>
##$CPDPRG4= <mlev>
##$CPDPRG5= <mlev>
##$CPDPRG6= <mlev>
##$CPDPRG7= <mlev>
##$CPDPRG8= <mlev>
##$CPDPRGB= <>
##$CPDPRGT= <>
##$D= (0..31)
0 0.7 0 0 0 0 0 0 0 0 0 0.03 0 0 0 0 0 0 0 0 0 0 0 0 0 0 0 0 0 0 0 0 
##$DATE= 1770792706
##$DBL= (0..7)
120 120 120 120 120 120 120 120 
##$DBP= (0..7)
150 150 150 150 150 150 150 150 
##$DBP07= 0
##$DBPNAM0= <>
##$DBPNAM1= <>
##$DBPNAM2= <>
##$DBPNAM3= <>
##$DBPNAM4= <>
##$DBPNAM5= <>
##$DBPNAM6= <>
##$DBPNAM7= <>
##$DBPOAL= (0..7)
0.5 0.5 0.5 0.5 0.5 0.5 0.5 0.5 
##$DBPOFFS= (0..7)
0 0 0 0 0 0 0 0 
##$DE= 6
##$DECBNUC= <off>
##$DECIM= 32
##$DECNUC= <off>
##$DECSTAT= 4
##$DIGMOD= 1
##$DIGTYP= 9
##$DL= (0..7)
0 120 120 120 120 120 120 120 
##$DP= (0..7)
150 150 150 150 150 150 150 150 
##$DP07= 0
##$DPNAME0= <>
##$DPNAME1= <>
##$DPNAME2= <>
##$DPNAME3= <>
##$DPNAME4= <>
##$DPNAME5= <>
##$DPNAME6= <>
##$DPNAME7= <>
##$DPOAL= (0..7)
0.5 0.5 0.5 0.5 0.5 0.5 0.5 0.5 
##$DPOFFS= (0..7)
0 0 0 0 0 0 0 0 
##$DQDMODE= 0
##$DR= 18
##$DS= 0
$$ [...]
##$SUBNAM2= <"">
##$SUBNAM3= <"">
##$SUBNAM4= <"">
##$SUBNAM5= <"">
##$SUBNAM6= <"">
##$SUBNAM7= <"">
##$SUBNAM8= <"">
##$SUBNAM9= <"">
##$SW= 18.0517328524113
##$SWIBOX= (0..15)
0 0 2 0 0 0 0 0 0 0 0 0 0 0 0 0 
##$SW_h= 3612.71676300578
##$TD= 16384
##$TD0= 1
##$TE= 0
##$TE2= 300
##$TE3= 300
##$TEG= 300
##$TL= (0..7)
0 120 120 120 120 120 120 120 
##$TP= (0..7)
150 150 150 150 150 150 150 150 
##$TP07= 0
##$TPNAME0= <>
##$TPNAME1= <>
##$TPNAME2= <>
##$TPNAME3= <>
##$TPNAME4= <>
##$TPNAME5= <>
##$TPNAME6= <>
##$TPNAME7= <>
##$TPOAL= (0..7)
0.5 0.5 0.5 0.5 0.5 0.5 0.5 0.5 
##$TPOFFS= (0..7)
0 0 0 0 0 0 0 0 
##$TUNHIN= 0
##$TUNHOUT= 0
##$TUNXOUT= 0
##$USERA1= <user>
##$USERA2= <user>
##$USERA3= <user>
##$USERA4= <user>
##$USERA5= <user>
##$V9= 5
##$VALIST= <valist>
##$VCLIST= <CCCCCCCCCCCCCCC>
##$VD= 0
##$VDLIST= <DDDDDDDDDDDDDDD>
##$VPLIST= <PPPPPPPPPPPPPPP>
##$VTLIST= <TTTTTTTTTTTTTTT>
##$WBST= 1024
##$WBSW= 4
##$XGAIN= (0..3)
0 0 0 0 
##$XL= 0
##$YL= 0
##$YMAX_a= 20423
##$YMIN_a= -18658
##$ZGOPTNS= <>
##$ZL1= 120
##$ZL2= 120
##$ZL3= 120
##$ZL4= 120
##$ABSF1= 10
##$ABSF2= 0
##$ABSG= 5
##$ABSL= 3
##$ALPHA= 0
##$AQORDER= 0
##$ASSFAC= 0
##$ASSFACI= 0
##$ASSFACX= 0
##$ASSWID= 0
##$AUNMP= <proc_1d>
##$AZFE= 0.1
##$AZFW= 0.1
##$BCFW= 1
##$BC_mod= 2
##$BYTORDP= 1
##$COROFFS= 0
##$CY= 83.5205535888672
##$DATMOD= 1
##$DC= 2
##$DFILT= <>
##$DTYPP= 0
##$F1P= 10.8118882576601
##$F2P= -7.23987719738617
##$FCOR= 0.5
##$FTSIZE= 0
##$FT_mod= 4
##$GAMMA= 1
##$GB= 0.15
##$INTBC= 1
##$INTSCL= 1
##$ISEN= 128
##$LB= 0.25
##$LEV0= 0
##$LPBIN= 0
##$MAXI= 10000
##$MC2= 0
##$MEAN= 0
##$ME_mod= 0
##$MI= 1.114404
##$NCOEF= 0
##$NC_proc= 0
##$NLEV= 6
##$NOISF1= 3.799351
##$NOISF2= 2.8
##$NSP= 1
##$NTH_PI= 0
##$NZP= 0
##$OFFSET= 14.38212
##$PC= 1
##$PHC0= -5299.348
##$PHC1= 6.821927
##$PH_mod= 1
##$PKNL= yes
##$PPARMOD= 0
##$PSCAL= 0
##$PSIGN= 0
##$REVERSE= no
##$SF= 200.129724274929
##$SI= 16384
##$SIGF1= 3
##$SIGF2= 2
##$SINO= 400
##$SIOLD= 16384
##$SREGLST= <1H.CDCl3>
##$SSB= 0
##$STSI= 0
##$STSR= 0
##$SW_p= 3205.1282051282
##$SYMM= 0
##$S_DEV= 0
##$TDeff= 0
##$TDoff= 0
##$TI= <>
##$TILT= no
##$TM1= 0
##$TM2= 0
##$TOPLEV= 0
##$USERP1= <user>
##$USERP2= <user>
##$USERP3= <user>
##$USERP4= <user>
##$USERP5= <user>
##$WDW= 1
##$XDIM= 8192
##$YMAX_p= 0
##$YMIN_p= 0
$$ End of Bruker specific parameters
$$ ---------------------------------
##NTUPLES= NMR FID
##VAR_NAME=  TIME,          FID/REAL,        FID/IMAG
##SYMBOL=    X,             R,               I
##VAR_TYPE=  INDEPENDENT,   DEPENDENT,       DEPENDENT
##VAR_FORM=  AFFN,          ASDF,            ASDF
##VAR_DIM=   8192,          8192,            8192
##UNITS=     SECONDS,       ARBITRARY UNITS, ARBITRARY UNITS
##FACTOR=    0.0002768,     1,               1
##FIRST=     0,             0,               0
##LAST=      2.2672688,     0,               0
##MIN=       0,             -18658,          0
##MAX=       2.2672688,     20423,           0
$$ Real data points
##PAGE= N=1
##DATA TABLE= (X++(R..R)), XYDATA
$$ [...]
867B05j65j0q6k1N6J11p4m7O3j59N1j0P3L4J01j66Pj32N6R6M5J64Qk16r9M2J4
$$ 205 40 30 -56 -77 -21 90 16 -31 32 -127 -76 -86 -13 21 122 -44 -37 -169 -113 -17 28 192 200 -16 -115 -73 -59
894e9J31J8o1r1J30l1n1J80k6j72j03P0P7%J79k7j70m2Nl0M7l1J19o2Nj7M3m2
$$ -59 72 90 29 -62 68 37 -14 166 140 -32 -135 -65 12 12 191 164 -6 -48 -43 -73 -26 -57 62 0 5 -12 31 -11
922a1J00jn7r2L4j37K66k6L7j30J09p0L0J5p7N9j60L8Q5N9q6J21J0o2r3N2m3M
$$ -11 89 88 31 -61 -27 -164 102 76 113 -17 92 22 52 67 -10 49 -111 -73 12 71 -15 106 116 54 -39 13 -30 -26
950b6O9oK1o0j19J68Q0k9j51k1Jk7R5O8q1P7p1k4j2P1J6k4o8n2J12o9oP7J05m9
$$ -26 43 37 58 -2 -121 47 127 98 -53 -74 -73 -100 -5 63 -18 59 -12 -36 -48 23 39 15 -53 -105 7 -62 -68 9 114 65
980F5j18N8p0R6qM9q7J7j17Q2o2j2J61j3j10qOOM7J0M5Nl9N2qj14J03Ll5n9J2
$$ 65 -53 5 -65 31 23 72 -15 2 -115 -33 -95 -107 54 41 -69 -77 -71 -65 -18 -8 37 42 3 55 47 -67 36 39 4 -55 -43
1011d3J04l1K7N8j81J19r9qP6K2o1k1L6K7q8M5J28nm0j92mJ55K8J40j76m5j05
$$ -43 61 30 57 115 -66 53 -46 -54 22 44 -17 -38 -2 25 -63 -18 110 105 65 -127 -131 24 52 192 16 -29 -134
1038a34J23kJ73j43q3N1j14J22k3K8J5Q2j26l2J4J8L6ol7m2j8JpJ35J3o3L7m2
$$ -134 -11 -13 160 17 -66 -15 -129 -7 -30 -2 13 95 -31 -63 -49 -31 5 -1 -38 -80 -98 -97 -104 31 44 -19 18 -24
1066b4P8o5K3J28j56J8L4p5R5K6n1p9J02j02J01j46J60PK2j14q6J11N1n4O6j00
$$ -24 54 -11 12 140 -16 2 36 -39 56 82 31 -48 54 -48 53 -93 67 74 96 -18 -104 7 58 4 70 -30
1092c0J24j03lO2LoJ02k12O6k0j8M1K0n3p2MJ50Rl2K6Qj45k2J41j06R8j2q6O7
$$ -30 94 -9 -12 50 53 47 149 -63 3 -17 -35 6 26 -27 -99 -95 55 64 32 58 66 -79 -101 40 -66 32 20 -66 1
1121AR9j95O1K6R1n4j9M3o2O3l2QK9j35m9Q0Q8K7j29l4j9J2J04N8j7l4o5RJ35
$$ 1 100 -95 -34 -8 83 29 10 53 -9 54 22 30 59 -76 -125 -45 43 70 -59 -93 -112 -100 4 62 45 11 -54 -45 90
1150I0m5n1l3n3K01j50j08J67M2j02P7M6j04J2P9r6N8n3R0j07L5l5L3M0P3p6k1
$$ 90 45 -6 -39 -92 109 -41 -149 18 60 -42 35 81 -23 -11 68 -28 30 -23 67 -40 -5 -40 -7 33 106 30 9
1177IK2o5J37j66J8Rl8j1P7L7j0n0R3j30o1O1O6j4J33j22J02k25R1N9N4j64K9
$$ 9 31 -34 103 -63 -45 -36 -74 -85 -8 29 19 -31 62 -68 -129 -68 -2 -16 117 -5 97 -128 -37 22 76 -88 -59
1204e9o5R7P6k3j30Q1Q0K2q3k1N8l8q1J06p8Q8J4n3o9J14L6j67J93j43N8K9l6
$$ -59 -124 -27 49 26 -104 -23 57 79 -4 -25 33 -5 -86 20 -58 30 44 -9 -78 36 72 -95 98 -45 13 42 6
1231Fn4MK8N5J4L7j49l1J15M9m8R7m7n9k3j46R7k9J38k0l5j11J69j14M7M5M0k7
$$ 6 -48 -44 -16 39 53 90 -59 -90 25 74 26 123 76 17 -6 -152 -55 -84 54 34 -1 -112 57 -57 -10 35 75 48
1259D8m8L2j34L7J78o6n4Lj01L3O5l9J9rP6o6J49j99J71o8k2j46J63p7J8r1Q4
$$ 48 0 32 -102 -65 113 47 -7 -4 -105 -72 -7 -46 -27 -36 40 -26 123 -76 95 27 5 -141 22 -55 -37 -128 -44
1286d4M0J6N3j47J18lQ4j11R9j28m4L6L2O9q4L9o5mJ27r4J24j83K2J02j33J42
$$ -44 -4 12 65 -82 36 33 117 6 105 -23 -67 -31 1 70 -14 25 -40 -44 83 -11 113 -70 -48 54 -79 63
1312F3j6J2p3J02j43J01l3k2R1j42R6j03J23J6m3L3m6ll3l7L8k8k8Q1n1m5J15
$$ 63 47 59 -14 88 -55 46 13 -9 82 -60 36 -67 56 72 29 62 16 13 -20 -57 -19 -47 -75 6 -45 -90 25
1339B5Mk7j8J18j98O6Q9j44kJ10j42N4J71j56L8lL3%o0qj7k8L4k4J28r4J1J04
$$ 25 29 2 -16 102 -96 -30 59 -85 -87 23 -119 -65 106 -50 -12 -15 18 18 -42 -50 -67 -95 -61 -85 43 -51 -40 64
1367F4j8J05o9o5M4p1p1K48k49J24J7k7n0KJ20j49M5J11j37J8o5j7J9R3P2k48
$$ 64 46 151 82 17 61 -10 -81 167 -82 42 59 32 -18 -16 104 -45 0 111 -26 -8 -73 -90 -71 22 94 -154
1393a54J26k7ml6N0j7P5o3M7R3n3n4P6j49M6J17p5k2j05K00l8n1p2J25k7j6Q6
$$ -154 -28 -55 -59 -95 -45 -62 13 -50 -3 90 37 -17 59 -90 -44 73 -2 -24 -129 71 33 -18 -90 35 8 -8 78
1420G8j55N3k3N4Pl2K3J5j8M3o6R9k6j16P0j39J85j36P6L0l8kl7k2RR7l6M5p3
$$ 78 -77 -24 -47 7 14 -18 5 20 2 45 -21 78 52 -64 6 -133 52 -84 -8 22 -16 -18 -55 -77 -68 29 -7 38 -35
1449c5J23pn4k7N6Q0j26n6l9J76j21O2p1P2M6j13R0n3j3%J12j27jJ47j83j7J20
$$ -35 88 81 27 0 56 136 10 -46 -85 91 -30 32 -39 33 79 -34 56 3 -10 -10 102 -25 -26 121 -62 -79 41
1476D1j1m0J18k0mm7r7k1P1o5J31m9n3N5m5N2K6K2K3n3P6q4L6r2J1J11L3j67J41
$$ 41 30 -10 108 88 84 37 -60 -81 -10 -75 56 7 -46 9 -36 16 42 64 87 34 110 26 62 -30 -19 92 125 -42 99
1505I9j46L0R3j18%M0Nr0J13K0N1j12j03pK29j93L6Q4j47J88j03J6L4m6O9Rj4
$$ 99 -47 -17 76 -42 -42 -2 3 -87 26 46 97 -15 -118 -125 104 -89 -53 31 -116 72 -31 -15 19 -27 42 51 37
1532C7%L0j85J69m2n2R9j03j0P7o8M4j3q0K8k7Q7m7J01j35%KK9K6m7J28qPm7o3
$$ 37 37 67 -118 51 9 -43 56 -47 -57 20 -48 -4 -17 -97 -69 -96 -9 -56 45 -90 -90 -88 -59 -33 -80 48 40 47 0 -63
1562f3L2j6k6l7R4n6P8l5O9P7k32R2J5j4o0J9O1j57J56jn1j8K28n8r2M8k9p1J3
$$ -63 -31 -47 -73 -110 -16 -72 6 -29 40 117 -115 -23 -8 -22 -82 -63 -2 -159 -3 -4 -55 -73 155 97 5 53 24 -47 -34
1591c4n1L0Q5r9k9k5K60j05l1l8J28j73N5j4J43j29p6M8L8N3p4N0q8R4k10J69
$$ -34 -85 -55 30 -69 -98 -123 137 32 1 -37 91 -82 -27 -41 102 -27 -103 -55 -17 36 -38 12 -76 18 -192 -23
1617b3n4K8L8M8q8P6m1r6J18O4j26P6k8KQk6L9J0J03k44m5K25m9k4O2l4j02N5
$$ -23 -77 -49 -11 37 -51 25 -16 -112 6 70 -56 20 -8 -6 2 -24 15 25 128 -116 -161 64 15 -9 53 19 -83 -28
1645b8l5L0J32j14R8m7j10L2l5J33O0r5Jk3k7R7M9n2j2j87K41o2j34Q5M1n1j28
$$ -28 -63 -33 99 -15 83 36 -74 -42 -77 56 116 21 22 -1 -28 69 118 66 54 -133 108 46 -88 -3 38 -13 -141
1672a41J48j7j8J90j93j54K31Rq9r1M1M2J16j70J22j02N0N3n3R8J7j25J36Qj31
$$ -141 7 -10 -28 162 -31 -185 46 55 -34 -125 -84 -42 74 -96 26 -76 -26 27 -26 72 89 -36 100 108 -23
1697b3N2M9j8p8M5j7n4P0j04Q1r1Q7m4J47p0n1M4R3j69K0m9MK4J24K0j05K5r3
$$ -23 29 78 60 -18 27 10 -44 26 -78 3 -88 -1 -45 102 32 -19 25 118 -51 -31 -80 -76 -52 72 92 -13 12 -81
1725h1O8j04J31k8j6J23n9j44L2J69j95L5J73j3j34l3J07m1R1j02L8N7m8N1q5
$$ -81 -13 -117 14 -14 -30 93 34 -110 -78 91 -104 -69 104 91 -43 -76 31 -10 81 -21 17 74 26 77 -8
1750hnP6q4j8k9J15OJ9o8pP7M4j94P2R1j49Pj6L2M4j19J31nJ9l4oL8P3j17P4M5
$$ -8 -13 63 -21 -39 -68 47 53 72 4 -3 74 118 -76 -4 87 -62 -55 -71 -39 5 -114 17 12 31 -3 -9 29 102 -15 59 104
1781A04j42N8M2K3k8j29J03N7m9j09r3K93j20m7M4k0J12j71j2J47N0r7o3R0r4
$$ 104 -38 20 62 85 57 -72 31 88 39 -70 -163 130 10 -37 7 -13 99 -72 -84 63 113 16 -47 43 -51
1806e1J57P8j34q2k7J43n2k5J6l4N4j7M1o5L6o2k1Q2N3p8j09J40r8P4M5j12n4
$$ -51 106 184 50 -32 -59 84 32 7 23 -11 43 26 67 2 38 -24 -45 37 90 12 -97 43 -55 19 64 -48 -102
1833a02R3O1r7N0M6M6k2L7j91J10kK6k0M3j50J40q9K8J23r2j27J04N0j36j2J03
$$ -102 -9 52 -45 5 51 97 75 112 -79 31 29 55 35 78 -72 68 -21 7 130 38 -89 15 65 -71 -83 20
1859B0l0J5m7N6L3Kn8J8l0k1J79j40jo0K4N6q1O9M0q7L8pj0qP6p6K3P4k4om7J4
$$ 20 -10 5 -42 14 47 49 -9 9 -21 -42 137 -3 -4 -64 -40 16 -65 4 44 -43 -5 -12 -22 -30 46 -30 -7 67 43 37 -10 4
1891DM1oK8n5j63J34K7mmK5Ro1p3M1n0K15k1j74k7J86l2j05M0J07N4m1q9l6N7
$$ 4 45 39 67 12 -151 -17 10 6 2 27 36 -25 -98 -57 -107 108 87 -87 -114 72 40 -65 -25 82 136 95 6 -30 27
1920B7k2n1j06J53P8o2j18M7J84m6k57J43R4J0n7j8O3j8r7O3l7M2q0M6K0rJ16
$$ 27 5 -46 -152 1 79 17 -101 -54 130 84 -173 -30 64 74 17 -1 62 44 -53 10 -27 15 -65 -19 1 -8 108
1947A08r2l6R1q2Q0j58k6K87j12L3q2m2L5J18n1j03j1P6L3o1K7N2l8p0J00k2k7
$$ 108 16 -20 71 -11 69 -89 -115 172 60 93 11 -31 4 122 71 -32 -43 33 66 5 32 84 46 -24 76 54 27
1974B7J1l0j08P9P4J2j41N9j3Q2N0j39Q4k0pP9k29J18j6L3j3L2j25R3J34j51p
$$ 27 38 8 -100 -21 53 65 -76 -17 -30 52 102 -37 47 27 20 99 -130 -12 -28 5 -8 24 -101 -8 126 -25 -32
2001c2pJ67j59O0J17r3K7k52J51O1l9r7J9Q9K7j68N1M1L9N1p3p0J11Q2n1p2lJ03
$$ -32 -39 128 -31 29 146 53 80 -172 -21 40 1 -96 -77 12 39 -129 -78 -37 2 53 -20 -90 21 103 52 -20 -23 80
2029H0k19J12o0L2R0Nj91J58M4L2k0r9k5J37r8j5O0pM9jj41K28j23J04r6n5o2
$$ 80 -139 -27 -87 -55 35 40 -151 7 51 83 63 -36 -61 76 -22 -37 23 16 65 64 -77 151 28 132 36 -19 -81
2056h1P7j5QM0l1j9O2q5KJ30j50Rk0O6O4j13LP0J7k0j22N2K7K9k6k1k5L6P3j0
$$ -81 -4 -19 -11 29 -2 -21 41 -44 -42 88 -62 -53 -73 -7 57 -56 -53 17 34 14 -108 -56 -29 0 -26 -47 -72 -36 37 27
2086B7r3J49j67l1J13j13Q1O5k3R4p4L3M1j73O4j8O4L5k43J38K5M6K6o0P2p7j28
$$ 27 -66 83 -84 -115 -2 -115 -34 31 8 102 28 61 102 -71 -7 -25 39 74 -169 -31 -6 40 66 6 78 1 -127
2113a27M2rP3M3o8L6j1L9O5q5L3l2j3pp1Q9MJ8r6P7JN2n3o8J25l0m9L4k9k5Q2
$$ -127 -85 -94 -21 22 -46 -10 -21 18 83 -2 31 -1 -14 -21 -92 -3 1 19 -77 0 1 53 0 -68 57 27 -22 12 -17 -42 40
2144D0m8m1o6j1J11j13K9J19L1j05m6Q6OM5q7M6J1rJQl6J52R2j15p7p0P2rn6q
$$ 40 -8 -49 -115 -126 -15 -128 -99 20 51 -54 -100 -14 -8 37 -50 -4 7 -2 -1 7 -29 123 215 100 23 -47 25 16 -40 -48
2174d8J78k20m0J29M0j6N0n6K3o1J05j3k02J66j60pQ5L0O8nm8N8p7N7L2m4o6o7
$$ -48 130 -90 -130 -1 39 23 73 17 40 -21 84 71 -131 35 -125 -132 -47 -17 51 46 -2 56 -21 36 68 24 -42 -109
2202a09J43o1J02o8J03j59N5j4j6NO9p1K0J3k6J4K1mo7N5n8J67j31N1o4q6J27
$$ -109 34 -27 75 7 110 -49 6 -8 -24 -19 50 -21 -1 12 -14 0 21 17 -50 5 -53 114 -17 34 -30 -116 11
2229A1N5o1q3L6Qk1J37kl3j39P9M7j9l1L9L9r9Q4m8o2M2J02j29M5k1J29j33J36
$$ 11 66 5 -78 -42 -34 -55 82 80 47 -92 -13 34 15 -16 23 62 -37 47 -1 -63 -21 81 -48 -3 -24 105 -28 108
2257A08Qn1qko1l1j25O2J88m5j57J81j9%n7nM7r7M3l7J05O5j23j8J7oJ08nj36
$$ 108 116 65 57 55 -6 -37 -162 -100 88 43 -114 67 48 48 -9 -14 33 -64 -21 -58 47 112 -11 -29 -12 -18 90 85 -51
2286e1K5l0J15k6j3l1K6j4q7J29o4L5QQM3q2L2l2P2n3J1k5l5k1N1l4K08j37j48
$$ -51 -26 -56 59 33 20 -11 15 1 -86 43 -21 14 22 30 73 -9 23 -9 63 10 21 -4 -39 -60 -9 -43 165 28 -120
2315a20J86J3r7j00J13N6j94J16Q1j4r2L0o1n1J22Q0L2j31J13m9o1R9j11N3J4
$$ -120 66 79 -18 -118 -5 51 -143 -27 54 40 -52 -22 -83 -134 -12 68 100 -31 82 33 -28 71 -40 13 27
2340B7kj1j7Qk8O4l0m9Q9kk4n4P7n3P6j64J68j22J7m8J35Q2j78l6J17p3R6M0k25
$$ 27 25 14 -3 5 -23 41 11 -38 51 49 25 -29 48 -5 71 -93 75 -47 -30 -78 57 139 -39 -75 42 -31 65 105 -120
2369a20N7L4K5pJ29j66L3Q5m2n9j1Q1j38Q6M5J9rp7R5j00R6n4n3M4P0q9J23r5
$$ -120 -63 -29 -4 -11 118 -48 -15 70 28 -31 -42 39 -99 -13 32 51 42 -35 60 -40 56 2 -51 -7 63 -26 97 2
2397BJ07j54q4Q7K6lO0n6N5j10J7k0R1j06P6lj04K63l9r7OM3j35K5KQ1lN2j76
$$ 2 109 -45 -129 -42 -16 -19 41 -15 40 -70 -53 -73 18 -88 -12 -15 -119 144 105 8 14 57 -78 -53 -51 30 27 79 -97
2426i7J05J8k2O0K7j21KJ24k20J24r2J32j2o4K8P0j70J76k5K0q1Q8o1J27p1k8
$$ -97 8 26 4 64 91 -30 -28 96 -124 0 -92 40 28 -36 -8 62 -108 68 43 63 -18 70 9 136 65 37
2452C7q9qP7o5N3p2K21j88R6L8m6m3K4q5mM2P5n7K2ol3KJ10j29M4m7N4m7J7Rp4
$$ 37 -52 -60 17 -48 5 -67 154 -34 62 100 54 11 35 -50 -54 -12 63 6 28 22 -11 -9 101 -28 16 -31 23 -24 -7 2 -72
2483g2P3n9M1j8Q8jj33Q4R9K1l6m0l6j2o8N4o5K04r1n8j01J08l3J49j43j0J60
$$ -72 1 -58 -17 -35 53 52 -81 3 102 123 87 47 11 -1 -69 -15 -80 124 33 -25 -126 -18 -51 98 -45 -55 105
2510A05j6k06J50n3r7J34R6j38J7J02j30K50k16kj45R4R5q4P3m8J2O7k9j00L5
$$ 105 89 -117 33 -20 -117 17 113 -25 -8 94 -36 214 -2 -4 -149 -55 40 -44 29 -19 -7 60 31 -69 -34
2535c4K5o6J14j5ON7q2lk8MjN5p3N9n1K8r5J02J26k08Q5L2p1OJ7N6L1r3KN7p0
$$ -34 -9 -75 39 24 30 87 5 2 -26 -22 -23 32 -41 18 -33 -5 -100 2 128 -80 5 37 -34 -28 -11 45 76 -17 -15 42 -28
2566b8j01J4J24jL2O0r4M2n0P8k03J32%r6J00o8K18j49j0j2P2q1O7q9K05q6r7
$$ -28 -129 -115 9 8 40 100 6 48 -2 76 -127 5 5 -91 9 -59 159 10 0 -12 60 -21 46 -43 162 76 -21
2593b1n2J17oJRk6j21R2L9j79J88q4J46k4Lj57J28K3n8j1O6j5j35L4j9K1j8J05
$$ -21 -73 44 38 39 48 22 -99 -7 32 -147 41 -43 103 79 82 -75 53 76 18 7 73 58 -77 -43 -62 -41 -59 46
2621D6j02N9l5%Lo1P6L3o4Q1j75K15j48J01r2J52q8L8p2o3J25j65J65pO4q9j50
$$ 46 -56 3 -32 -32 -29 -90 -14 19 -45 36 -139 76 -72 29 -63 89 1 39 -33 -96 29 -136 29 22 86 -3 -153
2648a53R8L8n5Q5M7l1LL9j17Q9PN1j26O9j2m2L0J0P3m1p8j11J31j8j00J64MO0
$$ -153 -55 -17 -72 13 60 29 32 71 -46 43 50 101 -25 44 32 -10 20 30 103 62 -16 -127 4 -14 -114 50 54 114
2676A14j24JM0o8Lq0J84j04J6Mo3J17Nj26P2j78K01k0RQ8J6j34J35q3k04J42P8
$$ 114 -10 -9 31 -37 -34 -114 70 -34 -18 -14 -77 40 45 -81 -9 -187 14 -6 3 91 107 -27 108 25 -179 -37 41
2703D1Rj09J83j21R1p9k8j5P6n4j9P2j5pP4j12N5j06m1J0J02R3j35N5M7n5L8j27
$$ 41 50 -59 124 3 94 15 -13 -28 48 -6 -25 47 32 25 99 -13 42 -64 -105 -95 7 100 -35 20 67 12 50 -77
2731g7J26o2M1l8m4L6j1J59j80m5L7Q9M7j01j3rK6P6n1K1n6J32r6N0j74K91q6
$$ -77 49 -13 28 -10 -54 -18 -29 130 -50 -95 -58 31 78 -23 -36 -45 -19 57 6 27 -29 103 7 57 -117 174 88
2758H8k07J20j8j3O4l6O4Pj38j6jj1K36q4k7j53N3L8K7L2k7M5q5M0m4K6m2P9J6
$$ 88 -119 1 -17 -30 34 -2 62 69 -69 -85 -86 -97 139 55 28 -125 -72 -34 -7 25 -2 43 -42 -2 -46 -20 -62 17 33
2787C3P1jj73j0J23l0J4L6j11L8l2oJ03RM0qm9j36J66j21j2J97k37J20q7J13j8
$$ 33 104 103 -70 -80 43 13 27 63 -48 -10 -42 -48 55 64 104 96 47 -89 77 -44 -56 141 -96 24 -63 50 32
2814C2J6o9J9r4PO9p2N0J0L4R2n8k2m4O9o9P6o0k6K1L5k2k1k9rO5P1m8l1K1J1
$$ 32 48 -21 -2 -96 -89 -20 -92 -42 -32 2 94 36 14 -30 39 -30 46 -14 -40 -19 16 -6 -27 -56 -65 0 71 23 -8 13 24
2845B4p8Q7J2q7J06q7m8P6Q7j20M3J01Pj56R9M9j20MK8m2j62J41M5Nj6r2Q0o7
$$ 24 -54 33 45 -42 64 -23 -71 5 92 -28 15 116 123 -33 66 115 -5 -1 27 -15 -177 -36 9 14 -2 -94 -14 -81
2873h1L1p4K4M6M2N2K9q1J6N0N8J0m0n4M4m5O4j48L3M0N1l6J6l2kj8n8J07j35
$$ -81 -50 -124 -100 -54 -12 40 69 -12 4 54 112 122 82 28 72 27 91 -57 -24 16 67 31 47 15 13 -5 -63 44 -91
2902i1QJ30L5m7j06J05o3OJ07j4j67o9J79o1R2L4q3r8K35j23m9k1R9r3K4N6j16
$$ -91 -83 47 82 35 -71 34 -29 -23 84 70 -97 -166 13 -48 44 78 -5 -103 132 9 -40 -61 38 -55 -31 25 -91
2929i1J33J0l9N5j40J10p5rR5j9R1j11K0O3r0k5k%NR5l2m5q1K44k43jR5p5J20
$$ -91 42 52 13 68 -72 38 -37 -46 49 30 121 10 30 93 3 -22 -24 -24 -19 76 44 -1 -82 162 -81 -82 13 -62 58
2958E8r6m2K8o7J62n1K5K2r3J09j27PJ03n7l8k0J82j68l4J64j38R0p1K5O0K9n3
$$ 58 -38 -80 -52 -119 43 -8 17 39 -54 55 -72 -65 38 -19 -57 -77 105 -63 -97 67 -71 19 -52 -27 33 62 9
2985Ij04K9O3j28J15M0k3j7P2r8M2M6p0OJ0k8L7M0j5n5M6j12P5NK2l1O9j24Q6
$$ 9 -95 -66 -3 -131 -16 24 1 -16 56 -42 0 46 -24 -18 -8 -36 1 41 26 -29 17 -95 -20 -15 7 -24 45 -79 7
3014Gl2nrQQ8m2R0j42m6O1Q9q6PM8j5l2Q9l6j39J7Q1l1jn1lJ25r6O3J4j00J50
$$ 7 -25 -30 -39 -31 57 15 105 -37 -83 -22 67 -19 -12 36 21 -11 78 42 -97 -80 1 -30 -31 -82 -85 40 -56 7 21 -79 71
3045G1j61J06p3K21k31J17k63J31J17o8L1j9P4k4l9l1P2r7J50j13nJ84n9j53J35
$$ 71 -90 16 -57 164 -67 50 -213 -82 35 -33 -2 -21 53 29 -10 -41 31 -66 84 -29 -34 150 91 -62 73
3070G3l6M4j42R5J9p3k3J05N7j38K3k0K1m8qK3j0J04J2q8lM0k22J10O1Q5r6J07
$$ 73 37 81 -61 34 53 -20 -43 62 119 -19 4 -16 5 -43 -51 -28 -38 66 78 -10 -13 27 -195 -85 -24 61 -35 72
3098G2r5J34p9L2q3OR9r9j10J14l8P7rj75J17k9J61k7n4J0j30K10N6j90k6K6J1
$$ 72 -23 111 32 64 -19 -13 86 -13 -123 -9 -47 30 21 -154 -37 -66 95 68 14 24 -106 104 160 -30 -56 -30 -19
3125a9N5j05N2M5J9j35j5R7Q0j04K0l9k9J05j7M3q3L2mL3J3k0k0K0p3L1M1l5o1
$$ -19 36 -69 -17 28 47 -88 -103 -6 74 -30 -10 -49 -78 27 10 53 -30 2 -2 31 44 24 4 24 -49 -18 23 -12 -73
3154g3R4p4p4J20qj6QM7j6K5n9k1J0k3K9J3l6P6p5P8n9K1P4J1N0j79J19j51J06
$$ -73 21 -53 -127 -7 -15 -31 -23 24 8 33 -26 -47 -37 -60 -31 -18 -54 22 -53 25 -34 -13 61 72 122 -57 62 -89 17
3183A7l8J10Nk34J95o2L3j4j00J14j18R4l3N8n6J7J53j72k9K2J6K7J46j26n4J50
$$ 17 -21 89 94 -140 55 -7 26 12 -88 26 -92 2 -31 27 -29 -12 141 -31 -60 -38 -22 5 151 25 -29 121
3209A21o0j27J02n4J6p8J51j11l8r8J66J00p3O0k05K00J1p7l6J26j32P0o7O4N0
$$ 121 61 -66 36 -18 -2 -80 71 -40 -78 -176 -10 90 17 77 -128 72 83 6 -30 96 -36 34 -33 31 81
3234H1Jl7j97K26j19pp8J60l4j8j00J58n5L0j26P2K5j01J16p4M3K0j6MQ4l1m0
$$ 81 82 45 -152 74 -45 -52 -130 30 -4 -22 -122 36 -19 11 -115 -43 -18 -119 -3 -77 -34 -14 -30 -26 58 27 -13
3261a3Ll5Q5j1j43J77r8N8o7P3p5j0j5P0N1p0KQ7j28N0p9N2J23nj11K01j70J05
$$ -13 -10 -45 40 29 -114 63 -35 23 -44 29 -46 -56 -71 -1 50 -20 -18 69 -59 -9 -88 -36 87 82 -29 172 2 107
3289A07k46J55kj6j2M8nj16L8N9l3L8R1o0L0k01O5J22n1j5M2q4L5L4N2k7L1l9
$$ 107 -139 16 14 -2 -14 34 29 -87 -49 10 -23 15 106 46 76 -125 -60 62 11 -4 38 -46 -11 23 75 48 79 40
3317D0j92J70n6M5O1nm0K8j04J40o9M0j17Q1Qq2N6N4M5k35K14J0j09n3N6K9o3
$$ 40 -152 18 -38 7 68 63 23 51 -53 87 18 58 -59 22 30 -52 4 58 103 -132 82 92 -17 -70 -14 15 -48
3344d8Q0r3L7L5k2K7J4n7j16N1jRO8N5n4n8J16n7n7NL6L5K2q6R8q4j5J24J21k33
$$ -48 32 -61 -24 11 -11 16 30 -27 -143 -92 -93 -84 -16 39 -15 -73 43 -14 -71 -66 -30 5 27 -59 39 -45 -60 64 185 -48
3374d8J06j11R2q7J0N7jl0m2O8j09P2o6N4O9p2Q1m6k6O4o6J9oJ9m6K7rrM2j8J64
$$ -48 58 -53 39 -48 -38 19 18 -12 -54 14 -95 -23 -89 -35 34 -38 43 -3 -29 35 -31 -12 -18 1 -45 -18 -27 -36 6 -12 152
3405A52j63m0J5l7N4n9R8mp5l7O2O0q2rJ89j41NO6NK9p5m2J8O1l7l6j41J9P2Q7
$$ 152 -11 -51 -36 -73 -19 -78 20 16 -59 -96 -34 26 -56 -65 124 -17 -12 54 59 88 13 -29 -11 50 13 -23 -164 -145 -73 14
3435A4m9J06m4k8K6Jl4P3n6jm8q6J81l0j01qjQ0K4qOJ42j11o2J7O8j02J7J16p9
$$ 14 -35 71 27 -1 25 26 -8 65 9 8 -40 -126 55 25 -76 -84 -85 -5 19 11 17 159 48 -14 3 71 -31 -14 102 23
3465B3L5r6J08n8m1lq0R7K7M2k1K6n4K2l1N8l7P3o6K5L4r8R6j96J57l6J19r2o
$$ 23 58 -38 70 12 -29 -32 -112 -15 12 54 33 59 5 27 -4 54 17 90 24 49 83 -15 81 -115 42 6 125 33 27
3494B7o0N5J3q1M9P6l6p9L9N0l9n7J13j6l1L7rr7n4J03k9M8Q7l2o0l0rJ7p0J02
$$ 27 -33 22 35 -46 3 79 43 -36 3 53 14 -43 70 54 23 60 51 -46 -100 3 -26 22 109 77 17 -13 -22 -5 -75 27
3524B7K8M9m9q4O8j1M3n3J0m5PN1%l9J9j48Q4n1P4q7K0Q0M9j1p2J6j1k0L7j14
$$ 27 55 104 55 -29 39 28 71 18 28 -17 -10 41 41 2 21 -127 -43 -94 -20 -107 -87 -7 42 31 -41 -25 -36 -56 -19 -133
3554a33K0J97o9n6l6R5J14k41K08m6rK2Mr1J71l6j0n2p6o4J33m3k8k8J06p1l0
$$ -133 -113 84 15 -41 -77 18 132 -109 99 53 44 66 70 -21 150 114 104 52 -24 -88 45 2 -26 -54 52 -19 -49
3581d9J00R9k04J37p1N9j30J35o7l4m2O6O3n8kN0j0p1L5jO9n1j5K8q2j7O4QJ5
$$ -49 51 150 -54 83 12 71 -59 76 9 -25 -67 -1 62 4 2 52 42 -29 6 5 74 23 8 36 -46 -63 1 9 24
3610B4L5ok0kmNj12nJ72j23J02l9o0P2k2Q9j75Qn0K29j65L2L5j1L8l0J8N3m0L
$$ 24 59 53 33 31 27 32 -80 -85 87 -36 66 27 -33 39 17 106 -69 -61 -111 118 -47 -15 20 9 47 17 35 88 48 51
3640E1p2K7L2l7m2J1J50j40%L7j7k1J08j05l8MPR0J6n5p3J72r4k8J5k3k7K7K1
$$ 51 -21 6 38 1 -41 -30 120 -20 -20 17 0 -21 87 -18 -56 -52 -45 45 61 6 -67 105 11 -17 -2 -25 -52 -25 -4
3669dmJ44j77J89q9o7J4q2O9J5L5l1l0q4J04N1K6o5o1M8j15L8mK2J26j66R1j7
$$ -4 -8 136 -41 148 59 -8 6 -76 -7 8 43 12 -18 -102 2 53 79 14 -47 1 -114 -76 -80 -58 68 -98 -7 -24
3697b4%NJ00oj10P8j71J70j11nJ04k8n1J5j8J00k8j46Q9Q3q0K0m0m6O3Q3nk1n8
$$ -24 -24 -19 81 75 -35 43 -128 42 -69 -74 30 2 -49 -34 -52 48 20 -126 -37 46 -34 -14 -54 -100 -37 46 41 20 -38
3726c8o5J11m6J84m2pp1j8k0J6M0j0N4j61P5j55J19Q8J4J0p6m8%Rk6L1P0k5K2
$$ -38 -103 8 -38 146 104 97 26 8 -12 4 44 34 88 -73 2 -153 -34 54 68 78 2 -46 -46 -37 -63 -32 38 13 35
3755C5K4j37J28m5L3m3P2q2k9K0M7R4j36O7J1k5n4N9kk4P9j26R4n2L5j01M2Q1
$$ 35 59 -78 50 5 38 -5 67 -15 -44 -24 23 117 -19 48 59 34 -20 39 37 13 92 -34 60 8 43 -58 -16 65
3783F5nq2j4P6k2j10J40p0QJ6NK2l3qN6j38J02J15k64K62k61J81k7j9O3j28J30
$$ 65 60 -22 -36 40 18 -92 48 -22 -14 2 7 29 -4 -12 44 -94 8 123 -141 121 -140 41 14 -5 58 -70 60
3810F0l1R6j30Q4j36P7N1o1K8j06l4J11nN6j38oJ49OK8j63P4j0k2o2M9O8N7j26
$$ 60 29 125 -5 79 -57 20 71 10 38 -68 -102 9 4 60 -78 -84 65 71 99 -64 10 0 -22 -84 -35 33 90 -36
3838c6K9L7p8oJ45m9n2K3p9Q0mJ0j5M3j02o5J64R2n8r2P6m3n9k2R7Qj04k3K16
$$ -36 -7 30 -48 -54 91 42 -10 13 -66 14 10 20 5 48 -54 -119 45 137 79 -13 63 20 -39 -61 36 44 -60 -83 133
3867A33j78j8M4Q9m5j66L4L8O4l7J00j01J15N8k5On1j5p0j1J01j35L5m1N0L9k2
$$ 133 -45 -63 -19 70 25 -141 -107 -69 -5 -42 58 -43 72 130 105 111 60 45 -25 -36 65 -70 -35 -76 -26 13 -9
3894iO0j74J22L6j49J39j30R0J47n1j09n7J67q3L1n2m0Q8J5j02J31j17Q9J4P0
$$ -9 51 -123 -1 35 -114 25 -105 -15 132 81 -28 -85 82 -1 30 -22 -62 26 41 -61 70 -47 42 56 126
3919A26l2j48J03j20J22L1j13O0m9J03l1o6N3k5L7k2k0lO6j34J54l9M6j42Q6K7
$$ 126 94 -54 49 -71 51 82 -31 29 -20 83 52 -14 39 14 51 29 9 6 72 -62 92 53 99 -43 43 70
3945G0p8P6q7j14J95J5j98J47j33O2O7q3J02m3j00L1M8K0j06K1J09P7k19M1K4
$$ 70 -8 68 -19 -133 62 77 -121 26 -107 -45 22 -61 41 -2 -102 -71 -23 -3 -109 -88 21 98 -121 -80 -56
3970e6J16M7p0p5N6n5K8j20J71p5p9J26RJ6P3j76l1J21Oq4J49k28M0Q1M9r8R2
$$ -56 60 107 37 -38 18 -37 -9 -129 42 -33 -112 14 23 39 112 -64 -95 26 32 -52 97 -131 -91 -10 39 -59 33
3997C3M1j26J67j61j1R8M1j23K6Q0N4j25k1j23R2k9Q5R3p4Qp6L4o4J08kPl8mJ5
$$ 33 74 -52 115 -46 -57 41 82 -41 -15 65 119 -6 -27 -150 -58 -87 -2 91 17 25 -51 -17 -81 27 25 32 -6 -10 5
4026EJK6r8K7J08j17J61r9l8Ln4N4l1O3k4l5M8P8j14K5Q6j44J22m8l2N1K0m3l1
$$ 5 6 32 -66 -39 69 -48 113 14 -24 -21 -75 -21 -52 11 -13 -48 0 78 -36 -11 75 -69 53 5 -27 24 44 1 -30
4055c0K6J35k10L7o6J13J64k63J89j80N1k3J10p6l2L1L6M6n3J2J4o6R2l0m5Q8
$$ -30 -4 131 -79 -42 -108 5 169 -94 95 -85 -34 -57 53 -23 -55 -24 12 58 5 17 31 -35 57 27 -18 70
4081G0p5m0P0l9O8j24R5K4r4KqJ9o7J00j11J35k2p3P1j8M3kl4L1o0l3R4j0k7N8
$$ 70 -5 -45 25 -14 54 -70 25 49 -45 -43 -51 -32 -99 1 -110 25 3 -70 1 -17 26 24 -10 21 -39 -72 22 12 -15 43
4111D3p6J42o8K7p4p0J43l6N8p6j8J7N6j73R1q0P7J1P0pl0K5j00L8m1l1J09r5
$$ 43 -33 109 41 68 -6 -76 67 31 89 13 -5 12 68 -105 -14 -94 -17 -6 64 57 27 52 -48 -10 -51 -82 27 -68
4139f8O3j18J21l4oJ04l6N6p9L7o6j3rK8n8M1O8m9K3K3r1J82j29j1O3n5O3o4J9
$$ -68 -5 -123 -2 -36 -42 62 26 82 3 40 -26 -39 -48 -20 -78 -37 31 -18 5 28 -63 119 -10 -21 42 -13 50 -14 5
4168EJ2K2n2N8l6Nj0l9KL3r2R8k5J02j33n6K11q6j4L1j13J02pj02J45l5p7P0r
$$ 5 17 39 -13 45 9 14 4 -35 -33 0 -92 6 -19 83 -50 -106 105 19 5 36 -77 25 18 -84 61 26 -51 19 10
4197A0J1J0oR1j49L1Nm4OM2j7l4K5j8R2p9KP2m8j3j06J47j09O0P5r8L5o2R5m6
$$ 10 21 31 25 116 -33 -2 3 -41 -35 7 -10 -44 -19 -37 55 -24 -22 50 2 -11 -117 30 -79 -19 56 -42 -7 -69 26 -20
4227b0J8n2o1j5J75p7J24j17J2l8k5J40m4q2J3n5K09k6r0Q8j44oN5P3K7q8K3r3
$$ -20 -2 -54 -115 -130 45 -32 92 -25 -13 -51 -76 64 20 -62 -49 -104 105 79 -11 77 -67 -73 -18 55 82 -6 17 -76
4255g6J26J2k1k1n7M4oqO5o0L2l6l3J16j33K3L7j27R8Q3rO3j94J34O2r1j20J24
$$ -76 50 62 41 20 -37 7 1 -7 58 -2 30 -6 -39 77 -56 -33 4 -123 -25 58 49 112 -82 52 114 23 -97 27
4283B7j1j20Q1O2j43J26j16P5%J0j8p7J37r8J58j3j30Q4r9L5N8p5k2J90k07J63
$$ 27 16 -104 -23 39 -104 22 -94 -19 -19 -9 -27 -104 33 -65 93 80 -50 34 -65 -30 28 -47 -69 121 -86 77
4309G7o6p9J2O1pj1R1r4N9J05j30L4L0Nj26Q6j1o1q4J88Pj62N3P6k4r5M7J41o6
$$ 77 11 -68 -56 5 -2 -13 78 -16 43 148 18 52 82 87 -39 47 36 -25 -109 79 86 -76 -23 53 29 -66 -19 122 56
4338E6j41Q9Q6r9N7p3J8J10p7o5lo3K9N6j12J51Km8l9L9J4L9L9M7p2O9j18M0j62
$$ 56 -85 4 90 -9 48 -25 -7 103 26 -39 -42 -105 -76 -20 -132 19 21 -27 -66 -27 -13 26 65 112 40 109 -9 31 -131
4367a31J41j01K15r1p4j3O2P4k6j09n2J53n4m6pm2l9J39o4J94j38m4J18p5q5K16
$$ -131 10 -91 124 33 -41 -54 8 82 56 -53 -105 48 -6 -52 -59 -101 -140 -1 -65 129 -9 -53 65 -10 -95 121
4393A21n3q9ML5N9j38pJ07o1k2O6m0J5J1m1J4P4PRj41J04k2o3J7l6J05q1J17j39
$$ 121 68 -21 -17 18 77 -61 -68 39 -22 -44 22 -18 -3 8 -33 -19 55 62 71 -70 34 12 -51 -34 -70 35 -46 71 -68
4422f8Q8r1J32j03J18l7JoN5j03Q1n5n7L5k6M2o1P6j1M7KOLj02K8K4PK7p4o4N0
$$ -68 20 -71 61 -42 76 39 40 34 89 -14 67 12 -45 -10 -36 6 -55 21 10 57 59 65 68 -34 -6 18 25 52 -22 -86 -36
4453c6j7M6l9n8J98q7k2K8q5J30o4R2l4k3OL2n8j02M9J25j18K9k3j2Q4j10J08
$$ -36 -53 -7 -46 -104 94 7 -15 13 -72 58 -6 86 52 29 35 67 9 -93 -44 81 -37 -8 -31 -43 41 -69 39
4480C9p5O6m6l6P0L3l7m3m5J95j22O5rj44J28j1m4j9R1o2K8N5l4k9l6mL3l1Q9
$$ 39 -36 30 -16 -52 18 51 14 -29 -74 121 -1 64 55 -89 39 28 -16 -35 56 -6 22 77 43 14 -22 -26 7 -24 65
4509F5k52K05j0m4Q6K3pj11P8p9J02p3J13L0j08n9m6O6K3k2j01j6J89o5K0nj4
$$ 65 -187 18 8 -36 50 73 66 -45 33 -46 56 -17 96 126 18 -41 -87 -21 2 -20 -121 -137 52 -13 7 2 -12
4536a2l5J05m9q0oJ07L6o8q9m0M8J30j32M6J57n2r4L8q3P0K6k0O9Ql4oL7Pr8L9
$$ -12 -47 58 9 -71 -77 30 66 -2 -91 -131 -83 47 -85 -39 118 66 -28 10 -73 -3 23 3 72 80 46 40 77 84 -14 25
4566B5m3J8MO8rk2n6kM5j35J22j46K06n0pN9J7o7P9k05J38J8r3jJ8k4R8j29L7
$$ 25 -18 0 4 72 63 41 -15 -17 28 -107 15 -131 75 25 18 77 94 27 106 -99 39 57 -36 -37 -19 -43 55 -74 -37
4595c7M2M9k0m8R5j11j5L9m6J09r7KM1Q0n8o9O7p6K3K9P2Nj27L7LN0j0l3M0K6
$$ -37 5 54 34 -14 81 -30 -45 -6 -52 57 -40 -38 3 83 25 -44 23 -53 -30 -1 71 76 -51 -14 -11 39 29 -4 36 62
4625F2%k7K0r4J2O3j3QJ4j6Jk9l6O2K8k5J29j60j2Lm5Q0K0R1j35j64K21Lm3m7
$$ 62 62 35 55 -39 -27 36 23 31 45 29 30 1 -35 27 55 30 159 -1 -13 -10 -55 25 45 136 1 -163 58 61 18 -29
4655b9M7l7P6n6j9Pm4K8J46k03l3Q1O6r9O5Q4n2r9O0j4K1J6m1m4K3L2J27j49j9
$$ -29 18 -19 57 1 -18 -11 -55 -27 119 -84 -117 -36 30 -69 -4 80 28 -71 -11 -25 -4 12 -29 -73 -50 -18 109 -40 -59
4684e9p3J35m4J57j29o0J00PJ8n1mP6n6Q2kj30J41j37l0L5rm1J41r2P0k3k4k9
$$ -59 -132 3 -41 116 -13 -73 27 34 52 1 -3 73 17 99 97 -33 108 -29 -59 -24 -33 -74 67 -25 45 22 -2 -31
4712c1l1M0M1l8rL9J4N4j02n1N8R4j19k6J2J44Km9q3r4J00O4j1Q4mj35k8J12j8
$$ -31 -62 -22 19 -19 -28 11 25 79 -23 -74 -16 78 -41 -67 -55 89 91 42 -41 -135 -35 29 18 102 98 -37 -65 47 29
4741B9N0p3nj0p8J94o1r1N3m0n0M5P4oK6p8M8k6l6j82K27P2r9N0j05K1oR5p4N9
$$ 29 79 6 1 -9 -87 107 46 -45 8 -32 -82 -37 37 31 57 -21 27 1 -35 -217 10 82 -17 33 -72 -51 -57 38 -36 23
4771B3m0J16m7m1l1j45J86n2K3j4J8P2j00J28l8k52K81p6l4l3%J16o0l1K1Qp6
$$ 23 -17 99 52 11 -20 -165 21 -31 -8 -22 -4 68 -32 96 58 -194 87 11 -23 -56 -56 60 0 -31 -10 -2 -78
4798g8K3j2O1%Qk2J04o8m9N7m3jQ5p7L4n6K9j08J01m7J23p2q1J46r5J31j23R3
$$ -78 -55 -67 -6 -6 2 -20 84 16 -33 24 -19 -20 65 -12 22 -34 -5 -113 -12 -59 64 -8 -89 57 -38 93 -30 63
4826F3o9k3R0j15j7J25J9j1m3M1L3l9r7K5M0r9Q7J8k9K1n8O1k8k2L3P5k5OOj02
$$ 63 -6 -29 61 -54 -71 54 73 62 19 60 93 54 -43 -18 22 -77 10 28 -1 20 -38 23 -5 -27 6 81 56 62 68 -34
4856c4R2q1j0O5lO1m4m8J7o1P3M7j12J24o6j5O3j43R7p6N5N5r7J7J55n8o9o0K5
$$ -34 58 -23 -33 32 29 90 46 -2 15 -46 27 74 -38 86 20 5 68 -75 22 -54 1 56 -41 -24 131 73 4 -56 -31
4885c1NJ01n9q1L8o0Q4J7k3K0qM1rk9Km0rJ22j00J26j26L5J0pQ0k2k38J96j54
$$ -31 -26 75 16 -65 -27 -87 -3 14 -9 11 3 44 35 6 8 -32 -41 81 -19 107 -19 16 26 19 99 77 -161 35 -119
4914a19J03J9n0J18Po6L7q2Q0lm5J4J3k3j4J18j68N8Q6k3p4k2Q9J1o4r2L6k1J35
$$ -119 -16 3 -47 71 78 12 49 -33 47 44 -1 13 26 3 -11 107 -61 -3 83 60 -14 -36 53 64 0 -92 -56 -77 58
4943E8M4j79L8K7R9j33J19O1j79K6j7P6l2N8n2o5J58j30P8K5p4Q3m3j2P2j40L6
$$ 58 102 -77 -39 -12 87 -46 73 134 -45 -19 -36 40 8 66 14 -51 107 -23 55 80 6 89 46 34 106 -34 2
4970Bj3No8O4n0M6k0M9K7p5Nl4PJ12q2l2Q9%mj41N8J31No0p8J41j77J67j79J62
$$ 2 -11 -6 -74 -10 -60 -14 -34 15 42 -33 -28 -62 -55 57 -25 -57 32 32 28 -113 -55 76 81 21 -57 84 -93 74 -105 57
5000E7J3qo5pJ11o5J8L2K5p2p6o2J55j0j15O0l6L8K5j11N2lj5J18n8M7M7k37J11
$$ 57 70 62 -3 -10 101 36 54 86 111 39 -37 -99 56 46 -69 -9 -45 -7 18 -93 -41 -44 -59 59 1 48 95 -142 -31
5029c1J10j66O8O9q4k2Q7M5n7J03p2j34M5M9r3j4J10o7o9O0L5J5J0K6pl4n1P9
$$ -31 79 -87 -19 50 -34 -56 31 76 19 122 50 -84 -39 10 -83 -97 13 -54 -123 -63 -28 -13 -3 23 16 -18 -69 10
5057A0O3j9J1Rj25J90n1j60J0J32Lp0j0j0m6J72j42K4M3k1P2n1j05N1J17j15P9
$$ 10 73 54 65 74 -51 139 88 -72 -62 70 73 3 -7 -17 -63 109 -33 -9 34 13 85 34 -71 -20 97 -18 61
5084F1j08O4r8J74j87Q4P2r2pK7J12j28j09J90j23j1O1J8K2n9J6J9L6n8k5M1L9
$$ 61 -47 17 -81 93 -94 -10 62 -30 -37 -10 102 -26 -135 55 -68 -79 -18 0 22 -37 -21 -2 34 -24 -49 -8 31
5111C1m9q6L9J66j40J08j38J16j18Q4N7j30J0j7J28j00q2J83J4l2m0N4r8Q4Lj85
$$ 31 -18 -104 -65 101 -39 69 -69 47 -71 13 70 -60 -50 -67 61 -39 -121 62 76 44 4 58 -40 44 47 -138
5137a38J01J37k1r0J30j82J23R6k76Q3q1J6R8O4j79J40m8R1j49O7l3J35O1j77
$$ -138 -37 100 79 -11 119 -63 60 156 -120 -37 -118 -102 -4 60 -119 21 -27 64 -85 -18 -51 84 145 -32
5161c2J71p3p3j5N3j03J18RP8n3o8j88K03N9j36J4J0J3n8R2P8J7j42J04p9J5j66
$$ -32 139 66 -7 -22 31 -72 46 55 133 80 12 -176 27 86 -50 -36 -26 -13 -71 21 99 116 -26 78 -1 14 -152
5188a52J21J03j57J71j66R3o0m0M1K5N5M1l6m7pj6qQ9k1K8L2j2j49MO5Ok9R0r0
$$ -152 -31 72 -85 86 -80 13 -47 -87 -46 -21 34 75 39 -8 -15 -31 -39 50 29 57 89 77 -72 -68 -3 3 -26 64 -26
5217b6k8O9l5j9nO8M6q0J98k15M4p4J6Oj6J12r4R5p1M0j5j02J25n5K1k1m4R8l6
$$ -26 -54 15 -20 -39 -44 24 70 -10 188 -27 17 -57 -41 -35 -51 61 -33 62 -9 31 16 -86 39 -16 5 -16 -60 38 2
5246BL2k5p4J42j62J47j5L2qj18J24r4N4P7l5P3j49m1q2Q4P5m0l1QO9J3pj4Kj00
$$ 2 34 9 -65 77 -85 62 47 79 71 -47 77 -17 37 114 79 152 3 -38 -120 -36 39 -1 -32 -24 45 58 51 37 39 -61
5276f1n4J33O0q1L5j7j25P1J20j89J11N5o8k8l6J09o3n4J97n3p8M7K6l9m6m4P0
$$ -61 -115 18 78 -3 32 15 -110 -39 81 -108 3 58 -10 -38 -74 35 -28 -82 115 62 -16 31 57 18 -28 -72 -2
5303bl1K3L4J3JrP3r8m4K8jl6O3l6R9l1o5o5J11Kj6l3K5o3J61n2rm8L2m4o0J15
$$ -2 -33 -10 24 37 38 29 102 4 -40 -12 -13 -49 14 -22 77 46 -19 -84 27 29 13 -20 5 -58 103 51 42 -6 26 -18 -78 37
5335C7Nj65L9O0J8k1k3R8j74K34q6m6L8m2l8J12m9n8N3j03K06n0K7m9L0m0j2j7
$$ 37 42 -123 -84 -24 -6 -27 -50 48 -126 108 22 -24 14 -28 -66 46 -3 -61 -8 -111 95 45 72 23 53 13 1 -16
5363a6N0r2N4M3j14K27k05P6K7l2RJ22j22j39J84j09j5J06K9m4o5Q1j37J34Q4
$$ -16 34 -58 -4 39 -75 152 -53 23 50 18 27 149 27 -112 72 -37 -52 54 83 39 -26 55 -82 52 136
5388A36j65l8P3m6N8J01j52K4m8r5Q5NK5PJ04k49K16k0j50K31j11k8N0K6k6n6
$$ 136 -29 -67 6 -40 18 119 -33 -9 -57 -152 -67 -62 -37 -30 74 -175 41 21 -129 102 -9 -37 13 39 13 -43
5414d3M3l7N4J22j94M2j00Q2j2o4J32l7K9Nj7J23j60L8oJ24j62J28o8L3q5m1P6
$$ -43 0 -37 17 139 -55 -13 -113 -31 -43 -107 25 -12 17 22 5 128 -32 6 0 124 -38 90 22 55 -30 -71 5
5441E%J31m0j26jO8%M9m4l1q6P3j10K00q4n3M6qr7J11Q6n8l9j7P7o7r2L8J26j02
$$ 5 5 136 96 -30 -31 37 37 86 42 11 -75 -2 -112 88 4 -49 -3 -11 -108 3 89 31 -8 -25 52 -15 -107 -69 57 -45
5471d5m2O0J04l0J1nl2n1R5Lj45J14J3n6j5o2J62j9n2K6l7oq2Q8O9j75R0J15q0
$$ -45 -87 -27 77 47 58 53 21 -30 65 68 -77 37 50 -6 -21 -83 79 60 8 34 -3 -9 -91 -3 66 -109 -19 96 16
5500A6J8o0K2Ql4Q2j21J50k9l9k1O2Nr2O5K5o0j3J7J0J28j05N5mj2m3K4L3j09
$$ 16 34 -26 -4 4 -30 52 -69 81 52 13 -8 54 59 -33 32 57 -3 -16 1 11 139 34 89 85 73 30 54 87 -22
5529b2J03j25J01j19Q1J15j90R9o4j2R6N1p0m9J21j89NO2j1K0p5PN8O1k0j02M2
$$ -22 81 -44 57 -62 19 134 -56 43 -21 -33 63 114 44 -5 116 -73 -68 -6 -17 3 -72 -65 -7 54 34 -68 -26
5556b6l5J07n7M8l8j6l4P8q2m3J33o3Q7j00J28q0L8L0q4P0n0L2n8Q2o4L1K5j21
$$ -26 -61 46 -11 37 -1 -17 -51 27 -55 -98 35 -28 59 -41 87 7 45 75 -9 61 11 43 -15 67 3 34 59 -62
5584f2n1J25P9j44k9pJ14Kj3q8Q9n2L1r1N7J90P5k79R1j22L7P5J6j6P3q0L5%m7
$$ -62 -113 12 91 -53 -82 -89 25 27 14 -74 15 -37 -6 -97 -40 150 225 -54 37 -85 -48 27 43 27 100 20 55 55 8
5613HL7j23J06m7J84j81J02K2j55P5Jp4M7j1J2Q4o3K5rj05O0l0J61j78J13q1L
$$ 8 45 -78 28 -19 165 -16 86 108 -47 28 29 -45 2 -9 3 87 24 49 40 -65 -5 -35 126 -52 61 -20 -17
5640a7n2N8r0L7R9L9j62J00O0k7M5o3k0k7j01J79j8Pk3J4p9k4P2rM3n1l1L4Mr0
$$ -17 -69 -11 -101 -64 35 74 -88 12 72 45 90 27 7 -20 -121 58 40 47 24 38 -41 -65 7 -2 41 -10 -41 -7 -3 -93
5670i3J44j1j5m8N4K1j8J8Q4p5j29mQ9o1L5M4j18L6k3N9k9J07j36O3M4j46J11
$$ -93 51 40 25 -23 31 52 34 52 136 61 -68 -72 17 -44 -9 35 -83 -47 -70 -11 -40 67 -69 -6 38 -108 3
5697Cj03J98j47PO9m1N9j01L3J10j02j04J61l1M8pP7j50Q2M2j75J67j30M7OR4
$$ 3 -100 98 -49 -42 27 -14 45 -56 -23 87 -15 -119 42 11 59 52 129 -21 61 103 -72 95 -35 12 18 112
5723A12j25k3J26n5K5qm8L5j3L6k9j01NP7K6j3j3M8j30L0J21j59J53QK8q3n3N7
$$ 112 -13 -36 90 35 60 52 4 39 26 62 33 -68 -63 14 40 27 14 62 -68 -38 83 -76 77 85 113 30 -23 34
5751C4p1J9Qn7J36r3O3m6J9r0J40n5J00j11L8M0n9Ln4P1rK1n1%m7J9j1O2J00k48
$$ 34 -37 -18 -10 -67 69 -24 39 -7 12 -78 62 7 107 -4 34 74 15 18 -36 35 26 47 -4 -4 -51 -32 -43 19 119 -129
5781a29N0J12N3j42K12j07Pp3j75K24j1pj4J20J4r5P6j10L0j06N4l0N1R9j60l
$$ -129 -79 33 86 -56 156 49 56 -17 -192 32 21 14 0 120 134 39 115 5 35 -71 -17 -47 4 103 -57 -60
5807f0O7p9R1L0l6l5N2O2n5O0q7l9M9j43M4N6O8l2p3J02k5l7m4N0m4N3l2J7R0
$$ -60 7 -72 19 49 13 -22 30 92 37 97 10 -29 20 -123 -79 -23 45 13 -60 42 17 -20 -64 -14 -58 -5 -37 -20 70
5836G0k7j09M1%L7P0N3j13k7P2qM4j11n1L5j4k9Kmk9J80j21JR4k50J60J3J26q0
$$ 70 43 -66 -25 -25 12 82 135 22 -5 67 59 103 -8 -59 -24 -38 -67 -65 -69 -98 82 -39 -38 56 -194 -34 -21 105 25
5865B5r0N4l8k7J43p7J5K7q8QJ05p7j9J42j52M6pJ8O2kj2o7N2jJ9J8l7l2kL6j23
$$ 25 -65 -11 -49 -76 67 -10 5 32 -56 -48 57 -20 -39 103 -49 -3 -10 8 70 68 56 -11 41 40 59 77 40 8 6 42 -81
5896h1K9m9N0O4m6R1j34K03o5o2l6P4o7K4l3k4MJ4R3j3N4r6q3J72j17J13n7k9
$$ -81 -52 -101 -51 13 -33 58 -76 127 62 0 -36 38 -29 -5 -38 -62 -58 -44 49 36 90 -6 -89 83 -34 79 22 -7
5924gkP2j11rJ34M5j13M4l0k1O2k0j32J94j06KJ2l1p2J22j21N6j3Q0J9p2L3Rk9
$$ -7 -9 63 -48 -57 77 122 9 53 23 2 64 44 -88 106 0 2 14 -17 -89 33 -88 -32 -45 35 54 -18 15 24 -5
5953ej9J23j05N4qP4j47J28o6L4p9O6q1J28j30r8J46o5j5P7JL3J2K0n0r8P0k5
$$ -5 -24 99 -6 48 40 114 -33 95 29 63 -16 50 -31 97 -33 -131 15 -50 -65 12 13 46 58 78 28 -70 0 -25
5981b5O9j1r2j7P3K3nqj42J22J8k8l6L6J11o4Mr9N8m9J25k2o7jJL6j26P0K5j4
$$ -25 44 33 -59 -76 -3 20 15 7 -135 -13 5 -23 -59 -23 88 24 28 -71 -13 -62 63 41 -26 -27 -26 10 -116 -46 -21 -35
6011c5N2j5P8k5lp1n4J57o3k5J2M5j32N7M9m7O1k8K4NJ8q0o7J21R3j01o9R2j08
$$ -35 17 2 80 55 52 -19 -73 84 21 -4 8 53 -79 -22 27 -20 41 13 37 42 60 -20 -87 34 127 26 -43 49 -59
6040e9J18J0m4N4q7N8m2j3o2L6J4M6m2M2o0p1J57k6L0j01L1J4m0q8J54q1J0Q3
$$ -59 59 69 25 79 -8 50 8 -5 -67 -31 -17 29 -13 29 -31 -102 55 29 59 -42 -11 3 -37 -125 29 -52 -42 41
6068D1M1j30o6J57M1j39j9K59j52q4O9R6j29L6j55J64n5Q1j15J93k21J31m2o4
$$ 41 82 -48 -114 43 84 -55 -74 185 33 -51 18 114 -15 21 -134 30 -25 56 -59 134 -87 44 2 -62
6092f2R9p4J42j94M2M0O4p8k3k0LR8r6J19K5j48PJ33j15M8L4r0k6J03N9q2r9J1
$$ -62 37 -37 105 -89 -47 -7 57 -21 -44 -64 -61 37 -59 60 85 -63 -56 77 -38 10 44 -46 -72 31 90 8 -91 -80
6120h0J41p9M8Ml2O0j24J61j33l0m4J70j69rJ50p7M3k3Q9j9n4J5Rl2J6l5J32j02
$$ -80 61 -18 30 34 2 62 -62 99 -34 -64 -108 62 -107 -116 34 -43 0 -23 66 47 -7 8 17 -15 1 -34 98 -4
6148dJ07j47M4Q5j07o4N3O5m1K2q4N7l3J30r8N2N7j06J5M0Qr4O3j13M6N8o4Q2
$$ -4 103 -44 0 85 -22 -86 -33 32 -9 13 -71 -14 -47 83 -15 37 94 -12 3 43 51 -43 20 -93 -47 11 -53 29
6176B9j27J84k14P6n8J20j2k3RjJ7l1J8J04j33K8O3j51Q2O1j0j09j0J17m6Jn0
$$ 29 -98 86 -128 -52 -110 10 -2 -25 -16 -17 0 -31 -13 91 -42 -14 49 -102 -20 41 31 -78 -88 29 -17 -16 -66
6203f6K9j4Jo7l0J34J48j09j46N1N4p6J28o0j9J20j07r1J08J57j92l4PJ28o0K0
$$ -66 -37 -51 -50 -117 -147 -13 135 26 -120 -69 -15 -91 37 -23 -42 78 -29 -120 -12 145 -47 -81 -74 54 -6 14
6229A4L1J3r8K4m1j10J46K3N6k2N0j13n8J4Q4j7J40j90J31j41J60q5l4j4N6j54
$$ 14 45 58 -40 -16 -57 -167 -21 2 58 36 86 -27 -85 -71 13 -4 136 -54 77 -64 96 11 -23 -37 19 -135
6255a35J39O2o7MK7l8r0J37n4J5P4o8oK7p9O4qp7l4Q5J3j5N6M4j58L7o4J82L2
$$ -135 4 66 -1 3 30 -8 -98 39 -15 0 74 6 0 27 -52 12 4 -73 -107 -22 -9 -24 32 76 -82 -45 -109 73 105
6284A05j85J37no0m9J21k6q7NJ0m8J07Oq1P6m0M5q9K5L9NJ48j60qk6k2O3oj28
$$ 105 -80 57 52 -8 -57 64 38 -49 -44 -34 -82 25 31 -50 26 -14 31 -58 -33 6 11 159 -1 -9 -35 -57 6 0 -128
6313a28P7N0O3lj4m2n1R6q0Ll8J29M1r0j7J00p5k3J8L2r1l3J8P2k1r3J68l5o8
$$ -128 -51 -1 62 59 45 3 -48 48 -32 -29 -67 62 103 13 -4 96 21 -2 16 48 -43 -76 -58 14 -7 -100 68 33 -35
6342c5MJ00q8Jm8k7J21p9J68j48l9J34j35J38Nj03l9K02k31L9J36o3N4j10pP8
$$ -35 -31 69 -19 -18 -66 -93 28 -51 117 -31 -70 64 -71 67 72 -31 -70 132 -99 -60 76 13 67 -43 -50 28
6368B8M1p9j3Q5q4nK08j41k3K8j39J34O2j70J23k2K2n5k7L3L2j6q4J08n5j4rN3
$$ 28 69 -10 -23 62 -22 -27 181 40 17 45 -94 40 102 -68 55 33 55 0 -27 6 38 22 -62 46 -9 -23 -32 21
6396B1J02j32n4J34p7J50k03R1j56J21j1Q2j14O4L7q3O6J4r1P6J3j1n1p1O3P0
$$ 21 123 -9 -63 71 -6 144 -59 32 -124 -3 -14 68 -46 18 55 -28 38 52 -39 37 50 39 -12 -83 -20 50
6422E0n7Q5j56kJ06j35N1J30j08l2J31k4n2J01jj51J15j57J46l5K4L4j07P2M8
$$ 50 -7 78 -78 -80 26 -109 -58 72 -36 -68 63 39 -13 88 87 -64 51 -106 40 5 29 63 -44 28 76
6447G6p8j4p8P1lo4J91j00L7OP6j92J40o8J3j0lqO7L8Q8j70J7m9R9r3m1R0Nj8
$$ 76 -2 -16 -94 -23 -26 -90 101 1 38 44 120 -72 68 0 13 3 0 -8 59 97 185 15 32 -17 82 -11 -52 38 43 25
6477B5o2N1QJ7Nj8j22R2r3J55n4P2r9M6rp5J21p8P5L5m4K3k8pj5m9R7j27j3QQ0
$$ 25 -37 14 22 39 44 26 -96 -4 -97 58 4 76 -23 23 14 -61 60 -18 57 92 48 71 43 36 21 -28 69 -58 -71 -63 17
6508A7kn5Q7p7jjj6Q8q7J5J61m7m9p6J17o1K1N4m0m3j3M9ojj36K3J24m5kM1J7
$$ 17 15 -40 47 -30 -31 -32 -48 40 -47 -32 129 82 33 -43 74 13 34 88 48 5 -8 41 35 34 -102 -79 45 0 -2 39 56
6539E6l4p7M2L8j51J81n7k1qp5R2L9q0J00j4p2J24o1p6R2N4j11J76j13r6J04j04
$$ 56 22 -55 -13 25 -126 55 -2 -23 -31 -106 -14 25 -55 45 31 -41 83 22 -54 38 92 -19 157 44 -52 52 -52
6566e2R5o4K7K7J00k23M1J7M7L4o8O3j7K5j70R8P9J6k7j14N3pJ61j76J06L3j09
$$ -52 43 -21 6 33 133 -90 -49 -32 15 49 -19 44 27 52 -118 -20 59 75 48 -66 -13 -20 141 -35 71 104 -5
6593epk0K3K2J3j18M8J03j30Q8n7K7O0o7K8L9J1l3K2l7p7J3M4o2nO5rl6LJ50r3
$$ -5 -12 -32 -9 13 26 -92 -44 59 -71 17 -40 -13 47 -20 8 47 58 25 47 10 -67 -54 -10 -72 -77 -12 -21 -57 -54 96 3
6624Cj08L6Q5N5n1q9J21j87J42K7r2O3K5m1N6j84J74l8k0O9j10N0J7l1O4M2Nj33
$$ 3 -105 -69 16 71 20 -69 52 -135 7 34 -58 5 30 -11 45 -139 35 -3 -23 46 -64 -14 3 -28 36 78 83 -50
6652e0J02j22N6Qj5LQ6j16j8J32l6p0J05j43jK57k51Q8J3on5N5j0rjm0l5P1O0
$$ -50 52 -70 -14 -6 -21 -18 68 -48 -66 66 30 -40 65 -78 -79 178 -73 15 28 22 -33 22 12 3 2 -38 -73 -2 58
6681E8l9K7m6N2Kp8Q3q1M5Q4l5q9j0M8O2j21R7Mj04Kk8J49r6J5p8J53l5J9m7O5
$$ 58 19 46 0 52 54 -24 59 -22 23 107 72 -17 -27 21 83 -38 59 63 -41 -39 -67 82 -14 1 -77 76 41 60 13 78
6711G8o4j4j4L5o2l1O7j5j12J78j50J08M6o9M2K2l9J6NJ2N1n9l0k9P8k7o2P8N7
$$ 78 14 0 -14 21 -41 -72 -5 -20 -132 46 -104 4 50 -19 23 45 6 22 27 39 90 31 1 -28 50 23 -39 39 96
6740I6n4q7N6M3q5J4jJ30j06O8o4N0o5mL4j1P3n4q6J21k6l1oj28P0K2J29r0k8
$$ 96 42 -45 11 54 -31 -17 -18 112 6 74 10 60 -5 -9 25 14 87 33 -53 68 42 11 5 -123 -53 -31 98 8 -20
6769b0Omj12J15P3n7q5J59o0k1L4j83K18L1Jj78J23q5P6O8q9l8P2k6q5J55j49
$$ -20 -14 -18 -130 -15 58 1 -84 75 15 -6 28 -155 63 94 95 -83 40 -45 31 99 10 -28 44 18 -67 88 -61
6796f1J09k7j5l4MO9O8j50M2R3L8p5o2N3j11J06m8P1j29L5J10j77O7r7K44n2l4
$$ -61 48 21 6 -28 -24 45 113 -37 5 98 136 61 -1 52 -59 47 -1 70 -59 -24 86 -91 -24 -121 123 71 37
6823C7m2j30J39m7J11n0nM9p9j1O2j6j2O8m8m1N3q0l1J67K3k32L3J60N8k40J77
$$ 37 -5 -135 4 -43 68 18 13 62 -17 -28 34 18 6 74 26 -15 38 -42 -73 94 117 -115 -82 78 136 -104 73
6850G3n6L1n4k5j12J78j45J81q6p4J17n1p0M1p2K42j43J9M6j20K8L9l6%l5k6J08
$$ 73 17 48 -6 -31 -143 35 -110 71 -15 -89 28 -23 -93 -52 -124 118 -25 -6 40 -80 -52 -13 -49 -49 -84 -110 -2
6877bL1j7rL6p3qm0O9P1j15P1o4J67l2O5j76jMM9K6j38JJ77j54O6k4n8qJ61j24
$$ -2 29 12 3 39 -34 -42 -82 -13 58 -57 14 -50 117 85 150 -26 -27 -23 26 52 -86 -85 92 -62 4 -20 -78 -86 75 -49
6907d9M3o9L4L3o1J50r5J15o2p0j7l7P7j6R1l4r3k3PR3l6OPj1j6N4P6j0o9l7P1
$$ -49 -6 -75 -41 -8 -69 81 -14 101 39 -31 -48 -85 -8 -24 67 33 -60 -83 -76 17 -19 -13 -6 -17 -33 21 97 87 18 -19 52
6938E2q8K1j5K4l7m6J78j7j06J23Op4j07J18POkL4n5Q1j19n0J88r3k0n4P7p8k6
$$ 52 -36 -15 -30 -6 -43 -89 89 72 -34 89 95 21 -86 32 39 45 43 77 22 103 -16 -66 122 29 9 -45 32 -46 -72
6967g2R3K2q0O5Qo7O7J9p5j2l4Q9O7Rq5L8N5j51nl6J06j45N6n0J03L1pK9n4n2
$$ -72 21 43 -37 28 36 -31 36 55 -20 -32 -66 23 90 99 14 52 107 -44 -49 -85 21 -124 -68 -118 -15 16 9 38 -16 -68
6997f8Q2l2m1P4M6J2j4J6k19R8O1K0l7L4jQ4j19n0O7kM7q4j8jR2l5l8l3J9K3J00
$$ -68 14 -18 -59 15 61 73 59 75 -144 -46 15 35 -2 32 31 115 -4 -54 13 11 58 -26 -44 -45 47 12 -26 -59 -40 -17 83
7028H3Qq4O0J2l2q2o3J33N2j4q6r0J42j30K36j03q3O0j5n9O9Q4l6p4J3M7L7j34
$$ 83 91 7 67 79 47 -35 -98 35 87 73 -13 -103 39 -91 145 42 -41 19 4 -55 14 98 62 -12 1 48 85 -49
7056d9j2l8J78j15J02j09L2P8l6j15J48j48J13l3k0P4j24J63j75k6Q6l8J30pl6
$$ -49 -61 -99 79 -36 66 -43 -11 67 31 -84 64 -84 29 -4 -24 50 -74 89 -86 -112 -26 -64 66 59 23
7081B3l8l3J22j31L9J74j89m3pJ00o0P3j67M4P4R5r1L1K0j6J9l7j2M1nj6R5l0
$$ 23 -15 -48 74 -57 -18 156 -33 -76 -83 17 -43 30 -137 -93 -19 76 -15 16 36 20 39 2 -10 31 26 10 105 75
7109G5j08j0J06r7J58j09l9N4p5J30j14J9nO7j22K14k68J12p7J91j54J34j05Q
$$ 75 -33 -43 63 -34 124 15 -24 30 -45 85 -29 -10 -15 52 -70 144 -124 -12 -89 102 -52 82 -23 -15
7133a5j6J21p4L0J3p4j7N6j4O2k7j33M5j24K07q2Q5r8N0P7pm1n8L0Oj01K15k7
$$ -15 -31 90 16 46 59 -15 -32 24 10 72 45 -88 -43 -167 40 -42 43 -55 -5 72 65 24 -34 -4 2 -99 116 89
7161H9q3m6m3Q9m8P8M1q3K8k6K5q5Q7j22N1L3J8k5M2nl6j3J6Q5p6rk2J5RK6O0
$$ 89 6 -40 -83 6 -42 36 77 -6 22 -4 21 -64 23 -99 -48 -15 3 -22 20 15 -21 -34 -18 67 -9 -18 -40 -25 -16 10 70
7192G0j2j40R9N1q4O7K6j43L1L4m4p3J12J9K4r6K0J40p4l1j7K7j6K5n8m6J65j08
$$ 70 58 -82 17 68 -16 51 77 -66 -35 -1 -45 -118 -6 13 37 -59 -39 101 27 -4 -21 6 -10 15 -43 -89 76 -32
7220c2Q0L3j05p2K5J14l3n6J02j05M6J8q2N3p3J32Lq1p2J43k53J93K7l5M7k7m3
$$ -32 48 81 -24 -96 -71 43 10 -46 56 -49 -3 15 -67 -14 -87 45 48 -33 -105 38 -215 -22 5 -30 17 -10 -53
7247e3O5l4k2J65q7L7j14J08o8L2k7RQ9j61J51M1j27Q8r4o6O8J65j66M5l8m0N6
$$ -53 12 -22 -44 121 34 71 -43 65 -3 29 2 11 100 -61 90 131 4 92 -2 -68 0 165 -1 44 6 -34 22
7274B2o2oN2l7J7L1o7pP5k3K9n4J5N1m7k8Q3n8L2J5P8j88j8j24K74q1j9J44k5
$$ 22 -40 -46 6 -31 -14 17 -50 -57 18 -5 24 -30 -15 36 -11 -39 44 -14 18 33 111 -77 -95 -219 55 -26 -45 99 74
7303G4j38J09K4K1j1o0Mj20J24M4j47P4k1J14p5K1J4j15lK3m0J13N0j37Q5p3L6
$$ 74 -64 45 69 90 79 19 23 -97 27 71 -76 -2 -23 91 16 37 51 -64 -67 -44 -84 29 79 -58 27 -46 -10
7330a0r4J64n0L4O6j12nm1R0m1j9L9j13L1J84j60JN8p7K4J27r0R6q7j18K06k26
$$ -10 -104 60 10 44 110 -2 -7 -48 42 1 -18 21 -92 -61 123 -37 -36 22 -55 -31 96 6 102 15 -103 103 -123
7357a23J71N2j55Q8J2m0n1m0J55o7Ql5J54j21j8l5N8l5M0M3j10L3J8k0L5N4m5
$$ -123 48 100 -55 33 45 5 -46 -86 69 2 10 -25 129 8 -10 -45 13 -22 18 61 -49 -16 2 -18 17 71 26
7384B6r9J35j1j45P7k7M7L2K0j99J01L5J12o0J4pn6k1K9o6O9k6m9K5R7l7n2m1
$$ 26 -73 62 51 -94 -17 -44 3 35 55 -144 -43 -8 104 44 58 51 -5 -26 3 -63 6 -20 -69 -44 53 16 -36 -77
7412g7P7p1J8N2j5N0j38J23j2k7R6o3pn2J67j32j9m9J86j04N8q2O2n9k8P5o7N8
$$ -77 0 -71 -53 -1 -16 34 -104 19 7 -20 76 13 6 -46 121 -11 -30 -79 107 3 61 -21 41 -18 -46 29 -38 20
7440B0qML0N0j87Q3O2j76J47N4j42K8l2N5M4RR6o3r6m7J8N0j81J52P0n3J46r5
$$ 20 12 16 46 96 -91 -8 54 -122 25 79 -63 -35 -67 -12 32 41 137 74 -22 -69 -51 -1 -182 -30 40 -13 133 38
7468C8L3r4J31j08K3J01o6j07N7p0P1o6L6J12l5l5r3P9k0K0o8o4L7N2J10o2q0
$$ 38 71 -23 108 0 23 124 58 -49 8 -62 9 -57 -21 91 56 21 -72 7 -13 7 -61 -125 -88 -36 74 12 -68
7495f8KJ09j13pJ01Q4q7j12K5M9J3r4o0J78k6o5J70p6n6Q7j14J0O8M8Lr9J3L2
$$ -68 -66 43 -70 -77 24 108 21 -91 -66 -17 -4 -98 -158 20 -6 -71 99 23 -33 54 -60 -50 18 66 69 -30 -17 15
7523A5m8L3N3j26R9mp0Rp6J20j3j1J16q1N4j66J05J27j87R4K5j70K1R3M9p7J4
$$ 15 -33 0 53 -73 26 22 -48 -39 -115 5 -8 -19 97 16 70 -96 9 136 -51 43 68 -102 -81 12 61 -16 -2
7550bJ5l1oL8n4m5Q1j0jk3l2J37m4J1o4J21p5m3j1k4J8pj9O1m7O1L0k1P4n4m7
$$ -2 13 -18 -24 14 -40 -85 -4 -14 -15 -38 -70 67 23 34 -30 91 16 -27 -38 -62 -44 -51 -70 -9 -56 5 35 14 88 34 -13
7581a3P5j68J03K6N6j29M4N7j85J55k6n0J62j75J41j6n3N0j6j34O4R1j30l2L0
$$ -13 62 -106 -3 23 79 -50 -6 51 -134 21 -5 -55 107 -68 73 57 4 54 38 -96 -32 59 -71 -103 -73
7606g3N1pJ20n0Mj00O8j51J59m4N1K4J18k21J3M8K6O7m0r3N8o1K0J3J5o6K6J29
$$ -73 -22 -29 91 41 45 -55 13 -138 21 -23 28 52 170 -51 -38 10 36 103 63 -30 28 -33 -13 0 15 -51 -25 104
7634A04j28RJ22j69R7k36K12j25R8r4Q2j3m1J21k5j06P8K5n1P3j58Q3Q2m4L2j11
$$ 104 -24 -15 107 -62 35 -201 11 -114 -16 -110 -28 -41 -82 39 14 -92 -14 11 -40 33 -125 -42 40 -4 28 -83
7660h3P0j0pp8J08j10J60l0k6k8P7n9RMJLQ1q8oJ3k2R4j38J9P8Kj23J63n9k1L
$$ -83 -13 -23 -30 -108 0 -110 50 20 -6 -34 43 -16 -7 -3 -2 1 82 -6 -12 1 -21 73 -65 -46 32 34 -89 74 15 -6 -3
7691cL9p4l0J07j31J04M1M3n6l6n6P5o6J35j21J5N6oo6m7Q8j15K24q6r9L1J11
$$ -3 36 -38 -68 39 -92 12 53 96 40 4 -52 23 -43 92 -29 -14 42 36 -30 -77 11 -104 120 34 -65 -34 77
7718G7r3J45k12J45j28M2J5N5k4l8J17j72M5J02j25L6L3l9k6L2l4MmO3O0q2K5
$$ 77 -16 129 -83 62 -66 -24 -9 46 22 -16 101 -71 -26 76 -49 -13 20 -19 -45 -13 -47 -43 -47 16 76 -6 19
7745A9qJ33j33k4J7k3n0J17j6m7K0k5j68J63K9n0N3j5K8O6j11m2K1R0j29K27j76
$$ 19 11 144 11 -13 4 -19 -69 48 32 -15 5 -20 -188 -25 4 -46 7 -8 20 86 -25 -67 -46 44 -85 142 -34
7772c4lM1l1P6k4J07j96K0R8p0l0Nl2Q4J3Q9j11J12k16J00N9n0L2q0Q0n6l5J4
$$ -34 -37 4 -27 49 25 132 -64 -44 54 -16 -46 -41 -73 11 24 113 2 114 -102 -2 57 7 39 -41 39 -17 -52 -38
7800c8Q3o6P2q9Q5K3ln4l5rl0N7r7J18n1m7P5J4OJ26p6j80J03O7j27J04m0P4K1
$$ -38 45 -21 51 -38 47 70 67 13 -22 -31 -61 -4 -101 17 -34 -81 -6 8 14 140 64 -116 -13 54 -73 31 -9 65 86
7829H6n8m3p9R5k0l2P4j43L3n1J06P4j6o2J34p8p8N9K1l1R5o9p6K5K3l3M4Q6p4
$$ 86 28 -15 -94 1 -19 -51 23 -120 -87 -138 -32 42 26 -36 98 20 -58 1 22 -9 86 17 -59 -34 -11 -44 0 86 12
7858A2rm7J2JJ42k9rj02R6j02J3K4mq3K15m5j18M8q7J25j18J06J5q8K8K0K6j34
$$ 12 3 -44 -32 -31 111 82 73 -29 67 -35 -22 2 -2 -85 130 85 -33 15 -72 53 -65 41 56 -32 -4 16 42 -92
7886i2O0K7QQ3j77J41N0j01o4O2n4P4LLj45P5L9m9N0Qmq0L1J1p2J00J03qj6l7
$$ -92 -32 -5 3 86 -91 50 100 -1 -65 -3 -57 17 20 23 -122 -47 -8 -57 -7 1 -3 -83 -52 -41 -113 -13 90 82 66 29
7916B9Q6n4p6L6m0MR8j3j70J44j80J60P9j48pk8J29K1m0J3n8J7nO7rj73J16J1
$$ 29 115 61 -15 21 -19 -15 83 70 -100 44 -136 24 103 -45 -52 -80 49 70 30 43 -15 2 -3 64 55 -118 -2 9
7944IO1j14l7J1J19J16o5m5N1m8j1K3n0mm8J07o1r3J40n0K8p2M1O6l9m7Q4l6j4
$$ 9 70 -44 -81 -70 49 165 100 55 106 58 47 70 20 16 -32 75 14 -79 61 11 39 -33 8 74 35 -12 72 36 22
7973B2k6Q5j20J40n0k0q3N1J8R4j03l2L7K5nn1M3j03L0N9K6q5N7k8qL3p1%J34
$$ 22 -4 81 -39 101 51 31 -52 -1 17 111 8 -24 13 38 33 -18 25 -78 -48 11 37 -48 9 -19 -27 6 -65 -65 69
8002F9j13Q6j68J20l6Q5j00J6J10j11r3P3P9r3J09oJ6o8jj7O1o0P8m1o6l2J40
$$ 69 -44 42 -126 -6 -42 43 -57 -41 69 -42 -135 -62 17 -76 33 27 43 -25 -26 -43 18 -42 36 -5 -71 -103 37
8029C7l5J18j34O5j04RK5O2J5p5L5p9N3rMJ1N3p0n6k3J81j7j40K1P6j01J68j8
$$ 37 2 120 -14 51 -53 -44 -19 43 58 -17 18 -61 -8 -17 -13 -2 51 -19 -75 -98 83 66 -74 -53 23 -78 90 72
8057G2l9m1om1l8N6j7nj3M4J39r7N6j30J16p0m8M2J90j40J07q6n5L5L4n4p1qJ48
$$ 72 33 -8 -14 -55 -93 -37 -54 -59 -72 -28 111 14 70 -60 56 -14 -62 -20 170 30 137 51 -4 31 65 11 -60 -68 80
8086H0n9j59J53l8N7q4N9o5Q9j8qq5R6k7K6L2p6n7M0J42r6r7k5j6J09L1J8M6O
$$ 80 21 -138 15 -23 34 -50 9 -56 33 15 7 -78 18 -9 17 49 -27 -84 -44 98 2 -95 -120 -136 -27 4 22 68 74
8115G4mm9rn2J28j22l9N4o4Q1j2qr7J21q2q2J26M5K6J8j2n2L4jJ4j56RJ8J04j18
$$ 74 70 21 12 -40 88 -34 -73 -19 -83 -2 -14 -22 -119 2 -80 -162 -36 9 35 53 41 -11 23 22 36 -120 -111 -93 11 -107
8145a07Q9q7J01o5J09n4o5Q8K9k9l9j21J42P2m8J1l1l2K5q3J71j11L9p2mP1p4
$$ -107 -18 -105 -4 -69 40 -14 -79 9 38 9 -30 -151 -9 63 15 26 -5 -37 -12 -95 76 -35 4 -68 -72 -1 -75
8172g5Q5m7N3Rm4lk3LQ3p0K9Q5j07mR1j35j4P3J0
$$ -75 10 -37 16 25 -19 -22 -45 -42 41 -29 0 85 -22 -26 65 -70 -84 -11 -1
8191a
$$ Imaginary data points
##PAGE= N=2
##DATA TABLE= (X++(I..I)), XYDATA
0@%%%%%%%%%%%%%%%%%%%%%Oj4J6j6J6j6J6k1K9l2L3l9M6m9N6o4P1p9Q9r9J08j22
$$ 0 0 0 0 0 0 0 0 0 0 0 0 0 0 0 0 0 0 0 0 0 0 6 -8 8 -8 8 -8 8 -13 16 -16 17 -22 24 -25 31 -33 38 -41 48 -51 57 -65
43f5J36j50J66j83K02k22K44k70K98l27L61m00M43m91N45o08O82p72Q82j017J190
$$ -65 71 -79 87 -96 106 -116 128 -142 156 -171 190 -210 233 -258 287 -321 361 -411 471 -546 644
64F44j423J758k276L194n328K1480K374l3985k486J2751J0029j0790p900P306
$$ 644 -779 979 -1297 1897 -3431 18049 20423 -13562 -16048 -3297 6732 -4058 -11958 -4652
78d652J4711j024j2264k327J6381M438j7332j4857P707J4398r01j3942M95J7801
$$ -4652 10059 9035 -3229 -5556 10825 15263 -2069 -16926 -9219 5179 4278 -9664 -9169 8632
92H632R941j2496j7535J927J6661L065j4590q638Q978R901m019p619O762J1697
$$ 8632 18573 6077 -11458 -9531 7130 10195 -4395 -13033 -4055 5846 1827 -5792 970 12667
106A2667l083j6849p766J3327J4112o853j5491qJ4756N568j0811q435P984J0829
$$ 12667 9584 -7265 -15031 -1704 12408 5555 -9936 -9944 4812 10380 -431 -8866 -882 9947
120I947m322j3539j870J2541O275q723p630O197Q687m932j2200J207J4909O972
$$ 9947 5625 -7914 -9784 2757 9032 309 -7321 -1124 7563 2631 -9569 -8362 6547 13519
134A3519j1685j3067M363J3661J972j1109n845O798O214n217o423N739J0810j087
$$ 13519 1834 -11233 -6870 6791 8763 -2346 -8191 -1393 4821 -396 -6819 -1080 9730 8643
148H643j2288n507Q478P589o011r714K899J1664K237r912n482Q440R589m553j2392
$$ 8643 -3645 -9152 -674 6915 904 -8810 -5911 5753 7990 -1922 -7404 1036 10625 6072 -6320
163f320k973Q237M510n156l290P007O620m975r777J010J0506L348j0293r408M586
$$ -6320 -9293 -1056 3454 -1702 -4992 2015 8635 3660 -6117 -5107 5399 8747 -1546 -10954 -6368
178f368J0738R77p526j369P757L956p335p986K915Q163j24p823k402P279N259
$$ -6368 4370 5347 -2179 -3548 4209 8165 830 -7156 -4241 3922 3798 -4025 -6427 852 6111
193F111m701n734L788P690j759j0641m603P729Q536k460p602k42O585J972n313
$$ 6111 1410 -4324 -536 7154 5395 -5246 -9849 -2120 6416 3956 -3646 -3888 2697 4669 -644
208f44l104M776M123m687p560J660Q860L138o289n130M145N966k705p207m28P549
$$ -644 -3748 1028 5151 464 -7096 -5436 3424 6562 273 -4857 -712 5254 2549 -4658 -5086 2463
224B463L528o066n974K989P137J75n521j645M348J696m902l710M460O918j354
$$ 2463 5991 -75 -6049 -3060 4077 4252 -1269 -2914 1434 3130 -1772 -5482 -1022 5896 4542
239D542p924k727O094N389l049n660O68M974M67n012j785N024M014l211n611M98
$$ 4542 -3382 -6109 -15 5374 2325 -3335 -2667 2307 2774 -2238 -4023 1001 5015 1804 -3807 -3309
255c309N378J126m506k120M075L676l351n464R20O428K454n045m908K103M882
$$ -3309 2069 3195 -1311 -3431 644 4320 969 -4495 -3575 2853 5307 262 -4646 -2543 2339
270B339k09l596j37L734P83m335k905L599M957j100n531j548M366K967k901l300
$$ 2339 2130 -1466 -1603 2131 2914 -1421 -4326 -727 4230 3130 -2401 -3949 417 3384 483 -2817
286b817J800M222p04m899j504L948L624k017l960L80L222K77l136o09L762K138
$$ -2817 -1017 3205 2501 -2398 -3902 46 3670 1653 -2307 -1927 1295 1572 -1564 -2173 1589 3727
302C727l440m255J137M974J580l623k875J907K817j031k831N85L369M63l345k469
$$ 3727 287 -3968 -2831 2143 3723 100 -2775 -868 1949 918 -1913 -1328 2041 2504 -841 -3310
318c310K397L474o43l349m38L029P40k845j820K417L510j007m085j255L086K562
$$ -3310 -913 2561 1918 -1431 -1869 1160 1900 -945 -2765 -348 3162 2155 -1930 -3185 -99 2463
334B463j464k436N61K182o65k515J28L223J591k711l069R52L128O71k514j191
$$ 2463 999 -1437 -876 1306 641 -1874 -1746 1477 3068 357 -2712 -1760 1368 2039 -475 -1666
350a666J866J610j655k285R34K912O75k751j810J383J907n74j471M09K155p0k668
$$ -1666 200 1810 155 -2130 -1196 1716 2391 -360 -2170 -787 1120 546 -925 -516 1639 1569 -1099
367a099j300K293K550q23l203p59K133J557r65j165J066J361j055k340N3K395
$$ -1099 -2399 -106 2444 1621 -1582 -2341 -208 1349 384 -781 285 1646 591 -1749 -1696 699
383F99R67j652j648Q76J838j9j620j19J746O26j987k077P55K471O38j460r88J033
$$ 699 1666 14 -1634 -758 1080 1061 -559 -678 1068 1694 -293 -2370 -1615 856 1494 34 -954 79
401G9Q21n84j031P09J304o31k220n79J729J956k78j666k16J214J30j192p12J056
$$ 79 900 316 -715 -6 1298 667 -1553 -2132 -403 1553 1275 -391 -607 607 737 -455 -1167 -111
419a11J140q00j377j13J562R87q00p86L79O29q46j007J76J747N25j463j340O02
$$ -111 1029 229 -1148 -1261 301 1288 488 -298 81 710 -136 -1143 -967 780 1305 -158 -1498 -896
437h96J581M65j013m42M49R3o82n93Q73J164l29j269l80J020P44l43p20P6Q02
$$ -896 685 1150 137 -305 144 237 -445 -1038 -165 999 670 -599 -979 41 785 442 -278 -202 600
456F00l58j066m26J177R75l55j055j65P81M89k54l29K97Q4p37j021N16J393M79
$$ 600 242 -824 -1250 -73 902 547 -508 -673 108 597 343 14 311 395 -342 -1363 -847 546 1025
475A025p13p62K77Q52j8q48j01M23n1p37l85O31J174J51n80l94K60P3n24m28M89
$$ 1025 312 -450 -173 679 661 -187 -288 135 84 -653 -1038 -407 767 918 338 -56 204 277 -247 -675 -186
496a86M20k85p69J45R09Q17O5r24l77L4o0l45Q0O34K20m71l15J45R37J92m94o06
$$ -186 234 -51 -820 -675 234 1051 1116 192 -185 -151 -211 -556 -476 158 378 -93 -408 -263 674 866 372 -234
518b34j7J35k78k34N05N94K93n84m50P4N82q2l49j70O0j40j14K0N94O14l19o99
$$ -234 -251 -116 -394 -628 -123 471 764 180 -270 -196 386 304 -45 -215 -155 -295 -409 -389 205 819 500 -199
540a99l01M13M88k60j82rM2j12l32K86L67K84l19n23P1L35O7K3j50J36q2m68L0
$$ -199 -500 -87 401 141 -41 -50 -8 -120 -452 -166 201 485 166 -357 -286 49 116 139 -11 125 43 -425 -395
563c95J73O34J77m12m35R0K30J04j74n8Q0j93l12J92M81M05q6l03k29k54J60q1
$$ -395 -222 412 589 177 -258 -168 62 166 -8 -66 14 -179 -491 -299 182 587 501 198 -31 -285 -125 -206
585b06J29N8J28k43p9P5L44L70j91l12l19j13qJ60J79K33J23l05j35J64L07Mk93
$$ -206 -77 -19 109 -134 -213 -138 206 576 385 73 -246 -359 -367 -207 -28 205 328 23 -112 52 359 363 70
608G0l93k1j44J99L43K02J35j30k75j40J08K2N4r4j07N4J1l9K50L05%l42k98p5
$$ 70 -323 -344 -488 -289 54 256 391 261 -14 -154 -46 -24 30 -64 -171 -117 -106 -145 105 410 410 68 -230 -305
632c05Q4K33K37j22j37Jj34K8J35K02K4l42k19J15J04K11K8J15j01k17o3JJ98
$$ -305 -221 12 249 127 -10 -9 -143 -115 20 222 246 -96 -315 -200 -96 115 143 258 157 -60 -123 -122 76
655G6J33n9j46p3k07J06K81Q1Oj18k26j05J27J17L38k52k5k80j0J07K32q4M7m8
$$ 76 209 150 4 -69 -276 -170 111 192 198 80 -146 -251 -124 -7 331 79 54 -226 -236 -129 103 19 66 18
679A8j26m8Q7K22J52p7j43k18J30k15J92J79n2j06p6j42R3K60j3%j01j95n6J34
$$ 18 -108 -156 -69 153 305 228 85 -133 -3 -218 -26 153 101 -5 -81 -223 -130 130 117 117 16 -179 -235 -101
703a01K35N9q1j20j62O9%K77j58K8j05k2jP4N5P9Lj32j35n7O9J94K8N2m8j45l1
$$ -101 134 193 112 -8 -170 -101 -101 176 18 46 -59 -81 -82 -8 47 126 129 -3 -138 -195 -126 68 96 148 100 -45 -76
730g6L1J48J21r0k92J5N2n5K12P2jj91j51J44k5K31l9o0q9o6k9J00J78p9n5L9
$$ -76 -45 103 224 134 -158 -143 -91 -146 66 138 137 -54 -205 -61 -86 145 106 46 -43 -109 -138 -38 140 61 6 45
756D5m4n3J7J03Q2P5l59P5m9J57O0L1j4k11P7j54J40J39L1j14o7j54N7P1K7J67
$$ 45 1 -52 -35 68 150 225 -134 -59 -108 49 109 140 126 -85 -8 -162 -22 117 148 34 -33 -187 -130 -59 -32 135
782A35j14q7k7K2JJ67J69r3k72L7k2J9O0M9L8n4k02Q1J35R2r2pn4j59J36M5M4
$$ 135 21 -66 -93 -71 -70 97 266 173 -99 -62 -84 -65 -5 44 82 28 -174 -93 42 134 42 35 -19 -178 -42 3 47
809D7P6j37P7j65J42m9L5O6j50M8n3K0K22m7M6j52o3p8mM5N1J20j33jl5L0M5J20
$$ 47 123 -14 63 -102 40 -9 26 92 -58 -10 -63 -43 179 132 178 26 -37 -115 -119 -74 -23 97 -36 -37 -72 -42 3 123
837A23j0j07q3j57K09J2L6O2N8J6j86j00J91r9R5k20J10p3O9J78JN3Mk26L8j68
$$ 123 113 6 -77 -234 -25 -13 23 85 143 159 -27 -127 64 -35 60 -160 -50 -123 -54 124 125 178 182 -44 -6 -174
863a74Q5R6j0N9j25J7P0K1J14o9k00J20j24q1Q9K50k5k6k00Q8j02K07m9P5m6r8
$$ -174 -89 7 -3 56 -69 -52 18 39 153 84 -116 4 -120 -201 -112 138 113 87 -113 -25 -127 80 31 106 60 -38
889c8j13L4J46J79j80k1n7l7L7L8M8L6J1p5j75P7J11o2J3O7p6R0rM1q7J0l3kn9
$$ -38 -151 -117 29 208 28 7 -50 -87 -50 -12 36 72 83 8 -167 -90 21 -41 -28 39 -37 53 44 85 -2 8 -25 -27 -86
918h6J14n2N7K8j1O9j18n1M9J65r0p9q0o0J04Q2L9J44k98n0N7K4J61p2n6j17J10
$$ -86 28 -24 33 61 50 119 1 -50 -1 164 74 -5 -85 -145 -41 41 80 224 -74 -124 -67 -43 118 46 -10 -127 -17
945a7p8J93m0n3j5j7m5K6j02J58J64j67oq4J09O8L0n0N3j16j43nk1J90L4jj77
$$ -17 -95 98 58 5 -10 -27 -72 -46 -148 10 174 7 1 -83 26 94 124 74 127 11 -132 -137 -158 32 66 65 -112
972a12Q4J07r3J72j51o6kJ8l2J33m1J76j33kj28mL3k0J17k7n5o2J36j9pK4K9m4
$$ -112 -28 79 -14 158 7 -59 -61 -43 -75 58 17 193 60 58 -70 -74 -41 -61 56 29 -26 -88 48 29 22 46 75 31
1000C1k4k7j25J97p8J11n7Pp6N7J38l1r9m8N6j37J41k5M6j06J23j23M2K7L4J5
$$ 31 7 -20 -145 52 -26 85 28 35 -41 16 154 123 24 -24 32 -105 36 11 57 -49 74 -49 -7 20 54 69
1026F9o7N2j02o3L7N8jQ5j4k15M3J39R4j88J28j73J4MJ10m8P6m0n8K3L0k2Q1q9
$$ 69 2 54 -48 -111 -74 -16 -17 68 54 -161 -118 21 115 -73 55 -118 -104 -100 10 -38 38 -2 -60 -37 -7 -29 52 -37
1054c7pp9L3k9J04J45p4o7j05JM7J37l6K2J5oj98N6J16J0q5R1j33L4O1j4o4J59
$$ -37 -44 -123 -90 -119 -15 130 56 -11 -116 -115 -68 69 33 55 70 64 -134 -78 38 48 -37 54 -79 -45 16 2 -62 97
1082I7k3r2o0K6j3Q0O0j32k0K3QJ7O7K7L4j26j53J8J62L6N5j27o9M5J54j40R7
$$ 97 74 -18 -78 -52 -65 15 75 -57 -77 -54 -46 -29 38 65 99 -27 -180 -162 0 36 91 -36 -105 -60 94 -46 51
1109E1MOj39L0K8JJ63j02j82J47o7J57j44N5K9o4p5J52j31J38J28j79P6j4n2J0
$$ 51 55 61 -78 -48 -20 -19 144 42 -140 7 -60 97 -47 8 37 -27 -102 50 -81 57 185 6 82 68 16 26
1135B6k5K0N5p3j3r6J30Q4r4n2L3nJ5m3R4n3J0J3j98K31p5P4o3j7J03r7O9j30
$$ 26 1 21 76 3 -10 -106 24 108 14 -38 -5 -10 5 -38 56 3 13 26 -172 59 -16 58 -5 -22 81 -16 53 -77
1163g7K13j60N7r7j4p4Q1N6J61K0j63Q8j17O5o5J34j39m7J02LR4j03P2K3j56j12
$$ -77 136 -24 33 -64 -78 -152 -71 -15 146 166 3 91 -26 39 -26 108 -31 -78 24 27 121 18 90 113 -43 -155
1189a55J76l7N8n2j0K7K7o4L3q0J20m5n9N5m7L2PK36l36J73o3r4J24J5q2M6nM0
$$ -155 21 -16 42 -10 -20 7 34 -30 3 -77 43 -2 -61 -6 -53 -21 -14 222 -114 59 -4 -98 26 41 -41 5 0 40
1217D0p9R5r2j2O0R9r1q7J2R1m7O5j0n2L9J10p1l3k2k8L8j2j1J07L5q4rJ0L7j07
$$ 40 -39 56 -36 -48 12 111 20 -67 -55 36 -11 54 44 -8 31 141 70 37 15 -13 25 13 2 109 144 60 51 61 98 -9
1247iq8J02q3m4N5K0J4J65j44J44q5j06p3R5P1o1J09r3j47J48kO8rPj59J7R2r
$$ -9 -97 5 -78 -122 -67 -47 -33 132 -12 132 47 -59 -132 -37 34 -27 82 -11 -158 -10 -12 56 47 54 -105 -88 4 -5
1275eop0qJ09o2N4r5J60P9k30L9R5j41Q7m6R7r4j85K38M4n4n3J14j04J04Ql4j12
$$ -5 -11 -81 -89 20 -42 12 -83 77 156 -74 -35 60 -81 6 -40 57 -37 -222 16 60 6 -47 67 -37 67 75 41 -71
1303g1J23n2J01j32Lk3J23q7J5r3L3J9m6K05j72J0PK8oPP9l0L5L1j22P3N6k63
$$ -71 52 0 101 -31 -28 -51 72 -15 0 -93 -60 -41 -87 118 -54 -44 -37 -9 -15 -8 71 41 76 107 -15 58 114 -149
1331a49J45Q8OLj1j10%Or5J31mj49O2R3j19J34m8j36J52p8M9j68Q0J73l1n0lJ47
$$ -149 -4 84 90 93 82 -28 -28 -22 -117 14 10 -139 -77 16 -103 31 -17 -153 -1 -79 -30 -198 -118 55 24 -26 -29 118
1359A18n2p1J18j73K3j4J2N7j8J29j05L1o0O1j5p1N5p6n9O3O9L8NK2k02J25r0
$$ 118 66 -5 113 -60 -37 -51 -39 18 0 129 24 55 -5 56 41 -30 25 -51 -110 -47 22 60 65 87 -115 10 -80
1386h0rOJ58j70R0o1N3L8lN2k9l3MLn3Q4O0j60N5PJ41j64rM1mqO3o9L4j39N0J31
$$ -80 -89 -83 75 -95 -5 -66 -13 25 22 74 45 12 16 19 -34 50 110 -50 5 12 153 -11 -20 21 17 9 72 3 37 -102 -52 79
1418G9Jq9k3j8J76j17N5l6J2l3jm2m4J14j41J32o3kJ24m8j4Rk6ql2J47j19o8P8
$$ 79 80 -9 -32 -50 126 9 64 28 40 7 6 -36 -80 34 -107 25 -38 -40 84 36 22 31 5 -3 -35 112 -7 -75 3
1447Cp2Q8l6N1m0J51k26n0K22r9k1J13q7m1j5k0N6K17j29j38J5N5j51R2J39q1
$$ 3 -69 19 -17 34 -6 145 -81 -131 91 -8 -29 84 -3 -44 -59 -79 -23 194 65 -73 -58 -3 -154 -62 77 -4
1473dP1j95J28m7R1J06k13Ko4J09K9n2J42j55m5J46q0J2j0K5j11P4J%l4J1k2O1
$$ -4 67 -128 0 -47 44 150 -63 -61 -125 -16 13 -39 103 -52 -97 49 -31 -19 -29 -4 -115 -41 -40 -40 -74 -63 -85 -24
1501b4O7l2rN6Poj8j03J18n0o2j6R1l6p4J26o8l5J7P4p5n5Q1M4o9k5Q3lM4m5k2
$$ -24 43 11 2 58 65 59 41 -62 56 6 -56 -72 19 -17 -91 35 -33 -68 -51 23 -52 -107 -26 18 -51 -76 7 4 48 3 -19
1532a9P2k8p5P0l3p8J01l2M6R5l6j12j8R9o2Q8n2m2pLR0j81J05R2j07q3J38j2
$$ -19 53 25 -50 20 -13 -91 10 -22 24 119 83 -29 -47 52 -10 78 26 -16 -23 -20 70 -111 -6 86 -21 -104 34 22
1560B2l5J04j77J12m6L3j34J64%nL2j83K01r0J7l7M2N6l5k3n6J5k1J60j10p4J41
$$ 22 -13 91 -86 26 -20 13 -121 43 43 38 70 -113 88 -2 15 -22 20 76 41 18 -38 -23 -44 116 6 -68 73
1587G3oj30O4J11j02k6l9K5J28j20P0j65R2K5M5k2M6r9Q0J06k38J57p2M6J15q2
$$ 73 67 -63 1 112 10 -16 -55 -30 98 -22 48 -117 -25 0 45 23 69 -30 50 156 -82 75 3 49 164 82
1613H2q2ML0K7r7N5J29k22k9J69N9o8j29O5m2l8J36j3M6J0k9q4j11J59k5r2J00
$$ 82 0 4 34 61 -36 19 148 -74 -103 66 125 57 -72 -7 -49 -87 49 36 82 92 63 -21 -132 27 2 -90 10
1640A0L5r0P7L0K5j23J1J14j66K4R3KN9l6l0jJ9K5j79R7N9o7rJ8K2l9k4Q0j37
$$ 10 45 -45 32 62 87 -36 -25 89 -77 -53 40 42 101 65 35 34 53 78 -101 -4 55 -12 -21 -3 19 -20 -44 36 -101
1669a01J16o5qM5j22J76l4m8J78k23jL1R2o4kl5K0N9R2j0j06n7P2O9j85P1O5q9
$$ -101 15 -50 -58 -13 -135 41 7 -41 137 -86 -87 -56 36 -28 -30 -65 -45 14 106 96 -10 -67 5 74 -111 -40 25 -64
1697f4n5J94k3p3k1J91n4j4l5r7K1j2pJ1j8j5Q0j0L1m3r6J67pj52J9R9m4qRj2
$$ -64 -119 75 52 -21 -42 149 95 81 46 -51 -30 -42 -49 -38 -56 -71 9 -1 30 -13 -109 58 51 -101 -82 17 -27 -35 -26 -38
1727c8Q4J4r6k8J81J03k31o3lJ30j24J70Kk9p8n4j40J44J98j23j29Q4Q3m6PJ5
$$ -38 46 60 -36 -64 117 220 -11 -74 -77 53 -71 99 101 72 -6 -60 -200 -56 142 19 -110 -26 57 11 18 33
1753C3j00J38K2m8n8l8N5N3O8j65R4m6oJ37q9M1m6J0J9m3L7j08L9p8L9J38o8m4
$$ 33 -67 71 93 45 -13 -51 4 57 125 -40 54 8 2 139 50 91 45 55 74 31 68 -40 -1 -79 -40 98 30 -14
1781a4p9J32O1k01R4r4J08m0l5K4k5Q9PM6k3l4n9R5k7j5K5k4o9P3M0n0j23K48
$$ -14 -93 39 100 -101 -7 -101 7 -33 -68 -44 -69 20 27 73 50 16 -43 52 25 10 35 11 -58 15 55 5 -118 130
1809A30j36m7J27o6j5qp4M5P1j19J83r9ln4J18o6k02K08K2n3l9J02N1p3M5k7N5
$$ 130 -6 -53 74 8 -7 -15 -89 -44 27 -92 91 -8 -11 -65 53 -13 -215 -7 15 -38 -77 25 76 3 48 21 76
1836G6P5r7r1lJ6PQn3J5J35o1P0j66R5q3ok8j6J57j0M1j18J18q1M1k2j7J5Q4o9
$$ 76 151 54 -37 -40 -24 -17 -9 -62 -47 88 27 97 -69 26 -57 -63 -91 -107 50 40 81 -37 81 0 41 19 2 17 101 32
1866C2O3o9Qm8rn7m3J36J0N5p9N2q6O9j30J12pL2l4n3P0L5O1j31K4jL4j27L3P9
$$ 32 95 26 34 -14 -23 -80 -123 13 23 78 -1 51 -35 34 -96 16 9 41 7 -46 24 59 120 -11 13 12 46 -81 -48 31
1896C1KN6k71J85Qq6P5M7o5o3K08j51M6p7p3K02q0Q9r2K2j01J08k7O2j01M7q9
$$ 31 33 89 -182 3 11 -75 0 47 -18 -81 127 -24 22 -55 -128 74 -6 83 -9 13 -88 20 -7 55 -46 1 -88
1923h8j6M7QN5O2j06R3o7J41N4r8j64O4M1J9nm3K4J0k0j28J39oom5K7j1k5O6L8
$$ -88 -104 -57 -49 6 68 -38 55 -12 129 183 85 -79 -15 26 45 40 -3 21 31 11 -117 22 16 10 -35 -8 -19 -44 22 60
1953F0n4K0M7n3n2Om7R2q3o0J29J17j49Q2Lm8j8m8J48p5K0J07k30jK9J02n0l1
$$ 60 6 26 73 20 -32 -26 -73 19 -64 -124 5 122 -27 55 58 10 -8 -56 92 17 37 144 -86 -87 -58 44 -6 -37
1981c7J87q0m3k1J9rN2J00l6j28L8K1J0j52J05nO1r9K6P3k9j16J48j52n1N2L0
$$ -37 150 70 27 6 25 16 68 168 132 4 42 63 73 -79 26 21 82 -17 9 82 53 -63 85 -67 -118 -66 -36
2008c6O8j8N4j02k5kJ60j22l2L4M6o7M5N2q0O1j68P5J11l3J7q4J9J2N9qj1j25
$$ -36 32 14 68 -34 -59 -61 99 -23 -55 -21 25 -42 3 55 -25 36 -132 -57 54 21 38 -46 -27 -15 44 36 25 -100
2036a00J53N1j31L7j2R1p2j10J14Q0j62M5q8N1J29N6j77Q7m7Kk5L4m3N1n0J16
$$ -100 53 104 -27 10 -2 89 17 -93 21 101 -61 -16 -104 -53 76 132 -45 42 -5 -3 -28 6 -37 14 -36 80
2062H0n9M1K3k6n9m4O2k4k5m6J38j41J71n2l5N0n5K9l3p4O1j0NK8O0k4j5n8J2
$$ 80 21 62 85 59 0 -44 18 -6 -31 -77 61 -80 91 39 4 54 -1 28 -5 -79 -18 -28 -23 5 65 41 26 -32 -20
2091b0L4plp4M5R2O6j71kK07j43O7j31r5K19o8L9j04J09n6Mj5J3J04m0j47J43
$$ -20 14 7 4 -70 -25 67 133 -38 -40 167 24 91 -40 -135 84 16 55 -49 60 4 8 -7 6 110 70 -77 66
2118F6J8j02J09j67J39k6j49rl0P6p3J17N4j30J20N1r6j00J66n0k8M1q3J11K5
$$ 66 84 -18 91 -76 63 37 -112 -121 -151 -75 -148 -31 23 -107 13 64 -32 -132 34 -16 -44 -3 -86 25 50
2143E0mRj27J23p9P5j83J7J07j13N8J5J25jk9k06K12L3j12j9PJ34l3mL3k4j10
$$ 50 46 55 -72 51 -28 47 -136 -119 -12 -125 -67 -52 73 72 43 -163 49 82 -30 -49 -42 92 59 55 88 64 -46
2170d6L3L5L1r5J04j65P5o4J26J3m2J9P8j35%M2r0P8j01M4QJ14j08J8K4j5m3J47
$$ -46 -13 22 53 -42 62 -103 -28 -92 34 47 5 24 102 -33 -33 9 -81 -3 -104 -60 -52 62 -46 -28 -4 -19 -62 85
2198H5j41K1L3N2j4k9m8L1j1j22J8M1J45k2n1J2J10j41P7p0m5K4L0k2J4k9J22
$$ 85 -56 -35 -2 50 36 7 -41 -10 -21 -143 -125 -84 61 39 -12 0 110 -31 46 -24 -69 -45 -15 -37 -23 -52 70
2225G0j25K9J09n9mmP9r4l4ol1P0M6m6POn8l1J02r3O9P8q7J2J5L2j04j2O1l1Q5
$$ 70 -55 -26 83 24 20 16 95 1 -33 -39 -70 0 46 0 7 13 -45 -76 26 -67 2 80 -7 5 20 52 -52 -64 -3 -34 51
2256E1k6Rj0j15L9R0p8ml8P2q1M6J06j30JN6r3N4M0l7l5O1Q9Pj46%jJ39o9m4P7
$$ 51 25 34 24 -91 -52 38 -40 -44 -82 -10 -91 -45 61 -69 -68 -12 -105 -51 -11 -48 -83 -22 67 74 -72 -72 -73 66 -3 -47 30
2287C0M1j03LnJ01j37J46o7jJ36j46qQ9j14K6P4j06M5M8k8j21Q2NQQ0P7j63j0
$$ 30 71 -32 -29 -34 67 -70 76 9 8 144 -2 -10 79 -35 -9 65 -41 4 52 24 -97 -15 -10 -2 78 155 -8 -18
2315a8l6M8LJ0OKr6J42r2K6o5J58j67K8j6OR6N6m1j30R4m1R7n8K1p0N5P0p7J25
$$ -18 -54 -6 -3 7 13 15 -81 61 -31 -5 -70 88 -79 -51 -67 -61 35 91 50 -80 14 -27 70 12 33 -37 18 88 11 136
2345A36j13jl3m1J31ll2n3N2j2J7o4J0Qr6J14l7q3J37l6Rj12R5N7j35R2k4J5Q0
$$ 136 23 22 -11 -52 79 76 44 -9 43 31 48 -16 -6 2 -94 20 -17 -100 37 1 10 -102 -7 50 -85 7 -17 -2 78
2374G8j15N3q0J52pk6m9k8OJ18j46M0K1k8O4k3p0pJ30lp7J25j41l8Q9m5m7K2Q6
$$ 78 -37 16 -64 88 81 55 6 -22 -16 102 -44 -4 17 -11 53 30 -40 -47 83 80 3 128 -13 -51 38 -7 -54 -32 54
2403E4k8p9J54Mj20P9j19O1O4r7R5n8M4j14O6Oj8K5j1r8J43O4j38K1k4j9j7L1
$$ 54 26 -53 101 105 -15 64 -55 6 70 -27 68 10 54 -60 6 12 -6 19 8 -90 53 117 -21 0 -24 -43 -60 -29
2431b9K9k3Q7m4K1p0R1r6p8Q5O7o2O9r8K2M3J3%q7ql5J51r2J00q4N7n9k5RP5j17
$$ -29 0 -23 64 20 41 -29 62 -34 -112 -27 40 -22 47 -51 -29 14 27 27 -60 -68 -103 48 -44 56 -28 29 -30 -55 -46 29 -88
2462h8J07k7n8J55l8n5J3K2n4L5M7k6N3n6m0J44j49J52k0o7m5J03o4J09k39J0
$$ -88 19 -8 -66 89 51 -4 9 31 -23 12 59 33 86 30 -10 134 -15 137 117 50 5 108 44 153 -86 -76
2488g6J36L2o5n3Q8MK6j27O4r6rl7Q0Q3j69J60q8pJ15o4om6J79l4p8jo9M4j4p
$$ -76 60 92 27 -26 62 66 92 -35 29 -67 -76 -113 -33 50 -119 41 -47 -54 61 -3 -9 -55 124 90 12 11 -58 -14 -28 -35
2518c5n0K0M2Q2o7L3j02J34r8M2L2r8K8m9P6N6n3m1J10m3J07o4r6k1J74j42M7
$$ -35 -85 -65 -23 59 -8 25 -77 57 -41 1 33 -65 -37 -86 -10 46 -7 -48 62 19 126 62 -34 -55 119 -23 24
2545B4Mp7K09j19q4k3J93n5j71O1kO3r0J04om9j1J1K3k5m1J35j13%J27q7n6NK9
$$ 24 28 -49 160 41 -43 -66 127 72 -99 -38 -40 23 -67 37 31 -18 -29 -18 5 -20 -61 74 -39 -39 88 1 -55 -50 -21
2574b1N6J1j10R9r9Q0P7j5J3l6p5k7J14j87O7L6J43j39J73j33k8pM4j6o2m1Q3
$$ -21 35 46 -64 35 -64 16 93 78 91 55 -20 -47 67 -120 -53 -17 126 -13 160 27 -1 -8 36 20 -42 -83 0
2601@L3p7J15q2J31j08l4m3o9K17j20l5J21j16L1R0j5q9J6M6j2n4O9J19j60J0
$$ 0 33 -44 71 -11 120 12 -22 -65 -134 83 -37 -72 49 -67 -36 54 39 -50 -34 12 0 -54 15 134 -26 -16
2627a6m1J7M4J8J8r7j9L2J05j8n6R9q6jK4%o9k3J71p7QL1j27N1O2r0L4m9J40j19
$$ -16 -57 -40 4 22 40 -57 -76 -44 61 43 -13 86 0 -1 23 23 -46 -69 102 25 33 64 -63 -12 50 -40 -6 -55 85 -34
2657c4K7rn6K17j45o3M5K5p5J24r1N3qL6n5NM8j27R5K0LM0m9k5l4Q7l1k6Kp1K
$$ -34 -7 -16 -72 145 0 -63 -18 7 -68 56 -35 18 10 46 -9 -4 44 -83 12 32 35 75 26 1 -33 54 23 -3 -1 -72 -70
2688g0k4R7n8N0j43J83L8l5q3k3P7q0R8n3J2J9J6p6N4M6j57M7k0J23P5q1o8nN9
$$ -70 -94 3 -55 -5 -148 35 73 38 -45 -68 9 -71 27 -26 -14 5 21 -55 -1 45 -112 -65 -85 38 113 32 -36 -41 18
2717A8l7J62k19N6m6O6n9M5P3o0O3q0M2n7K6j24J49Q5j19M9PR0j56J4n4R1J7j57
$$ 18 -19 143 -76 -20 -66 0 -59 -14 59 -1 62 -18 24 -33 -7 -131 18 103 -16 33 40 130 -26 -12 -66 25 42 -115
2745a15K11j17M0L3j2p7n9J01r8J49p9K01k70R8k5m5J7Pr2N9R2j4P5m6o9n9P6
$$ -115 96 -21 19 52 40 -37 -96 5 -93 56 -23 178 -92 6 -19 -64 -47 -40 -132 -73 19 5 80 34 -35 -94 -18
2772a8N1L3L7n5k4n4J8pmQJ8nq1k7J01j0m3K5K6m7L5l1qm9Q2O3n0n4Q9k8k2k4
$$ -18 33 66 103 48 24 -30 -12 -19 -23 -15 3 -2 -83 -110 -9 -19 -62 -37 -11 -58 -23 -54 -62 -111 -29 34 -16 -70 19 -9 -31 -55
2804e5o3J49kkj0n7P7Q6j35l8M4K4n5m4L8J04j02k6J6LJ02j29N8K9p3R6n5J8J
$$ -55 -118 31 29 27 17 -40 37 123 -12 -50 -6 18 -37 -81 -43 61 -41 -67 -51 -48 54 -75 -17 12 -61 35 -20 -2 -1
2833aj38O5P0l5qJ16M2j40P3j00P2m3J08J4j38R7j60K66j39r2J1J2K6N9q1O0l0
$$ -1 -139 -74 -4 -39 -47 69 111 -29 44 -56 16 -27 81 95 -43 54 -106 160 21 -71 -60 -48 -22 37 -44 16 -14
2860a4nKm5R4m5J03j19m6P3P8o9Jl0N7m2M0Q1j14M7K3j19k6j54K45J4l1M7q4N
$$ -14 -19 -17 -62 32 -13 90 -29 -75 -2 76 7 8 -22 35 -7 33 114 0 47 70 -49 -75 -229 16 30 -1 46 -38 -33
2889c3k5J17Lq2L1j29M8O9j2K7k3o6m4J72j02P2o0J8jPrN8j12N2L8l8LO3p4O7
$$ -33 -58 59 62 -20 11 -118 -70 -1 -13 14 -9 -75 -119 53 -49 23 -37 -19 -20 -13 -22 36 -76 -24 14 -24 -21 42 -32 35
2919C5M6r9L0j16J06N7j50J29p6P5R6oj96J4Q3o3J53j50k0O7K8n6j6K1j5N4j34
$$ 35 81 -18 12 -104 2 59 -91 38 -38 37 133 127 -69 -55 28 -35 118 -32 -52 15 43 -13 -29 -8 -23 31 -103
2946a03R9M5j27J15J9q2L6m0P0O0j78J28k3K7q6P4M0k5N1o0n4j9m6M8K3k5j2L6
$$ -103 -4 41 -86 29 48 -34 2 -38 32 92 -86 42 19 46 -40 34 74 49 100 40 -14 -33 -79 -31 -8 -33 -45 -9
2974iO9Rj25M3P9m4j19Q4J06m5n5K9j25PJ9J00p6K2Q8j79L3Q6M5n8Q0j26J5L2
$$ -9 60 69 -56 -13 66 22 -97 -13 93 48 -7 22 -103 -96 -77 23 -53 -31 57 -122 -89 -3 42 -16 64 -62 -47 -15
3002a5O9m2K5m9k1P8r2j8J17OJ5j3l6N1ll1ljj4o4NQ9j14jK4J12j30J11j0m0m1
$$ -15 54 12 37 -12 -33 45 -47 -65 52 58 73 60 24 75 72 41 38 37 23 -41 -36 53 -61 -62 -38 74 -56 55 45 5 -36
3033c6n1R7Po4M6Lk1n0P2J07j57kJ08r9N8k8Q1r0j9k0J63j81P9j32J32N8j77K8
$$ -36 -87 10 17 -47 -1 2 -19 -69 3 110 -47 -49 59 -40 18 -10 71 -19 -38 -58 105 -76 3 -129 3 61 -116 -88
3061h8J42n7On3N9q5R9l1j04J65q9P1Rr9L7NM9o2M8m6n2J04J30j96mM3KNK1Nm6
$$ -88 54 -3 3 -50 9 -76 23 -8 -112 53 -36 35 44 -55 -18 -13 36 -26 22 -24 -76 28 158 -38 -42 1 3 8 29 34 -12
3092a2O0rj6k7J4j54J70m1m3Q3r8N9J5R2j21l7N7O1o5J4J2k8r5P4Ol4P8j08P9
$$ -12 48 39 23 -4 10 -144 26 -15 -58 25 -73 -14 1 93 -28 -65 -8 53 -12 2 14 -14 -109 -35 -29 -63 15 -93 -14
3121a4j07P6L6j8p8J09pk2n6l5K11j65R0k2j0J62j41M8l8k2r3L8Q1K6N2q8q4M0
$$ -14 -121 -45 -9 -27 -105 4 -3 -25 -81 -116 95 -70 20 -2 -12 150 9 57 19 -3 -96 -58 23 49 101 13 -71 -31
3149c1j9L6q1RO3l3J21l9l5J12l2j3p1J24j80m8J13o7J14m8K3n8m8J12k6k0nM0
$$ -31 -50 -14 -95 -86 -23 -56 65 26 -9 103 71 58 -13 111 -69 -117 -4 -71 43 -5 18 -40 -88 24 -2 -22 -27 13
3177A3j14K1J49p0k1N8l1j2o0L4K1RPO6p0K8n5P6r7KR7r0l9N7P9j29P8o5K7j8
$$ 13 -101 -80 69 -1 -22 36 5 -7 -67 -33 -12 -3 4 70 0 28 -27 49 -48 -46 51 -39 -78 -21 58 -71 7 -58 -31 -49
3207d9K9Q5j28Q7K7l5J1j03L1M9M2L6l4jo2P7o8K8j3j37k2K23J2n7N1j73J07q3
$$ -49 -20 65 -63 24 51 16 27 -76 -45 4 46 82 48 47 -15 62 -6 22 9 -128 -150 73 85 28 79 -94 13 -70
3235g0M9nj22J28l5J10o2K8j81P1K01o1Q2j40k2J27j41Q2P3j78J68j76J08n9K5
$$ -70 -21 -26 -148 -20 -55 55 -7 21 -160 -89 112 51 133 -7 -29 98 -43 39 112 -66 102 -74 34 -25 0
3260@M9j11J09j14M3M3N1m8N8n0L2j28P7pm4m2J07q5J60l3Mp0O4O5p9r3J05j72
$$ 0 49 -62 47 -67 -24 19 70 22 80 30 62 -66 11 4 -40 -82 25 -60 100 67 71 1 65 130 51 -42 63 -109
3288a09J54p0N5j1oK4n1J64k52J4R6K9L6J9j22Q3p6j2J58r6Jj0k3k3m1oR0j0l4
$$ -109 45 -25 30 19 13 37 -14 150 -102 -88 8 37 73 92 -30 53 -23 -35 123 27 28 18 -5 -28 -69 -75 15 5 -29
3317b9j8NL5j19Q2O3j0M0j19Q4k0J18p5j17J36qj06Q1km6Q8j38J67lj37n1R7O0
$$ -29 -47 -42 -7 -126 -44 19 9 49 -70 14 -6 112 37 -80 56 48 -58 23 21 -25 63 -75 92 89 -48 -99 -2 58
3345E8r7j1Pj23K26oj11Qp8J4J01Q3K3j35J33n4O1o3p9O8Q9j27J2k6o1Q7Q5j02
$$ 58 -39 -50 -43 -166 60 54 -57 -49 -127 -113 -12 71 94 -41 92 38 99 36 -43 25 114 -13 -1 -27 -88 -1 84 -18
3373a8j2n0K37k37J61Qj66m1J62pl2k0p5Q0o1N0n1L6j0J07o9pJ31k0m9l1lL5K
$$ -18 -30 -80 157 -80 81 89 -77 -118 44 37 5 -15 -90 -10 -71 -21 -72 -36 -46 61 -8 -15 116 96 47 16 13 48 50
3402E0l9j05K2O9j7n2J50j82R5N3j27J79l5p3O9Mj08Oo5R7K9M2k5j6q2N8N2p4
$$ 50 11 -94 -72 -3 -20 -72 78 -104 -9 44 -83 96 61 -12 57 61 -47 -41 -106 -9 20 62 37 21 -61 -3 49 -25
3430b5l5Q0p7J05j35K02j06k1N6j71KJ08jL9l2j03Q1K8k6p7O2oR3j23L8j1j09
$$ -25 -60 20 -57 48 -87 115 9 -12 44 -127 -125 -17 -18 21 -11 -114 -33 -5 -31 -108 -46 -52 41 -82 -44 -55 -164
3457a64K05j29J40j5Nq5l1L1qM2L7l4J9Q7j80O6qR1p8o4J21j0J1n2J43j18j49
$$ -164 41 -88 52 37 42 -43 -74 -43 -51 -9 28 -6 13 100 -80 -14 -22 69 -9 -73 48 38 49 -3 140 22 -127
3484a27P2R3nl2nk7J7N4r6R5p5K1M5M9J4m5l6m6O7n9K0k7j40K43n5M7r1o8J53
$$ -127 -55 38 33 1 -4 -31 -14 40 -56 39 -36 -15 30 79 93 48 12 -34 33 -26 -6 -33 -173 70 15 62 -29 -97 56
3513E6j36J12k8pJ04j88N4NP5K1p3K7o6o9J91n7m2R2r1j5J13k0j06O5K7n3PL5
$$ 56 -80 32 4 -3 101 -87 -33 -28 47 68 -5 22 -44 -113 78 21 -21 71 -20 -35 78 58 -48 17 44 -9 -2 33
3541C3j39J08q5J25n8J11r3m6m6N7L2m2J0N1n8L5P8o5l6K3p7N4nr7K05lq5Lj52
$$ 33 -106 2 -83 42 -16 95 2 -44 -90 -33 -1 -43 -33 18 -40 -5 73 8 -28 -5 -82 -28 -33 -130 75 72 -13 -10 -162
3570a62J16J24j26J39n2m1n0LK1PL3k7N0m1J1RM8j36R7K3j38J40j94J70l9N0J
$$ -162 -46 78 -48 91 39 -2 -52 -49 -28 -21 12 -15 35 -6 5 14 62 -74 23 46 -92 48 -146 24 -15 35 36
3597C6J2n7M4n7k3m9J30k4M6n0n2K2ML8j13J56M5j65j3K5J12rMm8J8n6l3J01p6
$$ 36 48 -9 35 -22 -45 -94 36 12 58 8 -44 -22 -18 20 -93 63 108 -57 -70 -45 67 58 62 14 32 -24 -57 44 -32
3626c2P9j0n6m5j9K17j21m2J9o5LK5J4J56q6j37J51n8J06n3j35J03j19J45j86
$$ -32 47 37 -19 -64 -83 134 13 -29 -10 -75 -72 -47 -33 123 37 -100 51 -7 99 46 -89 14 -105 40 -146
3651a46J40p4K15j07N3r7P7J01k70J38pk6k7Q9j33O0j1k1RQ3j4p7k9R3q1J3J23
$$ -146 -6 -80 135 28 81 -16 61 162 -108 30 23 -3 -30 59 -74 -14 -25 -46 -37 46 32 -45 -74 19 -62 -49 74
3678G4k1n5j9L3j3k8P4k5p8R3O1j37L8O1n5N8j8j5j12J93j86K5R3j43R6Kl7J22
$$ 74 53 -2 -21 12 -1 -29 45 20 -58 35 96 -41 -3 58 3 61 43 28 -84 109 -77 -52 41 -102 -6 -4 -41 81
3706H1o0k2O3j88Q0M3P0j64K8j8J25m0o2O5N4j9m7M2M6n3%J4p3K6J6K8j4l7K09
$$ 81 21 -1 62 -126 -46 -3 67 -97 -69 -87 38 -2 -64 1 55 36 -11 31 77 24 24 38 -35 -9 7 35 21 -16 193
3735A93k28L4l5m2J11j63J07Lk6L9P9j61J04q6%R0l3P8l6k0O7j47J6M3OQK2N8
$$ 193 -35 -1 -36 -78 33 -130 -23 -20 -46 -7 72 -89 15 -71 -71 19 -14 64 28 8 75 -72 -56 -13 -7 1 23 81
3763H1j14Q4q3P3r1k1O5N1p6j02O6P9j2kN4j91J2K19K1j36L4j28O8k9J68o8o9
$$ 81 -33 51 -32 41 -50 -71 -6 45 -31 -133 -67 12 0 -2 52 -139 -127 92 113 -23 11 -117 -49 -78 90 22 -47
3790d7N4j52R1Q3j12P8Q5m5L9p6j17K18r2J2q1K3L6M7k0j7Ro3J11n5m8N8L5m0
$$ -47 7 -145 -54 29 -83 -5 80 35 74 -2 -119 99 7 19 -62 -39 -3 44 24 7 16 -47 64 9 -39 19 54 14
3818A4M2j08pJ47q5L4l8p0M4O8n4O1m5nm5L6O3o3N1j4j2K3j7j08M9R1j41L9J34
$$ 14 56 -52 -59 88 3 37 -1 -71 -27 41 -13 48 3 -2 -47 -11 52 -11 40 26 14 37 20 -88 -39 52 -89 -50 84
3847H4o7Pk4O3K1p3%j06J6M5p3J89j19P4j9qrj11P7O1k6O9k9n4j6MR1k4j01J40
$$ 84 17 24 0 63 84 11 11 -95 -79 -34 -107 82 -37 37 18 10 1 -110 -33 28 2 71 42 -12 -28 -24 67 43 -58 82
3877H2j77J76j11J2L1Nj11MK1M0P5p6K7J4o0L8NJ1l2P9n9L4l2O8M1o7l8j1Q0q6
$$ 82 -95 81 -30 -18 13 18 -93 -89 -68 -28 47 -29 -2 12 -48 -10 -5 6 -26 53 -6 28 -4 64 105 38 0 -11 69 -17
3907a7M4o0Q4M0q0NL8j21R7r5J7J62j10o1J21n1P7m9j1p3K6j14J50NMl6P7j61
$$ -17 27 -33 51 91 11 16 54 -67 30 -65 -48 114 4 -57 64 13 90 41 30 -43 -17 -131 19 24 28 -8 69 -92
3935i2Q4M8PO7j69mN3j02P7K1q1Q4LQ8o8p6PJ15p2Oq5R9k2L4oj02L2m1J30j90
$$ -92 -8 40 47 114 -55 -59 -6 -108 -31 -10 -91 -7 -4 84 16 -60 -53 62 -10 -4 -89 10 -12 22 16 -86 -54 -95 35 -155
3965a55J55J00m8K1j14nK7o5J41j10J74q9k0q8J11l1k0j0K2n5KR4J9m5m9J9m0
$$ -155 0 100 52 73 -41 -46 -19 -84 57 -53 121 32 12 -76 35 4 -16 -26 -4 -59 -57 37 56 11 -38 -19 -59
3992e9j4J07n9Q9n3r3J03q0RO6N3k14N0R7P1j02p4K00l7q3m1L4j3O9%l0kP1M5
$$ -59 -73 34 -25 64 11 -82 21 -59 -50 16 69 -145 -95 2 73 -29 -103 97 60 -23 -64 -30 -43 26 26 -4 -6 65 110
4021A10k36J61m0n6L8o4J60j57M8qJ1P0No5L9j60O0J66j08j0K1k5Q9%r7nRM9r8
$$ 110 -126 35 -5 -61 -23 -87 73 -84 -36 -44 -33 37 42 -23 16 -144 -84 82 -26 -36 -15 -40 49 49 -48 -53 -44 5 -93
4050i3J2J17j02O4J2l1O4K7L2l6o1j6P0j10RM3m2R3j9p7R5j09O2l6J04p5J10j68
$$ -93 -81 36 -66 -2 10 -21 43 70 102 66 5 -11 59 -51 -42 1 -41 52 33 -44 51 -58 4 -32 72 -3 107 -61
4078f1J7O7q1J02nJ9k0q0Q3p6L5J9j6M6k8j6J21j86N8l6L1p1P0M7l3R8k35J86
$$ -61 -44 23 -58 44 39 58 38 -42 41 -35 0 19 3 49 21 5 126 -60 -2 -38 -7 -78 -8 39 6 104 -131 55
4106E5j09J05j60l1J68k8LN3q5oK2l5Q6O2j44J13j13P5m0J12r5o5j0J64l9j38
$$ 55 -54 51 -109 -140 28 0 3 56 -29 -35 -13 -48 38 100 -44 69 -44 31 -9 103 8 -57 -67 97 58 -80
4132h0L1J25p0p7l2J85Pj02J01p4J06j93J13j44M2j0M7J12j38J15m7k6K2J6L3
$$ -80 -49 76 6 -71 -103 82 89 -13 88 14 120 -73 40 -104 -62 -72 -25 87 -51 64 17 -9 13 29 62
4157F2j3O1k32L09k07K9OJ49k50J29L6j69M8K7O7j48J07K5Qj98J30K9L3m0J49
$$ 62 49 110 -122 187 -20 9 15 164 -86 43 79 -90 -42 -15 52 -96 11 36 44 -154 -24 5 38 -2 147
4182A47p7n5m8P6mM9j08l3J5j2L6q3Q1M8k0q5oJ25j13j2J00m0J01j12O0j2r1L0
$$ 147 70 15 -33 43 39 88 -20 -53 -38 -50 -14 -97 -16 32 12 -73 -79 46 -67 -79 21 -19 82 -30 30 18 -73 -43
4210d3qM8m6J7M2K8j62R1M3Nm1J51j65l4NJ27q6K4O5j80K06j65J48r9N4o7Q6q5
$$ -43 -51 -3 -49 -32 10 38 -124 -33 10 15 -26 125 -40 -74 -69 58 -28 -4 61 -119 87 -78 70 -29 25 -42 44 -41
4238d1L8j4L7N6o2k3J16n2j09nN0M5o6JN8O6m6Rr5J10p9j27J57J15k22MN9J67
$$ -41 -3 -17 20 76 14 -9 107 55 -54 -59 -9 36 -30 -29 29 95 49 58 -37 73 -6 -133 24 139 -83 -79 -20 147
4266A47j80oJ3N5oN0n6m2Q7o6M4K1R1j94k2J2l0J60j84P0J5L4k3O7r0q5O2J19
$$ 147 -33 -39 -26 29 23 73 17 -25 62 -4 40 61 152 -42 -64 -52 -82 78 -106 -36 -21 13 -10 57 -33 -118 -56 63
4294F3j32O8j4j18J51j0k6M7K9j55J32j44J11K4oj12J86K5j40O0Qq7o2L0jJ16
$$ 63 -69 -1 -15 -133 18 8 -18 29 58 -97 35 -109 2 26 20 -92 94 119 -21 39 47 -40 -102 -72 -73 43
4320D3j0p3Q1q3KlJ87j65N4qM6m3Q3n1l9%nN8o9K6Qj19J3Q1M3r0j3P5M5n9m4P1
$$ 43 33 -40 41 -42 -40 -43 144 -21 33 25 71 28 111 60 21 21 16 74 5 31 39 -80 -67 14 57 -33 -46 29 74 15 -29 42
4352D2Qm6Np8J2Q0j8J5j01J07po5k7J32n1j1O0m1n3Q9k5r7J5J58j13kR3j36J34
$$ 42 50 4 9 -69 -57 23 5 20 -81 26 19 -46 -73 59 8 -3 57 16 -37 52 27 -70 -55 103 -10 -12 81 -55 79
4381G9l0j62J96n0k9Q6j11r3R0J04r6m6R7r6J7J5J35j60J55j22k5L7k5J18q5J2
$$ 79 49 -113 83 33 4 90 -21 -114 -24 80 -16 -62 35 -61 -44 -29 106 -54 101 -21 -46 -9 -34 84 -1 11
4407A1n6K4j9n7M2LM3R2q8k9KJ01m8J6k1k4J3L6k2m7n4P3l5L2Nm0O3J3j25J85
$$ 11 -45 -21 -40 -97 -55 -52 -9 83 -5 -34 -32 69 21 37 16 -8 5 41 19 -28 -82 -9 -44 -12 -7 -47 16 29 -96 89
4437H9m9l5l2JJ38m3j76L2N9l9P1O7r4K3N7j04J8RJ58k34L4j01J16l3J18l7NP
$$ 89 40 5 -27 -26 112 69 -107 -75 -16 -55 16 83 -11 12 69 -35 -17 -8 150 -84 -50 -151 -35 -68 50 13 18 25
4465B5j04J01j26N4J47k2p6R6r6K5r3J1Q2rq5O5N9k3Ql0K6m7KR8p8n6K7n0Q6k
$$ 25 -79 22 -104 -50 97 75 -1 95 -1 24 -69 -58 24 15 -70 -5 54 31 39 9 35 -12 -10 88 10 -46 -19 -69 17 15
4495A5l7J9J4MN7o9l3M3On2P5M3n7J72j92m5r1N2K6P1rK3N9k0p8R4K2j79kP0K5
$$ 15 -22 -3 11 15 72 3 -30 13 19 -33 42 85 28 200 8 -37 -128 -76 -50 21 12 35 94 74 -4 90 112 -67 -69 1 26
4526B6p7J40j09m0K26j39L5k32J68J16l5k8j40N6O8j5O5k02K30j14q8K2R8o1j3
$$ 26 -51 89 -20 -60 166 27 62 -170 -2 114 79 51 -89 -33 35 20 85 -117 113 -1 -89 -67 31 -30 -43
4551d3L6K0j5j15JJ33J26k12k4J07j11Q1L7q2R9N6n8N6j33L5NN6o7J3j24J21k3
$$ -43 -7 13 -2 -117 -116 17 143 -69 -93 14 -97 -16 21 -61 38 94 36 92 -41 -6 -1 55 -12 1 -123 -2 -25
4578b5L4K8l2o4O2n3j3O4n5O5p9J6mJ06k3m3J3M2l5J3Lj31J73j44J19j10N0J2
$$ -25 9 37 5 -59 3 -50 -63 1 -54 11 -68 -52 -56 50 27 -16 -3 39 4 17 20 -111 62 -82 37 -73 -23 -11
4606a1k4L8M7K4Ml7nJm8M0q4J70q4Po6pn7K10j03j18pM4J94j61JM3RM5K8j29k1
$$ -11 -35 3 50 74 78 41 36 37 -11 29 -55 115 31 38 -28 -35 -92 118 15 -103 -110 -66 128 -33 -32 11 20 65 93 -36 -57
4637e7kQm8R1OJ3m5l9M1P8m3J27j97N7J0p1Q4J06o0K8m7o3R0j20J17j26O4k2p5
$$ -57 -59 -51 -99 -8 -2 11 -34 -73 -32 46 3 130 -67 -10 0 -71 13 119 59 87 40 -23 67 -53 64 -62 2 -20 -95
4666i5J36o4r2J15O7n8M7pk5j26P0L0M6l0K3o2J53k6rq9K3J30q9l8j8qj7q3J20
$$ -95 41 -23 -115 0 67 9 56 49 24 -102 -32 -2 44 14 37 -25 128 102 93 4 27 157 68 30 12 4 -13 -96 24
4695B4k9K1p3k7J14O7k1j39P3m3J31j31M3Kn3LL6o1P2OOk4J4J45r2q0N4n0o5k0
$$ 24 -5 16 -57 -84 30 97 76 -63 10 -33 98 -33 10 12 -41 -38 -2 -63 9 15 21 -3 11 156 64 -16 38 -12 -77 -97
4725i7O2k8l7J02j1p0N3r0Q2J07r8Q2j71P2k6R3k3KK6m0q1R0j4k5J10k3j60J73
$$ -97 -35 -63 -100 2 -9 -79 -26 -116 -34 73 -25 57 -114 -42 -68 25 2 4 30 -10 -91 -1 -15 -40 70 47 -113 60
4753F0j79J08j31J02J26q8l2O1r8J12Q0o2j5j13K2R1j5l6k9lJ4LJ35j23P9p9j6
$$ 60 -119 -11 -142 -40 86 -2 -34 27 -71 41 121 59 44 -69 -47 44 29 -7 -36 -39 -25 -22 113 -10 69 -10 -26
4780b6P0k8p0qJ26R3j07o1O5p2M4n6Q4q8M0%L5p8N4K7M8j07p2J13n4Jl5%M0PK0
$$ -26 44 16 -54 -62 64 157 50 -11 54 -18 26 -30 54 -34 6 6 41 -37 17 44 92 -15 -87 26 -28 -27 -62 -62 -22 -15 5
4811EJ45j16j02R6m5P8j24J14j25J02l6j37R9J63j96m1J60j19J48LNk06K01l8
$$ 5 150 34 -68 28 -17 61 -63 51 -74 28 -8 -145 -46 117 -79 -120 40 -79 69 72 77 -129 72 34
4835C4p1J0N5K1L4K9j03K1rM6r6R8j66P8L2j1J9O6j55P2K8J8M8j53J16k7l0j02
$$ 34 -37 -27 28 49 83 112 9 30 21 67 -29 69 -97 -19 13 2 21 87 -68 4 32 50 98 -55 61 34 4 -98
4863i8J24om9kL6j10R0M5K3q2o6J18po7Q2o0Q4N3j43J79j84M7M7n9L2oo1P8q8
$$ -98 26 20 -29 -31 5 -105 -15 30 53 -29 -95 23 16 -51 31 -29 55 108 -35 144 -40 7 54 -5 27 21 -40 38 -50
4892e0J7J37q8K9p0J3r6R7R0n5J80k60N7m0J09q7L6n2N1K3k1L4p0O4J08k38OP7
$$ -50 -33 104 16 45 -25 -12 -108 -11 79 24 204 -56 1 -39 70 -17 19 -33 18 41 20 54 -16 48 156 -82 -76 1
4920Aq0J18m0Q7m6l4j3ML9L2n2m6oP8n0K0j36O1K1M6r9O6J15J2L4j35O6j07K9
$$ 1 -79 39 -1 86 40 6 -7 -3 36 68 16 -30 -36 42 -8 12 -124 -63 -42 4 -95 -29 86 98 132 -3 63 -44 -15
4949a5K2k0j1k7J18r0P2Q6j04N4j01j32J30n1J03j8j43K39j4q6Lj8l1qR1m6mM5
$$ -15 7 -13 -24 -51 67 -23 49 135 31 85 -16 -148 -18 -69 34 16 -127 112 98 12 15 -3 -34 -42 49 3 -1 44
4977D4K4K0m9o5M3P6n3j25N8K7r1J6Q2p4N9j9J2o5J42j18m1J17J8q3J14j29M8
$$ 44 68 88 39 -26 17 93 40 -85 -27 0 -91 -75 7 -67 -8 -27 -15 -80 62 -56 -97 20 38 -45 69 -60 -12
5004a2%l5N8p0J11Lr9j5k8J45J6p2L5o4J23j54J10j07N6O6j09J27m9j12J80pm4
$$ -12 -12 -47 11 -59 52 55 -44 -59 -87 58 74 2 37 -27 96 -58 52 -55 1 67 -42 85 36 -76 104 97 53
5031E3l9K8j22l0J12L2j06j0O7p2P7K5r2N3L0rlK8N0n7N0M6r1j9O2q5J5Q4m6l8
$$ 53 14 42 -80 -110 2 34 -72 -82 -15 -87 -10 15 -77 -24 6 -3 -6 22 72 15 65 111 20 1 63 -22 -7 77 31 -7
5061gJ6O2j1n2K2q8P6n0j0P1j60Q3j9O4mL3l1L4k9Q6k16Q5R4P9k1k08O3J7j4Q2
$$ -7 9 71 60 8 30 -58 18 -32 -42 29 -131 -48 -67 -3 -7 26 -5 29 0 86 -130 -45 49 128 107 -101 -38 -21 -35 47
5091D7L7q9Q4J1l1QP8j57J6m9Q1K8j15N8L2k01K17pK5J6j75P7j15J09L6M2m7P
$$ 47 84 -5 79 90 59 67 145 -12 4 -45 36 64 -51 7 39 -162 55 48 73 89 -86 -9 -124 -15 21 63 16 23
5119B3o3p5J54jj23J41jj13N6J2K3q0n4R0O7p7O7J9q5p4O9j2N2L2j43R2o5J13
$$ 23 -40 -115 39 38 -85 56 55 -58 -2 10 33 -47 -101 -11 56 -21 46 65 -20 -94 -25 -37 15 47 -96 -4 -69 44
5147D4o7P5j01P4P%j0o0O2RR4j89J14l6k6pj01J54m3l9n1J38j20P1O7K1j26L3
$$ 44 -23 52 -49 25 32 32 22 -38 24 33 127 -62 52 16 -10 -17 -118 36 -7 -46 -97 41 -79 -8 59 80 -46 -13
5175a3M4l3mqJp6J57k7j02k0J56j45Q5k2O5j25M8K9J51r7r8m7L4P1loo9P5p9P0
$$ -13 31 -2 -6 -14 -13 -89 68 41 -61 -81 75 -70 15 -7 58 -67 -19 10 161 64 -34 -81 -47 24 21 15 -54 21 -58 12
5205A2o5K0j44K06Km2nJ0N8j07M4KK1l6N4q1J05j15K4N5q8mP8J9m6J6j26J31L9
$$ 12 -53 -33 -177 29 31 -11 -16 -6 52 -55 -11 -9 12 -24 30 -51 54 -61 -37 18 -70 -74 4 23 -23 -7 -133 -2 37
5234C7l9j0KL9Ll6O2j3R2j43K1qL4j09k1O8r6J97j32J49j00k8N8qRj18Q6J10j88
$$ 37 -2 -12 -10 29 32 -4 58 45 137 -6 15 7 41 -68 -89 -21 -117 80 -52 97 -3 -31 27 19 28 -90 -4 106 -82
5263h2M3J40q6R6o5r1R4M6M4j86O1j8M4o4O1j49P4P0rj0l1O6j16P0r8N3Q1q8J
$$ -82 -39 101 15 111 46 -45 49 95 139 -47 14 -4 40 -24 37 -112 -38 32 23 13 -18 48 -68 2 -96 -43 38 -50 -49
5292d9J95j40m0l4L6Q4j16pN7Q8q6J3nJ04j5j46j0J61j38K9L8j6Q1j28jJ24k5
$$ -49 146 6 -34 -68 -32 52 -64 -71 -14 74 -12 1 -4 100 85 -61 -71 90 -48 -19 19 3 84 -44 -45 79 54
5319E4p8O1RoMN1j15m0R8RjK6l2j15J03m2J36j10m2R9j3k5j60J60q9P7l2l3m0
$$ 54 -24 37 46 40 44 95 -20 -60 38 47 46 72 40 -75 28 -14 122 12 -30 69 56 31 -129 31 -58 19 -13 -46 -86
5348h6P5Pp5P3J1q8M2J09P2j59n0N4J2J20r7K3k6L4j42J25j04J12J4k0l1pj32
$$ -86 -11 -4 -79 -6 5 -83 -41 68 140 -19 -69 -15 -3 117 20 43 17 51 -91 34 -70 42 56 36 5 -2 -134
5375a34J87p7L2L7r6p6k6J61j9P6p9n2R7Qn3L8m9o0K5Nl3M1m2J59j53P6m8p1J70
$$ -134 53 -24 8 45 -51 -127 -153 8 -11 65 -14 -66 31 39 -14 24 -25 -85 -60 -55 -88 -47 -89 70 -83 -7 -55 -126 44
5404D4q5J91j76k3L8k7k7O9J05q1m4J38p1jp9J3rO6K8k4p7O0J0l9R6j23O4K5m5
$$ 44 -41 150 -26 -49 -11 -38 -65 4 109 28 -16 122 51 50 -29 -16 -25 41 69 45 -32 28 38 -1 95 -28 36 61 16
5433A6J02j96J24j0o9J86q5k9k1K2J6j49R3l7Kom6L8lO8N5j7j34N1J02j60Q0M0
$$ 16 118 -78 46 36 -33 153 68 39 18 40 56 -93 0 -37 -35 -41 -87 -49 -52 16 71 54 -80 -29 73 -87 -7 33
5461C3m8O6j40j1O8J06r3M3j38K09r1l5R8o7m5M0k0J1O1l9l7N7J23nj39J4j0N2
$$ 33 -15 51 -89 -100 -32 74 -19 24 -114 95 4 -31 67 0 -45 -5 -25 -14 47 8 -29 28 151 146 7 21 11 63
5489F3l7n9L2N4o6J1N1j1O8r0Q0j60%n0J23J08q4p3J36j07lnk5M5r4M3P0rJ03
$$ 63 26 -33 -1 53 -13 -2 49 38 106 16 96 -64 -64 -114 9 117 33 -40 96 -11 -14 -19 -44 1 -93 -50 20 11 114
5518A14r1j53J93L1q8j39M3J62jj17P1j08J40p9R1j09j9J0n5J71j34K9J5J5N6
$$ 114 23 -130 63 94 6 -133 -90 72 71 -46 25 -83 57 -22 69 -40 -59 -49 -104 67 -67 -38 -23 -8 48
5543D8k8J5k7P8j23L3M0n1R3m4pM4m5n3j3l8J01r2J61j03M4n1K8N4j63O2O2o1
$$ 48 20 35 8 86 -37 -4 36 -15 78 34 27 71 26 -27 -40 -78 23 -69 92 -11 33 -18 10 64 -99 -37 25 -36
5571c6J40j94M3L6L4o7l9J21m6M1j09K5k6R9p7m6J66j24M2J67k46R3o2J13j38
$$ -36 104 -90 -47 -11 23 -44 -83 38 -8 33 -76 -51 -77 22 -55 -101 65 -59 -17 150 -96 -3 -65 48 -90
5596i0J14m9J69j49q8oQJ53j91J93j1lq9N9j10R3k2K1kJ9Q4p6j07N4K4o3L7p5
$$ -90 24 -25 144 -5 -93 -99 -91 62 -129 64 53 50 -39 20 -90 3 -19 2 0 19 103 27 -80 -26 -2 -65 -28 -103
5624a03O3K8P4Rr4Q5J7j07rl9J47j29P0l6PM7l9Qm0N1M3l1j04P0K4l7J8m9M4R6
$$ -103 -40 -12 62 71 -23 62 79 -28 -37 -76 71 -58 12 -24 -17 30 -9 -1 -41 10 53 22 -82 -12 12 -25 -7 -56 -12 84
5654H4r8o5J61j57K02j58n8P7kL4j5m0N2J52k41O2k4j0J2K7L7JK1j2O9j56j14
$$ 84 -14 -79 82 -75 127 -31 -89 -12 -14 20 5 -35 17 169 -72 -10 -34 -44 -32 -5 32 33 54 42 111 -45 -159
5681a59J28j0N9j9J0r0K05j10JM8k4n0J14j02o3J00n1k2J24r4k1LM5m3RN8%m9
$$ -159 -31 -41 18 -1 9 -81 124 14 15 63 39 -11 103 1 -62 38 -13 -35 89 -5 -26 -23 22 -21 -12 46 46 -3
5709cPM4q7R6o2j5O4l5o1j06J52K00k00m2L5K4j7m3Q3n2N3j15P4N2m3N8p6r6J12
$$ -3 4 48 -39 57 -5 -20 44 9 -52 -158 -6 194 -6 -48 -13 11 -6 -49 34 -18 35 -80 -6 46 3 61 -15 -111 1
5738Aj5j5l8R4j7p7R0n1J22p9L4P1k00R3j5L7K0p3o0P2Q4j15M1P0pN8j26R8q5
$$ 1 -14 -29 -67 27 10 -67 23 -28 94 15 49 120 -80 13 -2 35 55 -18 -78 -6 78 -37 4 74 67 125 -1 97 12
5767A2k9K8O6r5Q8o8r5J11l7Oo2Q2J2k6Q2j39K1J9K1j11P6Q9m2o3P5ko8J11j29
$$ 12 -17 11 77 -18 70 2 -93 18 -19 -13 -75 7 19 -7 75 -64 -43 -24 -3 -114 -38 51 9 -54 21 19 -49 62 -67
5796f7R4k9n3Q9k6K1k9L5n0O5n9L8J6P4k6j45K1K1o8Q7Q3r8Kp7J80j01M6j02R1
$$ -67 27 -2 -55 34 8 29 0 35 -15 50 -9 29 45 119 93 -52 -31 -10 -78 9 92 -6 -4 -81 99 -2 44 -58 33
5825C3p3jM8j38J32pj34P5N6o4J46p4n9K4J48n7j56K1K3O3m1OR3o3J12r2lj17
$$ 33 -40 -41 7 -131 1 -6 -140 -65 -9 -73 73 -1 -60 -36 112 55 -101 -80 -57 6 -35 -29 64 1 113 21 18 -99
5853i9J05KO3N7k68Q3N4kj6M7j21J41o9P4l7N3r1j16J19P9j0N1k6j01m8J86j73
$$ -99 6 8 71 128 -140 -57 -3 -5 -21 26 -95 46 -23 51 14 67 -24 -140 -21 58 48 99 73 -28 -76 110 -63
5880f3L5pJ06m6L2J04r4o0K8l0j10N5O7K6m7J7q6J6J10J3j81J31n9M5Mj7m1K5
$$ -63 -28 -35 71 25 57 161 67 7 35 5 -105 -50 17 43 -4 13 -73 -57 53 66 -115 16 -43 2 6 -11 -52 -27
5908b7lJ57j17L7k7q8N7o7M3k5K8p0J49k3lN0o1k3k3pJ4p4J71q1j7l6Q4j4p1Q9
$$ -27 -30 127 10 47 20 -68 -11 -78 -35 -60 -32 -102 47 24 21 71 10 -13 -36 -43 -29 -103 68 -13 -30 -66 18 4 -67 22
5938B2r9R9J10j56R9%K7j51R0p0K9j4k4J57n6j72P3lR7M8j86RQ2plLO0Jj25k4
$$ 22 -77 22 132 -24 75 75 102 -49 41 -29 0 -14 -38 119 63 -109 -36 -39 58 106 -80 -71 11 4 1 4 64 65 -60 -84
5968h4K5M3L0m3L3l9qP5j38J02lJ3n6Q3j4O6o6p2M1j0J02m0j10O9n5O3j8n6J66
$$ -84 -59 -16 14 -29 4 -35 -43 32 -106 -4 -7 6 -50 33 19 85 19 -53 -12 -22 80 40 -70 -1 -56 7 -11 -67 99
5997I9l5p5Q3j7nj65J53k8M9p2l6rK7J50j39q6M5Q4M7k6k9N7o4k1KK6Nj00RJ77
$$ 99 64 -11 72 55 50 -115 38 10 59 -13 -49 -58 -31 119 -20 -106 -61 23 70 44 15 72 8 -13 -11 15 20 -80 -71 106
6027A06n4l8j11j2J17q0qK20j16O5n5o1M5J3j19P7J7O9q8m3J26l6n2L4L0p8r6
$$ 106 52 14 -97 -109 8 -72 -80 140 24 89 34 -27 18 31 -88 -11 6 75 -13 -56 70 34 -18 16 46 -32 -128
6054a28K9J37n3O5r8Nk0Q1p6M2n9JQ9o7M3%J49j47L5m9K2L3j2l9jOo4N5L8r0J76
$$ -128 -99 38 -15 50 -48 -43 -63 18 -58 -16 -75 -74 15 -52 -9 -9 140 -7 28 -21 1 34 22 -17 -18 -12 -76 -21 17 -73 103
6085A03o5j91R5J01n3Lq4N4nR8j8o2O2l2m5J29o5o5l2l2K33j01K1j52QL0l7O4
$$ 103 38 -153 -58 43 -10 -7 -91 -37 -42 56 38 -24 38 6 -39 90 25 -40 -72 -104 129 28 49 -103 -95 -65 -102 -38
6113c8%o6K23j23k1P1m2Kj05J10j4M8M6l3j17M6k0J25p8QPo9J41j10L5k12K64
$$ -38 -38 -104 119 -4 -25 46 4 6 -99 11 -3 45 91 58 -59 -13 -33 92 14 22 29 -40 101 -9 26 -186 78
6140G8q6j49K23j53J72q6N2k5k4o5L8O7q0L3l1R6p3l1L6k8K4j1%J91jj58j2RJ9
$$ 78 -8 -157 66 -87 85 -1 51 26 2 -63 -25 42 -38 -5 -36 60 -13 -44 -8 -36 -12 -23 -23 168 167 9 -3 6 25
6169B5j7k0K9n6Q3k5n7O0ml4J40n2nm4oL5Rj09k0K2N1Oj4mj22K16n9j3J9j45J09
$$ 25 8 -12 17 -39 44 19 -38 22 18 -16 124 72 67 23 17 52 61 -48 -68 -46 5 11 -3 -7 -129 87 28 15 34 -111 -2
6200bj3R9n0J16j32oM7q3O0j61J35M6p7lO4p9N4j7P3m7Q0k23J70L6nrk19J19l9
$$ -2 -15 84 34 150 18 12 59 -24 36 -125 10 56 -21 -24 40 -39 15 -2 71 24 104 -119 51 87 82 73 -146 -27 -66
6229f6Q5p3n2J85n4j69K01r5R4j6J4m2l9J47j78j0J22o4Q1n6q4O7j3J26k33Q3
$$ -66 19 -54 -106 79 25 -144 57 -38 56 40 54 12 -27 120 -58 -68 54 -10 71 15 -69 -2 -15 111 -122 -39
6255c9j09K47Pj04r0R7L7j7Q7o8j6j08j5J01J3r5O2Nj83J61N9p7J7j5J30j44O8
$$ -39 -148 99 106 2 -88 9 46 29 116 48 32 -76 -91 10 23 -72 -10 -5 -188 -27 32 -45 -28 -43 87 -57 11
6282A1pM5j15N4Q6lj53J36j14K1K2M0n6L5P9j76K0J65J9j20k4j20K05Oj38K24
$$ 11 4 49 -66 -12 74 71 -82 54 -60 -39 -17 23 -33 2 81 -95 -75 90 109 -11 -35 -155 50 56 -82 142
6308A42j73J7Q0j14R7j9ml8M1o9J19j76J51p1LL3NJ6J3p2L1K4J3L7o1m8M7L0j15
$$ 142 -31 -14 66 -48 49 30 26 -12 29 -40 79 -97 54 -17 -14 19 24 40 53 -19 12 36 49 86 25 -23 24 54 -61
6337f1j7J83j94K5Q4j46J61p0K6j8PO0o3L8j24J50q5K4m5L3L1R4j70J1L2j1m1
$$ -61 -78 105 -89 -64 20 -126 35 -35 -9 -27 -20 40 -23 15 -109 41 -44 -20 -65 -32 -1 93 -77 -66 -34 -45 -86
6364h6j5O0J3Q1p6J10j37J8p0O4J24m7J5K2j42O6J3j11J37O3j38NM7l0m1j0J43
$$ -86 -101 -41 -28 53 -23 87 -50 -32 -102 -38 86 39 54 76 -66 0 13 -98 39 102 -36 -31 16 -14 -55 -65 78
6391G8r1L6r2qK02o7k00J27JK7N1p1o7P1M2r2N1m7Q1J8o0l9P0Jj01M4M3J1L3r5
$$ 78 -13 23 -69 -77 125 58 -142 -15 -14 13 64 -7 -74 -3 39 -53 -2 -49 32 50 -10 -49 21 22 -79 -35 8 19 52 -43
6421d3J13L3j82M2K0J42n1j01l4R2K1j88J8J10M9J06k07J61p6j80J19O3o7R1J0
$$ -43 70 103 -79 -37 -17 125 74 -27 -61 31 52 -136 -118 -8 41 147 -60 101 25 -155 -36 27 -40 51 61
6446F1L1j47J2Q5j97J61J16o0l5l7j5P8j54R0m9O2q8J14M0r4J7m0P1J05j66J04
$$ 61 92 -55 -43 42 -155 6 122 62 27 -10 -25 53 -101 -11 -60 2 -86 28 68 -26 -9 -49 22 127 -39 65
6472F5r2J06j38J05j05N8QLn7L2M5q2k3J08p8L0O5o1L4l6O6p4L4J2LJ3l8l6j8
$$ 65 -27 79 -59 46 -59 -1 7 10 -47 -15 30 -52 -75 33 -45 -15 50 -11 23 -13 53 -21 13 25 28 41 3 -33 -51
6501e1J14n0J23j29k8K0Mmk8L2PM5q5L4k5K2P3j30R3j9r3J2N4N0n0k3K2j7n2O3
$$ -51 63 13 136 7 -21 -1 3 -1 -29 3 10 55 -30 4 -21 1 74 -56 37 18 -75 -63 -9 41 -9 -32 -10 -27 -79 -16
6531a6J0k9O1K7q3L8L6P3p9j06J27o8Qj4rR1Kl3M5lj90J98k7o9r1N2Q2m5K0L1
$$ -16 -6 -35 26 53 -30 8 44 117 38 -68 59 -9 -1 -15 -24 67 69 36 81 78 -112 86 59 -10 -101 -49 33 -12 8 39
6561C9J1j02Q2q3o5O9J4J41m9j59J09J5p7L7J8OJ5j7L6r4j07J21L1N1n2o9P8J58
$$ 39 50 -52 30 -53 -118 -49 -35 106 57 -102 7 22 -55 -18 0 6 21 4 40 -54 -161 -40 -9 42 -10 -79 -1 157
6589A57k57J33Rj29R5Rm4m9M2k6L1L8J5L0o7%o2M5L4%O3N7j60L1N6n8O0j10N6
$$ 157 -100 33 42 -87 8 17 -27 -76 -34 -60 -29 9 24 54 -13 -13 -75 -30 4 4 67 124 -36 -5 51 -7 53 -57 -1
6618aj3L5o3R3j17MJ22k0o7N8n6jN0K1n0j6J49j79P7j4j0r8N0J15l8l8m0j9M1
$$ -1 -14 21 -42 51 -66 -62 60 40 -27 31 -25 -26 24 45 -5 -21 128 -51 26 12 2 -96 -46 69 31 -7 -47 -66 -25
6647b5N7o9J4J2J3J01j1j12J06r8K3m4j11J51m5M1M8o8L7p5J12k4m7P0M3j27K7
$$ -25 32 -37 -23 -11 2 103 92 -20 86 -12 11 -33 -144 7 -38 3 51 -17 20 -55 57 33 -14 56 99 -28 -1
6674aL0rk8J64k24J04o1J61j01k9l1J4L1Qj38N1J59j06j0P3p4Q8q8LMO3J8j19
$$ -1 29 20 -8 156 -68 36 -25 136 35 6 -25 -11 20 28 -110 -59 100 -6 -16 57 -17 71 -17 -14 -10 53 71 -48
6702d8J16n4L6k9PL3j27J8N2j6j17J80n7j03P5n8P4m6J36p9l9J01L3k6o7P2Oo1
$$ -48 68 14 50 21 28 61 -66 -48 4 -12 -129 51 -6 -109 -34 -92 -18 -64 72 -7 -46 55 88 62 -5 67 73 12
6730A2n4J13qK0m7p4j9P5Q3j60Q7Lj39R3QrM2Nk3Lp1j17J96pok1J8l3J4O7q8k8
$$ 12 -42 71 63 83 36 -38 -57 18 101 -59 28 31 -108 -15 -7 -16 26 31 8 11 -60 -177 19 12 6 -15 3 -30 -16 51 -37 -65
6762f5N5lKJ48j55Q7p0OoJ1o9L3M2n2N5j08J44o8Rl9M0K8k1J3j43J19K5J6j2n3
$$ -65 -10 -13 -11 137 -18 69 -1 5 -1 10 -59 -26 16 -36 19 -89 55 -13 -4 -43 -3 25 4 17 -126 -7 18 34 22 -31
6792c1Q1j7O2j10p1K8P5oL1q1O0p1MP4P9m8M7q7J7nk6m9P5J4kj24J10j46J41p4
$$ -31 50 33 95 -15 -86 -58 17 11 42 -39 21 -50 -46 28 107 59 106 19 36 31 5 -44 31 45 43 -81 29 -117 24 -50
6822e0Q6j36R2M0p3J36j26J29k03J36n9R8j1o3Pj8N1o6q8J60k2r9R2K5j51J51
$$ -50 36 -100 -8 32 -41 95 -31 98 -105 31 -28 70 59 -4 3 -15 36 -30 -118 42 20 -79 13 38 -113 38
6848C8N9j04M6o0R2o7l5M7N2n3l6m3J11n2k1r5k1J54j06J34j14Q1J1K5k2o4J08
$$ 38 97 -7 39 -21 71 4 -31 16 68 15 -21 -64 47 -5 -26 -121 -142 12 -94 40 -74 7 18 43 21 -43 65
6875F5q1M4Q7j86P8J05j66N5m2J80j33M2o6q2K9NJ14j03k0R3n2k0M3lK7o8J38
$$ 65 -16 28 115 -71 7 112 -54 1 -41 139 6 48 -18 -100 -71 -66 48 -55 -75 18 -34 -54 -11 -14 13 -55 83
6902H3p9j19K10j08j03R4J14j84J96j13m4Jj1Q7J2oKL0n7n8M3N9j38K25j82J20
$$ 83 4 -115 95 -13 -116 -22 92 -92 104 -9 -53 -52 -63 24 36 30 32 62 5 -53 -10 49 -89 136 -46 74
6928G4r7k7k0J05l8Q3K9j63J08n7M1p5L9j4k8N7J15j92Q2M2l6R6j01mn5J1O0J8
$$ 74 -23 -50 -70 35 -3 80 109 -54 54 -3 38 -37 2 -12 -40 17 132 -60 22 64 28 124 23 19 -36 -25 35 53
6956E3j10M2N7Nj12R6r3K0n6P8J9o6j6k2O1K4mm1O7M0J0n4N7q3Q0m1j19J61j57
$$ 53 -57 -15 42 47 -65 31 -62 -42 -98 -20 -1 -67 -83 -105 -44 -20 -24 -65 2 42 52 -2 55 -28 52 11 -108 53 -104
6985a04R8R6k26J44k5k6N2k7Qn4R8p4m6J31m3N2Q4j19j0q2J03Q3m4o1o8J17L9
$$ -104 -6 90 -136 8 -17 -43 9 -18 -10 -64 34 -40 -86 45 2 54 138 19 9 -73 30 113 69 8 -60 57 96
7012I6j09J66j96J12q5K2PPm9O9r0J8O2k3PJ4J26j68MPJ17j58l0J04Pl0M6o7j7
$$ 96 -13 153 -43 69 -16 6 13 20 -29 40 -50 -32 30 7 14 28 154 -14 -10 -3 114 -44 -74 30 37 7 53 -14 -31
7041c1J80j00j16M3Q2j18J13l4j30J42Q7j43q3L1J8K8J47o8M7j26J9O8j76Q2L2
$$ -31 149 49 -67 -24 58 -60 53 19 -111 31 118 -25 -108 -77 -59 -31 116 48 95 -31 -12 56 -120 -38 -6
7066fJ05j02j4rJ32j27K0j3J8p8J8J65j95J21Q6r0n0oN2Lj1R3K5j43J38j78P3
$$ -6 99 -3 -17 -26 106 -21 -1 -14 4 -74 -56 109 -86 35 121 31 -19 -25 27 30 19 112 137 -6 132 -46 27
7093B7j08pK9L4O5j30K01j27J1o4K1N6N3j19L6K3q6J35n7kJ5O0r6k5O5Jk8k3L4
$$ 27 -81 -88 -59 -25 40 -90 111 -16 -5 -69 -48 8 61 -58 -22 1 -85 50 -7 -9 6 66 -30 -55 10 11 -17 -40 -6
7122fn3P4j55J81OK7j09oJ9R8n7k5j3jRJ47j01n0R4m1q4Q6O4r7Q8l6J1O9j67l6
$$ -6 -59 15 -140 41 47 74 -35 -41 -22 76 19 -6 -19 -20 -11 136 35 -15 79 38 -46 40 104 7 95 59 70 139 -28 -64
7152f4k9pK18j17M6j5j17J20L4J6k00J60k0QQ3k02J26k4j1J12r1j8N2m3L3r9J25
$$ -64 -93 -100 118 1 47 32 -85 35 69 85 -115 45 25 33 116 -86 40 16 5 117 26 8 60 17 50 -49 76
7179G6j22R5m7r3J38k9R7j77P7O1J7p4r2KO2R8j43K7J63j76L1j1oL7p1J64rn3
$$ 76 -46 49 2 -91 47 18 115 -62 15 76 93 19 -73 -71 -9 89 -54 -27 136 -40 -9 -20 -26 11 -60 104 95 42
7207D2p3P1j11O0Q3o4K0P7j15J50j86L2J03j09q8J48m4l0j2J2j55J56L9j41J43
$$ 42 -31 40 -71 -11 72 8 28 105 -10 140 -46 -14 89 -20 -108 40 -4 -34 -46 -34 -189 -33 6 -135 8
7232HO8n9j17P8j2rq6J46M0j01K4k5P1N7j92J95m1j9k8O6q2R6p3p4R3n8q1K24
$$ 8 76 17 -100 -22 -34 -43 -129 17 57 -44 -20 -45 26 83 -109 86 45 26 -2 64 -18 78 5 -69 24 -34 -115 109
7260A09k22J62n7OQ8r4J6l9O2L7o3l8QK0J29j53j7P3O9j03R4p3n3R2r4L4L7Ro2
$$ 109 -113 49 -8 -2 86 -8 8 -31 31 68 5 -33 -25 -5 124 -29 -46 27 96 -7 87 14 -39 53 -41 -7 30 39 -23
7289b3L9p2RJ1P5m3n7J00m4J05j07l0Q1r8P0N7r7L5J0p1oK04k24P9L6K8N4j20
$$ -23 16 -56 -47 -36 39 -4 -61 39 -5 100 -7 -37 44 -54 16 73 -24 11 21 -50 -56 148 -76 3 39 67 121 1
7317ANj24J62O7j32J1L7q9O7j34J92n0M5j50M2L9J33l7j40O6O0j4Prm3J0l5mm3
$$ 1 6 -118 44 111 -21 -10 27 -62 5 -129 63 13 58 -92 -50 -11 122 85 -55 11 71 57 64 55 12 22 -13 -17 -60
7346f0J16N4j30N8m4N1j53J46n3K0O7r2o2J45q3N6K7o5K3N7L1j60Q9n8m2J07j08
$$ -60 56 110 -20 38 -6 45 -108 38 -15 5 72 -20 -82 63 -20 36 63 -2 21 78 109 -51 38 -20 -62 45 -63
7373f3J22o4ONj8n0K4L4M5j0q3J06o5Lm6M7K4l9L8K3j40O6O6K6l9p3M9M4K5o1
$$ -63 59 -5 1 6 -12 -62 -38 -4 41 31 -52 54 -11 -8 -54 -7 17 -22 16 39 -101 -35 31 57 18 -55 -6 38 63 2
7403BJo6L2j5M8k2L1Pq7J08n8Ro0Q3o9O1j2Q8j37m2J46J7j53M1J1R2j11J34j13
$$ 2 3 -63 -31 -46 2 -20 11 18 -69 39 -19 -10 -70 13 -56 5 -7 81 -56 -98 48 65 -88 -47 -36 56 -55 79 -34
7432c4%J4k0l1J05j0m3M2K5n6K3k6O1j27M8L9q3K90k16M1k38K28p4Q6r6n2J45
$$ -34 -34 -20 -40 -71 34 24 -19 23 48 -8 15 -11 50 -77 -29 10 -73 217 1 42 -196 32 -42 44 -52 -104 41
7459D1p9L2k4k7J05K5p9jj3j0j1P2j1m5nR8j4m3K2j9J9K1K9j68J09j20P2oP5j9
$$ 41 -38 -6 -30 -57 48 73 -6 -7 -20 -30 -41 31 20 -25 -30 68 54 11 33 14 33 54 83 -85 24 -96 -24 -30 45 26
7489B6p9o1Q2M0j19Q9R2k4l8N5j10J2J46j76K3Q4q3R4j98J26J76j48M8o8N9o2
$$ 26 -53 -114 -32 8 -111 -22 70 46 8 63 -47 -35 111 -65 -42 42 -41 53 -145 -19 157 9 57 -11 48 -14
7515a4l1R8o8k7J01j22O1p5j3O6O3mL5K1j00k2Q8o2j44J36M6n8j1J40j69J23q9
$$ -14 -45 53 -15 -42 59 -63 -2 -77 -90 -24 39 35 70 91 -9 -31 57 -5 -149 -13 33 -25 -36 104 -65 58 -31
$$ [...]
8191h6
##END NTUPLES=NMR FID
##END=
