##TITLE=1H_DE-80H_X3
 200.13MHz, d2o
 8 sc
 
 19ns.26.2.2025
##JCAMPDX= 6.0         $$ Bruker NMR JCAMP-DX V2.0
##DATA TYPE= NMR FID
##DATA CLASS= NTUPLES
##ORIGIN= UXNMR, Bruker Analytische Messtechnik GmbH
##OWNER= pz
$$ XWIN-NMR		Version 3.5
$$ Mon Jun 16 14:35:07 2025 Russian Standard Time (UT+4h)  Yarkov@DPX200
##.OBSERVE FREQUENCY= 200.1313
##.OBSERVE NUCLEUS= ^1H
##.DELAY= (6, 6)
##.ACQUISITION MODE= SIMULTANEOUS
##.ACQUISITION SCHEME= undefined
##.AVERAGES= 8
##.DIGITISER RES= 18
##SPECTROMETER/DATA SYSTEM= spect
##.PULSE SEQUENCE= zg30
##.SOLVENT NAME= CDCl3
##.SHIFT REFERENCE= (INTERNAL, CDCl3, 0, 14.3821)
##AUDIT TRAIL= $$ (NUMBER, WHEN, WHO, WHERE, WHAT)
$$ ##TITLE= Audit trail, XWIN-NMR		Version 3.5
$$ ##JCAMPDX= 5.01
$$ ##ORIGIN= Bruker BioSpin GmbH
$$ ##OWNER= Yarkov
$$ C:/Bruker/XWIN-NMR/data/yarkov2/nmr/H-C/1/audita.txt
$$ ##AUDIT TRAIL=  $$ (NUMBER, WHEN, WHO, WHERE, WHAT)
(   1,<2025-06-16 14:33:21.50 +0400>,<Yarkov>,<DPX200>,
      <created by zg, POWCHK disabled, PULCHK disabled
       configuration hash MD5:
       00 E9 B6 7A A2 85 ED C7 34 08 36 98 17 FE 4E 26
       data hash MD5: 16K
       01 ED 9B 1D C0 0B 40 09 B6 2C 44 68 C5 5C A4 6B>)
$$ ##END=
$$ 
$$ hash MD5
$$ 9F 02 E4 26 2F 63 B2 BC 1B 80 91 45 C7 EA AA FB
##$RELAX= 
##$RELAX= 
##$RELAX= 
##$RELAX= 
##$RELAX= 
##$RELAX= 
$$ Bruker specific parameters
$$ --------------------------
##$DU= <C:/Bruker/XWIN-NMR>
##$EXPNO= 1
##$NAME= <H-C>
##$PROCNO= 1
##$TYPE= <nmr>
##$USER= <yarkov2>
##$AMP= (0..31)
100 100 100 100 100 100 100 100 100 100 100 100 100 100 100 100 100 100 
100 100 100 100 100 100 100 100 100 100 100 100 100 100 
##$AQSEQ= 0
##$AQ_mod= 1
##$AUNM= <au_zg>
##$AUTOPOS= <>
##$BF1= 200.13
##$BF2= 200.13
##$BF3= 200.13
##$BF4= 200.13
##$BF5= 200.13
##$BF6= 200.13
##$BF7= 200.13
##$BF8= 200.13
##$BYTORDA= 1
##$CFDGTYP= 0
##$CFRGTYP= 5
##$CHEMSTR= <none>
##$CNST= (0..31)
1 1 145 1 1 1 1 1 1 1 1 1 1 1 1 1 1 1 1 1 1 1 1 1 1 1 1 1 1 1 1 1 
##$CPDPRG= <>
##$CPDPRG1= <>
##$CPDPRG2= <>
##$CPDPRG3= <>
##$CPDPRG4= <mlev>
##$CPDPRG5= <mlev>
##$CPDPRG6= <mlev>
##$CPDPRG7= <mlev>
##$CPDPRG8= <mlev>
##$CPDPRGB= <>
##$CPDPRGT= <>
##$D= (0..31)
0 0.7 0 0 0 0 0 0 0 0 0 0.03 0 0 0 0 0 0 0 0 0 0 0 0 0 0 0 0 0 0 0 0 
##$DATE= 1750070001
##$DBL= (0..7)
120 120 120 120 120 120 120 120 
##$DBP= (0..7)
150 150 150 150 150 150 150 150 
##$DBP07= 0
##$DBPNAM0= <>
##$DBPNAM1= <>
##$DBPNAM2= <>
##$DBPNAM3= <>
##$DBPNAM4= <>
##$DBPNAM5= <>
##$DBPNAM6= <>
##$DBPNAM7= <>
##$DBPOAL= (0..7)
0.5 0.5 0.5 0.5 0.5 0.5 0.5 0.5 
##$DBPOFFS= (0..7)
0 0 0 0 0 0 0 0 
##$DE= 6
##$DECBNUC= <off>
##$DECIM= 32
##$DECNUC= <off>
##$DECSTAT= 4
##$DIGMOD= 1
##$DIGTYP= 9
##$DL= (0..7)
0 120 120 120 120 120 120 120 
##$DP= (0..7)
150 150 150 150 150 150 150 150 
##$DP07= 0
##$DPNAME0= <>
##$DPNAME1= <>
##$DPNAME2= <>
##$DPNAME3= <>
##$DPNAME4= <>
##$DPNAME5= <>
##$DPNAME6= <>
##$DPNAME7= <>
##$DPOAL= (0..7)
0.5 0.5 0.5 0.5 0.5 0.5 0.5 0.5 
##$DPOFFS= (0..7)
0 0 0 0 0 0 0 0 
##$DQDMODE= 0
##$DR= 18
##$DS= 0
$$ [...]
##$SUBNAM2= <"">
##$SUBNAM3= <"">
##$SUBNAM4= <"">
##$SUBNAM5= <"">
##$SUBNAM6= <"">
##$SUBNAM7= <"">
##$SUBNAM8= <"">
##$SUBNAM9= <"">
##$SW= 18.0517328524113
##$SWIBOX= (0..15)
0 0 2 0 0 0 0 0 0 0 0 0 0 0 0 0 
##$SW_h= 3612.71676300578
##$TD= 16384
##$TD0= 1
##$TE= 0
##$TE2= 300
##$TE3= 300
##$TEG= 300
##$TL= (0..7)
0 120 120 120 120 120 120 120 
##$TP= (0..7)
150 150 150 150 150 150 150 150 
##$TP07= 0
##$TPNAME0= <>
##$TPNAME1= <>
##$TPNAME2= <>
##$TPNAME3= <>
##$TPNAME4= <>
##$TPNAME5= <>
##$TPNAME6= <>
##$TPNAME7= <>
##$TPOAL= (0..7)
0.5 0.5 0.5 0.5 0.5 0.5 0.5 0.5 
##$TPOFFS= (0..7)
0 0 0 0 0 0 0 0 
##$TUNHIN= 0
##$TUNHOUT= 0
##$TUNXOUT= 0
##$USERA1= <user>
##$USERA2= <user>
##$USERA3= <user>
##$USERA4= <user>
##$USERA5= <user>
##$V9= 5
##$VALIST= <valist>
##$VCLIST= <CCCCCCCCCCCCCCC>
##$VD= 0
##$VDLIST= <DDDDDDDDDDDDDDD>
##$VPLIST= <PPPPPPPPPPPPPPP>
##$VTLIST= <TTTTTTTTTTTTTTT>
##$WBST= 1024
##$WBSW= 4
##$XGAIN= (0..3)
0 0 0 0 
##$XL= 0
##$YL= 0
##$YMAX_a= 18292
##$YMIN_a= -14102
##$ZGOPTNS= <>
##$ZL1= 120
##$ZL2= 120
##$ZL3= 120
##$ZL4= 120
##$ABSF1= 10
##$ABSF2= 0
##$ABSG= 5
##$ABSL= 3
##$ALPHA= 0
##$AQORDER= 0
##$ASSFAC= 0
##$ASSFACI= 0
##$ASSFACX= 0
##$ASSWID= 0
##$AUNMP= <proc_1d>
##$AZFE= 0.1
##$AZFW= 0.1
##$BCFW= 1
##$BC_mod= 2
##$BYTORDP= 1
##$COROFFS= 0
##$CY= 83.5205535888672
##$DATMOD= 1
##$DC= 2
##$DFILT= <>
##$DTYPP= 0
##$F1P= 10.8118882576601
##$F2P= -7.23987719738617
##$FCOR= 0.5
##$FTSIZE= 0
##$FT_mod= 4
##$GAMMA= 1
##$GB= 0.15
##$INTBC= 1
##$INTSCL= 1
##$ISEN= 128
##$LB= 0.25
##$LEV0= 0
##$LPBIN= 0
##$MAXI= 10000
##$MC2= 0
##$MEAN= 0
##$ME_mod= 0
##$MI= 1.114404
##$NCOEF= 0
##$NC_proc= 0
##$NLEV= 6
##$NOISF1= 3.799351
##$NOISF2= 2.8
##$NSP= 1
##$NTH_PI= 0
##$NZP= 0
##$OFFSET= 14.38212
##$PC= 1
##$PHC0= -1707.972
##$PHC1= 2.166562
##$PH_mod= 1
##$PKNL= yes
##$PPARMOD= 0
##$PSCAL= 0
##$PSIGN= 0
##$REVERSE= no
##$SF= 200.129724274929
##$SI= 16384
##$SIGF1= 3
##$SIGF2= 2
##$SINO= 400
##$SIOLD= 16384
##$SREGLST= <1H.CDCl3>
##$SSB= 0
##$STSI= 0
##$STSR= 0
##$SW_p= 3205.1282051282
##$SYMM= 0
##$S_DEV= 0
##$TDeff= 0
##$TDoff= 0
##$TI= <>
##$TILT= no
##$TM1= 0
##$TM2= 0
##$TOPLEV= 0
##$USERP1= <user>
##$USERP2= <user>
##$USERP3= <user>
##$USERP4= <user>
##$USERP5= <user>
##$WDW= 1
##$XDIM= 8192
##$YMAX_p= 0
##$YMIN_p= 0
$$ End of Bruker specific parameters
$$ ---------------------------------
##NTUPLES= NMR FID
##VAR_NAME=  TIME,          FID/REAL,        FID/IMAG
##SYMBOL=    X,             R,               I
##VAR_TYPE=  INDEPENDENT,   DEPENDENT,       DEPENDENT
##VAR_FORM=  AFFN,          ASDF,            ASDF
##VAR_DIM=   8192,          8192,            8192
##UNITS=     SECONDS,       ARBITRARY UNITS, ARBITRARY UNITS
##FACTOR=    0.0002768,     1,               1
##FIRST=     0,             0,               0
##LAST=      2.2672688,     0,               0
##MIN=       0,             -14102,          0
##MAX=       2.2672688,     18292,           0
$$ Real data points
##PAGE= N=1
##DATA TABLE= (X++(R..R)), XYDATA
0@%%%%%%%%%%%%%%%%%%%%%%%%%%%%%%%%%%%%%%%%JlPj0J2j4J5j6J6j6J6j7K0k4
54a3K6k8L1l3L8m2M4n0N6o2O8p3P4n6m7O60J3135o434j5058j838m31p3J3515J4883
78A8292q026j6709m05P467j41R53M376n540r916N398J2340j788r407p08K105j374
94c083M317Q105m840j2622K1J0445L599k611k058o474q436M802J6323O740p213
109G015o636k635k584K799R183N83j2210p810N157O615K816L924K38q246m815
124f606O930N427m585l868J499l96JN885K293q584o428N406O670L43l48j368o923
141d652l439Q528Q573l760q383l759j409K139R952Q066n197r770r38M038K077
156B066J951O19o737p509L213Q652J931k792j076j333j671L304M635l203p030
$$ plain form
0 0 0 0 0 0 0 0 0 0 0 0 0 0 0 0 0 0 0 0 0 0 0 0 0 0 0 0 0 0 0 0 0 0 0 0 0 0 0 0 0 0 1 -2 5 -5 7 -7 8 -8 8 -8 8 -9 11 -13
54 -13 13 -15 16 -17 21 -21 23 -27 29 -33 35 -38 36 -20 -67 593 13728 7294 -7764 -9602 -10033 -10106 3409 18292
78 18292 10266 -6443 -6848 619 478 1431 5807 267 -9649 -4251 8089 6301 -3106 -3814 -1709 -3083
94 -3083 1234 9339 4499 -8123 -8102 2343 5942 3331 1273 -5201 -13637 -8835 7488 14228 7015
109 7015 379 -2256 -4840 -2041 7142 7725 -4485 -12295 -7138 -523 2293 6217 6455 -1791 -6606
124 -6606 324 5751 1166 -2702 -1203 -1599 -1598 4287 6580 -2004 -8432 -3026 3644 3987 3639 2271 -4652
141 -4652 -8091 437 9010 5250 -3133 -6892 -8301 -6162 3790 11856 6659 -3111 -4049 -11 2066
156 2066 4017 4636 -2101 -9610 -6397 2255 4186 1394 318 -1015 -2686 618 5253 2050 -4980
171d980M1N850K882k3j002m987n348L387R323K594n716m964j613M54N062O775
187G735j630r719n681L328N188L949K984k115o866j755O034M068k507l341j758
202b086k037Q77N277J949m851l105L054L079N4k95j986m474l43O638M788k837
218C702n048k515n25K641O310K452n653o464K51M060L428K210j284o106m766K878
234d429N954J894j425j611k017o21L296L523j919m568q16K099J343P30r4k707
250a368k628K511M983N87l797l202j066J083M417M283j861o389l000K668M123
265A344K923N56l810n739m97N424M093q71k771l029k056J807M670J559l456k741
281b594R54K007J288Q82j525l433l47L909K612j910l071j617p6K728M105L62m796
$$ plain form
171 -4980 -4939 911 3793 3770 2768 -2219 -7567 -4180 5143 7737 2021 -2943 -4556 -4102 960 7735
187 7735 6105 -3614 -9295 -5967 -779 3170 6154 4039 -2827 -4582 1452 5520 3013 -328 -2086
202 -2086 -4123 -3246 2031 3980 -871 -3976 -922 2157 2211 1916 -70 -4544 -4887 1751 6539 3702
218 3702 -1346 -3861 -4386 -1745 4565 7017 1364 -5100 -4849 -789 2639 4849 3565 -2541 -7307 -4429
234 -4429 1525 3419 1994 383 -1634 -2255 1041 4564 2645 -1923 -2739 -640 703 1433 1339 -1368
250 -1368 -3996 -1485 3498 4085 288 -2914 -3980 -2897 1520 5803 3942 -2447 -5447 -2779 1344
265 1344 4267 4823 1013 -4726 -5223 201 4294 3423 652 -2377 -4433 -2626 2044 3603 147 -2594
281 -2594 -1640 367 1655 2537 1012 -2421 -2768 1141 3753 1843 -1228 -2845 -2921 -193 3912 4274 -522
298e22m378P43L576L287J486k086m973k238L529M933J058k028l144k520K09L691
314F23K910j568l402j087J185J592J343l9k437j939J771K886L90k048j748m54
330b022J157K986J918k262m270j210K329L110J742p28l658l537P28M219K719q03
346B418k685k442o45K609M020P96k945k714l82J036J648J122j155k531m06K520
362B64J728n66j587j346m30J662K468j09l129k156J026K768K409M26k445l797
378b814q89L221L601N02k189l157j933J226L540J996j852l264j164J323K481K133
394B761p4k382k023P97J885L82j233j433n94R23K349J280j647k634n39J756J911
411A485O69j326k927j653J953L747J531j438k760k027K64K994K849l55k973k150
$$ plain form
298 -522 -4900 -4157 -581 2706 4192 2106 -2867 -5105 -1576 3357 4415 2387 -757 -3277 -3068 623
314 623 3533 1965 -1437 -2524 -1339 253 1596 1557 -880 -2819 -1048 1838 2228 180 -1568 -2022
330 -2022 -865 2121 4039 1777 -2493 -3703 -1374 1736 3478 2750 -908 -4445 -3717 502 3221 2418
346 2418 -267 -2709 -3354 -745 3275 4071 1126 -1588 -1970 -934 714 1836 681 -1850 -2256 264
362 264 1992 1426 -161 -1507 -1937 -275 2193 2084 -1045 -3201 -2175 593 3002 3428 983 -2814
378 -2814 -3703 -482 3119 3621 1432 -1725 -3658 -2432 1108 3104 1252 -2012 -3176 -1853 628 2761
394 2761 2687 305 -1718 -921 964 1346 113 -1320 -1914 -991 1358 2638 991 -1643 -2182 -426 1485
411 1485 2154 828 -2099 -3752 -1799 1948 3479 2041 -719 -2746 -2482 512 3361 3006 33 -2117
427b117J39J571J776M43j950k442k1K175J730L11q15j042l68J099J198p43k158
444a214j159R08J867J467M5j812j996J69K263J794m45k251k216n06K035L039J096
461C084k063k704q10J265K363J533o44k295j581R69J742P20r14j687j212M51J950
478A67J220o60j361j39J158J241K04j280k333r07J573K540Q93j206k074j035Q52
495a147K520J568j382k879j595P09K256K019P9k156k191J35J962J709J30j133
511F04j378k18J381J360l95j729j328J61J158J049k2j213r54Q82K071J054r58
528A525k172j583J05J985K101M1k024j845J61J789K000L38j676k404p91J358K033
545I41P61q20j633r59N67J526Q22n83j058k38Q37R79L58q71j535n64R27J219N0
$$ plain form
427 -2117 -1978 -407 1369 1812 -138 -2580 -2601 -426 1304 1615 800 -242 -610 489 1687 944 -1214
444 -1214 -2373 -1465 402 1869 1914 102 -1894 -1725 538 2332 1887 -364 -2580 -3086 -1051 1988 3084
461 3084 1021 -1683 -2493 -1228 1135 2668 2024 -271 -1852 -883 859 1579 665 -1022 -2234 -1783 167
478 167 1387 727 -634 -773 385 1626 1830 550 -1783 -2690 -1117 1423 2316 1110 -964 -1999 -1147
495 -1147 1373 2941 1559 -1320 -2915 -2206 50 2069 2148 -8 -2199 -2064 -102 1607 1737 604
511 604 -774 -992 389 1749 1354 -375 -1703 -1542 -384 665 643 -570 -1524 -642 1429 2483 1525
528 1525 -647 -2230 -2125 -140 1961 2002 -22 -1867 -1706 83 2083 2421 745 -1659 -2450 -1092 941
545 941 1702 882 -751 -1710 -1143 383 1205 622 -436 -674 163 1142 1500 629 -906 -1470 -543 676 726
564G26r94j108j34J265K024O41j456k278r60R66J948J271o11j880j398O88K030
581G40J399l50j696j683k30J492J637o0j244j128r5Q96J017J04j010q70M78J496
599H93Q43n30j369j102K37J343J081n78j845j013N09J929J695k3j883j956k88
616b057J621J766L12j202j690m92J239J754O53j044j531n92O15J305M49o99j165
633g58m18Q64R85N4r53r01l6J146J425K48j249j414j97J099J320L39j186j855
651a487n76J169J870R21p21j666j247L56J627J112k83j322j006J69J136J181r1
668A142r98r23P4R39O29j82r70o83K98J063O20n55j317o50N70J515R18l52j371
687b33j205L62J458J315j74j525j538j23J351J537M25j163j547m47Q25J287N15
$$ plain form
564 726 -268 -1376 -1510 -245 1779 2420 964 -1314 -2274 -1308 640 1911 1300 -580 -1978 -1290 740
581 740 2139 1789 93 -1590 -1820 -328 1309 1249 5 -1123 -1218 -322 695 799 -211 -1081 -603 893
599 893 1736 1206 -163 -1265 -1028 315 1396 818 -1027 -2040 -1531 398 2093 2070 187 -1769 -2057
616 -2057 -436 1330 1642 440 -1250 -1742 -503 1251 1904 860 -671 -1263 -648 657 1106 407 -758
633 -758 -1176 -312 673 727 -226 -1127 -1163 -17 1408 1656 407 -1007 -1204 -105 1215 1554 368 -1487
651 -1487 -2063 -894 976 1897 1176 -490 -1737 -1381 246 1358 1075 -247 -1253 -1084 52 1233 1142
668 1142 144 -779 -705 234 863 681 -289 -972 -674 389 1009 454 -863 -1513 -943 572 1490 1138 -233
687 -233 -1438 -1076 382 1697 1523 -2 -1540 -1663 -312 1225 1650 487 -1060 -1507 -682 605 1120
704A120n41j331m83P69J100L63n38q96k80O46R83M5r04j025K8R10J006J80j140
723A2j389j10J170J459L69j009j505o84R90J680P80q19j466r30M51J453R38l61
741A029j278r19K10J020P20j41r06o58K90Q18N79l13q28m26N60R17M49n19j180
760e76o71O04J257O90n23j301r22L44J352J092j95j363j175P4J110J216L34q93
778D54j181l45Q67R64L27o04j009l94O13P87J88o33p05r9N88P67R4p23q16L5R43
799A18R43R8r11j190k72R02J323L15q62j359m38P34J327O31n79j347q91M38J205
818A85Q22j97r67o84K42R49O56k78q62n62K41P85M49m21q48m85N50R55L81o38
838B73j050l88N75J314P74o11j303q01K60J191R73j42j174j060J20J080J129m
$$ plain form
704 1120 579 -752 -1235 -466 634 997 459 -437 -717 -71 912 957 53 -972 -944 -34 972 1152 12
723 12 -1377 -1487 -317 1142 1511 502 -1003 -1687 -697 983 1763 944 -522 -1452 -1001 452 1390 1029
741 1029 -249 -1168 -958 62 782 641 -265 -923 -633 185 764 451 -377 -803 -243 674 1123 604 -576
760 -576 -1247 -643 614 1304 781 -520 -1442 -1098 254 1346 1151 -212 -1387 -1313 -203 1013 1347 454
778 454 -727 -1072 -205 759 1086 482 -527 -921 -308 479 667 34 -671 -770 -182 585 679 -44 -860 -825 118
799 118 1061 1159 248 -942 -1214 -312 1011 1326 464 -895 -1333 -599 728 1359 780 -567 -1458 -1020 185
818 185 1007 810 -157 -841 -599 350 1006 728 -134 -696 -455 330 779 358 -490 -975 -425 530 911 273
838 273 -777 -1165 -590 724 1498 887 -416 -1217 -957 234 1207 1065 -109 -1169 -1049 31 1160 1156
856A156r44j021l31O73R17J56n55o31j1O36O73N1o14p23J06N81O26j31p33o82
876h01j4Q30Q06q9q93q83j20R99J169L22q20j208m14N43J076N84n04j052n59M20
896f08J058O52k64r03p50J79N93M41j83n96l56L49P43M43l96o84l73L56Q95M46
916A042n47r85n34M80R91O09m22j169q02L36J137J021l1r82r96q9Q28R10Q9p97
936H9q13j23P67Q34J60n82p49j57M68N81r9o63n41J38P64O78m8q38o29O5Q66Q39
958A007m1q70r02j32Q48R21J46p84r66m18O45J033N56l94r66n08L75P63L89k68
978D34p52m11L49O68L76j67n36l34L00M59J46m59p36k16M66Q63L54m79q23m30
998i28M57R19N49k20j013o49K46R22P27j96q23q84m7P08Q56J35n49o73j93M57
$$ plain form
856 1156 212 -809 -1140 -467 450 606 51 -580 -591 45 718 769 155 -568 -462 119 745 614 -119 -801
876 -801 -815 15 821 732 -161 -1044 -1164 -165 1004 1326 506 -702 -1116 -573 503 1087 583 -469 -1028 -608
896 -608 450 1102 838 -65 -815 -636 -43 398 215 -381 -737 -388 355 798 402 -282 -655 -299 596 1042
916 1042 495 -490 -1024 -544 447 1056 634 -535 -1337 -1001 136 1157 1126 144 -852 -941 -113 797 886 89
936 89 -724 -847 -80 754 914 332 -417 -574 -106 475 376 -287 -828 -690 74 752 704 -134 -763 -698 168 1007
958 1007 966 96 -806 -938 -90 831 977 193 -773 -1191 -546 487 1043 649 -317 -825 -450 313 702 434
978 434 -318 -729 -380 288 664 497 -39 -373 -73 386 532 73 -663 -879 -413 450 804 325 -498 -928
998 -928 -471 448 997 777 -236 -885 -639 283 1010 814 -9 -893 -940 -232 624 759 210 -463 -656 -199
1018a99O40J65n17o09o0N26N82j6m06n05N3N65M81o1p45o94n7P96P61J05p49r02
1040h46j32P59Q73L20n97q96l81N54Q96L80l76r25m78L75O75M23k02o55l47K60
1060c20O22K34k96n74k73L46O24K22l28o15k35M78O97K87m92p99n29M23R50M16
1080H38k99q86n94K03Q18O68r2p23n85KO03O66R1n60n79j38M77M35J07m57l57
1101c62L0M03L28o3n16m44J76N47M60p4n02n75M5N98O56O3n86p90j40M87Q18K14
1123G73m48q17l88M36P28L22j75o57l70J91N77L80j78m66l41K42M26K37k45m77
1143b50j80K57M67K45l75n84k58L70O88L04l44o94m28K93P65N99k25p72n83J35
1163e70O38O02p0o00n78p1N34N82K6n41l93J6L41L96M4l81l44Q3M69K81n1m47
$$ plain form
1018 -199 441 606 89 -520 -580 -54 528 512 106 -399 -346 219 700 639 -106 -800 -857 -61 700 805 56 -846
1040 -846 -978 -219 654 974 377 -519 -900 -346 550 930 554 -371 -849 -474 201 624 422 -233 -580 -320
1060 -320 302 536 240 -334 -607 -261 363 585 257 -358 -593 -115 582 869 377 -422 -951 -528 422 838
1080 838 539 -347 -941 -738 80 748 656 -67 -652 -650 -47 619 710 150 -429 -567 -90 345 452 -5 -362
1101 -362 -332 71 399 336 -180 -624 -448 99 559 485 -17 -592 -547 51 707 770 184 -606 -746 -259 559 773
1123 773 325 -492 -880 -444 284 606 431 -226 -596 -405 172 552 374 -92 -433 -191 235 472 227 -250
1143 -250 -430 -173 294 539 164 -420 -678 -308 380 684 340 -354 -782 -489 276 875 650 -122 -705 -570
1163 -570 68 670 600 0 -578 -649 -115 467 493 -48 -441 -425 -84 312 356 -25 -369 -286 183 464 413 -34
1185c4l77P5M69L99j11n86m06m1N50O29K6n67o04p0M60O44K15l93n46l03K94N67
1207B90K79k54n16k53J23M56K94j57l94k32Q9L98J65j94m56l4K52M79J85k56m80
1228b16k29K70M43K79k53o15l70K45N73N51j43o47m90L4N83N19l3m44n11l1M63
1249b2M17L1m22l66JK75M05Q9m07l53R8K92L28q1m62l74J13N87L84n7m33m25k1
1272d03M83N23m2n01n93r6M84M98K09m00m28k48K77M33K71k68m11j49K25L41J58
1293C63k30k80j73K03L00J54k60l07pK05L55Lk82m93j54L49M69K64k47l77j93
1314c38J17M83K76j31n22m03Q4M33L82Qm21k70p6K85L37N8k82k96J7K68K58o1
1336B06k61k27N2L14J74l5k84j97J6L56L69j71m13l94J3L75M35M6l44l63q8L50
$$ plain form
1185 -34 -411 -336 133 532 421 -165 -571 -612 -62 567 593 26 -578 -648 -188 456 671 278 -268 -571 -277 290
1207 290 569 315 -201 -454 -331 125 419 262 -132 -364 -275 123 288 94 -362 -396 -144 335 520 264 -216
1228 -216 -445 -175 268 547 294 -321 -691 -446 127 678 535 -112 -602 -568 15 534 501 57 -454 -485 -22
1249 -22 395 426 4 -362 -361 -86 319 408 1 -352 -254 38 366 285 -177 -551 -438 149 533 476 43 -382 -403
1272 -403 80 603 561 60 -533 -629 -145 353 562 162 -266 -514 -237 196 467 199 -212 -361 -136 205 363
1293 363 133 -147 -320 -117 183 337 77 -230 -237 -32 323 326 44 -449 -603 -254 215 479 232 -145 -338
1314 -338 -221 262 538 407 -115 -518 -434 -1 381 389 -32 -302 -378 -93 244 302 20 -276 -259 9 267 206
1336 206 -55 -282 -230 84 258 223 -61 -258 -242 114 483 312 -101 -495 -482 -107 328 374 30 -333 -421 -71
1358g1M91J21l53m25j15J74L81J89k05l23j99J37L35J21j78k19j84K02L42P1k17
1379G5k95j17K31L50J05k84l01j03K99M13J43k83n10k44K07M50K30j53l64l18
1399d69K21M16K45j08k87k30o9L21J95J4j99k61M3K26J64j25k27j11N4K51J93
1420B57j33j92l00J09L41K40p0m06k72J79L60L34Nl36m24j01K56L41J49k79k58
1441b00j13K07L05R7j58k65j00J58K26O4j04j93j27J70K37N6k29k57n8J67M33
1462C16J9k17l72q6K02L30J32j59m09j89K21L78K37j08l27k92P7K75K38m8k53
1483c5l01J17K35K29n8j83j58mK39J47l4l06j51J74K25K08k09l06j38J00K87J65
1505B43k4l17k42M4L42K22M5l27k80p6L11L09O9j99k85o0J67K35K5j67k30p2K06
$$ plain form
1358 -71 420 541 188 -237 -352 -178 203 392 187 -136 -335 -198 137 258 80 -139 -323 -121 221 292 75
1379 75 -220 -337 -106 244 349 65 -236 -339 -40 373 516 233 -277 -521 -314 136 366 213 -151 -469
1399 -469 -248 168 413 305 18 -212 -281 40 235 249 50 -211 -168 58 222 97 -130 -241 -187 64 257
1420 257 124 -68 -368 -259 82 322 252 -154 -426 -247 113 447 452 116 -308 -409 -153 188 337 58 -200
1441 -200 -313 -106 199 296 138 -127 -227 -69 157 221 117 -76 -203 -33 204 260 31 -226 -284 -117 316
1462 316 335 118 -254 -340 -138 192 324 165 -244 -433 -212 166 403 295 -32 -324 -247 28 266 218 -35
1483 -35 -336 -219 16 245 187 4 -154 -158 81 228 194 -112 -263 -89 136 344 135 -171 -309 -209 78 243
1505 243 219 -98 -340 -296 46 268 313 -14 -294 -370 -59 250 319 120 -165 -225 -58 177 202 35 -195 -267 -61
1528f1K06L4j80j01n2J31K39j9k13k36Q5J98K08L3k11l15RJ41L03J11k08k90j53
1551c41J30K79J71l5k87k27P3K67J79j7k07k01M1K28J36m1j79j71J21J41J17r8
1573G9k29p6J30J77J53j23j79j79K7L73J52o9k34k18j2K90K53ok81l18j5K50K32
1596A77N8k08j80n3J43J72K7j08j49m5J26J99K2j76j41qJ53K00q7j69j41rJ96
1619aK40nk46k12l1J59K58P8j01l15l6J13K78R7j55j56j74K7J72J41l1k25m1J34
1643c2R4R5m9j91j17J32J67P6j00j63l4qK49R5r6j86j37J04J05K50q9j89k66N3
1667b37J85J45J02k02j83j4K22K13J4j62k00q0J19J61k5m4j22l4J22J50Rj21j71
1690a53J2P8J70L8j76j23L8J49J77j4j81k13L6J34J82R2j68k37q2J20J65J25j20
$$ plain form
1528 -61 145 179 -1 -102 -154 -23 216 197 -16 -252 -167 31 239 272 61 -254 -245 -104 199 310 102 -188 -341
1551 -341 -211 68 239 204 -83 -310 -237 30 209 192 -15 -216 -175 53 189 148 -31 -202 -81 60 177 79
1573 79 -150 -226 -96 81 234 111 -68 -247 -220 153 305 236 2 -216 -228 62 315 309 28 -290 -305 -55 177
1596 177 235 27 -153 -206 -63 109 136 28 -121 -166 -40 159 181 5 -136 -144 9 209 122 -47 -188 -197 -1
1619 -1 239 234 -12 -224 -255 -96 162 240 139 -176 -212 -99 179 276 121 -35 -209 -182 -10 131 100 -125 -166 -32
1643 -32 62 157 108 -83 -200 -68 99 175 75 -88 -122 -130 119 214 118 -68 -205 -101 4 254 165 -24 -290 -237
1667 -237 -52 93 195 -7 -190 -204 18 231 245 83 -117 -197 -78 83 58 14 -108 -142 -20 130 139 18 -153
1690 -153 -141 -63 107 145 -31 -154 -116 33 210 196 15 -198 -162 -28 154 246 78 -159 -241 -121 44 169 49
1713D9j81m3J31J03J28p9j12n5n1J06J05p4j46k5J06J26Mmj93m4Q2J41O6j19j39
1738a18m3J26J76M9p9j23j60N5J69J40l0j63j22J1J36N0J1j9j91qR9J37J4p3j50
1763a06L8J18M9k4j66k2j0J74O4J2j45j20L8J01J63n3j36j71R3J10J07J3n6j56
1787h5n7J19J01R3l3j46r4L1J44Qk8j16o9P1J28L7n0j11J4P1R4%q4j88jJ13J10
1814G2M0o1j32j28J86R8O3r7j10r6J14J08M5k1j31l3l4J33J30k1j04m4m9J56j4
1839G0Nj36p8N1N5P3Oj06o4J12R1O7l2j79l3%J07J35n4r8m1j10J98Q4K8j48r9
1866i6j0J02O4R3j34j01k8Q0O8Q7j17K5r9Q2P8L9r9j24M4k4R4J17j54r6k0R5J57
1893A23J6q0j93k1J17J19O2r4j26n3J31P7Ppj18rp9J81K3j5p6o5J8J11M3n9n2
$$ plain form
1713 49 -132 -175 -44 59 187 108 -4 -59 -110 -4 101 27 -119 -144 -38 88 92 88 -105 -149 -67 74 140 21 -118
1738 -118 -161 -35 141 190 111 -12 -172 -117 52 192 162 -1 -123 -112 24 74 85 66 -125 -133 -34 103 117 44 -106
1763 -106 -68 50 99 75 -91 -113 -123 51 115 127 -18 -138 -100 1 164 111 -25 -196 -103 7 114 127 71 -85
1787 -85 -142 -23 78 171 138 -8 -102 -71 73 81 53 -63 -132 -61 67 104 54 -57 -43 28 122 122 38 -150 -151 -38 72
1814 72 112 51 -81 -209 -23 75 138 41 -69 -165 -51 57 102 81 -50 -83 -117 16 146 125 21 -23 -72 84 70
1839 70 75 -61 -139 -88 -33 40 46 -60 -124 -12 79 146 114 -65 -98 -98 9 144 90 -8 -49 -159 39 123 151 3 -96
1866 -96 -106 -4 60 153 19 -82 -110 -30 38 125 8 33 -66 16 94 133 34 -90 -46 -70 24 141 -13 -109 -129 -34 123
1893 123 139 59 -134 -155 -38 81 143 49 -77 -130 1 78 85 78 -40 -49 -128 53 76 61 -15 -80 -62 49 92 33 -19
1920a9m2N4R9K0j60J0o8P2O9J28j47q4p1N3J90k3m0p4l7r9J57K9O1j26n3R8J4
1947A1N5qj02p2P9N0N2rn1l7l8P3O7Mj00q0O0P6P9o0o8k2q2J42P9o1p1r1j9J48
1977DJ15o5%q2j04P2R0P0p9r5m6Q7J10J4or9K9o4O7P0k9j09m0J35M5Lk7j14nM5
2007hR1no7p2l6P0K5J17j08q8jL1J38L1n5j47j3N3Q3Q6j6j51rj4J15R3j30ol5
2036b8K1K8Q6k1j13l5%J16Q7q1p8j05J19L2J7m8J0r5mJ29lJ4l9k0l3M4O6M5p4
2065C7q9n3L4R4M3j0r8KO8J4L5p0p5LR9L5pm6q4L2L5MN2o5m8j3O9N4K2p3k2j23
2097a44J09P3P7q0j80M6Q3J03Kj0j10j4kJ15j4j05K2j8K6P9oo4o0L5kP7M6l2o3
2126a1k8J3P4K3j5r6o0P0N9M4r0l8k0N8N8Jrp1n2K1P3M6M1r4n1qP5N4l9j08J1
$$ plain form
1920 -19 -61 -7 92 112 -48 -38 -106 -34 35 163 16 -68 -139 -86 104 81 41 -33 -70 -169 -12 17 78 -48 -101 -3 11
1947 11 66 58 -44 -116 -37 13 65 56 5 -32 -70 3 70 74 -26 -106 -46 30 109 49 -19 -41 -123 19 98 37 -34 -125 -144 4
1977 4 119 54 54 -28 -132 -60 30 100 21 -74 -120 -33 77 91 85 -14 15 -49 18 88 59 -50 -90 45 90 93 66 -48 -53 -8
2007 -8 83 78 11 -61 -97 -27 -2 115 7 -81 -82 -51 87 118 63 -84 -97 -44 39 125 109 -42 -51 -65 50 143 13 7 -28
2036 -28 -7 21 107 86 -27 -62 -62 54 141 60 -18 -123 -4 28 45 -3 7 -88 -92 37 34 48 9 -11 -44 0 66 111 37
2065 37 -52 -105 -71 23 66 56 -42 -40 28 42 77 7 -68 -65 34 69 62 16 -68 -36 -1 3 55 -10 -58 -71 -2 52 74 1 -21 -144
2097 -144 -35 38 115 35 -145 -99 -16 87 89 79 -31 -45 -47 68 54 -51 -29 -47 -21 58 52 -12 -72 -37 -39 38 84 52 -11
2126 -11 -39 -26 48 71 56 -40 -100 -30 29 73 -17 -55 -75 -17 41 42 33 -38 -90 -69 4 50 91 -3 -54 -62 13 67 28 -80 -69
2157f9MJ17j8l5qqk9P4K3om0m5j9K5R1k0m6q0mQ3Q0k5ro9j8L2L4Q1r8q3J3K8R8
2190E4j4j08QPN5Q7J0n3j21M7J5K3M4m8p4m1Q0M4R1r2r3m8J02P0RM4j65K1M4J
2220aR0l8p2m4L6kQ4m6l4p4k1J36K5lj8q0M1N6K1Pj06k0JJ40K4k5j06k8N8k6J07
2251H2n6o4m8J5P7O0Kj29L5j5M8L8Lo5Pl0K6J00j3j13Km2L5J02%j15m7R9pJ15
2281A02m9p9o9N1L5J02k2lj12m0O2K7P1j55O9j08N3R0M4K6j13r6Q0N8k9P9j51
2308g7J7O8J05l3n3j9m0lN8M9m8p8k3M1P7N9n5j11n0L8J21O0Pj48n8K5R8M1j4
2337E4q0o6N1R6O9K8j79o2%Q5O7nj07o1J30J3N9nj09j19J05PJ59o0p1q3j1J12
2365A7Q7n4n7j03j6J31L1N4j18m6MO7N8k8m5k0kN2M0L5m0r8K5k8P1M3j13Jl8R0
$$ plain form
2157 -69 -65 52 34 -1 -9 -17 -46 28 51 45 5 -40 -59 -34 57 37 -9 -89 -93 -10 70 45 36 -33 -51 -19 15 96 -2 -85 -72 -44 54
2190 54 40 -68 -60 -53 2 89 99 46 -75 -28 -13 10 54 6 -68 -109 -29 15 106 14 -79 -127 -25 45 54 98 -67 -46 -2 -1
2220 -1 89 51 -21 -65 -29 -31 53 7 -27 -101 -122 14 39 36 18 -62 -21 35 56 63 -43 -63 -62 78 102 77 -29 -57 1 -25 82
2251 82 26 -38 -86 -71 6 66 68 -61 -26 -41 7 45 48 -17 -10 -40 -14 86 73 -40 -38 -80 -45 57 57 -58 -105 -6 -13 102
2281 102 53 -26 -95 -44 -9 93 71 68 -44 -84 -22 5 76 -79 -10 -118 -65 25 69 95 -18 -114 -34 24 -5 74 -77
2308 -77 -60 8 113 80 27 8 -32 -35 23 72 24 -54 -77 -36 41 100 45 -66 -116 -78 43 103 110 -38 -96 -71 27 68 54
2337 54 -26 -92 -41 55 124 152 -27 -89 -89 -4 63 58 -49 -110 20 33 92 87 -22 -141 -36 -29 130 70 -1 -84 -95 17
2365 17 104 50 -7 -110 -126 5 36 90 -28 -74 -70 -3 55 27 -18 -38 -40 12 52 87 47 -51 -26 -54 17 60 -53 -52 -90 0
2395@O6L2p3o1n1P1O9J8o1o0o9O4Q9P5q0j04k2M5R4K0K4j33J2lJ4R5j7n6k9oK9
2426hR6o7On8mj3J68m0j35J7n3O6J06jo5j24Q0N1L8Nj0j24m7J00R4Oj07l9n1J02
2456a1N9Kp1m0OO5Q8o2k8k5p3J06M7J7j5o8q7J21KN3q7l1l8N5Q9L9m4j19j0j0
2486g0R8L7Mj41l6O2Q4%k8o9q1Q5N4O6Qq5o4P2M5J4j4r0J5j3Q4Lj8n2j7K3M8M1
2518F5P1j54j22P4R5O1l1n3n3K2k1J01K2q2k9k3RN3L7l0m6J3L8L7J4o5n5qO4m
2548@R8p4m9MRJ7L5L6j08o7P7J05J8j14k9j6L1J19km1n9q4P0N1O2Qj14p5Q1pL6
2579A8K5r0n1K9R6L0k2o0q1R0Q1Ln2q2oN9O0N6j6j29pn2J25O0l8m5m9M8PM9J3
2610F9k8m7p9L3R4Mk4n9qO5k6OK6o0O0k1P5l8n1Mp4M3J21m7j1q3q1J24M7J19q7
$$ plain form
2395 0 66 98 25 -36 -87 -16 53 71 10 -50 -119 -55 34 109 29 -75 -97 -52 42 62 86 -47 -35 -38 -24 71 54 -2 -31 -37 -8
2426 -8 88 21 27 -31 -35 -48 120 80 -55 -38 -91 -25 81 80 15 -109 -29 22 60 65 55 -69 -116 -16 78 84 -23 -62 -113 -11
2456 -11 48 50 -21 -61 -55 10 98 36 8 -17 -90 16 63 80 65 -3 -90 31 33 86 -1 -32 -70 -15 74 113 69 -50 -60 -70
2486 -70 28 65 69 -72 -108 -46 38 38 10 -59 -140 -55 -1 65 73 -12 -76 -4 41 55 41 -49 -34 -47 37 40 22 -30 -47 -24 24 65
2518 65 136 -18 -140 -66 29 90 59 6 -47 -25 -46 55 77 -5 -34 -57 -48 5 42 12 -34 -21 17 54 68 3 -52 -60 4 0
2548 0 98 24 -25 -21 -12 5 40 76 -32 -99 -22 83 101 -13 -42 -58 -27 92 90 49 -10 -94 -24 27 89 97 -17 -92 -11 -18 18
2579 18 43 -47 -98 -69 27 57 35 -25 -106 -16 65 68 16 -66 -72 -13 47 103 87 -42 -49 -101 24 84 46 1 -48 0 7 56 69
2610 69 41 -6 -85 -52 42 46 22 -37 -45 20 -6 0 26 -34 26 5 80 42 -9 -5 -79 -36 85 38 27 -56 -137 -13 34 153 66
2641F6q9j7K0Q0o8N5q2j1N7LO6l5j14k0PL4J11o6j0l8NP2N2m2r8L9R3m1R7j07
2671A9o7k7J8Q1L1J2p6n4N4M5K2P8j62r9P2M1R8km7j48Q5N6N4l4j04L0JK4M3k4
2701B0Lq4k5P2N5mq7l4RP8O3j5l8j15N0O8LKj7j14J07j3O4K2l5m9o5N1Q6o2M5
2732D1kl7j7L9L3m2m2KM7Oj7l7Qm8J14k3N5l2j44J6N8N5Q5p9j19L6N8j5M9nm7
2763dm1J3j0R8Oo3l2m2Q3K2l6qq5O8N9K1rk9j06O8O4N0m0m9o3K5O6R9j13m5m1
2794g4j7L8Q2N3r5l2OM6J24j01j9m2l0M3Q0lk6n4q5R7Q2L8l4n6j00J04LJ7k3o9
2824d7j6J0J12L0o9q0m6J15N6Nn8J1o6K7%P7qn1p3M9M6M4k4l0k0m5Q0K2j1r8J
2855e7JJ05k1L3n5n7RP1O1r0K2j00l3Q3P5P3j63l4J5P8j9K4j7p9k3P3O1J4l5m4
$$ plain form
2641 66 -23 -40 -20 60 -8 47 -35 -46 11 14 80 45 -69 -89 -82 -48 63 -3 -13 -51 -46 26 78 36 -62 -23 70 29 126 19
2671 19 -48 -75 -57 24 55 67 -9 -63 -9 36 58 136 -26 -125 -53 -12 86 84 37 -111 -26 30 84 50 -54 -24 -23 1 44 20
2701 20 23 -61 -86 -14 41 37 -50 -84 -75 3 66 51 13 -102 -52 16 19 21 4 -110 -3 -16 48 70 35 -14 -79 -28 58 -4 41
2732 41 39 2 -15 24 57 15 -27 -25 22 28 11 -26 -18 -66 48 25 80 48 -96 -80 -22 33 118 39 -80 -44 14 -1 48 43 -4
2763 -4 -45 -32 -42 56 62 -1 -33 -75 8 30 -6 -14 -99 -31 28 49 40 11 -95 -27 37 87 47 -2 -65 -40 26 125 12 -33 -74
2794 -74 -91 -53 29 82 -13 -45 -39 7 131 30 11 -31 -61 -18 62 59 33 -21 -106 -9 73 111 77 21 -79 25 28 45 22 -47
2824 -47 -63 -53 59 89 20 -60 -106 9 65 70 12 23 -43 -16 -16 61 53 2 -71 -22 24 68 44 14 -6 -51 29 51 40 -58 -57
2855 -57 -56 49 28 61 6 -51 -42 29 90 0 22 -78 -111 -28 47 120 -43 -77 -62 16 -3 21 4 -75 -98 -25 36 50 15 -29
2885b9p6J42k6K4j0m6j3P4M4j8k1r3k5N6J08n4j8o4j3J24K3M4r1j30K4k1J30K7
2913G2k7q8k3J6J10Q0r0m6o5kR5M0j0q6m6K3M9L0m5oq5R2K2mP4j21K5kJ10Rl6
2944F5n9l5J7J7J8Oj4r9N7M1O6Jn6j05nJ10k1M2o4K5j18J07N1k2l1o1lj7J16M
2974C3l9J0m7K2Q6J2m0j1j16N4J31L4j40lr1M1P1N8l5n2j19P1N9N3On5j02J07
3002bL2L7k7j20K6LM9N3j9j20L1M2P8m4L7j36l5K6J12P9n5k4q5K0R6K2J6p1p3
3031e2L6J3L7j0K4j26N6%P0j6k2l5j1M4K0L7q4Po9J9J07jl3n4j0O3J8Q3j03p0
3061f2l6Q9O7Mk0j01j5KJ53L3p8m0r9N2N5Q3k5nj07n4J38KP4j93N9j8L3O4o6j4
3091b5RK4N8nj9j22NO5l5J38J5q5r5m2R9K8R1j27n1K5Q1N6Lm4q3J1M1N3J3m2k9
$$ plain form
2885 -29 -105 37 11 35 25 -21 -34 40 84 66 45 -48 -73 -17 91 37 19 -45 -58 66 89 133 42 -88 -64 -85 45 72
2913 72 45 -43 -66 -50 60 140 50 4 -61 -63 32 72 62 -24 -70 -47 2 32 -13 -19 -104 -12 10 6 80 -41 -16 -18 92 101 65
2944 65 6 -29 -12 5 23 29 15 -84 -27 14 80 81 25 -80 -85 25 4 46 -18 7 -111 -4 47 25 -6 -67 -70 -87 29 33
2974 33 -6 4 -43 -21 65 77 37 26 -90 -36 95 129 -11 -14 -105 -64 7 65 30 -22 -141 -70 -11 42 48 -7 -109 -2
3002 -2 30 67 40 -80 -54 -51 -2 51 32 -88 -57 -15 63 19 56 -80 -115 -89 23 102 47 23 -62 -42 54 76 92 21 -52
3031 -52 -16 -3 34 24 48 -78 -22 -22 48 32 10 -25 -36 8 28 65 -19 -12 -81 -62 45 44 11 -43 -53 10 28 111 8 -62
3061 -62 -98 -9 58 62 42 -59 -74 -72 81 114 36 -4 -103 -51 4 87 62 57 -50 -104 34 36 110 -83 -24 -42 -9 55 -11 -25
3091 -25 -16 8 66 61 42 -80 -75 -10 -45 93 108 23 -72 -114 -15 13 104 -23 -74 -49 32 88 91 47 -36 -25 16 69 82 40 11
3122A1j8rO3Pq0k9PM2N5nj0q8M6m7J00J2p9l4j1N0O4o6K1kl8J7J01n6J8l5o7M0
3154b0K7P1o7j4lj3O9m0K3Oq3N4j6nK7l2n0M6K2M8l0o7J9k6P5J4l6m1nk5L0J32
3186I0r6M2p3l1Q1J9J8o8k8N0L4oN2p1l8k4O1K9N2o5k5j6ON0K6r2q3J9N2P4N1
3217I0l1j14j6K5N4L9j1j44N2O2N1O1l1p6n6j3Q6M5n8l1Rl3N6J9l2j3OjK3J8M
3248D0o1n1M7M0j5L2m7k2P8k1K7n2ro4RJ32k9Qm1k9j2rJ21j6l1q6%P3N6n7l5j9
3280d3k4N8L8M4j68J0Q8o6O4K1l4l2pOP9j4Mr5K9N9%N5p7n0l4L6O8J3%r1nj9J30
3313D3M9l4j06NKQ8j0K8n4p0P5OO1j9k4r5N9l8R0l3m2l8JP9K1j0o2k6m3R5L5n3
3345b0L4l2k8MM5N1n9jo8O0P0j7kp2P9p0Q3ln3J7q2J21lL2n7p5k2Q5K6K2Ln0n1
$$ plain form
3122 11 -7 -16 47 54 -26 -55 -48 -6 49 44 34 -54 -8 -55 45 57 -22 -56 -67 -17 47 -19 2 0 -38 -21 80 24 42 7 -60 -20
3154 -20 7 78 11 -3 -6 -19 50 10 33 39 -44 10 -6 -11 16 -16 -66 -20 2 50 20 -47 -28 -54 21 35 -1 -42 -47 -72 -42 90
3186 90 -6 36 -37 -68 13 32 50 -18 -46 4 38 32 84 13 -25 -49 12 41 93 28 3 -13 -7 43 69 -23 -106 -87 -35 39 90
3217 90 59 -55 -71 -46 8 47 36 -108 -56 6 57 118 87 11 -45 -58 28 73 15 -16 -7 -40 16 35 3 -10 -4 -5 18 36 40
3248 40 -21 -72 -25 15 0 32 -15 -37 41 20 47 -5 -14 -78 -69 63 34 42 1 -28 -40 -49 72 56 25 -61 -61 12 68 11 -24 -43
3280 -43 -67 -9 29 73 -95 -85 3 -63 1 22 -12 -44 -51 -45 34 20 24 -71 -42 17 17 72 -5 -55 -89 -53 15 28 28 -63 -68 -87 43
3313 43 92 58 -48 -43 -41 47 37 65 11 -59 16 22 83 64 40 -55 4 -34 56 23 -19 -57 -56 23 44 34 -28 -54 -97 -2 33 -20
3345 -20 14 -18 -46 -42 3 54 -5 -6 -74 -14 56 39 37 -35 44 -26 57 54 1 18 -64 57 54 86 29 -46 -68 17 43 65 68 18 -33
3378c3J8K2L4n9l2j3M6N1mrj9rk1N9j5J4k3r2L4O7k7lkk6Q5NL1m6l3j9M1j2M3
3411E3%j49N3OL5P1j7k3q8l4P2N4P5j26m2M2K6L9jp3L9n0J6M3L3m0p9OQ2K1J5
3442E9p3m1N7mJ06j1n2q8M4J8JP8k2r4mnM9L6o0nn6J01l6O6o9J2p0M5Q1r5RK2
3474ao1M1O0j0n4M5k3K6lK9n3l9K5J0R8m5Qr3L3j0L9k0M5o6J9rL8N3l0K8r3n3
3506f6J10k9k7L3k5o6P8P9j5j21M1n6N8J19p3k6l6PPO6K2o8l2oL0jNJ1l9l3N8
3537EK0P2p7j8j2p8O2J8M1k5l6j9L0O2m3m%n2O9N3r4K3p4MR9n0L1L3n9jL3J6j1
3570A8m2M4m8k6Q0j2M4m8j3l1R7pj8l4k3K6J3L5n7j2K1j9Q9o7qJm6N2j0k5L3m8
3602d1lj9Q6m2M5m8N5l9KJ5K4l3oK3M4qk1o5M9j4l3J01l1r7M3oN8M4m5j5n6L9
$$ plain form
3378 -33 -15 7 41 -18 -50 -63 -17 34 30 21 2 -7 -28 31 16 30 7 -85 -51 16 -11 -14 -16 -42 43 48 79 33 0 -19 22 10 53
3411 53 53 -96 -43 -37 -2 69 52 29 -59 -93 -21 33 108 -18 -60 -18 8 47 46 -27 12 -38 -22 21 54 14 -65 -59 23 44 59
3442 59 -14 -55 2 -2 104 93 41 -47 -3 15 16 94 72 -22 -26 -31 18 54 -6 -11 -67 34 -2 64 -5 7 -63 -18 63 -32 -23 -1
3474 -1 -62 -21 39 29 -25 20 -3 23 20 49 -4 -43 -18 -8 90 45 53 -40 -7 -17 22 2 47 -19 0 -9 29 82 52 80 -13 -66
3506 -66 44 15 -12 21 -4 -70 8 87 72 -49 -8 -64 -6 113 40 14 -22 -15 -8 58 80 12 -20 -26 4 3 8 19 -20 -53 5
3537 5 25 97 20 2 -10 -88 -26 -8 33 8 -28 -47 -17 45 2 -2 -2 -54 15 68 -26 -3 -77 -73 26 -24 7 40 -19 -20 13 29 18
3570 18 -24 20 -28 -54 26 14 58 10 -3 -34 63 56 38 4 -19 7 20 55 -2 -14 7 -12 77 10 2 3 -43 9 -1 -26 7 -41
3602 -41 -44 -63 23 -19 26 -22 33 -6 -4 11 35 2 -4 19 63 55 34 -31 18 4 -29 72 41 -56 -13 -19 39 83 38 23 -33 6
3634FJ3M6r1j6j2P3ml2K7l7oM0L5k4K2j7n0K3Q0n1pj6n1Q9k3k8J6Qk7Mj8j8R5
3667D9J6p1n3J19LK1m7n3j8J2P0mp8N8k6J2O6j9o7m7J9O3L4k7K5q0K5l1K3K1R
3698B4k3J2jN5j2k3n4J1k1Q3m4M7j4m3jJ7OJ3l0j6j3P4J6J6r7K4r1N7P8o1k2K0
3730a3J7p2P3qm9L1j2M2J3j7rK6%L5Lj7k7m9rN1N7o2k6l2R9j5Nok3k1N5j7l3Q1
3764G1q1j7l6P8l5K1lNl4j7J03Oo4m0k5Q8K9J5j14P6ooN0L2o9k8rK5m8O3m0J4
3796Dk2K9K1j5l7L3K7l9N3qp2L4o0M1j8M1L6k4l6k2M2ml4k0j0K6M5rl3L8m1PK8
3829AJ6LJ4r5M3Q6n8N6o0l5m2O2L0j1k2n7O1K0J6m2Lll9J5N6mOm4K3Jj3K5J6j2
3863A6l0k7M1L6l8kl6N6MoJ8k1m2J6L3K0J6p0k4O3N7q9j3M2n2N1j4j9j5M8j01
$$ plain form
3634 6 19 65 -26 -42 -54 19 15 -17 10 -27 -33 7 42 18 40 23 -27 -4 76 25 18 2 -49 40 17 -11 5 13 -14 -10 -28 -46 49
3667 49 65 -6 -59 60 63 84 37 -16 -34 -22 48 44 -34 24 -2 10 76 57 -10 -57 -38 25 59 32 57 -23 2 -29 -6 15 24
3698 24 1 13 12 67 55 32 -22 -11 -32 51 7 54 40 -3 -4 13 19 32 2 -14 -27 47 63 79 -18 6 -85 -28 50 -11 -33 -13
3730 -13 4 -68 5 -3 -52 -21 -33 9 22 5 -4 22 22 57 60 43 16 -33 -42 9 66 4 -22 -54 45 30 35 29 6 -15 40 23 -10 71
3764 71 -10 -27 -63 15 -20 1 -2 3 -31 -48 55 61 -3 -43 -68 20 49 64 -50 26 20 14 64 96 27 -1 -10 15 -33 30 -10 4
3796 4 -18 11 32 17 -20 13 40 1 54 46 -26 8 -52 -11 -29 12 48 24 -12 -34 8 4 -30 -50 -60 -34 11 2 -31 7 -34 -27 1
3829 1 17 20 34 -61 -18 68 10 66 6 -29 -71 -9 21 10 -12 -69 -8 12 28 -14 -11 -14 -53 -38 18 14 20 -24 -1 0 -13 12 28 16
3863 16 -14 -41 0 36 -2 -4 -40 16 20 14 32 11 -31 -15 18 38 54 -16 -40 23 80 -9 -22 20 -32 19 5 -14 -29 19 -82
3894h2P6oM1Ln6N1n2O6m4o2N0J4n9R6l8K6j5o8O6l8N7pJ0m5ML7lj4J9rko3M1m0
3928d6P7r4J5L0j3j0J0L5r%mnJ1m1K2J4j6pJ4jN2k3k1k4j2jM4K6o8L5J2K1Jj13
3962h9J55o6j1j3OjmK0l9QK2K9lL5n7m9P2Pnj3K4m1L3Kl3mQrm0K6jJ2N7k6n7Q8
3998D3l0K0rlj3KRjL7k8J0l1K%l3Ok3RmP6L5n9Kl0J6J0l2J3j7l7K2N9QQQo9J9
4035ek8N7p7J7N6j8J8Nm2Rk3K3J6O6j0k9m7M0m8K0M9q7M9k9nL3rK5J1m0M6qj9
4068A6Lm6J3M4k0j4M0k2m%j2nM1k2ml4M9Op9O5j8J6OPn7j2K4M0k1nk5L3OkKm2
4104c3N2Nn4O0o3o3R9j0m0J8N3Rj1m2N9Ll7k2N7n1N6m8L8K2o4K3k5N0j4m7K9L1
4136D0M7m0pK2o9L0n0O8j4l5k7L2%nOlm4L8m7O1N3o0j1K5j7L1J2M1n8j2okj7l
$$ plain form
3894 -82 -6 -12 29 32 -24 27 -25 41 -3 -65 -15 -1 -60 36 -2 24 9 -59 7 -31 26 19 29 -16 -12 25 22 8 27 18 16 -47 -6 -46
3928 -46 31 -63 -48 -18 -31 -41 -31 4 -5 -5 -9 -14 -3 -44 -22 -8 -24 -31 -17 -18 34 11 -10 -34 -46 -47 -3 23 -45 -10 2 23 24 -89
3962 -89 66 0 -11 -24 -18 -19 -23 -3 -42 -34 -12 17 14 49 -8 -57 15 22 17 4 28 -13 20 22 -11 -15 -7 -16 -56 -30 -31 -19 38 12 -45 43
3998 43 13 33 24 21 8 10 19 18 55 27 37 6 8 8 -25 -19 -42 -33 -37 39 74 15 17 -13 3 13 -19 -6 -23 -60 -38 21 29 37 45 -24 -5
4035 -5 -33 24 -53 -36 20 2 20 25 -17 -8 -31 -8 8 74 64 35 -12 28 -20 0 49 -38 11 -18 -23 10 1 26 37 -3 43 35 16
4068 16 19 -27 -14 30 10 -4 36 14 10 10 -2 -7 34 12 8 -26 23 29 -50 15 -3 13 19 26 -31 -43 -19 21 0 -5 -30 3 9 7 9 -33
4104 -33 19 24 -30 30 -33 -96 3 -7 -47 -29 24 33 22 -20 39 42 5 -17 40 -11 45 -3 35 57 -7 16 -9 41 27 -20 9 40
4136 40 87 47 40 62 -7 23 -27 41 27 -8 -35 -3 -3 -8 -2 -5 -49 -11 -58 3 56 -4 -15 10 -7 24 36 77 19 7 1 -1 -18 -21
4170b1M8l1N2o3j9L9J6jqk0J9j4j5L6N1n6q8J31o6L8m8N8Ml7k6M4M5n1j7N1j4
4201C7q8P4N4n2K8m3kl2K9J4Ql8L8k0K3k2m4mO7l1J4K3k5LjmJ4k9K8K2p1N4k1
4234CK4RK2k7m1l6N4M2r1K8QJ2J3j0o4Q9l7PqK1J0p8L8O1j4L1l8q9R8m7kKm0Q1
4268C1k9j0K3n4L0O8j4l8J3kK0l1j5K3p3M3l2Q2J6m6k8J6J5k7L2l5jl4L6N6l5
4299@J6k0j9k2J9N9k0oN8j14P2n4M1LM0q4K3jJL0K1m7J4l6N0j7J9l7Rmj0qP1j0
4333C7m8J3J5N5n2K7j8o4J0j2L6L8j1j1M8o5kpO3n3k8K6N9n3jJ8k5qL4m4M8kR
4366C2j7Jk5OKpL6JM2k9q7Q4m5J6JN8n1qJ7L1o7O9p2K0J5m7J7J9K9j7j3jj4m2
4400d6Q0n8M5qQJ1m0jO6q5k4K8L5qM2p9Q4o2J5n6O8Qp5k1M7L9K4q2N7n9j2P1j4
$$ plain form
4170 -21 27 -4 48 -15 -34 5 21 20 12 -8 11 -3 -18 18 69 13 -75 56 -10 28 -20 38 42 5 -21 23 68 17 0 51 37
4201 37 -51 23 77 25 53 10 8 -24 5 19 27 -11 27 7 30 8 -36 -40 27 -4 10 33 8 11 10 6 20 -9 19 41 -30 24 3
4234 3 27 36 58 31 -10 -46 8 50 -41 -13 -5 7 20 10 -54 35 -2 5 -3 18 28 -50 -12 49 35 66 28 -61 37 -10 -12 -10 -50 31
4268 31 2 -8 15 -39 -9 59 45 7 20 18 38 7 -8 15 -58 -15 -47 35 51 5 -23 -7 8 -19 13 -22 -23 -57 -21 35 0
4299 0 16 -4 -23 -45 -26 33 13 7 65 -49 23 -31 10 13 53 -31 -8 -9 -8 22 43 -4 10 -26 24 7 26 -11 -2 -6 -16 -24 47 37
4333 37 -11 2 17 72 20 47 29 -35 -25 -37 -1 37 26 15 63 -2 -4 -11 52 -1 -29 -3 56 3 2 20 -5 -13 21 -23 25 23 32
4366 32 15 16 -9 -3 -1 -8 28 29 71 42 -45 39 -6 10 11 69 18 10 27 58 -9 60 -12 8 23 -24 -7 12 41 24 11 10 -4 -46
4400 -46 34 -24 21 13 21 32 -8 -9 57 -28 -52 -24 11 3 45 -34 50 -12 3 -53 15 23 -52 -73 -26 13 37 -45 12 -47 -59 12 -2
4433bN1k4J9l6Mn7M8j9Q2q5O0m9N0m6L4r9N6kl7Q5j9Jk2l0qO0m0L3K5kj6l3O7
4466D9m3N3%Pj02j9L5K9K2q0N5kk0OM2q8nM5P3p7j1PP5j2m7OJ7o4M9J4n6N0l4
4499b6L3%K1k7m8P5J0m2J0oPm0L7m0K4jnL1jK2mk4j3J6OJ0l1M3j4J7J5m9l4lK3
4534hOj9K9n7J7M7p5N2J5L8k7k6K6m5Q2k5r9O8NL8j05K4Q5M0r5K0j3L7k0qj3k3
4566b9O4m3R3n2r0J28j18J4O6p7L6NJ2Mm8M0k6J9L5n6rM5j3K2m7l0K3J5j0o0J28
4597D1Mq5N7j4M7l8L7kOr6O6K8m6l7L2J4m1J6pK1k1M0k3L4m6K7j3j5mj1N7j8n0
4630d0Q9m0K0k7J0p1M3Pk3M0Rl9M9J4j0m3K5j1pk2K8j1L3Ok7M1j7m9K8o9O2k0
4662b2L1m5K9OJ3m2K1N1k4K9p3M1m7j9Q6l8N6l1n7mL7J8j03P7M0mn7L8JNK0k2
$$ plain form
4433 -2 49 25 44 8 12 -45 3 -16 66 -19 41 -8 42 -4 30 -69 -13 -15 -52 33 14 15 -7 -37 -45 15 -25 8 33 31 15 -18 49
4466 49 6 59 59 66 -36 -55 -20 9 31 -49 6 4 -16 -10 32 -56 -61 -16 57 -20 -31 -24 51 39 -8 -2 15 -49 0 14 -42 8 -26
4499 -26 7 7 28 1 -47 28 38 -4 6 0 7 -33 4 -36 -12 -13 -18 13 12 34 30 6 -7 9 15 25 -6 37 23 40 55 6 -28 -31 -8
4534 -8 -2 -21 8 -49 -32 15 -60 -8 7 45 18 -8 18 -27 55 30 -69 -1 4 42 -63 -39 46 86 -9 11 -2 35 15 7 -6 -29
4566 -29 35 -8 85 33 -57 71 -47 -33 33 -44 -8 -3 9 13 -35 5 -21 -2 33 -23 -32 13 0 22 -25 -55 -32 -17 -27 -87 41
4597 41 45 -40 17 3 50 12 49 47 53 -43 23 51 5 -32 0 14 -27 -11 -18 3 -18 22 -1 33 -13 14 1 -14 -18 -29 28 10 -40
4630 -40 49 9 29 2 12 -59 -16 -9 -32 8 17 -22 27 41 31 -12 13 2 -5 -27 1 -10 23 29 2 43 26 -23 5 -64 -2 -22
4662 -22 9 -36 -7 -1 12 -30 -9 42 18 47 -26 15 -32 -51 35 -3 53 22 -35 -39 -2 16 -87 -10 30 26 -31 7 8 13 33 11
4694A1Lm0m3O3M7n4KJ2J7lj9k1M2j9J3k9k9L5N7m5m2P3l1l2K8K2j1nj0M9k2J6
4726C5p1K6J3qjPkk1K4M9Pr3LK5J7N3o3L6k1l2m8L9P2J2n0j6QN8m0j1l9QRM4j3
4761A6k8J5k9P0n2L7k5jLk5K8l1N4qn0L5Ml7LNL2l7j3Q7q5L6m8K7K6l8J0K6L5
4794D2o0j9O4k7qN6l5J5m4j8M6%j0m9P9o1K9N3n7%NN6Lr5K4q3J00L9m6o0M9j7
4826b9L2k7K1pl9J03m1l6J5L1l4L8j1nK9k0j3m7K6J8mqj0KPK4L9n8K4k6L4m6M2
4859B4J0l7j9K4jl2J5J9j7j2M8K1l2jj0jk3L2NJ1%p5P2nq1L8L4n8Q8j2m0QQml1
4894c4M8l9L8Qm9jO3j2K2m1k3J7J6ok3Nj6K4Jk0Q3q5K4J4N1n2r6J14m7K3k4j0
4926b7M4j2m3K1N5oj1l0%J0RK4o0rL2Q7n2p5M7K8o5ON2l2K4k%p3P1K8m7lk8N1
$$ plain form
4694 11 14 -26 -69 -6 41 -13 -11 1 18 15 -4 -25 17 -2 11 -18 -47 -12 45 0 -42 31 0 -32 -4 18 7 2 -8 41 19 35
4726 35 -36 -10 3 -5 -6 1 -1 -22 2 51 58 -35 -32 -7 10 63 0 36 15 -17 -65 -26 46 58 8 -8 0 58 18 7 -32 -24 -15 29 16
4761 16 -12 3 -26 44 -8 29 4 3 6 -19 9 -22 32 24 -26 9 13 -24 -21 -16 16 -21 -34 53 -32 4 -44 -17 9 -29 -19 7 42
4794 42 -18 -37 27 0 -8 48 13 28 -16 -34 12 12 2 -47 32 -29 0 53 -4 -4 1 57 60 -35 -11 -94 6 45 -1 -61 -12 -29
4826 -29 3 -24 -3 -10 -49 54 13 -23 -8 23 -11 27 16 11 40 20 7 -40 -14 4 0 -8 -18 -16 -9 15 54 -4 20 -6 28 -18 24
4859 24 34 -3 -22 2 1 -31 -16 3 -14 -26 22 43 11 10 0 -1 -24 8 13 24 24 -51 21 16 -65 -27 7 -51 37 25 -15 -7 1 -3 -34
4894 -34 14 -25 13 21 -28 -29 34 22 44 3 -20 -3 13 7 -16 -11 -27 -3 -2 -22 61 -24 0 14 65 13 -83 31 -16 7 -17 -27
4926 -27 17 5 -38 -17 38 32 21 -9 -9 1 10 34 -26 -35 -3 84 32 -43 4 32 -33 -27 25 -7 17 15 15 -58 13 41 -6 -9 -37 14
4960A4Rpk2k8J7L6J6o2K3J9k9RJ4K8r1O6j8j5L6k5Ol2jJ9J2nOK3l2Po4Q9Kl3M
4995iQJ3j1K1m2k3J8qJ6M0j8k4M6o1O1L2K2o3k0k6qM1j9k3L2LJ7M4m7j3j1l3L8
5028gpL7kQ3j04J3Pn3L4qRJ7J9j9o5J8M7mpM0n5k7N5K5m2rJ2l5k4O6l2j9PO9m0
5063ak3J5K0qk8k9Q6J7m2N3o5K9Ro9K7L3p4P1K9o0N7rj3r9O5j0j3NN0o9N5l6M8
5096B1oj9J5l0k8N0Ookk4L1L4j6m9J8Mk0J04r9l7M9N9m6l3Q4j0l9J6n4N2no2L2
5129a0JM0rq2K2nrRJ3O2m0K4j3KL2Kn7n5Q7j1j7R%mL3n3nN6l0lM9j0L0p0kM1j9
5166HP2r1pK2l7N5njjq0O6K1k6M1m6llO2k3J7p0R4k6k3o1M4L4Mk0j7J8j1J2m6
5200b7J0L7KqQ%j1k6N1q7j4N6M2o0m8N2M2m4K3k2K7m6M9K5J3r1L3n%N6p4O1l0
$$ plain form
4960 14 23 16 -6 -34 -17 19 35 -27 -4 15 -14 -5 9 37 -54 12 -6 -21 15 -10 -4 -36 -37 -18 -6 -11 -5 18 -14 -7 -71 18 20 -13 -9
4995 -9 -1 12 1 22 -20 -43 -25 -33 -17 23 5 -19 27 -34 27 59 81 18 -2 -28 -36 5 -14 -37 -5 -2 15 59 12 -1 -12 -45 -7
5028 -7 -14 23 21 104 0 13 20 -33 1 -7 2 19 38 19 -46 -28 19 15 8 48 -7 -34 21 46 4 -5 7 -28 -52 14 -18 -37 -30 39 -1
5063 -1 -24 -9 11 3 -25 -54 32 49 7 60 -5 24 33 -36 -9 24 -50 21 50 -10 47 38 25 -74 -9 -19 -32 -27 23 -46 9 -27 21
5096 21 15 -4 11 -19 -47 3 9 3 1 -23 8 42 26 -23 -5 -1 -21 83 -16 -53 -4 55 9 -24 60 50 11 27 -27 25 20 -42 -10
5129 -10 -9 31 22 -60 -38 -43 -52 -43 -30 32 -8 16 3 5 37 39 -18 -73 14 3 -14 -5 -5 -9 24 -29 -34 22 -8 -11 38 28 58 -12 -14 27 8
5166 8 80 -11 -18 4 -33 22 17 16 15 -65 1 22 -4 37 -9 -12 -15 47 24 41 -29 65 39 16 -45 -1 33 37 17 0 18 7 19 -27
5200 -27 -17 20 22 14 22 22 11 -15 36 -51 -65 -9 33 -27 -75 -23 19 -25 -2 -24 3 -43 6 31 44 -47 -14 -19 -19 37 -37 24 -6
5233fL8J0l4j7L6K1n2J7kqj0j1JJK5j3k5J9N5m0k0qN6n5N8L1p3j9L9omL2m8M6
5267C4m4JK6j4l4lL8n3M5J3n4M1lLrK6N3n6nKK5L6m6Ll6qN8j0j2m0J0L7k4KL3
5302C5m3jL2o0rP1no8R8ro5J6Rk6j4N4j5J1J0Ql2j8O8m7QNN4m4K6k0lN0r1jJ6
5337@K0M9n4j6k4k1N6ml0m8M8kJ2QJ2m6M0j6J2MNnj2OMP1p4N4k5J0qM1o1Mk7P6
5373E9j04J04k8jPp6O6j6J1l1J9lm1M2O2o9J2M2r8O8J4j2l4k5M8j6nK4j8J4l1
5404a6j0k8O3n6M8K1Pk2mpL4j1j6J7P5j20N1l2JNm2N6m6R1o3j4J7Nq2Q7l6L7L
5437A3n4L2RML6j1Qp6P4m3LJ5k2K4K0K1m9j1K0J1qR6j30L6q3L6ON0mm6m7P3Jn1
5471d7J3K4l1N6po5L7K4Oj6l2NO4n6O6p8N4l1L0L4o7nN8k7m9R1p1K8K1l9J3kM3
$$ plain form
5233 -6 32 42 8 -9 27 48 -4 13 11 3 -7 -18 -17 -16 9 -4 -29 -10 45 5 -15 -23 33 -22 36 67 -6 -25 14 8 4 36 -12 34
5267 34 -10 -9 17 3 -31 -34 4 -49 -4 9 -45 -4 -7 -4 -13 13 66 10 5 7 32 68 22 25 -11 -19 39 29 17 -23 -13 24 0 2 35
5302 35 -8 -9 23 -37 -46 25 20 -48 50 41 -24 -8 1 -25 -39 15 0 11 21 29 -3 -21 47 0 8 13 67 23 49 29 26 76 -15 -16 0
5337 0 20 69 15 -1 -25 -46 10 6 -24 -72 -24 -26 -14 -6 6 -40 0 -16 -4 0 5 0 -12 -6 -2 69 -5 49 24 34 26 67 6 10 -17 59
5373 59 -45 59 31 30 37 -39 27 11 22 -9 10 7 -34 8 70 1 13 55 -43 25 39 27 -7 -32 16 0 -5 19 1 15 -16
5404 -16 -26 -54 9 -47 1 22 29 7 3 -4 30 19 3 20 95 -25 26 -6 -5 0 -42 14 -32 59 -4 -18 -1 4 -78 9 -27 10 13
5437 13 -41 -9 0 4 40 29 37 -39 35 -8 -5 10 -12 12 32 53 4 -7 13 24 16 112 -18 18 -65 -29 -23 27 23 -23 -70 3 4 -47
5471 -47 -34 -10 -41 15 8 -57 -20 4 10 -6 -38 -33 31 -25 41 -37 17 -14 16 50 -17 -22 36 9 -40 51 -20 8 29 -10 3 1 44
5504D4k2kM1q7Q6o0mN2m9K8j9l4J2Rl8O1lkl0jML3j3m1N8J1Qm7J7Lk9l5P8M9q2
5539dL7l3j9N3l1J3J6j6L4m9K4j0j4k0rO3l3mO1l1Po3K9m2M8j6rl7N9l5O9q5P0
5572B3k9k2K4L0qp8O4j1M5j0n7Lj8L3jL5on0KJ0OKj2rM3J4OL4pm1m5L8OJ9j3q2
5608f2P5l8N8l4m7N7K8q4L2KL7J8j3On5N0n3j8Q6o7O4Mo1k2M6K1l5J8n0J5%L6
5640A4lK8j4j8k5NJ7J8j6k1n0N3K6k5J8o2L4J0nO4l8j3M5n0M8K5p3L0o8K6L4N0
5672F4k8km2K4K7j9%oo2Q9rk3j8pnl3N4qL3M5q2K7j01J02n7J5k1N5qQ6o9Kl5k6
5706c8L6J4Lj5N2n0kK5k5l3JL8K7J6jk7l9J2L0p2O5kl8K1OQ%l0l2J8mM9J2k8k7
5741c0J9PK6l3K5m1oPN8J3m6n1J3R5k1l2o9M1K0J8k4k0P0o9L7nL9m9l0L0RL5J6
$$ plain form
5504 44 22 20 61 -26 60 0 -4 48 -1 27 8 -26 -14 -5 -43 18 15 13 -17 -18 -14 19 6 -35 23 34 42 -5 12 15 -14 -49 29 78 -4
5539 -4 33 0 -19 34 3 16 32 16 50 1 25 15 1 -19 -28 35 2 -2 59 28 35 -28 1 -41 7 -9 -18 -55 4 -31 38 -47 23
5572 23 -6 -28 -4 26 18 -60 4 -7 38 28 -29 -26 -44 -11 -12 23 17 -33 -31 -21 -15 -13 -25 -34 9 23 29 63 56 15 -30 8 14 33 20 -62
5608 -62 13 -25 33 -1 -48 9 37 -47 -15 -13 24 42 29 35 -20 30 -23 -41 45 -22 42 46 -15 -37 9 30 -5 13 -37 -22 -22 14
5640 14 11 39 25 7 -18 -13 4 22 6 -15 -65 -12 14 -11 7 -55 -21 -11 -16 48 10 -3 42 -8 40 65 -8 22 -46 -20 14 64
5672 64 36 34 -8 16 43 24 24 18 -44 45 36 13 -5 -12 -17 -50 4 -4 29 74 -8 19 -82 20 -37 -22 -43 12 4 90 21 23 -12 -38
5706 -38 -2 12 15 0 52 2 0 25 0 -33 -32 6 33 49 48 21 -18 -6 24 -48 17 15 -23 -2 4 12 12 -18 -50 -32 -36 13 25 -3 -30
5741 -30 -11 -4 22 -11 14 -27 -33 -26 32 45 -1 -52 -39 56 35 3 -66 -25 -5 13 -11 -31 39 -30 7 2 41 -8 -38 -8 1 36 52
5774E2n9Kj0l9N4N4k8l8j8K9RL4m3j0J3o8M7RR4o7o0j2M1j6R3j9p3L1j3k2Q0l
5806D4j8K3k6m7J9O5l4p9M7N0l4j3k7J2k0L5N4Rqq8P3r4P7nM9r9L2k1P2n6M9j8
5838B3j1m3J7J3J0j8N4q5Q3o5R4p5k3K0j7N6m9O8m3Ml9M8l2o9J04n1J8j8k5N9
5868HJ6n9K4J6K3j2oK3l4Rl1J5Pq4P7K8nqmj0J6J9qm8j2J2j8N8j8%J4l2L5K8l8
5903AL7j29R3J8m3M2J5n2K5n9M6K9n7j4N1J7K1J4n8n7K5M4p1Q8k3rk8J8l0P0o3
5934c9P3m0mN0j9k1l0K2k6N1p3P5r9%J05m7L8rm3JK3j8Q2j0l6L5oJJp9N0%P5m3
5968D0m7qLJ2l3L0N7L6r8o5N9mO0l6J8j1j0j6J6K0k2rl0K5Pl6j9mJ1L5MQ0j16
6001e1O2qk2K6MM7n5OjnO7n0L9r9K5K4rJl7M4M9q5N7nk6m0J8M5jk0loj1j3L6J3
$$ plain form
5774 52 -7 -5 -15 -54 0 54 26 -12 -30 -1 8 42 -1 -11 2 -66 -19 -10 84 17 -43 -55 -14 -30 63 44 -29 2 -11 -33 47 44
5806 44 26 49 23 -24 -5 60 26 -53 -6 44 10 -3 -30 -18 -38 -3 51 60 52 -36 37 -57 20 15 64 -35 -3 -24 48 -8 41 23
5838 23 12 -31 -14 -1 9 -9 45 -40 43 -22 72 -3 -26 -6 -23 33 -16 52 9 13 -26 22 -10 -79 25 -26 -8 -26 -51 8
5868 8 24 -35 -11 5 28 16 10 33 -1 8 -23 -8 -1 -85 -8 20 15 7 3 -7 9 28 20 -28 -40 -28 -46 12 -6 -6 8 -24 11 39 1
5903 1 38 -91 2 20 -23 19 34 -18 7 -52 -6 23 -34 -48 3 20 41 55 -3 -60 -35 9 -62 26 3 -6 -34 -16 -46 24 -39
5934 -39 34 -6 -10 40 21 0 -30 -8 -34 17 -56 19 -80 -80 25 -22 16 7 -36 -35 -12 -30 52 42 6 41 35 36 37 -42 8 8 83 40
5968 40 -7 -15 -12 0 -33 -3 54 90 -8 -73 -14 -18 42 6 24 13 3 -13 3 23 1 -8 -38 -13 -6 -42 -61 -65 -54 -19 -15 65 -51
6001 -51 11 3 -19 7 11 58 3 9 8 3 70 20 59 -40 -15 9 0 1 -36 8 57 -28 29 24 -2 -42 -24 21 20 0 -3 -9 -20 -33 3 16
6037A6k7jl0j0M3M1k9M5ql5K4J3j26Q1l0mQ1J2q7kL7QN1r0l4Q4q2N3O1o8K3j3
6069cKl6N7J4o4M2o6P3o6M4L1r4M7k4N4K0q4OM5n5R0m0m2K9K2oM5n8J3m3L8L7
6101B8onL9m3k2mj2J1n2N6j3L8j9L9j5o6j0K9l2O1L6n5j3JN5Kok1l2L5kO5J4n7
6135B4j0jk1L8J5n1j5L4K4L0j03LM0KJ5K6o1J0rKJ1%j1O4m1j9qO0k4N2m7l0k3
6168b4K0J0k3Rl6K2K6N5j06J7R0o2j6N4m9nKL9J3k7j9k0M1k2N7m1Q1r3K0lo7R4
6200C7k9l8L0n5J5L7Rk9kJ9j9JpL9r6P0L3J0j5K8j01R0k1j9N8l8m6K4L1J9j7j8
6232@K0l4PK7j7krk0jP6j6m0J8m0mk5K9O8J3p3%L2K6o6M6q4rQ3l7RK7n9QP5l4
6267fM7p5J8K6pLK2j9k8k3Q2n6J0N2l4l4P9On4J2m6J4j2rR1p1M1k8Lj5j0n1l0
$$ plain form
6037 16 -11 -12 -42 -52 -9 32 3 48 40 5 29 42 -84 -3 -33 -37 44 56 -31 -33 4 12 63 -27 -61 23 -59 -6 55 -13 10 -3
6069 -3 -1 -37 20 34 -30 12 -54 19 -47 -3 28 -66 -19 -43 11 31 -53 -47 -2 -57 33 -7 -49 -20 2 -4 41 -17 -4 -47 -9 28
6101 28 22 17 56 13 -9 -13 -25 -14 -66 -10 -23 15 -4 35 20 -46 -56 -27 -59 2 38 -17 -30 -29 26 28 22 1 -31 4 2 67 81 24
6135 24 14 13 -8 30 45 -6 -21 13 37 67 -36 -33 7 9 24 50 -11 -1 -10 -8 3 3 -8 56 15 -4 -12 48 24 76 29 -1 -24
6168 -24 -4 6 -17 -8 -44 -22 4 59 -47 -30 60 -2 -18 36 -13 -18 -16 23 36 9 -10 -30 11 -11 46 5 86 -7 13 10 -57 37
6200 37 8 -30 0 -55 -40 -3 6 -23 -25 -6 -25 -24 -31 8 -88 -18 15 25 10 38 -63 27 6 -13 45 7 -39 -15 16 35 18 0
6232 0 20 -14 -7 20 3 1 -8 -28 -29 47 31 -9 9 -31 -35 -60 -31 37 50 -23 -23 9 35 -31 15 -69 -78 5 -32 -23 4 -55 -47 28 -6
6267 -6 41 -34 -16 10 3 6 28 9 -19 -42 40 -16 -6 46 12 -22 57 63 9 21 -25 -11 -23 -32 59 -12 29 1 4 -11 -21 -72 -102
6300a02O0N1MO8j10J1kPP6q2NML6J3l2R2j11l8L8L6kK2j6p4OP9l2N5r2M0o4L5
6332a9j3N1k7k0j6J7M3Mo0kl9R4K2%Nm0m0O2m0M4l2J0k5K6K4j9J1Mo6Rl0J21k4
6365C5n5pJ4j8R0l8q9L2J7K8O3m2j8p0l1P3L9l1Rj2KJJ8jo4L1%L4J6J6p5j9J0
6398d2J2O5m9l6Rk6J13m3M3o4qKK6l5P0Jj5j18N9P9m7L3n8j8K1R2n0K6n8L4r4
6429g6Q8J3L7n0q9N2O0J8p4K2Nm2J0P9p8O5p1M3k0M3k6RJ2m8M4J2K0k1p2l7N8
6460a4R4j04K8m0J2O5lj0ml5K6k3LJ26r4j9j6LN9m2Kk7l9J05J0k1j9k0Lj5J3P4
6492G8j33N5K3n7K7R4j07n9J2J22k0pmJ0p2KM4n8Q9n0pJ1J8J6m6J11j01m7M7Q3
6522G4m1n0l3M1O3Qn0j7m0O8J2l3J8Ql6j6%M7k7J3l4k9Q8M3j10j2L8p2L9J25n6
$$ plain form
6300 -102 -42 9 13 81 -29 -18 -20 -13 63 -19 -14 -10 26 39 7 99 -12 -50 -12 24 22 44 28 -46 -40 39 7 62 -30 10 -54 -19
6332 -19 -32 19 -8 -28 -44 -27 16 20 -40 -42 -81 13 35 35 40 0 -40 22 -18 26 -6 4 -21 5 29 10 21 25 -41 -32 -62 59 35
6365 35 -20 -27 -13 -31 59 21 -68 -36 -19 9 72 30 12 -58 -89 -16 23 -8 1 -11 -9 -8 10 9 -55 -24 -24 10 26 42 -33 -52 -42
6398 -42 -30 35 -14 -50 -41 -67 46 3 46 -18 -26 -24 2 -33 37 38 23 -95 -36 43 -4 29 -29 -47 -26 66 16 42 -16 18 -76
6429 -76 12 25 62 12 -77 -25 35 53 -21 1 6 -36 -26 53 -25 40 -31 12 -8 35 9 18 30 -18 26 38 58 37 -35 -72 -14
6460 -14 80 -24 4 -36 -24 41 38 28 24 -11 15 -8 -5 121 27 8 -8 -5 54 12 14 -13 -52 53 63 42 23 3 6 -9 4 78
6492 78 -55 0 23 -34 -7 87 -20 -79 -67 55 35 28 24 34 -38 -36 8 -50 39 -11 -18 -7 11 27 -19 92 -9 -56 -9 74
6522 74 33 -17 -50 -9 54 62 12 -5 -45 23 35 2 20 28 -8 -24 -24 23 -4 9 -25 -54 34 77 -33 -45 -7 -79 -40 85 29
6553B9m2J9%K4k1K3m5p2Q0J5K2ll5j3k0N5K8j4n5M5r3N2N3J3o9M1o9M5Q9j9oj44
6585h7N4Q2m3M4l0m2n4Q1OQ6o6r4L0%M0pP8j05ll6Q4Nj9J1l9k1J03j43J09j8m0
6616c4Q9p2R6ro3n2NM5kQ7j20l0M5L0K8o6J4mk9N2KoN0j04N0JK5Ml0l6J4M4pj8
6650apK3o8K0N6NP0n8m0M2n9j0P6p5l8N8L3j9L1o7j1oO8o3O8Rq9L1J6MK1l7K1
6683Dkj5j7R1q2%M0n1N3L5n6m1N5m6O3J3n2j8JK6M5rj2l9kOk1L8j2n1P1l7K6O
6717A0N8j07J3N3o4L1L2n5l5J52r6j1K2MM8m9P2j8o3m8Q2n3RJ6oM5l6j2O9Kq8
6748b3J6J5Ok1j4Oj1K5j0M4j0m0qP8j11J26o1nJ7q1K8j2J07l5n6oM0lO2k5o2j9
6780d3J3J5L3J9m0j0rQ7km9J3k8j5K4O2n0K7q1k1J1K6M2m4j5J5K1K8J0l4o3K2
$$ plain form
6553 29 -13 6 6 30 9 32 -13 -85 -5 10 32 29 -6 -19 -39 16 44 30 -25 20 -73 -21 32 45 -24 17 -52 -7 82 63 57 -87
6585 -87 -33 49 6 50 20 -22 -76 5 11 97 31 -63 -33 -33 7 0 78 -27 -30 -66 18 23 4 15 -24 -45 58 -85 24 6 -34
6616 -34 55 -17 79 70 7 -45 -40 5 3 90 -30 -60 -15 15 43 -23 -9 -13 -42 10 12 6 56 -48 2 3 28 32 2 -34 -20 24 17 -1
6650 -1 -8 15 -53 -33 23 28 98 40 0 42 -17 -27 49 -26 -64 -6 27 8 39 -28 -39 -45 23 -40 28 37 -52 -21 -5 -1 20 -17 4
6683 4 2 -13 -30 61 -21 -21 19 -32 21 56 0 -41 14 -32 31 44 -8 -26 -25 1 46 37 25 -14 -16 -10 -31 7 -5 -56 15 -22 4 10
6717 10 68 -39 -26 27 -37 -6 26 -29 -64 88 -8 -19 3 7 55 6 78 60 -3 -51 31 -22 -13 3 -3 42 6 -6 63 65 -23
6748 -23 -7 8 14 -7 -21 -15 -26 -1 -11 33 23 -17 -25 53 -58 68 7 2 19 -62 -34 -46 61 26 -30 -36 4 1 63 38 -24 -43
6780 -43 -30 -15 18 37 -3 -13 -22 65 63 14 27 -1 -16 8 70 20 47 -34 -55 -44 -18 24 -20 -35 -20 1 29 39 5 -58 -36
6811c6K9M4Ol4p1K8rN1N8n4k9J9m3O7K0j7o6mO8M1n8N9m7o7N9L0o4J3Kn0N5jN6
6844E5j08K5J6j0O4K6k0p0k6P5L4rj0rm7l2J6O7nl2l5J4P5p7N6l1k8J4N2J3n0
6875CK2K1j36J05QL9p7l5K1QK7J7j7l3Pn0J14r7O0rn2R1l6J6l2L0LNj1M9m6nl
6908GK3kO2p7J8L7n9QL9o0l1jNO0m2K8m1j5L0K1O2o3qLLl5N9J7l6r2R1RnLj5l0
6944b7L8KLQ3k9j27J07k6kK2n7J3K1n2R7Pk5j0j05N8K0N2r2K7m4N9l6lN1m7Lo
6976b5O3Nj2j00R6n1J8J5M1n3qM2k9kJ6J4m2QO9j1jj02J9ol0Q3l7J4k7K3K9J3
7008C2J5m7mL9k2J3l4POl9j9K0PL4K1m3L0jn3L7jn2j5Q8lk8K6m7O0L4l5%l4J3
7042ErNok7L6n0K4PK3J1p4j6R1mJ0m7O0k3k4L1j3m7M7m2kP6j6k8l7k1J18po3K6
$$ plain form
6811 -36 -7 37 43 9 -62 -34 -43 8 66 12 -17 2 -41 26 46 29 -37 -41 27 68 10 69 22 -45 14 44 -20 -7 -5 -55 0 -1 55
6844 55 -53 -28 -12 -22 42 68 48 -22 -48 27 61 52 42 33 -14 -46 -30 37 32 0 -35 -21 54 -23 33 2 -26 -12 40 53 3
6875 3 25 46 -90 15 23 62 -15 -50 -29 -21 6 23 6 -27 -20 -70 44 -53 7 -2 -54 37 1 17 -15 15 18 23 12 61 15 10 7
6908 7 30 28 90 13 31 68 9 17 56 -4 -35 -36 -31 29 -13 15 -26 -41 -11 10 72 9 1 4 7 -28 31 48 12 -80 11 20 15 18 3 -27
6944 -27 11 13 16 99 70 -57 50 24 22 44 -13 0 21 -31 66 73 48 38 -67 -9 11 63 -29 -2 -46 13 -23 -26 25 -22 -19 -25
6976 -25 38 43 31 -69 27 -24 -6 9 50 -3 -11 31 2 0 16 30 -12 -4 65 54 53 -49 -30 -36 -66 17 -20 -6 -33 -10 19 32
7008 32 47 0 -4 35 13 26 -8 -1 5 -34 -53 -33 -26 8 29 -14 16 15 -38 -1 -2 -54 -69 19 16 -12 14 -33 27 61 26 26 -8 5
7042 5 -4 1 -5 -32 4 -46 -22 -15 8 19 -55 -71 20 16 26 -21 39 16 -8 23 10 -37 10 -32 -34 42 26 -2 -39 -60 58 51 -12 14
7076A4qq9J20N4o8J0o3J6L5Nj0%K3o4N8lo3RJ4l4P0l1N5o0j2k7l1J23l1N1p1j
7108iLN3%m9l0K8o8J19l3O0m1n3rN3n8N8k9p5O3J4L1K9q2Oj5M0M4l1J7o7l4K5
7140d0LJ3K5o3Q4j1P2r3LM9m3k5J9N5r9M9k3M7mK0Kj05Q8j6M6n7O2n6k7L2L3l3
7172Gj1l2QpJ04o2j0k3J1k0K4O0Rk4k8l0L8L5m3j2j8j0P0Mn8LK1n0P3kl5J8k9
7205a9M0K8l0l6N4kq9j4O4Nj3J0jnL3J2o0J9j3K2L8j1K5j06j9P4L7j3nl1o0L8
7237b8RK2J0l6m4NN7p3R5k4k1j2N1M4n9rj4J6M2K7k1r3J9J16k2lo5MJ4k9K7nM9
7270D9rl8JM0l4Nkl7L8J5K2m1j6L7k7l7K7N9l8ml4K5K3k6K6l8L4l1M7M1r7J0K8
7303A8J4l2M6o6l3J2N0k0R3n2o5J2n1P1L5n1j5N5n7K0M2J2qj5lK8Ok4J8l3l6M9
$$ plain form
7076 14 6 -83 37 91 23 33 -30 -14 21 26 16 16 39 -25 33 30 -33 -24 -10 -44 26 -5 50 -10 -22 -49 -80 43 12 63 -8 -9
7108 -9 -6 47 47 -2 -32 -4 -72 47 14 74 33 -20 -29 24 -34 24 -5 -80 -17 -3 28 57 -25 -19 -34 6 50 19 36 -31 -65 -40
7140 -40 -37 -24 1 -62 22 11 83 -10 -7 42 -1 -26 -7 48 -51 -2 -25 22 18 38 40 -65 23 7 53 -4 58 2 -25 7 40 7
7172 7 -4 -36 -28 -35 69 7 -3 -26 -15 -35 -11 49 58 34 6 -24 14 49 6 -6 -24 -34 36 40 -18 -15 6 -44 29 27 -8 10 -19
7205 -19 21 49 19 -17 37 35 -54 -68 -4 1 -12 -2 -3 -8 25 37 -23 -4 -17 5 43 32 57 -49 -68 6 43 30 25 -6 -66 -28
7237 -28 -19 3 13 -23 -67 -62 -5 -78 17 -7 -28 -40 11 55 -4 -13 -27 -11 31 58 37 -56 -37 79 57 54 -11 -7 7 -22 5 0 49
7270 49 40 2 3 43 9 14 12 -25 13 28 50 9 -7 30 3 -34 -7 52 14 10 -24 1 24 -2 24 -14 20 -11 36 77 -20 -10 18
7303 18 32 0 46 -20 -53 -41 9 -11 82 30 -35 -23 -74 -3 32 -19 -34 21 -36 -16 26 38 30 15 12 40 46 22 40 7 -29 20
7335B0j4N2o5l1qL4M5m1J1pL2m2R8m7p5M5p2J04m7M5p1lO4jL3l4k5k2Jm0P5j0
7367DK%NLQl7P9p1j8J03q0P4n8qNpK2m2kk1J3J02r1P2oo5k9L1K9o1P2n3n0J14
7401C9k0m1K9n1K1L4m3L8K2o4L6j0K9l0Q8p5L7Kk8L9j1r5KJ6M0k4L4n2nJ0j3L4
7433a2K1l0J1o2L3Q0l0Jn0L8k0N1m0K8k8Pk6O8J9p1J8j4M4K2n4l2P0k6l1P3k9
7464B9k4k5J7M3p0N9k8m1j1mP1j8K0l0J8jn6R0o0j6N2M2m3J6m5j4N1k2K2j0m1
7495b9K2k9K9J3O1j30N5Lk0L0qJ6K1j9pK1n4M0J2o2O9k1m4Q0p0J6Nl2N2m5M1l
7527A3n8j2Q8K4j02L2n1R0K8k1m7o9N3N0L5q6K4RJ1J2jJ6m7l3N3N6j15R3m7Ok8
7558b4j2N9m5J22r6l8oN3PJ9k2lj3l2M4k2K3k0m0K9K2L0q7J5L3rMPK7o3P4K1k4
$$ plain form
7335 20 6 58 -7 -38 -46 -12 33 -8 3 -4 28 -14 84 37 -38 7 -65 39 -8 37 -34 -37 27 26 59 25 0 -22 -21 -61 14 4
7367 4 6 6 11 14 22 -15 64 -7 -25 78 -2 72 14 6 11 4 26 -16 -18 -39 -26 76 -15 57 51 -14 -43 -12 17 -44 28 -25 -75 39
7401 39 19 -22 7 -44 -23 11 -32 6 28 -36 0 -10 19 -11 77 2 39 41 13 52 41 -54 -52 -36 4 -20 14 -38 -43 -33 -46 -12
7433 -12 9 -21 -10 -72 -39 41 11 12 -38 0 -20 31 -9 19 -9 -2 -28 40 59 -12 6 -8 36 58 4 -28 42 16 -15 58 29
7464 29 5 -20 -3 40 -30 29 1 -40 -51 -55 16 -2 18 -12 6 5 -51 39 -21 -37 15 57 14 30 -15 -29 22 0 22 12 -29
7495 -29 -7 -36 -7 6 67 -63 -8 -5 -25 5 -3 13 34 15 8 29 -25 15 27 -35 34 13 -31 49 -21 -5 0 -32 20 -25 16 13
7527 13 -45 -57 31 55 -47 -15 -66 24 52 31 -16 -85 -32 18 53 -33 -9 0 11 23 22 38 -9 -42 11 67 -48 45 -2 4 -24
7558 -24 -36 23 -22 100 4 -34 -40 13 20 39 17 14 1 -31 13 -9 14 -6 -46 -17 5 35 -52 -37 -4 -13 -9 -2 25 -38 36 57 33
7591C3m4mO7q8Kj6N2m8P1j6K0j1J4l1j4k2J08k9Rn5j1J4m2J4N8j0o4K5N4mn1L6
7623A7n5M8l4K8K7o6Nn1J11k0L6nl7LRRm4K2RM3p4M8k2k1k9K6K6M6j10Q1Jj7k3
7656a3l5k1N9ml8J9N7k0M8m9j8mM4j9rJ4k0M3o2N6n4NNK5jK3Onmj2LMj7L3m5J9
7692A3qO4q3k7j2J9K9Q3j17O1j1n0M0J7j6m2RKJ0j2P7pl9M7k4q3L0M6m0K3%O2
7724F1m1J9m5n1O9KK4m0j4l4K4M0pJ2n9j3O8Ll4j4J9MJ3k0N1J6m5N6l3Mrk1n4
7757d9O6%k4K6k1nJ3n1M5mM6p0lQJ06m7k7M0q8O4j1j8L3n6J6j4M3L4l4J7o3L9
7789A1qL4j6m1L6p7P5l9Rk0J6J8J4J5k7K3o2O6n4K9Kl8N3o3O9l7M4n4j6N5l3q
7821b4N8Qo5o4P6k8K9K2No4L7J1L8l6%l8jP6n1N5k3n5P7q0R5J2q1l8N3J1p7J00
$$ plain form
7591 33 -11 -15 52 -36 -34 -50 2 -46 25 9 29 18 32 1 -13 -35 73 44 53 -2 -13 1 -41 -27 31 21 -43 -18 36 32 -19 17
7623 17 -38 10 -24 4 31 -35 -30 -81 30 10 46 41 4 7 16 25 -19 3 12 55 -19 29 7 -14 -43 -17 9 55 -55 26 27 10 -13
7656 -13 -48 -69 -10 -14 -52 -33 24 4 52 3 -15 -19 25 6 -3 11 -9 34 -28 28 -26 -21 -16 9 8 31 37 32 28 16 19 23 6 39 -6 13
7692 13 5 69 -14 -41 -53 -34 -5 78 -39 22 11 -39 1 18 2 -40 -31 -29 -19 -31 46 39 0 47 23 -60 -30 16 -24 -1 -1 61
7724 61 20 39 -6 -57 12 14 38 -2 -16 -50 -26 14 7 19 -40 -53 15 18 -16 -30 -11 -7 6 -14 37 53 8 64 31 35 26 5 -49
7757 -49 17 17 -7 19 -2 -7 6 -45 0 -4 42 -28 -31 -23 83 36 9 49 -39 25 14 -4 29 -27 -11 -25 18 52 18 35 -28 11
7789 11 3 37 21 -20 16 -61 14 -25 -16 -36 -20 -2 12 27 0 23 -39 27 -27 2 4 -34 19 -44 25 -12 32 -22 -38 17 -16 -24
7821 -24 34 42 -23 -87 -11 -39 -10 12 17 -47 -10 1 39 3 3 -35 -36 40 -11 44 21 -34 43 -37 58 70 -11 -49 4 15 -62 38
7853C8n8k6J3NO0K9l8n0J6L1K0j0lm8KK0L1j5Nm9J0k0Q0l6j0k8%N5M9p7Kl0M1
7886IJ1n3J26p4k0p1J31m0j7J1k5M3j19J07N6p5n8K0Q4n5M2m4L7m9k3N0l0P1m5
7915@l9K3M9p9M9j0J8oJ0om4j5J9mK0O4m0%n4J2M0L2l2j0NJ5o0P5n9N1l8O5r5
7948d4P0Jom5J4N2j0l8k2J3m6K4N2mq2Q1J8m0oK8m1O8n9QJ9O4j1p6L0J8n5O6m1
7981@mrJ8l4L3L3rr5M9Q9m4pn2k2N8K3k7L0o9jj3M5j1MMRj7KrM0m3l8O4L9r0J9
8017c5O4j3j9OOj4J6k6j3jK6j3NK3k6K0k3L3m5n2J17m2j5J00q1mM8m3OM9q7oK1
8050a8mQK1J7k7J4n3R3Nm0k2Om7NQ2l2J5j6n5O2nL5n1pP7n7K3m2j9rL7l0klP1
8085C2q2P1pJ4K3J5l8j4pN2r5J8k5NM0k4K6o5lL8L1j0Lj6L6j6L5l7N9k1l9l8J4
$$ plain form
7853 38 -20 -46 -33 -28 32 61 23 -27 -11 20 40 30 27 -21 -19 1 32 17 22 -27 -17 -37 43 7 -3 -31 -31 24 73 -4 -2 -32 9
7886 9 20 -33 93 19 -1 -72 59 19 2 13 -12 31 -88 19 75 0 -58 -38 46 -9 33 -11 26 -23 -46 4 -26 45 0
7915 0 -39 -16 33 -46 3 -7 11 5 15 9 -35 -50 -31 -35 -15 49 9 9 -45 -33 7 39 7 -3 2 17 -43 32 -27 24 -14 51 -44
7948 -44 26 27 21 -24 -10 42 32 -6 -28 -15 -61 -37 15 11 -71 10 28 -12 -18 10 -31 37 -22 -14 5 69 58 -18 12 30 -25 41 0
7981 0 -4 -13 5 -29 4 37 28 -67 -18 71 27 20 -32 -54 4 27 0 30 -39 -40 -53 -8 -19 -15 -11 -2 -19 -17 -26 14 -29 -67 -3 36 -54 -35
8017 -35 29 16 -3 3 9 -5 11 -15 -28 -29 -3 -16 -11 12 -14 6 -17 16 -29 -81 36 -6 -21 79 -2 -6 42 -1 5 54 -33 -39 -18
8050 -18 -22 -14 7 24 -3 11 -42 51 56 16 -6 0 -47 -42 40 8 23 7 -48 14 9 44 -7 -14 63 6 29 -13 -32 -41 -4 -34 -36 -39 32
8085 32 -50 21 14 28 51 66 28 14 7 59 -36 -18 -43 -38 2 -22 4 -61 -64 -26 5 -5 -2 -18 18 2 37 0 59 38 -1 -39 -25
8118b5L4J3l2l1Q7j4o2P6k4o0J2J5K2l4P3q9N0m1KO9o3J5ML5m4rJ8L2p1N3J6m
8150B3%nk6J7M3k1J6o5l2P2l4O2l6J3K8r4L2K1On6K9K3%K9r2J7mP2n0J4rJ1J2
8183A6j07Q5j8K1Kk0k0N3
$$ plain form
8118 -25 9 22 -10 -41 46 32 -30 46 22 -38 -26 -11 11 -23 50 -39 11 -30 -28 41 -22 -7 -3 32 -12 -21 -3 29 -42 11 27 23
8150 23 23 18 -8 9 52 31 47 -18 -50 22 -12 50 14 27 55 -39 -7 14 20 -36 -7 16 16 45 -47 -30 -34 38 -12 2 -7 4 16
8183 16 -91 -6 -24 -3 -1 -21 -41 12
8191A2
$$ Imaginary data points
##PAGE= N=2
##DATA TABLE= (X++(I..I)), XYDATA
0@%%%%%%%%%%%%%%%%%%%%%%oJ4j6J6j6J6j6J8k6L2l2L7m5M8n3O1o6P4q5R3j02
43e4J15j26J38j54J70j87K07k28K52k76L02l35L72m14M62n14N76o53P43q56J002
64E42j198J480j913K681m458J7277J823k5230L12K193J500O411R395j0896j4021
79a4102N061J5198R76l062J30n146q703N976J1883k529j0881Q01N763j24L64L748
95E353n817j0277M027J4268L524o563m779m298n188M853J2069L80j2199o064M769
110e942N807O233P445k447j3868p502O696O405j202j183q77n284r39R130N883
125H355o179n885J995J354n09L651J440p306m143P476O785l268m781j865l106
140e986N46J0033P493o367j0045j724K210K348N262K170q349q819L999R893M245
$$ plain form
0 0 0 0 0 0 0 0 0 0 0 0 0 0 0 0 0 0 0 0 0 0 0 0 -6 8 -8 8 -8 8 -8 10 -16 16 -16 21 -24 24 -29 32 -34 40 -45 48 -54
43 -54 61 -65 73 -81 89 -98 109 -119 133 -143 159 -176 196 -218 244 -270 306 -347 396 -460 542
64 542 -656 824 -1089 1592 -2866 14411 16234 -8996 -8684 -6491 -4991 1420 10815 -81 -14102
79 -14102 -9041 6157 7133 4071 4201 -945 -9648 -3672 8211 5682 -5199 -4398 1365 1241 1605 5353
95 5353 -464 -10741 -6714 7554 11078 4515 -264 -4562 -9750 -4897 7172 7552 -4647 -10711 -5942
110 -5942 -135 6098 13543 11096 -2772 -10274 -3578 2827 1625 442 -435 -5719 -6658 2472 8355
125 8355 2176 -3709 -1714 -360 -869 2782 4222 -3084 -7227 249 7034 3766 -1015 -2880 -5986
140 -5986 -5440 4593 12086 5719 -4326 -6050 -3840 -1492 3770 5940 -2409 -11228 -7229 2664 6909
155F909J90j329o362n991L841P463j064o131j465J487R58L224L366l762o639J259
171d046O654J648k854k253k513j718M922P750j082q944m802K312M243N166M159
186H642l674r559k996O043N195k07k078m072m916J516Q621M654l571l974m09j98
202i83P50L215j34n538k440M611L929j196j971j587k417J011O035K586n173n419
218d721K05K952L478L696p49p150n172L264O609K744n51k732n055k154M444N368
234D476r20m614k528l24J224L762L100k293m115M25L284R56j173j173k089j081
250c083L142M246j063m779k417J315K620L118J417l743o052n10N370M415M59k243
266B212m279l585K180O432K867l105m087j583L53K631L594m77m693k576K238K779
$$ plain form
155 6909 7099 5770 -592 -6583 -2742 4721 3657 -2474 -3939 -2452 -1494 1730 5096 1334 -5305 -4046
171 -4046 2608 4256 1402 -851 -3364 -5082 -160 7590 6508 -2436 -7238 -4926 -683 4483 8642
186 8642 4968 -4591 -7587 -1544 3651 3444 1366 -2706 -7622 -6106 2515 7169 3598 -376 -785 -983
202 -983 -233 2982 2848 -2690 -5130 -519 3410 2214 243 -1344 -3761 -2750 3285 5871 698 -4721
218 -4721 -4516 -1564 1914 5610 4861 -2289 -7461 -4197 2412 5156 4605 1873 -3182 -5336 -892 4476
234 4476 3556 -1058 -3586 -3910 -2686 1076 4176 1883 -2232 -1807 1477 2433 1260 87 -2002 -3083
250 -3083 59 4305 3242 -1537 -3954 -2639 -19 3099 4516 773 -5279 -5789 -419 3996 4455 2212
266 2212 -2067 -5652 -3472 2960 5827 2722 -1365 -2948 -2595 36 3630 3153 -1540 -4116 -1878 901
282I01N15m07j453k085P94M133J456l260l296qJ958K687K247j443n178k650L058
299b031M625J483j464l613l783r0M945M353q82l819k563j29K100L682J440l051
315A203l763j5K397J637K96r96k178q64K155K573r52k850j269R60J935K112L85
332B766k995l289O18L866K596l22k482l219j351K571M523R83l074l557j406Q73
348b899L040K893o97l517j734J585K468J240j46j936k379J32K616J290j527j597
364a168j84R48J764J335j440l453j301K193L041R38j375k725k176J037M151K597
380D182j544l444k198M68K789L284L29l360l433k20K097K064N21j182k099o01
396b347K197K568n1k029j449p4R39J497K8k072j759J148K863J505p38k323k443
$$ plain form
282 901 1416 1009 -444 -2529 -1735 2398 3854 594 -2702 -2710 -752 1935 4182 2739 -2439 -5089 -2031
299 -2031 2594 4077 2613 -1000 -4783 -4873 72 4425 3543 -276 -2839 -2968 -868 2814 4254 1203
315 1203 -2560 -2575 -178 1459 1755 759 -1419 -2283 -128 2445 1493 -1357 -2626 -1666 269 2381 2766
332 2766 -229 -3518 -2900 966 3562 3240 758 -2461 -3812 -1241 3282 4265 1191 -2366 -3772 -2899
348 -2899 141 3034 2337 -1180 -2914 -1329 1139 2379 2233 297 -2082 -1950 666 1956 429 -1168
364 -1168 -1352 -404 1360 2695 1255 -2198 -3499 -1306 1735 2673 1298 -1427 -3603 -2566 1585 4182
380 4182 2638 -806 -3004 -2536 253 3537 3866 506 -2927 -3147 -1050 1014 1535 353 -1746 -2347
396 -2347 -150 2418 2367 338 -1111 -1185 -246 1251 1279 -793 -2552 -1404 1459 2964 2226 -97 -2540
413b540m19K646L032j43k842k495j83J885K998J404j967l312r49J991K577J280
429B963o71k377k108M75K054P56j157j307l50Q34J766J222p87k020o18J188J340
446A203J0j210j803o65J674K914J134j733k595j408P53K324J928o04k820k044
462b942O26K341J883J59j856k195l80K081K396L41j465j429o03O50J207L4j644
479g96j470O19J861J298o0j239j427L1J861J457q09k333j631M01K166K559N40
496C028k211k751l89J961K024O52j393k386j225J323K427Q70j244j802q29O50
512a295J896J261n56j430m64P84R45K8j203j644n64J339K094N59j362j540l14
529a466J276J798O62j515k631j033J423K451J388m77k030j717L50K028J519m00
$$ plain form
413 -2540 -2959 -313 2719 2576 -266 -2761 -2944 -1059 1939 3343 1376 -1936 -2885 -894 1683 2963
429 2963 2292 -85 -2193 -1718 336 1092 -65 -1372 -1722 -888 878 2100 1313 -707 -1325 -137 1203
446 1203 1213 3 -1800 -2465 -791 2123 3257 1524 -1071 -2479 -1726 598 2526 1922 -898 -2942
462 -2942 -2316 25 1908 2067 211 -1984 -2364 -283 2113 2454 989 -440 -1043 -393 814 848 -796
479 -796 -2266 -1647 214 1512 1452 213 -1214 -1183 678 2135 1326 -1007 -2638 -2237 -71 2488 3028
496 3028 817 -1934 -2323 -362 1662 2314 921 -1465 -2690 -1367 1060 1930 686 -1116 -1945 -1295
512 -1295 601 1862 1306 -124 -588 196 1141 1169 -34 -1678 -2242 -903 1191 1750 388 -1152 -1466
529 -1466 -190 1608 2270 755 -1876 -2909 -1486 965 2353 1876 -154 -1871 -1521 507 2026 1626
545A626j715j369p5J212J489M4j389j291P4J183R13J53p33o99M42J227P76r30
563I38j741j119L72J555J464j08j711j409M02J919J470j34j788k164m54J643K248
580A383O35j142j689p88Q48J710R06q54j697o63P24J283M39n60j370p01P65J338
598E67K86q12r83LJ194J454L01j420j902o16J184J777O30r14j842r00J056K065
616A128J093r02k035j351L76J703J498r5j485j187J98J267J008m7j138j013K67
633g15J170P26n37j219o17M07J019O71m35j386p52Q95J745R66n00j616j486J92
651a472J686J402j88j459j412j21J291J647M04j258j605n37P80J283O61n50j169
668f17m08O71J027K93o15q20k59O75R20K05r31j141j95R65J204J33j077j404l11
$$ plain form
545 1626 -89 -1458 -1533 -321 1168 1212 -177 -1468 -1394 -211 702 855 122 -577 -135 1092 1868 938
563 938 -803 -1922 -1550 5 1469 1361 -350 -1759 -1357 562 2032 1898 110 -2054 -2508 -865 1383
580 1383 2018 876 -813 -1601 -753 957 1863 1009 -688 -1351 -627 656 1095 535 -835 -1536 -771 567
598 567 853 41 -942 -939 255 1709 2010 590 -1312 -1928 -744 1033 1663 749 -1093 -1993 -937 1128
616 1128 2221 1319 -716 -2067 -1691 12 1510 1415 -70 -1257 -1059 208 1216 1169 31 -982 -715
633 -715 455 1181 644 -575 -1192 -785 234 905 470 -916 -1668 -773 972 1938 1438 -178 -1664 -1472
651 -1472 214 1616 1428 -31 -1443 -1564 -273 1374 1778 520 -1085 -1622 -842 441 1102 552 -617
668 -617 -1025 -354 673 966 351 -469 -728 -53 867 1072 141 -1000 -1195 -230 974 1107 30 -1374 -1685
687a685J148J767O22r39j778q14P60J631J062n38j686j023L51J411J053j25j185
704C2j236P4J043R38k08q96o39K02Q80P95k83j066n93O03J039N71m72j275q58
723a349N04J441R15n34j568j057J96J549J379o1j442j361K5J160J367L26r61j349
741h20l71Q50J131L74o96j080l23O00Q10J64o74p79o0Q21Q31pq48q12j4J017J100
762A214L0j079j216k49R55J409M33q49j519o35P35J371P08n40j284q64L71J268
780B59Q67k40q76p47N4Q92O98k16q69n46L64O54M05l54r01n03M23J068N45m56
800E21j045o39N03J251Q00l82j271j143K69J271J188j2j124j182j79R83J161J60
818A130r54j098k80O80J052L35m68q99q2O44O95L6o39p79m0Q02P93j29r52r28
$$ plain form
687 -1685 -537 1230 1852 913 -865 -1679 -919 712 1774 1236 -450 -1473 -1122 289 1342 1217 32
704 32 -1204 -1130 -87 851 643 -253 -892 -690 190 985 702 -364 -957 -354 685 1256 784 -491 -1349
723 -1349 -845 596 1511 977 -591 -1648 -1452 97 1476 1415 -27 -1388 -1363 -203 1164 1490 529 -820
741 -820 -1191 -341 790 1164 468 -612 -935 -335 475 639 -35 -814 -874 -53 778 771 -77 -889 -903 114 1214
762 1214 1244 165 -1051 -1300 -345 1064 1497 648 -871 -1506 -771 600 1308 768 -516 -1380 -1009 259
780 259 1126 886 10 -737 -683 209 907 691 -178 -724 -360 294 699 345 -556 -1059 -636 432 977 521
800 521 -524 -1163 -660 591 1391 1009 -262 -1405 -1136 135 1323 1311 187 -995 -1174 -191 970 1130
818 1130 176 -922 -1202 -522 530 865 397 -502 -584 60 755 791 152 -627 -667 135 928 799 -153 -1081
838a081R7R43R20J25j002j054j34J030J195K88q31j308o08P17J292O14l83j070
856b50o06L62R58N69l83r75n84J39P81N33j93o62l20L75P64K90m50p85l51N61
876b27Q97M44n80j081o02M41J110N95l19j068q04K50J250Q32o3r75j132p8P31
895c79J001K98o81p36j17N44P65J68n93p86k62N15N69O8n17n43Q8O60P49J5q64
916c8q24R4Q56R48J56r19j116l24Q01J098L14o92j181l80O33J162O25m95j077
935c59o75L09Q07N69k05p12m11L56Q00L72l25p91m21L74O65K18m25p62l09N37
955c88R36L90n25r65m71M84J089O48l36j058p87J37R66P94j47q42q35M8P57Q46
975G41J59o60p61j64M81N86j6n10l74P4N20O47m8n88n39M4N55M78m9p96o52OP73
$$ plain form
838 -1081 -984 -41 879 1004 2 -1052 -1186 -156 1039 1327 496 -812 -1420 -703 589 1203 820 -250
856 -250 -856 -494 464 1033 650 -325 -909 -770 11 544 351 -311 -631 -256 508 798 348 -437 -788 -227
876 -227 670 1114 534 -547 -1149 -708 402 997 678 -390 -1194 -944 306 1138 1075 100 -1032 -1110 -379
895 -379 622 920 239 -497 -614 -70 695 863 270 -516 -778 -263 306 374 -143 -686 -598 62 811 826 -38
916 -38 -862 -768 88 1036 1192 273 -843 -1167 -366 732 1046 354 -827 -1207 -574 588 1213 718 -359
935 -359 -1034 -725 82 651 446 -266 -677 -321 479 851 526 -265 -686 -312 353 571 146 -616 -925 -388
955 -388 548 938 413 -552 -1023 -539 550 1198 862 -196 -983 -846 120 914 767 -75 -910 -862 -105 741
975 741 900 240 -521 -685 -204 382 366 -144 -518 -444 76 723 675 87 -452 -408 147 625 576 -220 -872 -866 -93
998i3Q72no53q84k65O85J070L81n53r14m99L73Q53N20l91q46m68K84P17N10j63
1019E31o16m42J58M83L45l36n39k69M03P15L21l54o72l92L75P97L89m63r05m97
1039i68K96R15P44l08r91p13J47R08P47Q7o85q12l8O49O58K9n50o41k8M27N97
1060D70N1n21m23J3L94M92j38o36m76J59O95O42p6o74o21Q0P16O93L1p67q46j20
1082h62O35Q62J59n30p91l47M17P75L17j80o90l29L01M97L42k37m88l09K75M68
1102B85J63j83n00j86K76N57J36m07o52j95L37O57M23l16p61l83L52P06N42j61
1122F90p40o37L7O23P10k7o06o34j55N83N60Q5m12n37j5M25M02J09m14m55K8M98
1144A18M27q7n04m80M4N76N17q2o67n73m8O57O66J65n98o77j68M65P82L15m33
$$ plain form
998 -93 779 774 121 -763 -1028 -343 727 1108 555 -359 -858 -485 368 888 497 -349 -817 -533 184 694 531
1019 531 -85 -527 -369 114 459 123 -416 -685 -282 433 754 400 -272 -664 -289 508 897 434 -471 -968
1039 -968 -672 243 987 679 -312 -1025 -878 30 777 864 179 -633 -671 -22 636 665 115 -526 -554 -127 470
1060 470 521 0 -423 -410 -16 476 338 -298 -774 -615 80 722 646 -28 -649 -569 147 840 871 104 -742 -862
1082 -862 -227 635 794 264 -527 -874 -457 318 635 455 -235 -564 -263 234 576 339 -149 -458 -183 285
1102 285 448 265 -235 -421 -145 412 548 141 -511 -706 -369 288 711 395 -366 -749 -397 309 851 690
1122 690 -50 -687 -650 -27 683 656 50 -584 -739 -156 404 489 77 -460 -475 -50 352 461 47 -408 -380 118
1144 118 545 458 -46 -526 -482 94 611 529 -138 -711 -759 -102 564 729 131 -546 -714 -249 533 848 415
1165D15p46l08K06P12L35k19n98l11K11M56K49j36n22k83L14M54J77l19l87j25
1185d25L25N37J69l53o03k35L24O39K85l13o99l72K82N69M85j42n81n33O7N85
1205A1N59K3m40n65k2L58M82l8k25l73n0K34L50Q9l83l75M0L39K68o0l23l15l7
1228d53N50N08o8m55m94j37N54M54J22m27o06j86L82O35K23l27n98k90L04N05
1248A96K77k14m27k38J75L82J43j24l72j53K22M16J37k56l28k31K26M17J77l53
1268G2m78j77L89N55L11k23n72m16K51N02L54j19n38m55Q7M98L97k0m09m24K8
1289c87L30L68l5k85k63J0L13K65j20k98k32J69L70K39j63k95l36P3L85K61m6
1310C23n16m02R2M33M87Q0l25m72j85L27M75J61k81l84k36J99M02K01j88l22k25
$$ plain form
1165 415 -331 -639 -433 279 614 395 -203 -514 -303 153 402 266 -256 -539 -225 229 406 87 -300 -425
1185 -425 -100 437 606 253 -350 -585 -261 378 663 350 -349 -721 -439 130 615 473 -108 -641 -574 11
1205 11 570 593 153 -412 -434 -76 406 368 143 -230 -280 -46 304 393 10 -365 -325 14 282 222 -101 -416 -453
1228 -453 97 605 537 82 -412 -549 5 459 581 154 -452 -638 -256 379 602 275 -323 -613 -309 196
1248 196 473 259 -168 -406 -231 151 294 170 -202 -355 -133 283 420 164 -164 -395 -169 248 425 72
1268 72 -406 -583 -194 361 672 449 -123 -539 -288 214 568 449 -89 -544 -457 41 438 418 9 -415 -387
1289 -387 -57 311 276 -9 -272 -262 51 316 196 -102 -334 -165 205 444 281 -14 -350 -277 108 369 323
1310 323 -193 -595 -503 -70 417 497 172 -300 -485 -158 317 478 197 -187 -423 -224 178 379 191 -131 -356
1331c56J17K68K47j63k85j03J63K84J24k27l15r4K11M88P5j80m37j76K37M36J20
1352D34j95n30k91J50N10L21rm27l29R7K89L95n2l76k66k0K89L59n9m25q9pK70
1375C9K20l5k82k08R3L07K48k08k92l50J02M36L21L1m17k91oM03L33l1l43m69
1397c99j31L18M21J01j44l30j09J07L53J36j52l27o8J37K59J23j81k54o3J40K60
1418A97K6k22k66K1K02L64Q7k68m04j40K21L45J74j19l91j53J66L63K50j08l84
1439c9l06PL13K47%k80j57o4L15K42q9k54j62R4K13J31J9l32j26J01K59K11j13
1462B30l34k03J03K90K74j03l30k49l9K91L37P4l25k94r6L48L43R4k41l44j32
1483c06J74L45J7j25k69n5J47K09L5k17j25o4J66K72O9k54k18j6K05K73J42l18
$$ plain form
1331 -356 -239 29 276 113 -172 -275 -112 172 296 69 -246 -340 -129 359 434 254 -183 -359 -122 314 434
1352 434 239 -291 -582 -432 78 399 390 -37 -366 -269 20 415 363 -13 -279 -299 -10 349 290 -135 -224 -231 39
1375 39 259 224 -58 -266 -173 134 382 174 -118 -468 -366 70 391 422 5 -286 -292 111 444 413 70 -399
1397 -399 -530 -212 209 310 166 -164 -273 -166 187 323 171 -156 -224 -87 172 295 114 -140 -203 -63 197
1418 197 223 1 -265 -244 -42 322 409 141 -263 -403 -182 163 337 218 -173 -326 -160 203 453 345 -39
1439 -39 -345 -338 -25 222 222 -58 -215 -279 36 278 189 -65 -227 -133 80 211 230 -102 -228 -127 132 343 230
1462 230 -104 -307 -204 86 360 257 -73 -322 -361 -70 267 341 16 -278 -374 -26 317 411 170 -174 -306
1483 -306 -132 213 230 105 -164 -219 -72 137 172 -45 -170 -234 -68 204 273 19 -199 -215 -10 263 405 87
1505H7k95j09J83L59J46k37k95k01J31K81K63j62k47j35J7K58K23l3k19j85Q8
1526h2K23P3j32j25j45M8K42M9p0k10q1O5K57J41j10l10r8J09K54J99j7l18j74
1549b12k9K50K35Q4k80k63o7K25K61L5j92k48KJ58J44J45j38k15n4J11K21L2k05
1572@j37m6J68J97K6j74k63lJ87K24N9k75k01j16K37K92J79j20l25j12O7K11K01
1595B76r5k97j88P0K94J07m2j63j63J26J80N8n9k08m4O0K10R4r3k13j26J43K49
1618A76P1p5k56j89J54K28J52j15k23j94O9K14K36j6k12j66m0J64J70P0j48k08
1640a38l7J12J39L2p8j62l2J83J27m4k03k7j6J74J92l1k14j85J9J76K39Qk01j86
1664a53nQ3J85J12r6k73r5O5K28J41r3j72p5P4J87J08j51r1p1nQ3J39j3k08l6
$$ plain form
1505 87 -208 -317 -134 225 371 134 -161 -362 -231 50 313 151 -96 -231 -214 44 267 234 15 -170 -82
1526 -82 141 214 82 -43 -188 -140 102 151 81 -129 -210 -145 112 253 143 -167 -265 -156 98 297 280 -38 -212
1549 -212 -241 9 244 328 48 -215 -282 -57 204 239 47 -201 -199 -41 103 248 110 -105 -159 -48 173 205 0
1572 0 -137 -183 -15 182 208 34 -229 -232 -45 179 238 -37 -238 -354 -117 175 354 234 -91 -203 -136 75 276
1595 276 181 -116 -304 -234 60 167 125 -38 -201 -75 105 163 104 -104 -148 -88 122 216 123 -90 -216 -73 176
1618 176 247 172 -84 -273 -119 109 261 146 -77 -271 -202 12 248 232 20 -146 -186 -22 148 218 70 -138
1640 -138 -175 -63 76 108 30 -132 -164 19 146 102 -101 -128 -144 30 222 191 -23 -208 -189 -13 226 234 33 -153
1664 -153 -158 -75 110 222 126 -147 -242 -177 51 192 99 -73 -148 -74 113 221 70 -21 -92 -97 -14 125 112 -96 -132
1689a32R9J32L6n5k56kJ07J73J05j10j96j38J45K20P9m3k11j15J2K26J60k5k40
1712b9j48J9J44J34L0j92p1O8P2J26J8j21j10k5P3J47p5n5k00J14J29J18jk15
1736e0j07K5J10J98n4q2k04K6J01J99J5j08j92p1J35J63N2m4j12j38O3P8Q3k5
1760F1j87kJ02Q9J04j40r1n4P1J17N5j05j23mJ13J28ork10p1N7K08Q5r2j51m8
1786a03m5J98R9o4j08j48N0J35J93m4j10r7MO2k3K8j13r2J11N9J12Oj31j10Q7
1811d4P0J38o0j65j55J20J07J61qj47j59JJ30J56K5j59j55P0M1J58M7r2j83nJ30
1836B2K7N3k0j55J2P0O7L3j25m9n2J11O7J5j00l2l8O3J07J26j36j66jN0J39M3
1862A31o1q7n3M7J5J59m7j30j18J9J90M1j8j18l6K3P0O0p7l4J9n3J67n7%r3p9
$$ plain form
1689 -132 -33 99 135 80 -176 -178 -71 102 207 97 -99 -237 -92 128 207 164 -47 -162 -150 76 236 211 -29
1712 -29 -177 -158 -14 120 150 -42 -113 -45 27 153 171 50 -60 -85 -12 135 60 5 -195 -81 48 166 165 -50
1736 -50 -157 -132 -22 176 122 40 -164 -138 -37 162 177 69 -123 -194 -59 104 156 112 0 -138 -75 3 86 61
1760 61 -126 -128 -26 63 167 27 -64 -118 -47 70 125 20 -103 -107 6 134 128 119 -91 -162 -105 103 188 96 -55 -103
1786 -103 -148 50 149 85 -23 -171 -121 14 207 163 53 -44 -40 22 -1 27 -86 -178 -67 -8 104 110 -21 -131 -44
1811 -44 26 164 104 -61 -216 -96 11 172 164 17 -142 -141 -11 145 170 11 -144 -74 -33 125 172 80 -103 -108 22
1836 22 49 102 82 -73 -61 9 76 109 -16 -65 -117 -6 61 76 -24 -56 -94 -31 76 202 66 -100 -101 -51 88 131
1862 131 70 -17 -70 -23 -8 151 104 -26 -144 -125 65 106 88 -30 -66 -43 27 87 10 -24 -5 -58 109 52 52 -41 -120
1889a20Q3J05K2p7j0q1J6N3J45q1n5j47OJ92N9L2j25j46R1j2J42kq9n4pN3O6L2
1917I1j40j5mM9Q6k5n6j11O6J24Mk0n7j3kM5Q8j9j09q7L3Q7L2N5j25l3j5PJ46
1946H2O2p6p2o1O1K3J05p4p9j2O2J9K9l6p1j4L1M7R7j26n7l2R0P1j0j8o2o2K6
1975e7R7N9o7q4n4R1R1K3j3q1p2m0J47J7Km7m6%J11k0l5m9jl1Q5P3n7o4k5j3R6
2006C6L9k9j18j2PN9R4L3o9j52P2N0J06Rr7r2O6LJ21q7Or4K4O5NP2j56j5JM7M6
2037D0L5p6m2mJ36Jq6O6j26j3L4J01M9j39m5m7Q2L2P6m1p8j2M4M8O0j03o6O8k0
2066b6J7N4L7j29NlJ19o7J0k3o4K9M9N2Np5p2O5P5O0o9j09nOL4J04q3J6j12L8
2096f2J05J5l3n5l6j7J38J7mo4q2O6mO4Pp7J4j9M0M0l8j8n6OjJ23Qj41rk4J29
$$ plain form
1889 -120 -37 68 90 13 3 -78 -62 -9 136 55 0 -147 -141 51 110 142 17 -129 -38 -50 92 90 1 -53 -60 -7 59 91
1917 91 -49 -64 -68 -19 67 42 -14 -125 -59 65 69 49 -8 -21 -23 22 110 91 -18 -105 -72 15 47 102 -23 -56 -71 -64 82
1946 82 144 68 -4 -65 -4 19 124 50 -29 -41 21 40 69 33 -38 -52 -21 26 123 -3 -60 -92 -2 69 59 41 -21 -83 -57
1975 -57 40 99 32 -52 -106 -15 76 99 86 5 -67 -107 40 57 59 12 -34 -34 77 57 22 -27 -28 -59 26 99 42 -22 -47 -60 36
2006 36 75 46 -72 -84 -77 -18 76 109 40 -112 -40 10 116 125 28 -64 2 5 126 39 45 -49 -25 40 45 117 -39 -54 -53 -6 40
2037 40 75 -1 -43 -47 89 90 4 70 -56 -69 -35 66 115 -24 -69 -116 -34 -2 74 33 -45 -57 -13 35 95 -8 -74 -6 -26
2066 -26 -9 45 82 -47 -42 -45 74 7 17 -6 -70 -41 8 60 65 -10 -82 -17 58 118 49 -60 -65 -59 -25 79 -4 12 -100 -62
2096 -62 43 58 25 -30 -66 -83 55 72 68 4 -78 -12 -16 48 55 -22 -8 -27 13 53 15 -3 -59 -53 -54 69 77 -64 -73 -97 32
2127C2J7J09j85p5k8J57O1o5Lm6n5N0Q6j8K4j14j9J0N4O4p3k4k2j2J50o3l4Pr6
2156a05J03O5J9r5L7n4J4N5K6m9j32N2N6J02mo7k2q4P7OL1J6r6J1j3J00L0l9m8
2185hm7N0nN3n2j1Ol4Q0jJ2j05M6j6O4Q5j05n6J1jN8J12m6j39q1R6Q4K4L3j42
2215c5J5m9Q2L8J9q5n4M8O7K7J4p3m4j6j7P4j0n0j2k7O4M6P0j43Nj9N5R9o9k3
2245cm1l6Q1L6O6p5q6m9Q5P0P9o5o1p0L4J06p0M0q6q1J11%P4j6m4o4P7M4k7no0
2276c6J9qJ10K0p0p5o5N5Q3M9n0j01k2J4J14M2L7j22j8m9R7Rok6j8k9O1L8k5m0
2306a2j03N2P5M6k5kn9k0P9N5j5q3l7K5K9Q0j6m8j28K8J20L0Ln1j39j8M7J77N1
2335A41r1j29k4M7J25Ll4r3L0J5M2J1L3j27m8Q7M4NJj18M0Q4K3M2j22p3j2P6R2
$$ plain form
2127 32 49 158 -27 -102 -130 27 88 23 26 -20 -75 -25 61 43 67 -47 -66 -56 -2 62 -11 -35 -57 -69 81 18 -16 -9 -105
2156 -105 -2 63 82 -13 24 -30 -16 39 65 16 -116 -64 -8 94 90 23 1 -83 -6 0 31 47 -49 -38 -51 49 79 40 -8
2185 -8 -55 -5 -10 43 -9 -20 -14 -48 32 31 43 -62 -16 -32 32 117 12 -44 -33 -34 24 136 90 -49 -130 -34 50 74 107 -35
2215 -35 -20 -69 13 51 70 -15 -69 -21 46 73 87 14 -30 -46 -63 11 1 -49 -61 -88 -24 22 92 -51 -46 -65 -10 89 20 -3
2245 -3 -44 -80 1 37 103 28 -58 -107 -22 48 127 62 1 -69 -35 71 1 41 -45 -126 -15 -15 59 43 -1 -65 12 56 29 24 -36
2276 -36 -17 -25 85 105 35 -40 -105 -50 33 82 32 -69 -91 -77 37 79 116 -6 -24 -73 24 33 27 1 -17 -46 15 53 28 -12
2306 -12 -115 -63 12 58 33 31 -28 -48 31 86 71 -12 -49 -24 5 85 69 21 -107 -79 41 71 74 23 -116 -134 -87 90 141
2335 141 50 -79 -103 -56 69 72 38 -55 -25 -10 32 43 76 -51 -99 -12 32 37 38 -80 -40 44 67 109 -13 -86 -98 -22 70
2364G0N3r3q3n8K8J76k3Ro1r0N5K3N9l7k5m0pM1K6j6L5r1K7L7LM9j28%jJ11O9
2395A18k2j52J5j4Q9O5o8l5qn4J05K8J2j24Kj27J40P6J9k5j04j7Q2K8K1Jj01K3
2423b7qP3Jjk9p5O0P4j8k4n5m5L7M7L3r9j9J4o7J76j8nm4p0l4J86lK1r3q6Q1J7
2455@M4k2k8n9k7Q4L2rj0j32J06L5J02j00o0j7L1O1K2O7j46l6M9LQ1K2j45j7l6
2484a05N5J40o1n4p5O2j8J33l5m0n5L0J6J02Oj17m9M0K9L1M1p6k3j3RQ0k9o3l8
2513g7JK6J01L5o6k2n1M6J05k9k3j21J4O7L8O9m5j43NMN1R0k2q4l5L2J00L1o8
2542B9o1l0O0N0R4j35m6JJ8N5N8n5q8j2j0Q2L8l1%o5L4P2QJ5m8j32M9J02L7p7
2572A2l1k5l2L4J10o1mk7k8K5J07m1m5n1j9Q4M6l0q7K7j9M6J01n0j4o1l3R7L9
$$ plain form
2364 70 123 30 -53 -111 -83 93 70 79 18 -72 -17 6 65 28 3 -37 -44 -3 23 7 42 -49 -22 15 18 67 -61 -61 -62 49 118
2395 118 96 -56 -41 -55 34 99 31 -4 -12 -66 39 67 79 -45 -43 -170 -30 46 65 40 -64 -81 1 29 50 51 -50 -27
2423 -27 -35 38 39 38 9 -66 -6 68 50 26 -29 -74 -37 10 43 -56 -75 -61 -128 48 30 25 -19 -89 -123 63 60 81 -12 -98 -17 0
2455 0 44 22 -6 -65 -92 -8 24 15 5 -127 -21 14 116 16 -44 -61 -30 31 53 120 -26 -62 -13 -10 71 93 -52 -69 -105
2484 -105 -50 90 29 -25 -100 -38 -56 77 42 2 -53 -23 -7 95 101 -16 -65 -25 4 35 76 0 -23 -36 -27 53 24 -39 -77
2513 -77 -76 -50 51 86 20 -2 -53 -7 98 69 46 -75 -61 6 44 113 68 -75 -70 -66 -15 75 53 -31 -66 -34 66 97 29
2542 29 -32 -62 -2 48 142 7 -39 -38 -20 35 93 38 -50 -62 -72 10 48 17 17 -48 -14 58 66 81 33 -99 -50 52 89 12
2572 12 -19 -44 -76 -42 68 7 3 -24 -52 -27 80 39 -6 -57 -76 8 54 24 -63 -36 -55 -9 92 42 28 -33 -66 31 70
2601G0K5q8p5l6M4R6lL1q8n6O3L9O3p1k2m1M7MP9p1Kq1N6j4L1Ll1n7P5O9k1J1
2633E3j04n3K0J10O0n6j03j3K9L9J02j7j05r2L7R5P4J6m9j15M3QN9L0n3r5NQ5
2661A0K2%k5m8rjJ40jq2p9O6J3P5L8j66k4l0J17M2J8m2j41M1N0P0K2n1p2k7M8
2691b6L3P6n8o8k6J4Q5NOj07OJ3J32k7o7l5k5N7P4m8K3o6p4O6P8J9j9l7q5R8L6
2722E3K0K1p8q2lK4J14o5m2k1m3J8J43k8l0o7J6J05j8J5pp4m7J35Oo5q2J2j4R8
2752A4L4j4k5j22L2L7O1J4l9o1L4M9OJ8pn6m1J8Q0noq7J1K5O2j1%k5j22R4R5l3
2784C0l8j05M3M7J3O7j0j23%O1M9J2Oo8m1%Q8M3K9j20l8mR0J1l2Pp1l4J00J00
2814A12r8o4k2N5NL1nk4n9n8Q8J13rr0k2m7J70M2l5j07o2KO4L1O1l0o6J3j3R1
$$ plain form
2601 70 95 7 -68 -104 -60 36 33 64 -24 -80 -17 22 85 14 -8 -49 -2 2 81 10 12 -69 -13 -27 4 7 -24 -81 -6 63 42 53
2633 53 -51 -104 -84 26 86 30 -73 -86 -57 -18 84 67 -38 -130 -93 2 76 92 43 -72 -29 -21 38 68 15 -80 -75 10
2661 10 32 32 7 -41 -50 -51 89 88 6 -73 -7 6 81 119 -47 -71 -101 16 58 76 34 -107 -66 -16 54 76 25 -47 -74 -26
2691 -26 7 83 25 -43 -69 -55 30 35 41 -66 -60 -47 85 58 -9 -44 -69 -12 62 14 37 -29 -103 -37 41 60 41 4 -81 17 53
2722 53 73 94 16 -66 -69 -45 69 4 -38 -59 -102 -84 59 31 1 -66 -50 55 37 52 45 -29 -76 59 65 0 -82 -70 -84 14
2752 14 48 34 9 -113 -81 -44 17 31 -8 -69 -35 14 20 38 31 -25 -66 -48 32 27 21 -66 -55 -30 32 21 21 -4 -126 -32 63 30
2784 30 -8 -113 -70 -23 -10 57 47 -76 -76 -15 34 46 52 -16 -57 -57 31 74 103 -17 -55 -59 31 42 10 17 -54 -88 12 112
2814 112 14 -50 -72 -17 -12 19 14 -10 -69 -127 -39 74 65 -25 -47 -94 76 118 83 -24 -86 -84 -20 11 72 42 -24 -11 -24 67
2844F7J5m8n6o5R5rR4q2m5r%Q8k0k4p3J2PJ49rr9rp8M9O5J13j13l3NJ0M2M0J2
2876I1j32l0Q7J5Q2p1k5q9j4J22L3J5j21M4j28J43L5j8p0mN3l4J02n3q1mL5L2
2904A5P3n7p9j22L8R4J36m2l5q0k4M0J00N6j65J4n3O3M7O1l8o0j9N5N8j4pj02
2932d7qqP0M1p0k6L2J6N1l4l3n9J4L5P7Nj5j30J1L0K8Q9l3j29L3RN1J11p5k8k0
2963a2j2P9k1l8n6k2N2R6n7M2l8q9M0K8L9n0mp2L4R7J8K3r2k9l1J00O2p4kp9N
2994f3N9K8P4o3n7m0M0N7Onq5l4Q4L3L7q7p3MO4J18r7nm1m8J03J1M1m3p8j1N3
3025a8K4P9k5j33j3L0Q3P5o8r7lQ0Ll1K7Oj00M6M6Q0r2mj8j6M1N1j8j05K8j9J00
3056C9L5Pl7q8L5lP4l4n9l2J2M8J21n4j00qj7N3Q2k1l3n0nJ6L7k7K1m0K1k1J6
$$ plain form
2844 67 82 34 -22 -87 8 -1 93 11 -34 -43 -43 45 25 1 -72 -60 -53 96 87 -12 -21 -99 -50 15 128 15 -18 -13 -3 39 79 91
2876 91 -41 -71 16 31 113 42 17 -72 -86 36 69 84 -37 7 -121 22 57 39 -31 -35 18 -16 86 33 -48 -52 -17 15
2904 15 88 31 -48 -170 -132 -38 98 56 21 -59 -83 -43 57 113 -52 -38 -91 -28 19 80 42 -18 -37 18 76 62 55 -47
2932 -47 -55 -63 7 48 -22 -48 -16 0 51 17 -16 -75 -61 -26 51 56 41 -89 -78 -48 -20 69 36 -93 -60 -51 0 111 36 8 -12
2963 -12 -24 55 34 -4 -60 -82 -30 66 9 51 13 -76 -36 -8 31 -19 -23 -95 -61 36 54 77 -15 -44 -75 25 87 13 11 -68 -63
2994 -63 -4 24 98 35 -22 -62 -22 35 41 36 -49 -83 1 34 71 -16 -89 -85 -21 97 0 -5 -46 -94 9 20 61 18 -60 -71 -18
3025 -18 6 85 60 -73 -86 -56 27 102 34 -63 -66 14 17 -14 13 19 -81 -35 11 91 -1 -5 -23 -39 2 53 35 -70 -42 -61 39
3056 39 74 81 44 -44 -9 -12 62 28 -31 -63 -51 -3 118 64 -36 -44 -61 -8 74 53 20 -30 -35 -19 18 -9 12 -28 -7 -28 -12
3087a2P6k1o9nlJ01mq1r7J15M4oM7p2n8p7N8J20nlo4m1K4Q4qjj08L9k3Q2R5j00
3119B7Lq5P0L1J5l2k9l6pL7N1p2K0p4N2N7L6k5q4%K7K8K9k9J8r8k4P4J05m0r0
3150d5NJ2n5J60k6p8l1k8K5J34o2n0o8O0K6P8n2K0r9oM1MR8l7o7kQ6k0M4p3o7
3181g3k2P4N0O0o6q8qQ3J3N9n5q9P9oNL6n1Oo5N9l0R5l6q7%P4RJK0n8o5%J07N4
3215H5n8m2q4L0O0Q5k9j18kN1K1P0po7l4k2L5O4M0q8n1K5M%J9m5Ql5j7J46n9j6
3247c1j4J4M0kO0p0n6M5L9J0Nk1n3n0J46n9L7Jn4p3N4J6Q0o4k7ll2O5QM3n2j7
3279a5J7J8J1n4L4j32P3N2J8No2K9n3J08k4Kp2ml1J29L1L6j17q0O5l2P3M8j04
3308c1l1k6J16Rl0Qo5nN6N1m2l6k6oP2O4Oj23l5N1l1M1R3q9Pn0%Q1K6n9k5m0P0
$$ plain form
3087 -12 64 43 -26 -31 -34 67 63 -18 -115 0 44 38 85 13 -45 -122 -64 56 51 48 -16 -57 -33 51 43 42 -66 -27 -50 32 127 27
3119 27 30 -55 15 46 61 29 0 -36 -43 -6 45 -27 -7 -81 -29 28 64 39 -45 -45 -18 10 39 10 28 -70 -94 -20 85 45 -45
3150 -45 -40 -28 -83 77 51 -27 -58 -86 -61 73 11 -39 -107 -47 -21 57 5 25 -74 -80 -39 -35 63 26 -41 -43 43 23 67 -6 -73
3181 -73 -95 -21 29 89 23 -65 -73 10 23 82 27 -62 17 11 16 52 1 7 -58 1 -29 66 30 -57 -57 17 26 27 47 -11 -76 -76 31 85
3215 85 27 -15 -99 -69 -9 76 47 -71 -73 -22 -1 69 62 -5 -39 -61 -26 38 78 -10 -61 -36 -32 -32 -13 -58 -50 -85 -102 44 -15 -31
3247 -31 -45 -31 9 7 67 -3 -59 -14 25 35 40 19 -34 -84 62 3 40 41 -13 -86 -32 -16 64 0 -27 -30 -62 3 11 54 2 -15
3279 -15 2 20 31 -23 11 -121 -48 4 22 27 -35 -6 -59 49 25 27 -45 -49 -80 49 80 116 -1 -81 -16 -48 25 73 -31
3308 -31 -62 -88 28 37 7 15 -50 -55 1 52 10 -26 -52 -58 14 78 84 -39 -74 -23 -54 -13 80 -9 -2 -52 -52 29 55 -4 -29 -69 1
3341ALN7n4p2L2L5L2M6n3r3mM1K2N8m0l5k9RJ07m9M5k5p4LJ7P6p3mrl9J09L9j05
3374b6M3r2PJ50n3k5J3q7N5QL2J6j0n0j3LO1J1l1J3q4J2M5M2n9m0N5J7k7Q5o7
3405Dn5P5L0J5m4K6j25J7P1N2Qp6k8j3j0J32k8o7rl7N2J9N7o0Ln2L6L1k%m5P5
3437E2o4O4Nr5L9l2k2K3P2q1K8l2M7M6qJ2j04N8n4K3L9K4m0oK0j7K2Nn5J6k8J
3469d2P1J4n3k5j0M2N4mj2n2m3L4J8J9Ql6J8j6L2O6j07n9L4P3M5n2J4o1LJ5N0
3500C8rm9jO2n0O9J7n0k4o6M7L7L3k6mp1K9N8P2j59J1k5L3O3n1P4n1l4K9Mj7m
3532a5l9K1m6P2L5K1n8Nl1N1qK5j02M5K5J6kj5Rm9N2l4L5j5L5o3K5j2M2jk0l3
3564b9k5J04L3l0k3n2nJ3N5j5k4l2J7m4Q7l6rj2kM2J6k1j5K2o5oN8M8m1k5K3K5
$$ plain form
3341 1 4 61 7 -65 -33 2 34 80 27 -66 -70 -29 -7 51 11 -24 -53 -44 63 14 59 34 -40 -37 -20 56 -17 -21 -30 -69 40 79 -26
3374 -26 17 -75 -68 82 29 4 17 -70 -15 -7 25 41 31 -19 -32 -29 32 43 12 25 -59 -47 -2 40 -19 -59 -4 13 -14 71 4
3405 4 -51 24 54 69 25 51 -74 -57 14 66 74 -2 -30 -43 -53 79 51 -16 -25 -62 -10 9 66 6 9 -43 -7 24 22 22 -23 52
3437 52 -12 52 57 -38 1 -31 -53 -30 42 -39 -11 -43 4 50 42 54 -50 8 -46 -23 16 40 0 -6 14 -3 19 24 -31 -15 -43 -42
3469 -42 29 43 -10 -35 -45 -3 51 47 35 -17 -60 -26 -8 11 19 -17 1 -15 17 83 -24 -83 -49 24 69 17 31 -30 -27 -12 38
3500 38 29 -20 -21 41 -9 60 77 27 3 -63 -16 21 54 28 24 -47 -18 40 112 -47 -36 -61 -28 35 -16 58 7 -27 2 6 -11 -15
3532 -15 -54 -33 -79 -7 28 49 -9 -4 -35 16 8 33 -69 -24 1 17 15 0 9 -40 12 -22 13 -2 33 -30 -5 -17 25 24 4 -29
3564 -29 -54 50 83 53 30 -22 -27 -14 41 26 2 -30 -13 -57 30 -6 -15 -27 -29 13 29 8 -7 15 -50 -56 2 50 9 -16 7 32
3596C2n5L4l5jJ4l1P9oj7k4j6QO2pm3k5m5K4N7R4j03J8j9k6L1k2N8n4O2j07P8
3627A5M3m8L8m4l6J3N6rk1m6j9L1J7M9J1r8j5O5J8K9q2KJ1m8Q5ln2OkL9Rj2k0
3660a8L5n5K1N1k8J5j5l6pQ9n1k4N9q3P9r7J03r6Q8q6N5NL6l6k7K5j1M5j7Op6
3691e1L7j1K6j3j7Pk7L5K0K6l0K1n4pR4o0M5l6rJ8l5KO8qk0l7j4Q0l4j2n0K9L1
3724A4k1jJ2k6L9K1pJ4j2K5o3M1L0o8rk4KK3J0L6k4l5l8K7M8M0n6k2j4J2M3K1
3756C8L6r9K1k6k0J30j08L5k5K0N8m2L6o7ll3M8MK4m0N7No9Q2k7o3%j2O5q0K8
3787b7M2q3L9N3l4J0J9l2k3O2pnkk3p7O4M5J6j2l9Q4m0j0K6n1O9j00L7K7J7k9
3818A6k3p6O3rJK1J5Qj07J50n1k5j0O9n9k1K7L9n2j6K6K7k8O3n1j2L6n1L7pj4
$$ plain form
3596 32 -23 11 -24 -25 -11 -42 37 31 14 -10 -26 -18 44 37 -6 -31 -76 -52 5 99 -4 14 -5 -31 0 -22 36 -18 44 -63 15
3627 15 58 10 48 4 -32 -19 37 28 7 -39 -58 -27 -10 39 50 -48 -63 2 20 49 -33 -31 -20 -68 17 14 -38 -32 -34 5 14 2 -18
3660 -18 17 -38 -17 34 6 21 6 -30 -37 52 1 -23 36 -47 32 -65 38 -58 30 -56 -1 4 40 4 -23 2 -9 36 19 25 -51
3691 -51 -14 -25 1 -12 -29 -22 -49 -14 6 32 2 23 -31 -38 56 -4 41 5 -4 14 -21 -19 49 41 21 -16 -30 50 16 4 -46 -17 14
3724 14 -7 -8 4 -22 17 38 31 45 33 58 -5 36 66 -2 -11 -35 -33 -10 0 36 12 -23 -61 -34 14 54 -2 -24 -38 -26 17 38
3756 38 74 -25 -4 -30 -50 80 -28 7 -18 2 60 18 54 -13 -16 -49 -1 3 27 -13 44 49 -20 62 35 -28 -28 -40 25 -55 -27
3787 -27 15 -68 -29 24 -10 0 19 -13 -36 26 19 14 12 -11 -88 -24 21 37 25 -14 70 30 20 46 -5 64 -36 1 28 45 16
3818 16 -7 -83 -20 -29 -28 -7 8 16 -91 59 8 -17 -27 42 -17 -38 -11 28 -24 -40 -14 13 -15 48 -3 -15 21 -30 7 0 -14
3849a4ONK4j5Ooo3K4K9j0k1M7n2M8Jj5J0n2N2j5L8Lrk6j6k5L4O4o3J5n9N0N5k6
3883B4m5j1KL7M3k2n8kK4qnk6R1l4n6j5M6N1Qqr2J2M2J1o4J16m6l2ok3J41q6j7
3916hK4l0K9N0n2l5j9M2jl5K8j9oJ1J8NPK1m7QK9n9M8Qk8K7pJ0m2K9J1J4lm1L0
3951A7om8K8N9p4Q3o1m5R6r3M8j4k1L7N0q0K1l2M8l1JJ0O9k5m3k9K4L1j3j3pk5
3983c8j9N9L1l6qL3M7j19J20p9n5Q7jkn6L2l7J03n1o5O1L4K6n4p2L2J3M8k4Mj
4014A3qoL4k0j1%j8L0K6j2k1m5O3Jm3k0K5J3QL4l5k0RJ8K8k3m0N6j8l3J3j2Q3
4047F9n9l5N6l9lJKkR4m9r3M7O7j09P8j5n2J3J3M9l5j3l3Q2K3m1l9L5jj2K3l2
4079a0j7N3r0J06j07O3J5n1%J2M8nk4N4n5J1J0%K0%j2j2J8o0KO3j6l1L9k2pk6
$$ plain form
3849 -14 -8 -3 21 6 12 6 -57 -33 -4 -14 -35 12 -40 8 9 -6 4 -48 4 -11 27 30 21 -5 -21 -46 -12 52 -11 4 -55 -5 50 24
3883 24 -21 -32 -30 7 50 28 -30 -32 -8 -16 -21 -47 44 10 -46 -61 -15 36 44 36 -56 -44 -2 9 -55 61 15 -17 -23 -46 95 9 -8
3916 -8 16 -14 15 65 13 -22 -41 1 0 -35 -7 -26 -32 -21 -3 2 9 30 -17 -9 20 -39 9 17 -11 16 9 19 -23 6 17 31 28 -13 17
3951 17 11 -37 -9 50 -24 59 -2 -47 49 -44 4 -10 -31 6 56 -24 -3 -35 13 -18 -17 -7 62 37 -6 -35 -11 20 7 -6 -13 -38
3983 -38 -57 2 33 -3 -11 22 69 -50 70 -9 -64 23 22 20 -36 -4 -41 62 11 -54 7 41 67 13 -59 -27 -14 34 10 14 13
4014 13 5 -1 33 13 2 2 -16 14 40 28 7 -38 25 26 -17 -37 -12 1 9 43 8 -12 -3 15 43 20 -20 36 18 -15 -2 -14 69
4047 69 10 -25 31 -8 -11 -10 -8 -10 84 35 -58 -11 56 -53 25 10 -42 -29 -16 33 -2 -15 -48 34 57 16 -23 12 11 -1 22 -10
4079 -10 -27 26 -64 42 -65 -2 13 -38 -38 -26 22 17 -7 47 -8 3 13 13 33 33 21 9 27 -33 -31 32 16 -15 24 2 -5 -31
4111c1N8l5J5k4M0rK2n9P6j1m8M2n4PJ0oK4j7j2P7j02O5l1k5L0M2p3L9L0p7P7
4142D0k1prL6k9Jl6kk0K9J5L7j2J8Npm0J4j4QL2l0l8R6p2J7rL5m9K7j6K3pl7k4
4177d6J1M4l0j4K0lN6l6M7Rr2Q4o8k0K8K0k2l2M9l9J2K8M5n5LK8k2L6mo8L3OM
4210A2j9K6m1L3j2j0MP2j05J02q5QM2j3J6j20R4j4jL8l2j8K3Ql8O6l1K9k1J3k0
4241FnL5k0J6j4J0q9Q1j4mM2o3N3k6J3Np7P5qRj6M9p1K6k9P3J8k7o9lJ3l1J8J6
4275hmQK9n0k2J21m6o2N9m0K1m0K6k7P2K5n4K5k2JRl6J5K4j1k5N0ol8mL4n7Q1
4308D8r7LM2j8L7rQ1j18J0k0P3k1l7J5L7m1rk9Q2J3o6k7K7N5m1k0O3m9J7l7J13
4339G7r2j1P2n5M3k8m1M6k0K7j1RJ2l9K7L6j6o1%M9k3N0m1JL0o0Pl1R1nJn8L5
$$ plain form
4111 -31 27 -8 7 -17 23 14 36 -23 53 42 -6 36 -18 -11 -1 -7 17 0 -12 65 -37 28 -3 -28 2 44 -29 10 40 -37 40
4142 40 19 12 3 39 10 11 -25 -27 -47 -18 -3 34 22 40 45 38 -2 12 -2 6 38 8 -30 66 -6 11 2 37 -12 15 -1 22 15 -22 -46
4177 -46 -35 9 -21 -35 -15 -18 38 2 49 58 -34 50 -18 -38 -10 10 -12 -44 5 -34 -22 6 51 -4 -1 27 5 41 37 -31 2 8 12
4210 12 -7 19 -22 11 -1 -11 -7 65 -40 62 -23 -15 27 14 30 -90 4 -10 -11 27 -5 -23 0 8 -30 36 5 34 13 26 6
4241 6 1 36 16 32 18 28 -61 20 6 2 44 -19 34 8 21 26 -51 24 16 25 9 58 -13 13 -16 57 75 48 -21 -24 -11 -42 -24 -8
4275 -8 -12 -4 25 -25 -47 74 28 -34 25 -15 6 -34 -8 -35 37 62 8 33 11 12 21 -15 0 24 13 -12 38 32 -6 -10 24 -33 48
4308 48 -49 -46 -4 -22 15 6 87 -31 -21 -41 32 11 -26 -11 26 -15 -24 -53 29 42 -24 -51 -24 31 -10 -30 33 -16 1 -36 77
4339 77 -15 -26 46 -9 34 6 -35 11 -9 18 7 16 28 -11 16 52 36 -25 -25 24 1 51 10 11 41 -19 -12 -43 48 43 44 -14 21
4372B1JJ1m9M0n5O4k9j4Pk2Q2n8j6L2Kll9J06r6L2qm8K9M1%J4j9o5Q8q2J5j2K7
4405cpK3o5Q6J4k0r3O9j8K7rK3l3k1J8M1rl2MJ6kj9K4Lj0J0n0M4n0Q1q6K5j7Q8
4439E2l6o5J8N3mk9MJ4L5l3K2k3k8KKK5J3l8L2J6j9mn4K7k0L8Nj9K1K0n2jk4L2
4473a8M3n2M2rJ5qk9N0k1J6m2L3K2m8KL4J2K5m9j6L2NmJ1q6M4k6N8k5M8n9j5k6
4506d1J2k1M4J1K5q2M7M9j21N1M6p6O2N5l2p6O1K8j21J00k0Mk9K6J4j9j3O6o1
4535a1L8j1l9qJ2J0pK3m9j4J02k5OJ4n7K7l5L2p3N6rK2L4j1o3M2OJ3o0j8K7M4
4567A8K5o8L3o5O7k6OK1K8l7n3L4KQj5rK9l8N6k7L2k1jRn4K9k0Q0m1j7Q0o1L6
4600D0j2j5k8J1rNj4M4q6J00o1M8n9K2Ok9M0k8k9Q4k8l2N7k7km5P6m4m9M8Jlk
$$ plain form
4372 21 22 33 -16 24 -31 33 4 -10 -3 -25 57 -1 -17 15 17 14 -25 81 -15 17 9 -39 -10 31 31 45 26 -39 49 -33 -18 -30 -3
4405 -3 -10 13 -52 34 48 28 -65 4 -14 13 4 27 -6 -27 -9 32 23 -9 -5 11 9 -10 14 17 7 17 -33 11 -39 42 -44 -19 -36 52
4439 52 16 -49 -31 22 18 -11 -7 7 42 9 31 8 -20 -18 -16 9 22 -16 16 32 13 9 -45 -18 -38 0 5 -14 7 27 -25 -26 -50 -18
4473 -18 25 -27 15 6 21 13 -16 34 13 29 -13 20 42 -6 -4 30 42 67 18 2 34 39 35 46 -40 4 -22 36 11 59 0 -15 -41
4506 -41 -29 -50 -6 5 30 -52 -5 44 -77 -26 20 -56 6 61 29 -47 14 42 -79 21 1 5 -24 2 16 -3 -16 50 -11
4535 -11 27 16 -23 -31 -19 -9 -16 7 -42 -56 46 21 27 41 -16 11 -24 8 -65 -9 -18 4 38 27 -36 6 12 25 -35 -53 -26 18
4567 18 43 -25 8 -57 10 -16 -10 11 39 2 -51 -17 -15 -7 -22 -31 -2 -40 16 -11 21 0 -1 8 -46 -17 -37 43 2 -15 65 4 40
4600 40 28 13 -15 -4 -13 -8 -22 22 -64 36 -25 23 -36 -14 -8 -37 3 -25 -54 30 2 -30 27 0 -2 -47 29 -15 -64 -16 -15 -18 -20
4633b0j3L8M9m8K3q6O7OK2K1r3Rlj9O2jm2J17j06qN6mn9J3J4N4p7J9O7m7K4o6
4665c1N4j3l0L1j3mk7P4o1MM9Ql4K4k7lK3l4j8L8k6O1j3l0p3P6J0p6J27n7l2N3
4697C0j1l5m3kL1NO9m3K7k8Nn5J10m6L0j8p3P4l3L4l9j6MR8j10j6L9J1l9qK6P
4729a5N9%n0Ok7Q9m5J0n4J7j2L8l8%N6o3K7kL0qj5N4q4N4j9mm4P6m4K2l2j0j8
4762d6N5k4J8k1o3N5p0P0j7N4m9Q8m3RpL2k1j1k6%K0K3k4QLJlk1K0k3jM1j3K2
4796C6n0M5j1k1J7m5L4j3j9l2P3rn0P7K2n8J6n6J10K1j00J1K8j3K8l5k6rN1k0
4826Bj1L5k7j7J2M9pj6l8rON3j8M0Ln7KK2Ln3K1lL2K2k9M9q7L1m1L8n5N8J9l5
4860fj9K4L7M1p5Ol1RQj0Ok2J6MK0n1P0l9K0j5J4l3M4l6LM0m2N2o3K8J7Jl0J5
$$ plain form
4633 -20 -33 5 54 6 29 -57 10 16 38 59 -34 -25 -28 -47 15 14 -28 89 -17 -25 31 27 -32 -19 -5 49 -28 -9 58 11 35 -31
4665 -31 23 10 -20 11 -2 -6 -33 41 -20 -16 33 41 7 31 4 1 24 -10 -28 10 -16 45 32 2 -71 5 15 -61 66 9 -23 30
4697 30 19 -16 -59 -61 -30 -25 44 1 28 0 5 -50 60 14 44 26 -47 27 -6 28 -11 -27 -23 75 -35 -51 -12 -1 -40 -48 -22 -15
4729 -15 44 44 -6 0 -27 62 17 27 -27 -10 -22 16 -22 -22 34 -29 -2 -4 26 18 3 57 -27 27 8 4 -40 36 -8 14 -18 -28 -46
4762 -46 9 -15 3 -18 -81 -26 -96 -26 -43 11 -38 50 7 16 9 41 20 9 -17 -17 3 26 2 10 13 14 11 -10 10 -13 -14 27 14 36
4796 36 -14 31 20 -1 16 -29 5 -8 -27 -59 14 5 -45 32 54 -4 12 -44 66 87 -13 -2 26 13 41 6 -20 -29 22 2
4826 2 -9 26 -1 -18 -6 43 36 20 -18 -27 -21 32 14 54 57 0 2 24 27 -26 -5 -8 24 46 17 66 -21 10 -31 7 -48 10 29 -6
4860 -6 -25 -1 36 77 2 8 -23 -14 -6 -16 -10 -32 -16 -12 8 -43 27 -12 8 -7 7 -26 18 -18 -15 25 -17 35 -28 0 17 18 -12 3
4894Cj6lkqM6m6N5l4L1On0K5J2k9L4j1j6j0%NNjJ1lJJ2J2n2M9n2j2QrL1mO8k6
4931C0p2K0K4K1pm5K3K5k5J8j9m4K8QL4lJ2n9J4lK9k0J4QK2l0k6k9O3jk0Ll8P9
4965C4rK8m1k6Ol4M3j2L4Kq8L9O2l8j4N3n6%MJ8Ok6pL2j5J2K0l3K2p9M1J5ok2
4999c5Mk5J01l8o4N6j6J0j4j4P1J2m4K5r0O5Qj5n3P9p5O6m6K7k7N5l3K4mkrJK1
5032B1Mm8K7M3j08J02N2p0K2Oo9J1l3M1N1j2J5qo6LO1o9QK8O0m8j0J6n6L5l9L9
5064IJM2k1k1N6m7l2QK6Mlo6J9O3k1p0N1O4m3o0J8L4K8m2l3J1J9J5n2O8j1m2L6
5097Hk5O4m4J6j5k4j9RL3M4kl6p4N9n2L2j0j2J07n9k2j0J4oL2j8K5k7j7N9l2M3
5129D1o8P8n3lL8j17R3p8N5L8n9M9j9n2Q6l4l9L0M3j5Pj3J0%o8L1mJ4M9m8j4J3
$$ plain form
4894 3 -13 -16 -18 -26 20 -26 29 -5 26 32 -18 7 19 -10 24 13 -3 -13 -13 -8 -3 -4 7 4 5 17 29 -23 26 -26 -38 -30 -39 -8 -12 56 30
4931 30 -42 -22 2 23 16 -29 -6 19 -6 12 -7 -51 -23 -15 19 16 28 -31 -17 -20 9 -11 3 11 33 3 -23 -52 11 10 -10 -7 -45 34
4965 34 25 53 12 -14 -8 -42 1 -11 23 25 -63 -24 38 0 -14 39 -17 -17 -13 5 11 -15 -22 10 -5 7 27 -6 16 -63 -22 -7 -13 -35
4999 -35 -31 -56 45 7 -57 -1 -17 -7 -21 -35 36 48 4 29 -61 4 12 -3 -56 23 -52 14 -32 -5 -32 23 -10 14 10 8 -1 0 21
5032 21 25 -23 4 47 -61 41 93 23 45 51 -18 -7 -40 1 52 40 55 47 -19 -16 45 -24 -16 12 72 24 14 30 -26 9 -30 9
5064 9 10 52 31 10 66 19 -13 -5 21 25 22 -44 -25 38 17 -53 -2 62 19 -41 -23 11 39 -3 -36 -25 -6 9 -43 25 14 -28 8
5097 8 -17 47 3 19 4 -20 -39 -30 3 47 45 9 -65 -6 -58 -26 -36 -48 59 0 -22 -32 -18 -24 8 -10 15 -12 -29 30 -2 41
5129 41 -27 51 -2 -5 33 -84 9 -69 -14 24 -35 14 -5 -57 29 -5 -44 -14 29 14 21 8 18 18 -50 -19 -23 -9 40 -8 -22 -9
5161iN2l2K8k4k9k8K4K6J3j5n1J21r5PJ6O5n7l2L9m3o7P1N7om4o7P9Nk5M9l1k5
5193b8K7J7j6qj8M1o2O7m3J4j6K7KOMk2J1opN7n0M0j5N4j31O2L5m4j7K1lj3J6
5226BK1J1j8p0R8o2M5Nn5O1l9k1p%J2%jO7k8po5P1l4L0NQk2m2K5L3l0J5k2j2Q4
5261E8r2K7L4q4J27j10K3j6M0K3k9O1k9j2l1k3RKJO7o2J0n2O6j6N0on6jK6L5k9
5293A1o8J12mj3p0P7m4K9k9j8mk2O1l2J2RJ7m5Q9n7%M7n1j0RrL5l2p0J07m4jj1
5326a9pN1k2N2o5j6o7J01%Ol7O7q9N2Ok6J5j4m4NJ1PL0Jn3M0j1J3L3kJl4N2j5
5360B2m0l3M7k3O3k0l9KL9L1o8M4l4P4k6l0M6m7K6n0Nk1L4K6nk8N9k3kn2K4l3
5392c2j8J8j9L8J5J3j8k4oNMJ5N5q1M2kPK2p5N0Rj0k3j8M1m6L9oK2l2J4j2PL8
$$ plain form
5161 -9 43 11 39 15 -14 -42 -18 8 21 6 -45 76 -19 -12 4 69 12 -20 19 -24 -91 -20 37 31 -13 -80 -1 4 -21 28 -3 -28
5193 -28 -1 16 0 -8 -26 15 -47 20 -23 -9 -25 2 4 10 14 -8 3 -3 -10 47 -3 37 22 76 -55 7 42 -2 -19 2 -1 -14 2
5226 2 23 34 16 -54 44 -18 27 32 -23 38 -1 -22 -29 -29 -17 -17 -18 49 21 14 -51 20 -14 16 21 29 7 -35 -10 23 -7 8 -14 -26 58
5261 58 -34 -7 27 -57 70 -40 -17 -33 7 30 1 62 33 21 -10 -33 -24 -22 -21 46 -16 -6 -58 8 -8 42 36 -20 -21 5 40 11
5293 11 -57 55 51 38 -32 45 1 30 1 -17 -21 -43 18 -14 -2 7 24 -21 68 11 11 58 7 -3 6 -3 32 0 -70 37 -7 -8 -19
5326 -19 -26 25 3 55 -10 -26 -93 8 8 14 -23 44 -45 7 13 -13 2 -12 -56 -51 -40 -33 -3 -2 -55 -15 -26 -13 20 18 19 -15 37 22
5360 22 -18 -51 -4 -27 36 16 -23 -21 18 49 -19 25 -9 65 39 9 55 8 34 -16 -11 -32 2 28 23 -5 54 31 29 -23 1 -32
5392 -32 -50 -32 -51 -13 2 15 -3 -27 -33 -28 -24 -9 46 -35 7 5 12 34 -41 9 18 8 -15 -33 8 -38 1 -5 17 -15 -1 -13 -6 32
5426C2j4n6LO2l2lJ1Q3m6m7k2k2P6l1pK9o9P7m1K8J2j8k3K2J7O4o2k7n4N2n9M3
5458b2R5r8k%QK3k0k4N3lM7k8k4l9L2J7PK6o8K7n4oQ4j0ljj4l1P5j35M1lJ4j8
5492e4L7K%j2k5O8l6K9K0o5J8rK1Q3q6%M1m6M1l5K1qj7l9O8k4L2ql4m5L5N8m7
5525a6j9J6qL9j6L1k6ol8k9N6K1o3K5L9MM6o1JO8o1L7q5O5Jk8L2n3K4J9oj5n1
5558e7P3N1j5n4k5N2kn9Q5k9l7N2j8Nj8j3L8J4r5P6j5J3k7j1PJ2k3N7o6MM1nJ7
5591B8qm3OM6j0n6J8K2k1%J0O7n9L4j4j3m4P6l8M8n3K6m8L0j0J0j8M9m7L1l9L
5623a7k7M7L7r5R9k8j1rl3J7K8N0o9j4M4p0J7O9o2Q5k9n6K9N7k5Mn2mM0nJ2o7
5655c8N8m9J9oQL9k5Nk2pN1l9oj7K3PJ5o0J01o6OMJ7n4K4Nnj9L1L6n1Jm0P0K7
$$ plain form
5426 32 18 -38 -35 27 -5 -8 3 86 40 -7 -29 -51 25 -6 -13 16 -53 24 -17 11 23 5 -18 4 21 85 23 -4 -58 -6 -65 -22
5458 -22 73 -25 -27 -27 -19 4 -16 -40 13 10 57 29 5 -34 -2 15 22 48 -20 7 -47 -53 31 21 18 17 3 -28 47 -88 -47 -50 -36 -54
5492 -54 -17 -15 -15 -27 -52 16 -20 9 29 -36 -18 -27 -6 77 -9 -9 32 -14 27 -8 13 5 -12 -51 17 -7 25 17 -17 -62 -27 31 -16
5525 -16 -35 -19 -27 12 -4 27 1 -5 -43 -72 -16 5 -58 -33 6 10 56 -5 -4 64 3 40 -45 20 21 -7 25 -28 -4 15 9 -6 -57
5558 -57 16 67 52 -2 -27 25 23 -36 49 20 -17 35 17 22 4 -9 29 43 -52 24 9 22 -5 -16 -9 3 -20 37 -29 -25 16 11 28
5591 28 20 -23 -17 29 19 -37 -19 3 -18 -18 -8 59 0 34 20 7 -37 39 1 49 -4 22 -26 4 -6 4 -14 35 -12 19 -20 -17
5623 -17 -44 3 40 -55 44 16 5 -4 -37 -20 8 58 -11 -25 19 -51 -34 35 -27 58 29 -27 2 59 34 38 -14 -18 22 17 29 -38
5655 -38 20 -29 -10 -16 -8 31 6 11 -11 -18 33 -6 -12 -29 -6 1 16 -44 57 -9 -3 1 18 -36 -12 -7 -12 -31 0 36 -15 -14 -54 16 43
5690D3j7m1K1Q4n7l8J0k3%M9O2o1p8N1n7Q4rrl5J6qJ7K4Jo8L3K0l5K7j4R1q5L0
5723B8kk0k6k0K4LK7qN8o5k2J23j04M3q9M3L7o2J5N0qm6m4M3O5j8K5l5j3K8m9
5754a9P5K8m8q2K1K6N9n3no0L4J6K1Qm6M0l4K8Jl5rO3lr9M0P3m8pjk2K8mOn5N3
5789a0NK4J6m3L8m8J3l1O5m6L7l5j2NN8lk3l5nk1J13l4k7Qk0L9mj4o7M8kL3m1
5822a9P7j19O7m5J8P3l0m3l4N5k4j7R7kn2q5N8J7L7p7J2nN2nL6k4n0M6M1l8j6
5853Aj2jPRrJ3j3j5L3jMJ2J4q4N1m6O6Jk1m2M5n7M3P8j05K3k0K1j9J00o8JkJ6
5887B3Kqm8M7k7L6k1j6j0M0p7K5O1m2K9l8L2n3N1J3nj2j9k8K4J5J4K2j9k9N0o
5919B6K6n1k5O2op7P3q5R9o4J9J1QM5o5j6L2lrl6N3k8M6m8M3p3L0l0M4k7J9j3
$$ plain form
5690 43 26 -15 6 90 33 -5 5 -18 -18 31 93 32 -46 5 -52 32 23 14 -21 -5 -13 4 28 29 -39 -6 14 -21 6 -8 83 -2 28
5723 28 26 6 -20 -40 -16 -13 14 6 64 -1 -23 100 -4 39 -50 -7 30 -32 -17 33 25 -21 -65 -22 43 25 50 15 2 30 -19
5754 -19 56 84 36 -46 -25 1 60 7 2 -58 -24 -8 13 21 -25 15 -19 9 10 -25 -34 29 26 -73 -33 40 -8 -15 -16 -38 -10 -14 -8 -63 -10
5789 -10 -5 19 35 -8 30 -18 -5 -36 29 -17 20 -15 -27 -22 36 33 10 -25 -30 -51 62 28 1 9 -11 28 24 10 -57 -9 -11 22 -19
5822 -19 58 -61 6 -39 -21 52 22 -21 -55 0 -24 -41 56 54 2 -83 -25 -8 29 -48 -36 -41 11 6 42 18 -32 14 55 17 1
5853 1 -11 -12 -5 4 -5 8 -5 -20 13 12 16 28 42 -42 9 -37 29 30 9 -33 12 -45 -2 76 -29 -6 -26 -5 -24 76 8 9 7 23
5887 23 25 17 -31 16 -11 25 4 -12 -22 18 -59 -34 27 -15 14 -24 8 -45 6 19 14 2 -17 -45 -21 -6 8 30 11 -18 32 26
5919 26 52 1 -24 38 32 -45 28 -57 42 -22 -3 8 16 61 -4 -20 12 9 0 -36 17 -11 35 -13 30 -43 -13 -43 1 -26 -7 -20
5951b0K1k1J9j1N7k0o3K9l5M4l6Q2p3l9Q4J1oj6m8qM9lO0k5p1L5L4L3kkj27M3
5983b5N6p5N0l5K7n6P3N6n6J1k0k2jK6K6k5j9K9J1Qk2J1k6k7pK8M2j0o7L4L6k7
6015DQ9p4n1L5Jj3J6j2oRnJ0L4j7l2J6k9M1j8N1m3m1O7q1P2m5L2m7MO8q6O0Qm
6049A3o3k2Q6j4l4lL1j7j4J3P1l6LJ4pK4o9J4j7M1J5nL0o9mm1P3m4M1Rj8j6J0
6082eM0n6M5Jm6N2j9PJ8r0P1J3l8L4k2p3N5K6M7o7k9l7N4N3j8rK9o8L8RJ5n1K4
6115Ck7L5k5M1PJ8j15J01o4M0mp8N3l5N9L0Qn2o4P5k1J9M8Jo8l6N7J%J2mn6M3
6148BO5n5L1k2m9PO0mkk9l8J1O7Km5J8Lm8k2Q0k5K8m5K4j8N8q7OM3o9M6K3j9m
6182gL1l0J4L3Ql8l1MO4pJ0q9O9j2l6QJ9L4n9m5Q1k1K7o7J2K5rOM3Lo7L1j5K5
$$ plain form
5951 -20 1 -20 -1 -12 45 25 -38 -9 -44 0 -36 46 -27 -66 18 29 23 7 -41 -49 0 -3 57 32 -39 -4 30 63 61 59 -68 -25
5983 -25 31 -44 6 -29 -2 -58 15 71 15 26 6 -16 -17 9 35 10 -9 20 31 39 17 28 2 -25 -32 -4 38 28 -39 -5 31 4
6015 4 93 19 -32 3 4 -9 7 -5 -11 -2 -7 3 37 20 -12 4 -25 16 -2 49 6 -35 32 -49 23 -22 10 -37 -33 35 -51 9 17 13
6049 13 -50 -72 14 0 -34 -37 -6 -23 -37 -24 47 11 14 28 21 45 -24 -10 -27 14 29 24 54 -15 -19 -60 13 -31 10 19 1 -15 -5
6082 -5 35 -21 24 25 -21 31 12 19 37 -53 18 31 -7 27 5 -68 -13 13 60 -7 -36 -73 -19 34 16 7 36 -32 6 15 30 -21 3
6115 3 -24 11 -14 27 34 52 -63 38 -26 14 10 -68 -15 -50 9 39 47 -5 -69 6 -15 4 52 53 -15 -51 6 7 7 19 15 -41 2
6148 2 67 12 43 21 -28 -21 39 35 33 4 -34 -23 44 46 1 19 22 -26 -48 32 7 35 -10 14 -4 54 -33 -27 16 -53 -7 16 -3 -7
6182 -7 24 -6 8 41 49 11 -20 -16 48 41 51 -38 31 19 -17 -9 10 44 -15 -60 21 0 27 -40 -28 -3 -12 -6 37 40 -27 4 -11 14
6216A4k4K6m5K7k6K4L2k2k6Qm2M3J5L2k2k1J7P1j04L5p9J2P2M0o6K4n1K6JLlM0
6248C1n7K5J1K1M1o1qn9RO7K8m2p0R9%p0O5j3m9j4J1K4M6j7l9K2j6K5m6O0k9m9
6280e4O0m2K6O0q6K4j7k5Q5o3M3n4L3k5R1l2j9j2Oj2L7l0J5j7p5K5M3J2K3n7K5
6311a2k1N0l9%J3l2M1j1Q7j21KqQ9nrJJ9q8l3L0Q8p3K4n3L2L9l7M4r9J29o0nJ8
6344@K4n1k4O2j8M3j1Ppm6K2j5L9m1k1L2lL7Jrj9l2j6J02On2o5L3L0Ol0K9j9l5
6378d1O1j8J1k6k5%K1l3J06n5l3K9k1J2J5N1p1M9p1O8k1K4n6L0Ll7l2N6Jj9J0
6409a2J00qkj12J4M0j1j7K1o5M3nOJ5J8l1pk7L5L2l9mK9m3N7K2j0m4J5pJ8j2j4
6442el3K5M0n5K6J3J9j2rn3Q6l9L6m9m5Q0Mj1M0o9pl0P4J2n6l1K3K8o2K4L0%q
$$ plain form
6216 14 -10 16 -29 -2 -28 -4 28 6 -20 -12 -54 -11 4 36 14 -7 10 81 -23 12 -67 -55 17 57 -9 15 -36 -10 -9 -6 -9 31
6248 31 -26 -1 10 31 72 11 3 -56 -47 20 48 6 -64 35 35 -35 30 17 -32 -46 -35 -11 35 18 -21 1 -15 10 -36 24 -5 -54
6280 -54 6 -36 -10 50 -36 -12 -29 -54 31 -32 11 -43 -10 -35 56 24 5 -7 -1 -13 24 -6 9 -8 -83 -58 -15 -3 20 -37 -12
6311 -12 -33 17 -22 -22 -9 -41 0 -11 76 -45 -43 -51 38 33 24 25 44 -44 -77 -47 41 -32 -8 -61 -29 10 -27 17 -82 47 -13 -18 0
6344 0 24 -27 -51 11 -7 36 25 32 25 -21 1 -14 25 -16 -37 -5 -8 29 30 21 2 -30 -46 56 62 10 -55 -22 8 14 -16 13 -6 -41
6378 -41 20 2 13 -13 -38 -38 -17 -50 56 1 -32 -3 -24 -12 3 54 -17 32 -39 29 8 32 -24 6 9 -28 -60 -4 -3 -22 -12
6409 -12 88 80 78 -34 -20 20 9 -8 13 -52 -9 -14 -8 7 25 -6 -13 -40 -5 27 -12 -16 13 -30 27 49 39 -5 10 3 21 9 -5
6442 -5 -38 -13 27 -28 -2 11 30 18 9 -44 42 3 39 -10 -55 25 29 18 58 -11 -18 -48 26 38 -18 -49 -26 2 -60 -36 -6 -6 -14
6475a4k1K6K5K4j6m1j8M6K1k9Rq6K8R2o6J5n7L1l2R9l5N8n3l9pP7l2J0J4o1L5
6506Com7M6L6o7j9K5K2oLo%L5K4k1M3l8n9O0l0k2QJ4l0M4Pj2lm9M4LK0J1n3M5
$$ plain form
6475 -14 -35 -9 16 40 24 -17 -35 11 32 3 12 -74 -46 46 -20 -5 -62 -31 -63 36 1 59 6 -33 -40 37 5 15 29 -32 3
6506 3 -3 -50 -4 32 -35 -54 -29 -7 -13 -10 -16 -16 19 43 22 65 27 -32 28 -2 -24 -16 -2 -32 12 19 7 4 -45 -1 2 22 33 -20 25
$$ [...]
8191B7
##END NTUPLES=NMR FID
##END=
