##TITLE=1H_DE-80H_X3
 200.13MHz, d2o
 8 sc
 
 19ns.26.2.2025
##JCAMPDX= 6.0         $$ Bruker NMR JCAMP-DX V2.0
##DATA TYPE= NMR FID
##DATA CLASS= NTUPLES
##ORIGIN= UXNMR, Bruker Analytische Messtechnik GmbH
##OWNER= pz
$$ XWIN-NMR		Version 3.5
$$ Tue Apr 22 10:12:14 2025 Russian Standard Time (UT+4h)  Yarkov@DPX200
##.OBSERVE FREQUENCY= 200.1313
##.OBSERVE NUCLEUS= ^1H
##.DELAY= (6, 6)
##.ACQUISITION MODE= SIMULTANEOUS
##.ACQUISITION SCHEME= undefined
##.AVERAGES= 8
##.DIGITISER RES= 18
##SPECTROMETER/DATA SYSTEM= spect
##.PULSE SEQUENCE= zg30
##.SOLVENT NAME= CDCl3
##.SHIFT REFERENCE= (INTERNAL, CDCl3, 0, 14.3821)
##AUDIT TRAIL= $$ (NUMBER, WHEN, WHO, WHERE, WHAT)
$$ ##TITLE= Audit trail, XWIN-NMR		Version 3.5
$$ ##JCAMPDX= 5.01
$$ ##ORIGIN= Bruker BioSpin GmbH
$$ ##OWNER= Yarkov
$$ C:/Bruker/XWIN-NMR/data/yarkov2/nmr/H-C/1/audita.txt
$$ ##AUDIT TRAIL=  $$ (NUMBER, WHEN, WHO, WHERE, WHAT)
(   1,<2025-04-22 10:10:37.48 +0400>,<Yarkov>,<DPX200>,
      <created by zg, POWCHK disabled, PULCHK disabled
       configuration hash MD5:
       00 E9 B6 7A A2 85 ED C7 34 08 36 98 17 FE 4E 26
       data hash MD5: 16K
       25 B0 95 19 7C 59 3E 92 FB 72 FE F0 DF 7C 16 74>)
$$ ##END=
$$ 
$$ hash MD5
$$ 81 14 DA 19 2E FB CB 2A E1 8F 8F E9 69 11 79 60
##$RELAX= 
##$RELAX= 
##$RELAX= 
##$RELAX= 
##$RELAX= 
##$RELAX= 
$$ Bruker specific parameters
$$ --------------------------
##$DU= <C:/Bruker/XWIN-NMR>
##$EXPNO= 1
##$NAME= <H-C>
##$PROCNO= 1
##$TYPE= <nmr>
##$USER= <yarkov2>
##$AMP= (0..31)
100 100 100 100 100 100 100 100 100 100 100 100 100 100 100 100 100 100 
100 100 100 100 100 100 100 100 100 100 100 100 100 100 
##$AQSEQ= 0
##$AQ_mod= 1
##$AUNM= <au_zg>
##$AUTOPOS= <>
##$BF1= 200.13
##$BF2= 200.13
##$BF3= 200.13
##$BF4= 200.13
##$BF5= 200.13
##$BF6= 200.13
##$BF7= 200.13
##$BF8= 200.13
##$BYTORDA= 1
##$CFDGTYP= 0
##$CFRGTYP= 5
##$CHEMSTR= <none>
##$CNST= (0..31)
1 1 145 1 1 1 1 1 1 1 1 1 1 1 1 1 1 1 1 1 1 1 1 1 1 1 1 1 1 1 1 1 
##$CPDPRG= <>
##$CPDPRG1= <>
##$CPDPRG2= <>
##$CPDPRG3= <>
##$CPDPRG4= <mlev>
##$CPDPRG5= <mlev>
##$CPDPRG6= <mlev>
##$CPDPRG7= <mlev>
##$CPDPRG8= <mlev>
##$CPDPRGB= <>
##$CPDPRGT= <>
##$D= (0..31)
0 0.7 0 0 0 0 0 0 0 0 0 0.03 0 0 0 0 0 0 0 0 0 0 0 0 0 0 0 0 0 0 0 0 
##$DATE= 1745302237
##$DBL= (0..7)
120 120 120 120 120 120 120 120 
##$DBP= (0..7)
150 150 150 150 150 150 150 150 
##$DBP07= 0
##$DBPNAM0= <>
##$DBPNAM1= <>
##$DBPNAM2= <>
##$DBPNAM3= <>
##$DBPNAM4= <>
##$DBPNAM5= <>
##$DBPNAM6= <>
##$DBPNAM7= <>
##$DBPOAL= (0..7)
0.5 0.5 0.5 0.5 0.5 0.5 0.5 0.5 
##$DBPOFFS= (0..7)
0 0 0 0 0 0 0 0 
##$DE= 6
##$DECBNUC= <off>
##$DECIM= 32
##$DECNUC= <off>
##$DECSTAT= 4
##$DIGMOD= 1
##$DIGTYP= 9
##$DL= (0..7)
0 120 120 120 120 120 120 120 
##$DP= (0..7)
150 150 150 150 150 150 150 150 
##$DP07= 0
##$DPNAME0= <>
##$DPNAME1= <>
##$DPNAME2= <>
##$DPNAME3= <>
##$DPNAME4= <>
##$DPNAME5= <>
##$DPNAME6= <>
##$DPNAME7= <>
##$DPOAL= (0..7)
0.5 0.5 0.5 0.5 0.5 0.5 0.5 0.5 
##$DPOFFS= (0..7)
0 0 0 0 0 0 0 0 
##$DQDMODE= 0
##$DR= 18
##$DS= 0
$$ [...]
##$SUBNAM2= <"">
##$SUBNAM3= <"">
##$SUBNAM4= <"">
##$SUBNAM5= <"">
##$SUBNAM6= <"">
##$SUBNAM7= <"">
##$SUBNAM8= <"">
##$SUBNAM9= <"">
##$SW= 18.0517328524113
##$SWIBOX= (0..15)
0 0 2 0 0 0 0 0 0 0 0 0 0 0 0 0 
##$SW_h= 3612.71676300578
##$TD= 16384
##$TD0= 1
##$TE= 0
##$TE2= 300
##$TE3= 300
##$TEG= 300
##$TL= (0..7)
0 120 120 120 120 120 120 120 
##$TP= (0..7)
150 150 150 150 150 150 150 150 
##$TP07= 0
##$TPNAME0= <>
##$TPNAME1= <>
##$TPNAME2= <>
##$TPNAME3= <>
##$TPNAME4= <>
##$TPNAME5= <>
##$TPNAME6= <>
##$TPNAME7= <>
##$TPOAL= (0..7)
0.5 0.5 0.5 0.5 0.5 0.5 0.5 0.5 
##$TPOFFS= (0..7)
0 0 0 0 0 0 0 0 
##$TUNHIN= 0
##$TUNHOUT= 0
##$TUNXOUT= 0
##$USERA1= <user>
##$USERA2= <user>
##$USERA3= <user>
##$USERA4= <user>
##$USERA5= <user>
##$V9= 5
##$VALIST= <valist>
##$VCLIST= <CCCCCCCCCCCCCCC>
##$VD= 0
##$VDLIST= <DDDDDDDDDDDDDDD>
##$VPLIST= <PPPPPPPPPPPPPPP>
##$VTLIST= <TTTTTTTTTTTTTTT>
##$WBST= 1024
##$WBSW= 4
##$XGAIN= (0..3)
0 0 0 0 
##$XL= 0
##$YL= 0
##$YMAX_a= 239135
##$YMIN_a= -149915
##$ZGOPTNS= <>
##$ZL1= 120
##$ZL2= 120
##$ZL3= 120
##$ZL4= 120
##$ABSF1= 10
##$ABSF2= 0
##$ABSG= 5
##$ABSL= 3
##$ALPHA= 0
##$AQORDER= 0
##$ASSFAC= 0
##$ASSFACI= 0
##$ASSFACX= 0
##$ASSWID= 0
##$AUNMP= <proc_1d>
##$AZFE= 0.1
##$AZFW= 0.1
##$BCFW= 1
##$BC_mod= 2
##$BYTORDP= 1
##$COROFFS= 0
##$CY= 83.5205535888672
##$DATMOD= 1
##$DC= 2
##$DFILT= <>
##$DTYPP= 0
##$F1P= 10.8118882576601
##$F2P= -7.23987719738617
##$FCOR= 0.5
##$FTSIZE= 0
##$FT_mod= 4
##$GAMMA= 1
##$GB= 0.15
##$INTBC= 1
##$INTSCL= 1
##$ISEN= 128
##$LB= 0.25
##$LEV0= 0
##$LPBIN= 0
##$MAXI= 10000
##$MC2= 0
##$MEAN= 0
##$ME_mod= 0
##$MI= 1.114404
##$NCOEF= 0
##$NC_proc= 0
##$NLEV= 6
##$NOISF1= 3.799351
##$NOISF2= 2.8
##$NSP= 1
##$NTH_PI= 0
##$NZP= 0
##$OFFSET= 14.38212
##$PC= 1
##$PHC0= -891.6688
##$PHC1= -15.66629
##$PH_mod= 1
##$PKNL= yes
##$PPARMOD= 0
##$PSCAL= 0
##$PSIGN= 0
##$REVERSE= no
##$SF= 200.129724274929
##$SI= 16384
##$SIGF1= 3
##$SIGF2= 2
##$SINO= 400
##$SIOLD= 16384
##$SREGLST= <1H.CDCl3>
##$SSB= 0
##$STSI= 0
##$STSR= 0
##$SW_p= 3205.1282051282
##$SYMM= 0
##$S_DEV= 0
##$TDeff= 0
##$TDoff= 0
##$TI= <>
##$TILT= no
##$TM1= 0
##$TM2= 0
##$TOPLEV= 0
##$USERP1= <user>
##$USERP2= <user>
##$USERP3= <user>
##$USERP4= <user>
##$USERP5= <user>
##$WDW= 1
##$XDIM= 8192
##$YMAX_p= 0
##$YMIN_p= 0
$$ End of Bruker specific parameters
$$ ---------------------------------
##NTUPLES= NMR FID
##VAR_NAME=  TIME,          FID/REAL,        FID/IMAG
##SYMBOL=    X,             R,               I
##VAR_TYPE=  INDEPENDENT,   DEPENDENT,       DEPENDENT
##VAR_FORM=  AFFN,          ASDF,            ASDF
##VAR_DIM=   8192,          8192,            8192
##UNITS=     SECONDS,       ARBITRARY UNITS, ARBITRARY UNITS
##FACTOR=    0.0002768,     1,               1
##FIRST=     0,             0,               0
##LAST=      2.2672688,     0,               0
##MIN=       0,             -149915,         0
##MAX=       2.2672688,     239135,          0
$$ Real data points
##PAGE= N=1
##DATA TABLE= (X++(R..R)), XYDATA
0@%%%%%%%%%mRj1J6k2K5l2M1m9O1p4Q9j07J27j50J77k07K42k82L23l71M28m89
32b60N55o31P15q05R04j016J139j272J418j576J750j941K147k372K620k890L185
49A670l511L868m258M691n173N708o309O988p761Q653r693J0924j2408J4239j6565
64h937J9630k3877L0206m0790O2988j86994J30948J15280q3977J75230l10617
75a20910O8244N9011l4364N7299m5770L2628j551J1551j4630q6688J04232m7594
87a8542J9793K6295n4332N8609j9465j5497k2942l993O1592n3684M7174j6055
99H953k9799R0229q9164n3392O1486j0554Q5134M4508j47630k8807M3119j8806
111d4723J17839k1971r4274O6562m8912J2801L2995n5818M8752k514Q523j6820
$$ y = [0, 0, 0, 0, 0, 0, 0, 0, 0, 0, -4, 5, -6, 10, -12, 13, -19, 22, -27, 34, -40, 49, -58, 69, -81, 96, -111, 131, -151, 172, -199, 229, -260, 295, -336, 379, -426, 478, -538, 601, -671, 747, -829, 921, -1020, 1127, -1245, 1375, -1515, 1670, -1841, 2027, -2231, 2460, -2713, 2995, -3314, 3674, -4087, 4566, -5127, 5797, -6611, 7628, -8937, 10693, -13184, 17022, -23768, 39220, -147774, -16826, 98454, 14477, 189707, -120910, -52666, 6345, -28019, 29280, -16490, 16138, 14587, 26138, 11508, -75180, 29052, -18542, 1251, 27546, -26786, 31823, 12358, -3139, -26081, -30074, 31518, -22166, 25008, 8953, -20846, 69383, -19781, -73173, -11687, -22241, 62893, 107401, -40229, -69036, -25917, -44723, 73116, 51145, -43129, 23433, -25479, -12678, 20317, -35501, 13251, 10737, 19260, 2440]
123B440k6220L8262l8138L4334q701k5619N9188l6356M624j1081q333K5975k7374
136a6999L3809l8102L3668M4203r2014L7026m1689k007J19639o1115p865j2978
148d424n6252O6396J3231j3055K239p931k549R42L116k0420J7753J4771j2749
161A068N457r784R41J517J83n972j435K3117j1284m294K997r399P388M57j1035
176a0078n578L9445m293k0505O733n6248M1622M4842l6529L2191m6397j8127M7722
189A4800k4207J8185l751q942J3688j3541O060j6695J3520J0894j6702J7646j5126
202d171L571P108j4955O308l860J4732n720p001J2807j6303J3062l522k5878K4117
216B95J4406m779N934k7227k3520L9632N797k904J4349m1525J0639J6425j8844
$$ y = [2440, -23780, 14482, -23656, 10678, 1977, -23642, 35546, -810, 3814, -7267, -15600, 10375, -16999, 16810, -21292, 12376, 56579, -35435, 1591, -40098, -42105, 77534, 16419, 8554, -4424, -60676, 5720, 18951, 5896, 8135, 204, -2345, -1403, 1713, -18707, -954, 13817, 1068, 6525, -3259, -2318, -801, -618, -6590, -8025, 15092, 3808, -486, 2511, -6888, 500, 957, -10078, -15656, 23789, 19496, -1009, 5724, -50524, -8902, 35940, -589, 31602, -14795, -32922, 14800, -9407, 8778, 5027, -3915, 9773, -3768, 2292, -14403, -883, 10011, -6691, 10955, -4171, -600, 6508, -8447, -2139, -5999, 8733, 3013, -3988, 8819, -7484, 5578, 2056, -23822, 295, 14701, 9922, 15856, -11371, -34891, 4741, 10538, 7634, 21983, -19542, -8903, 7522, -11322]
229a1322J9681j0448L787O783j1892M724j3365J6147j015q808J5489j5500J0681
242D942k237j1100Q615m859J3133j1877K246J0207j5780J7494j9676j1756L1746
255A1098m574N695k879l0774O718K1993l158N965l379k0797J5987p58q412J1860
269D585o873P857k258n595J295o306J3842r487R72Q610j0418J0087r426j185M510
284B10j662P344j4000J3699R54j0963J1962k5365R581K4206j2041N807j3522j5265
298a9055J8117Q824n428L015n897o710J1258o703j996P844k578M379o477K61m88
313a634j363Q072j0570P335K970o843N011q166N512q53O87J413q328J9058j0442
328A859q298P062j7229K3579R650j8401K845j1112Q70J6658j464o992K720k487
$$ y = [-11322, 8359, -2089, 1698, 8481, -3411, 1313, -12052, 4095, 3080, -5728, 9761, -5739, 4942, 2705, -8395, 220, -4639, 8494, -3383, -1137, 9070, -6710, 10784, -8892, -20648, 11098, 6524, 12219, 9340, -21434, -14716, 7277, 4119, 10084, 6705, -14092, 1895, 1137, -7275, 4585, -2288, 5569, 3311, -2284, -989, -7295, 6547, -2940, -1968, 6642, -3776, 6311, -3115, -4300, 210, -1452, 5892, -8108, 5591, 6545, -4418, 7544, -17821, -8240, 15966, 3925, 9732, -3790, -19055, -938, 7886, 2458, 5473, -424, -7134, 4124, -2579, -4575, 3269, 691, 5070, -1407, -1146, -1634, -2997, 5075, -5495, 1840, 4810, -2033, 2978, -5188, 324, -529, 158, 1571, -6757, 12301, 1859, -6439, 623, -16606, 6973, 16623, -1778, 1067, -10045, -9175, 7483, 6019, -973, 1747, -740]
342g40k824N584n922K740N692k872l90m915M637k407j59M412o861Q976k733n235
358c017K990k704N843o816M474P70k333J3431k1616p12J1975o729K0138r549j8110
373a1965R091j175N674N758o671l867M972k141l830M783j401L382K16l743k93
388a210j057M885n460K066M470m987M692n586l1K885r87J375o588J2195k611o915
404b864N487j7610J5404J2970j3780N608j2567k837J5627k263j940J50j943j500
418b058K585k277r58O576k042j399j857O02Q50j838L764l962M003J652p073L362
434g0j246K508k325k72M307l909R467j2681p545J6243o322J1256j659k0480J0312
449b416J650J297N992o583k141K359L08l887L012K437j207J509l670o2M95J620
$$ y = [-740, -3564, 2020, -3902, -1162, 4530, 1658, 1268, -3647, 990, -1417, -1576, 2836, -4025, 4951, 2218, -3017, -27, -2731, 3112, -3704, 770, 1540, -793, 12638, -8978, -9690, 2285, -4444, 15694, 6145, -11965, -2874, -4049, 1625, 7383, 712, -3155, 1817, -324, -4154, 629, -772, 2610, 2826, -917, -1210, -2267, 2618, -2842, -776, 3694, -1293, 3399, -2187, -2218, 667, -320, 1055, -5533, 6662, 4051, -2864, 2623, -14987, 417, 13387, -393, 5215, -7352, -10189, 5438, 3175, 1235, 1385, -558, -2058, 527, -1750, -2708, 3868, 1826, 427, -1430, -828, 22, -1816, 1948, -2014, 1989, 3641, -3432, -70, -1316, 1192, -1133, -1405, 2902, -1007, 8460, -4221, -11766, 4477, -1845, 9411, 7752, -12728, -2416, -766, 531, 6523, -60, -2201, 158, 466, -3421, -409, 2028, 821, 2330, -1340, -1402, -907, 713]
465G13q86j939O056l792p04O20k916M310j941Q73k243M469M195j3723N347k437
481c998J125J8235j5943m842M174o467J3044L10p392J706l29o94o90K262q98K337
497A940P88m833Q49O89J296j722J073K086k965K734l756n64M114j845K26j993
513a883N803k006m793L139r297J2408P501j4031M717p971o4J4637o489j520L78
528E29k839J604M38J36n94L694j559l508J488k32J252o89J053l48l39J855m917
545b976J980K340j531M77j141L573k770J26j948n781J4467j726o409L676j2056
560i699P911R146p693K519l232k042L570m94l39L48K856k724j852J337p02J796
576G06k87O9o08P19L24l880L037Q20r86P71j228J977j746P50l493j189J1481n357
$$ y = [713, -173, -2112, 3944, 152, -552, 68, -2848, 1462, -479, 394, -1849, 2620, 6815, -6908, -1561, -3998, -2873, 15362, -581, -5423, -1249, -7716, 5328, 5638, -1754, -48, -377, -1071, -1761, 501, -397, 1940, 2728, -2105, -1256, -567, 729, -993, 80, 2166, -799, 1935, -1821, -2385, 1729, -116, 110, -1883, 3920, 1914, -2879, 260, -9037, 3371, 10872, -3159, 1558, -6413, -6477, 8160, 1671, 151, 529, -2310, -706, -268, -132, -726, 2968, 1409, -2099, -611, -843, 409, -280, 773, 425, 86, 1941, -2976, -996, 1344, -187, 290, -851, 2722, -48, 78, -1870, -7651, 6816, 5090, -1319, 2357, -9699, -1788, 7358, -335, 2184, -1048, -3090, 480, -14, -353, -5, 2851, 127, -1725, -388, -1090, 706, 419, 488, -120, 599, 923, -2957, 80, 900, -86, 685, -543, 1434, -312, 438, -3055, -4244, 7237, 1880]
594A880k147N82r865J1722L908p002L262n194K13M147j555MO20J505k862p23J230
611b75n84K091o37n38k25O31m01k560L354J2r30Q11j416J419j112J57k545J477
629a271Q172p024j172r5n869J2557k28p258L384m902K259L946k703N05L60L70
645A031k481N6J729n24J707j199q08L32K04l60j368L200n58j463R80j323J220
662C75q33j71n79K150M683q300m67K473k660J0489m102q104N269k867K926L105
678C387m181Q60J89l79j505R57K163j278P35j277o38J002j83L7n09K428j262j992
696a446J750q99Q00n12M3R35N48J339p331J798O165l185N036n605o669R120j277
713F10K15J938m865J610O30p59k3J120J607k617P0Pl31J377n43K49k40Q71j226
$$ y = [1880, -267, 315, -9550, 2172, 6080, -922, 2340, -2854, -2641, 1506, -49, -45, 575, 2080, -782, -1505, -275, -859, 1232, 595, 57, -168, 463, 62, -2498, 856, 868, -62, 749, -667, 752, -360, -203, -2748, -1271, 6901, -123, -1295, -1390, -7259, 5298, 5070, -2188, 1196, -3706, -1447, 2499, -204, 301, 661, 1031, -1450, -1394, 335, -189, 1518, 319, -489, -157, 47, -313, -1681, 1519, 961, -502, 478, -845, 375, -458, -629, -1208, 942, 5625, -2675, -3142, -669, -3329, 7160, 3058, -5046, 223, -2644, 282, 3387, -794, 66, 255, -124, -1629, -672, 1491, 213, 948, -329, -967, 35, -148, -111, -620, 1808, 546, -1446, 304, -595, 205, -307, -264, 671, 1219, 2558, -4773, -2975, 3190, 5, 5041, -564, -7233, 1887, 610, 825, 2763, -2102, -492, 138, -621, -644, 476, 2083, -534, -464, -457, -788, 589, 46, 295, 55, 926, -300]
732c00j651K801o03m02L06J30Q48j707J65k905L349O244p326P5o62l220R916k322
750B736m843K968k971J627J450j231Q25L7K32k477O11J954r73O54m93K9k72l01
768d38K17p47K444p63j773J461p7l12j973J812J362n9K286p902L71P588l498L240
786C239k334o468O451M9j323J844j629L83q09L5j8N84J949k275l15Q03m25m9k11
805e19J466p02l8k8j575J914k38j052L46J953Q60m926J103L38M92P191p151l959
823d525N308k951M315R88n556K508r6q27M77N83J312j688J55o92l71J975q37j12
841c4K59N07r80j312K191m45k15M43o38R63p67n39k040K731N088o034n27J00k890
860d139Q972j817n945L608k505J178K425k166R25j12l13j423K45K539j344M8P5
$$ y = [-300, -1951, 850, 247, -155, 151, 281, 1129, -578, -413, -3318, 31, 6275, -1051, -976, -1638, -4858, 5058, 2736, -2107, 861, -2110, -483, 967, -264, 561, 598, 830, -1647, -1036, 918, -55, 599, 106, 135, -137, -438, -221, -968, 1476, 713, -1060, 401, 324, 12, -1961, -149, 1213, 1154, 3440, -4462, -4091, 3497, -1, 3239, 905, -5563, 888, 937, -386, 1458, -171, 212, -597, -562, -580, 4, 1953, -322, -637, 166, -259, -308, -519, 947, 245, 207, 179, -1396, 518, 280, -772, -426, 1527, 2387, -2539, -1436, -1098, -606, 6585, -566, -4525, 783, -2168, 2147, 3135, -2421, 87, -9, -836, -359, 224, 1536, -152, 3, -689, -1060, 915, 78, -34, 225, 732, -248, -1560, 631, 186, -29, 414, -224, 739, -28, -567, -2607, 124, 5212, -822, -1349, -1249, -4139, 4833, 3016, -2929, 679, -1826, -648, 1777, -389, 536, 424, 111, -1312, -1067, 1472, 128, 176, 251]
877B51o55L70n53O42k36J108j09k259J658K70j020o51J434K274k546K32k985q66
895c641R209l564l888K510m880M754L329n227J777j74j073M49j60J590o38K83
911F56q72j343K069l11m28L88N71k87j822J426P0l08Q08r92R28Q4o14k527N32
930a972O564l340k329Q45n015P321K912p236K599j247r87L600j810K63N52n05
946B15q77j023K661k65r09P05q07K21m49L85K37J86Q99k149M42J393j252p23O52
965d58L088j848j928K15l036P059J963q278K770r19n51O021m046j387K251j694
981g78K45l7J520Q3j446O04j291Q67R80r93M45J85J17j559K38J943j323N9M09
1000B68K53j41j508K37m88M269P40p702K577J557q84N708n257l247M923j978O41
$$ y = [251, -404, -34, -587, 55, -181, 927, 818, -1441, 217, 487, -533, -1184, 250, 2524, -22, 210, -2775, -3641, 5568, 2004, -1884, 626, -4254, 500, 3829, -1398, 379, 205, -868, -419, -579, 1011, 373, 656, -216, -1559, 510, 199, -229, 159, 730, 443, -1379, 47, 117, -191, 617, -375, 553, 637, 23, -2504, -1972, 4592, 1252, -1077, -232, -5247, 2074, 4986, -2250, 349, -898, -1885, 1715, -95, 168, 720, 215, -662, -1685, 976, 711, -198, 507, -300, -79, -528, -143, 94, 280, 1179, -970, -528, 865, -387, -1110, -458, 2630, 782, -1146, -931, -3967, 3092, 5055, -3223, -453, -1372, -1923, 4098, 52, -1335, 916, -778, -533, -570, 950, 1033, -413, 191, -1100, -233, 747, -246, 199, 384, 501, -1058, -820, 1123, -200, -141, 268, 521, 380, -1128, -891, -1379, 2890, 3630, -4072, -1495, 62, -822, 4886, -371, -3618, 1305, -673, -32]
1017c2J169j181N76j205K01j24P64J418k092J06P14o38j12J68J351r43n17N56
1035A79q26R54m39m64R74J164l45m771K175L853k191K423l859l746P365j079j938
1052e71K141l016Q44J018r90R90J14K98j645l43J916q23J14L12k04j40p07P05
1070A3j75N01L59j449R27M16j054j026J369K977k770j092J26j957N961j36n855
1087b865K871o68l00L163k442j47R49j123M3L8J580n14j271Q60n34J74L06q3M01
1106D38m10P4p47K88J229j234J8R80L02j533j421K558J65O00J74n275K726L832
1124B764l172J433j078k139L095o72o17J081m10l17j045R91P72q36N56m74k03
1141b71K52k79L89nN16o53p73J334l95p66L74J243K21k321L27PQ29L436m102k178
$$ y = [-32, 1137, -44, 532, -673, -472, -596, 168, 1586, -506, -400, 314, -324, -436, -268, 1083, 140, -377, 179, -647, 307, -132, -596, 378, 1542, 1197, -3574, -1399, 2454, 263, 2686, -1173, -4919, 2446, 1367, -571, 1570, -1446, -602, 416, -574, 416, 530, 828, -817, -1160, 756, -67, 47, 359, 155, 15, -692, 13, -162, 339, 698, -751, 176, 592, -462, -1488, -119, 2858, 88, -1004, -878, -2835, 3126, 2990, -2865, 6, -662, -962, 2201, -241, -388, 561, -562, -519, -481, 1099, 585, -686, 174, -360, -186, 120, 37, 438, 28, 102, -645, -357, 872, -362, -344, 636, 938, -595, -2016, 542, 707, 1307, 1481, -3794, -1068, 2764, -408, 1025, -53, -2192, 903, 231, -386, 695, 285, -32, -1077, -86, 686, -150, 406, -68, -271, -19, -298, 91, 86, 602, -51, -824, 510, 115, -651, -277, 966, 1187, -1134, -807, -800, 29, 3465, -637, -2815]
1161b815L693j379J211R66l191J346N08j006Q31K08L68j133l62J042n00M34P2
1178B93l87K36m29J27q7N64L03j233O30M94q15n51O56J819j266q73k01j295M078
1197B063K78m406J892j46m89K648j907n56J120j008J89K46P83k17j235P62j08
1214i1j29M99k31K30l68j04l2pR08p80k74R72l11r68n55K126N66j750L09j936
1234a926J180L944l409j031J732j747J716N47j586R66m37m17J42M25Q62j232j02
1251c73O06n59K85R3K79j41n18L42l66M85J86p51P59K94p41j352R77K635j833
1270C07q06R0j736L745N73l912J746Jq74J765q13m5K24p70K71o7Q94p4j148P39
1290A10o0l78K45L16L21r21J48M29m84L72j91K57M59n62r15o94L002O82l613R70
$$ y = [-2815, 878, -501, 710, 1676, -1515, -169, 339, -667, 164, 372, 740, -393, -755, 287, -213, 221, 293, -94, 142, -287, -160, -247, 317, 620, -613, 17, 511, -304, -855, -199, 1620, 354, -519, -720, -2015, 2063, 2341, -2065, -173, -319, -808, 1840, -67, -623, 497, -511, -322, -76, 707, 490, -745, 17, -91, -220, 279, 48, 278, -90, -194, -226, -233, 675, -105, -379, 593, 282, -686, -1241, 885, 1451, -299, 10, -1926, -746, 3198, -211, -1242, 490, -1257, 459, 1006, -580, 386, -51, -468, -326, 99, 961, -271, -373, 233, -326, -41, 52, 331, 190, -328, 14, -352, 133, 319, -432, 327, 621, -120, -1472, -495, 2140, 307, -499, -409, -2145, 1600, 2173, -1739, 7, 8, -866, 899, 86, 41, 265, -505, -234, -301, 593, 519, -629, 110, 50, -328, -83, 233, 554, -367, -219, 210, -274, 98, -93, 164, 623, 61, -854, -1548, 1454, 2136, -1477, -507]
1310e07l9k51L400k584j781K555j173N4R73n26K02q33J28N08j80P11p51k98O18
1329B26m65O0K40M83m09q91J048n6p61L74O16M19j283m14J67N33K778k611k915
1348b861L501l54k70J645k912M47J708j498P18M31l44m62o21J278q6n09N73n29
1366a45j0mK1M62k61J84n06j06Q66q25k04J059O41j386j894K299J010r07Q27l032
1386a911J04M338k328r64J574j802P60O87o04P25n90k73j02J04J109q52k94O63
1404C44n27j45J63P00k12r22P79J0n30J09J96Q06l75o90r76K86L598j628l243
1423b257K370m52K35K192k978j29J899j481M77O96k54l17q59R54K55n15N39m33
1441e8j11J06j76M51r1R5l23l35Q70n33n31R23P98q04k141J432J784j146O78j782
$$ y = [-507, -546, -797, 2603, 19, -1762, 793, -380, -326, 647, 121, 323, -510, -382, 126, -54, 657, -94, -392, 226, -239, -179, 61, 544, 135, -756, 292, 236, -525, -151, 465, 884, -399, -813, -646, -113, 2665, 54, -2861, 640, 286, 16, 1661, -1251, -804, 904, -594, 124, 555, 211, -251, -872, 406, 320, -189, 384, -145, -155, -159, -138, 324, 63, 247, -259, -365, 501, -324, -528, 531, 1172, -214, -2108, 191, 1201, 294, 1121, -1911, -1807, 2531, 203, -761, 813, -989, -229, 458, -146, 579, -11, -284, -386, -282, 827, -25, -319, 344, -183, -328, -165, 535, 323, -599, 180, 190, -340, -231, -35, 771, 396, -294, -1270, -984, 2614, 986, -2257, 113, -339, -104, 2088, -890, -1019, 880, -601, -124, 572, 318, 1, -858, 96, 351, -164, 375, -58, -169, -63, -239, 212, 121, 216, -107, -442, 428, -105, -636, 287, 1085, 281, -1860, -428, 1356, 210, 888, -894]
1461h94j333M068q19k192J844j043l06J194n67M44k89n12K52j47Q19k17p42O65
1479B25k49k98K50L81J17r32L83N91p85n7M83O48m76j032K42OJ813K60l668J203
1499h95K150j663J116l24j724J692j26o32R38l43l11l79L33Q35p89OM04n03K5
1518a90J00L89o9n32L71r7p5J07k18N76J46n88r59L38K504j110k134J467m01L91
1538A6J620k356j89J668j135K37O83m51j55m90N70L68n22L38k04k69K98j26K47
1557A48jj53k2k43M66j29m66O78L39o72j108Q64J782j309o75L11r19K004N05k669
1577a269J045P22j117R09P3m04K5m42N27J27j61K43n83J56K77k87K81O1j34k61
1597b12n6O52m19l46P58J14p52p46J100J052j133j36n21l56K586p87k228J651
$$ y = [-894, -2227, 1841, 1022, -1170, 674, -369, -675, 519, -48, 396, 107, -405, -153, -300, 519, 302, -440, 225, -24, -322, -72, 309, 426, -506, -123, 468, -317, -374, 109, 757, 281, -751, -509, -503, 1310, 1570, -2098, -895, 1255, -408, 708, 384, -1340, 352, 226, -406, 532, 189, -122, -501, -168, 667, -122, -116, 288, -215, -190, -90, 299, 230, -302, 69, -28, -103, 4, -214, 362, 508, -80, -1039, -701, 1803, 693, -1441, 26, -375, 16, 1636, -720, -909, 759, -376, -139, 544, 93, -62, -552, 18, 386, -136, 202, -2, -271, 27, -99, 148, 147, -6, -28, -271, 195, 66, -400, 278, 617, -55, -1163, -299, 1483, 174, -501, -190, -1109, 895, 1400, -1269, -224, 498, -619, 290, 363, -41, -16, -458, 69, 196, 35, 278, -305, -149, 128, -159, 122, 183, 49, -212, -268, 384, -35, -381, 377, 491, -261, -1007, 93, 1145, 12, -124, -645, -1001, 1585, 798, -1430, 221]
1615B21q1o80J189n22k58J28m19N32O6Ll2o15M75J68l76L74J2k18k77J85N62n94
1637a57j00P25k42p13k27J185M56j123q2n99N42K302k012j489K105o07k47J085
1655H02j008k3K52l69O02o0j00j45m38O80Km09M35j37k59r1L36L54o94J25O10
1676D65n50m73L02J068k35j261K69j6Q49J250k625m54K495j074k12R19j230K20
1694b93M46l09N64l16k57L4j76O83k01m16M41k75j65K04K64M3o38L26M33p50l4
1715c92P15M46r02r60J135M02MK21k110O46K484j786m80J154j157L69O71m73K75
1734B62m74j19M44j57L71k65m02M83k38k7L43r2j26l37L89K42o92M03N90m74q99
1755g75J33J691l67j338M98n11P83J522k341l44J890j087K7Q87q00p1l3J66N22
$$ y = [221, 140, -540, 649, 127, -131, -3, -422, 110, 176, 179, 147, -468, 7, 175, -201, 173, 185, -33, -310, -125, 437, -157, -257, 468, 226, -487, -714, 471, 927, -196, -278, -877, -335, 1967, -45, -1534, 571, -36, -283, 802, -206, -229, 23, -346, 256, 196, 96, -49, -487, 193, 195, -214, 221, 84, -175, -266, 70, 424, -270, -145, 465, -85, -558, -256, 812, 577, -684, -415, -431, 418, 1668, -957, -1411, 1084, 10, -202, 717, -513, -293, 153, -156, 408, 92, -165, -131, -307, 376, 175, -241, 200, -75, -240, -36, 228, 271, -367, -41, 392, -358, -392, 323, 769, -133, -1093, 42, 444, 448, 669, -1441, -795, 1689, -97, -577, 577, -580, -211, 460, -13, 262, -212, -331, 113, -44, 327, 62, -340, 143, -95, -122, 221, 129, 3, -334, 55, 297, -395, 8, 598, 124, -775, -642, 1049, 682, -656, -158, -669, 114, 1636, -705, -1049, 841, -246, -219, 668, -132, -203, -236, -70, 452]
1774D52n30M8P3l62M32j4p3J38l36Q5L8R2J51l92L34J01p30Q7Q38N94j386j110
1796a470J987K84j015O58j185j1J998j227o27J148q22r7O57m6ro01J51N60m93
1815a60J91K31l83pj3L03K3l92L09k8k42N3J5M90l9o38l34K80J550n68k172J419
1837a12Q66j148R22m23r95J258j97m20O65m74k31J82J37L92n41j25M80m15M8L44
1857B13o9j95k47M31Q2n94M30M25m22o34J93J087k45p43P2m94J099R36k162R8
1877g39J543j120K06P31r03Q1J54QM06m24n4J51k73L79J9k15J34k24N9J67p4J15
1899A27j99J04Q9n08K74O44o8r72n02J668L31j633M58J99m98J293n16j121J117
1918B87j85m85P45j65l23r3P4N15l50k24M26l06j24L00Q0q0l33K29K67n17J09
$$ y = [452, -78, -30, 43, -319, 113, 99, 26, 164, -172, -87, -49, 43, 194, -198, 136, 237, -493, -406, 432, 1026, -360, -1470, 517, 801, -214, 444, -741, -752, 1246, 19, -608, 540, -282, -379, 278, 232, 223, -378, -227, 333, -160, 31, 262, -121, -128, -141, 162, 185, -207, 102, 74, -168, -115, -100, 390, 351, -287, -621, -341, 1209, 641, -1531, -112, 754, -394, 528, 105, -890, 368, 171, -249, 416, -58, -289, -107, 30, 422, -119, -244, 236, -179, -131, 213, 144, -51, -298, 133, 215, -379, 51, 476, 54, -580, -387, 700, 455, -288, -216, -710, 389, 1325, -837, -739, 804, -316, -110, 621, -282, -201, -47, -39, 367, -57, -111, 40, -233, 146, 165, -50, 84, -140, -81, 86, 12, 127, -72, 32, 121, -387, -113, 531, 463, -509, -1011, 657, 988, -645, -187, 12, -486, 807, 291, -830, 287, 102, -383, 362, 197, -126, -219, -145, 370, 20, -204, 222, -84, -208, 92, 172, 92, -241, -12, 255, -262, -153]
1939a53M94n1n27l53P51L73m10j36p84N73J563j481p89J454n91k86R22n81k38
1958b50K16j09M04j67k39K06k46J62K34k54R9r7r7K20r4P5l2o7J56l56k6O34J26
1981D98o40q32R71J248j452n27J047n78L52O25j225K18O80o33L14K79m92j4qL46
2001A77Q9n22K89Q7l76K74J68j09k20k6M08k71k98O23J16o76m21P81Q36j006n30
2022f07N70j78P40J60j711P18J122j153K66N53q08O7L31J62pn45K43K84m05K89
2042I1J43l30l3L8K71r0l22M06J1m58J3L97L93n17n81L73L01N87l48j627J128
2063a54J372j592M5Q31r78L08O33m46jk24K7M63l03O0Q0l76K47J24r1R0k42P9
2085d8J34k00J46N8L0j01m51L10N73K3o75q93J257J218j873k89J325p80J47P55
$$ y = [-153, 341, 290, -237, -590, 161, 534, 124, -12, -796, -223, 1340, -141, -930, 524, -67, -353, 569, -12, -250, -34, -143, 261, 94, -145, 61, -185, -23, 211, -43, 56, -41, -138, 82, -12, 63, 31, -36, 120, -236, -262, 372, 498, -142, -974, -3, 1245, -207, -734, 313, -265, 87, 712, -513, -295, 385, -248, 66, 345, -147, -161, -169, 177, 266, -256, 33, 120, -256, 18, 186, 77, -143, -169, 239, -32, -330, 293, 409, -267, -688, 93, 929, -77, -607, -37, -215, 525, 685, -1026, -308, 814, -339, -73, 480, -328, -261, 70, 232, 225, -320, -77, 207, -198, 91, 234, -96, -129, -91, 180, 90, -232, 174, 185, -273, -260, 137, 530, 13, -568, -195, 106, 693, 345, -1282, -154, 1218, -374, -329, 502, -476, -168, 465, 19, 18, -206, -179, 284, -19, 41, 121, -255, -8, 116, 25, 115, -127, -48, 86, -114, 32, 90, 120, 19, -432, -122, 451, 474, -201, -1094, 163, 1381, -492, -781, 544, -236, -89, 666]
2105F66r93K7M67l02L72j04l60K25j36K38J57m27J47L9j62K83o7q7J1q3J56j84
2127a17N8M95l54o14J10R59M26j707k81J883n23p61Q10p47q4J095o30k38M10m78
2147b88K18L19k08K5l13J11M02l39P2J43l30J11J37J8l5j74K61j28m03N47M22
2168E68m94q48L00J552n73j580J042M36p14Q20m11q46J000l8m21M98l74k01L59
2187G5m9K01k54k67M27j32r4L09k37j13R3M3J14k10J59J66n73NO97K66p73r19
2209a066J224J019j585j34R23p17M17N56j096K12N15m66L73K6m61J95nJ59J36
2228B25m30J43J34k15K58nj92P5o3J05l6l2L40l72m32M59N76n8j202p5J736m19
2250E20j320R48k6n92R53k46o89N13j02K4L16m27J9J28j61L32q5k62J71j02R7
$$ y = [666, -327, -300, 167, -135, 237, 133, -227, -2, -138, 100, 257, -170, -23, 16, -146, 137, 70, -17, -6, -89, 67, -117, -59, 436, 82, -532, -422, 537, 963, -744, -1025, 858, 335, -426, 384, -363, -447, 648, 18, -220, 190, -288, -70, 249, 41, 66, -247, -136, 266, -73, -1, 142, -188, -77, 60, 78, 43, -131, 130, 2, -401, 146, 568, 74, -774, -474, 1078, 505, -1075, -33, 403, -311, 509, 98, -748, 252, 214, -207, 291, -83, -284, 75, 26, 227, -27, -294, 133, 1, -93, 216, -21, -134, -41, 2, 116, -94, 65, 231, -342, -337, 360, 626, -147, -1066, 158, 1177, -408, -542, 381, -336, 81, 637, -459, -247, 268, -198, 175, 201, -260, -65, -70, 89, 225, -205, -62, 72, -143, 115, 110, -82, -7, -70, 35, -1, -33, 307, -65, -497, -38, 538, 480, -722, -797, 939, 520, -800, 148, 122, -470, 483, 237, -452, 61, -41, -17, 299, -128, -109, 19, -142, 190, 105, -157, 14, -88, 9]
2271IJ19k20J20K0j96R1R7K14j72n25K47M89J86m57r75R30J156j458k92J151p34
2292b00p3Q45o34k51L23m2K68j96k81L60j89o0L83k22j72P5O4J59k29k0L23l26
2314i5k19L81K94k09o45K12P18k44j65k63l56J109J53j438O16O78r14L86M62p15
2334b54K7K66P9O5l93J11K93l60J55K65l52n1J48R4m0k20K90L8n41K19O08j51
2356B96p45j13J076O6j094L29L62m28O13j01r08P12K83o03M03mm58L21J05m7K
2377F7k87J97J79k42J60j6k03J64Jm1R4o3nj79M3M63j15m96j29M74O72p72q79
2400i13J178L29j039M91K54p59M59L75m49ok3O8K53k89J3K00l23J16K59j85r2
2421h3mJ31N2k62J99K58m59j83M59L64m28o46N35N58n19j3k3l50P69R4r98M59
$$ y = [9, 128, -92, 28, 48, -148, -57, 40, 254, 82, -443, -196, 293, 479, 22, -953, -23, 1133, -325, -617, 534, -200, -273, 572, -62, -313, 10, -32, 236, 40, -241, 119, -70, -130, 253, 31, -141, -66, -2, 157, -72, -92, 231, -95, -314, 67, 361, 152, -493, -281, 437, 193, 28, -235, -591, 518, 671, -767, -151, 527, -387, -1, 461, -254, -227, 39, 118, 183, -210, -99, 194, -166, -11, 254, -98, -149, -1, 93, 53, -167, 123, 161, -380, -161, 447, 296, -449, -562, 514, 580, -514, -185, 177, -251, 362, 261, -647, 65, 348, -255, 148, 144, -314, 7, 112, 65, 67, -220, -23, 156, -86, 74, 58, -145, 19, 20, -21, 73, 10, 5, -174, -131, 332, 217, -279, -408, 66, 738, -34, -913, 265, 594, -445, 46, 300, -459, 0, 375, -74, -80, -103, -35, 218, -71, -58, 142, -181, -65, 194, 9, -83, -87, 44, 96, -166, 33, 291, -168, -351, 108, 472, 44, -602, -67, 491, -28, -41, -64, -414, 355, 449, -549, -90]
2443i0M24o07L23K39n12Q9J93L2K5k80R4K01k30J20J19k55O9Q5n4N4qL5j56j75
2467b65M37J96m48l45K27P81j97j158N57R23q89q6O71o43o1O70k73k36N5oK72
2488A82j50j93K94j79j43L51o1k12L0J06Q9k12J9L59k92l94M27M47l24p21L09
2509b68R12n23n72N58j40j06O08n38m17P24j14k67L26k72q6K97j07K3j8k07K15
2530B8O9j26N3q8K4J26j92R6K04k36k08J78L76q0n83J19M67m9l2l87k41R58m0
2553D36j007N23M10o74L44L05n46K3K59K5J0k68P5K50k50O2J81k67J6J59n9J2
2575A9j3K8r9j21L49J50n01j92L72M82k19r51M23J060q13n06Q74l13m04P01j31
2596A95m90K07J53Q6j22k49K85M2k76K71L5l23J28J51l1r7k0J72j64k04M31J48
$$ y = [-90, 334, -273, 50, 289, -223, -134, 59, 91, 116, -164, -70, 131, -99, 21, 140, -115, -46, 39, -15, 39, 31, 66, -90, -265, 172, 368, -80, -425, -198, 583, 386, -772, -215, 708, -181, -267, 404, -239, -300, 370, 97, -139, -84, -90, 182, 32, -161, 133, -46, -189, 162, 101, -111, -81, 25, 114, -98, -79, 280, -12, -406, 21, 468, 144, -577, -268, 644, 121, -451, 107, -33, -139, 469, -69, -486, 238, 124, -143, 183, -89, -175, 122, 15, 38, 20, -187, 28, 97, -29, 24, -64, -40, 86, -106, -10, 194, -42, -250, -72, 304, 224, -359, -240, 227, 178, 146, -241, -482, 476, 436, -571, -48, 362, -312, 32, 337, -209, -186, 73, 98, 108, -160, -85, 165, -85, -23, 158, -109, -93, 66, 7, 19, 6, 34, -65, -186, 163, 313, -188, -380, -8, 474, 255, -696, -273, 787, -26, -532, 342, 29, -375, 326, 195, -295, -88, 65, 151, 29, -220, 65, 107, -169, 102, 137, -186, -58, 93, 62, -35, -55, 117, -47, -251, 180, 328]
2618C28n71j79N39N07o59p51R48M96j017J58N59o49J69N69n53j51L03J8Q2j96
2638e0j30L14j46j08L09j73k18K25R5q8j22M9J95k76o1M81j09n44P9O18J26q39
2660c73j90J046j33q16N15J23n11N18J30o14K01K35j04O8k09OK70k11mK32k70
2681i1o1K69l7j12n6J14Q5k50Q8L46l25l32L62M30l10o54L61P80n87m95O73j27
2703G1l38N58j88m94M56J09k05M6j50J03K07k51L9J57k70R2K25j51j00M9Q7rj49
2726a06J52J47l87rM62Qm66j88N80L08p92j20P81l03l29N28k71l41N32Nl45J21
2748c3pO9J07k52R6J27k38J31J75k56k2J43Pl2o1R9mk29K05K52l21k49K43L85
2772C35j56o15K43O96n08l74O04j76l46N28o5m42K44J43q3%j31P5J40j83O1J28
$$ y = [328, -243, -422, 117, 624, -35, -786, 162, 658, -359, -201, 358, -291, -122, 447, -106, -257, 46, 64, 146, -50, -180, 134, -12, -120, 189, 16, -202, 23, 118, 30, -92, -43, 152, -124, -185, 296, 187, -357, -278, 340, 466, -373, -563, 483, 350, -466, 49, 172, -339, 179, 309, -305, -104, 131, 27, 95, -114, -108, 162, -49, -53, 179, -91, -152, 117, 80, -32, -88, 26, 111, -139, -51, 295, -30, -362, 0, 430, 120, -534, -173, 607, 20, -475, 198, 71, -267, 291, 103, -391, 65, 174, -31, 15, -135, -32, 175, -76, -37, 120, -150, -58, 167, 16, -84, -35, 52, 43, -106, 46, 193, -194, -203, 259, 267, -199, -387, 193, 501, -291, -411, 370, 67, -262, 266, -5, -346, 186, 191, -154, -33, -40, 29, 136, -116, -20, 107, -131, 0, 175, -81, -103, 40, 47, 15, -46, 53, 49, -180, 25, 277, -44, -293, -50, 335, 179, -436, -193, 503, -5, -379, 225, 49, -297, 231, 166, -276, -32, 111, 28, 28, -103, -28, 112, -71, -10, 118]
2794A18k17M1J69j07j6K0l5RJ2J04l5k85J31L33j28k54j00K96L55n18l37O75Q
2817B39n34L80P2m47K92K36l28JO6K1J00j24p6J57q4JR0j12K1N2j17J17J22j92
2841d7j36J62K57j34l88J86L31k11n4Nk00L80J64n93J09M24l21PK04k73M6K20
2863A38j72K6L9j76J76R8k08PP8J6j3r3J48M5l42J29M07k04m34J37N42m3p02J42
2887b59O94l88l62N24j88l33N58m5n15K48K16j28Jj23M7J79j96L7J72k35k8K62
2909A38j04r6P2k9pL3Q5m6k70J22L99j93l39O1K78K43l89m45O47K66p24J52M37
2932B91m62N5M18l61j28K72m7Pj6j70J54R1j42K2J0QK9j24R9J84l25j34M58J32
2956C21m91k39N32L54o38k77P03p9m64M44o4m81N09K20n80N7K95p6J6j22l3K09
$$ y = [118, -99, -58, 111, 4, -12, 8, -27, -18, -6, 98, 63, -222, -91, 242, 114, -140, -240, 56, 411, -107, -444, 231, 239, -295, 85, 157, -290, 2, 238, -90, -89, -23, -2, 98, -26, -102, 55, -29, -28, 62, -50, -29, 23, -94, 23, 145, -47, -183, -21, 236, 102, -286, -100, 231, 20, -34, -29, -229, 151, 315, -278, -169, 255, -66, -59, 145, -128, -82, 138, -34, -8, 31, -145, 31, 129, -79, -72, 6, 22, 9, -84, 64, 109, -233, -104, 303, 99, -335, -198, 344, 301, -401, -259, 435, 47, -315, 209, 21, -312, 246, 201, -314, -66, 150, 22, 23, -100, -53, 126, -70, -33, 139, -96, -124, 138, 34, -62, 10, -19, -26, 7, 92, 46, -224, -102, 297, 104, -235, -174, 104, 347, -42, -487, 160, 426, -298, -146, 291, -171, -116, 302, -59, -187, 85, 38, 45, 29, -141, 13, 104, -38, -16, -6, 2, 31, -93, 6, 190, -135, -269, 189, 321, -170, -409, 123, 477, -161, -438, 265, 186, -278, 166, 102, -379, 130, 350, -230, -173, 122, 46, 62, -60, -93, 116]
2978A16j30q1K40j54j80K80Rj74P8Qo1M3Q6J8k85rM58p2m11L7K25K24j38n45K59
3003a59O55n17l52N66j14k99L92q6l13K58M5r9J01j56n2K75r7j44O7P0Jr2JK48
3027A99k21l05M68K43n46k65N20L99n38n49P11M35q36j9O78m50k16O42k65m70
3047c85M44J79k73m3%J17R3k17M4J21j49P3O1j29Q7%j89K48J55l70j56L72K75
3070C58m24l75N47L18o26jM33l55L3M38m72k17N81l4l80J09O5M8M4k12J00J30
3092A08k30R8J91k75KK09j07k4R3j07m8J24J27j45k74K46L12l39j83K46oP6L5
3115A29m19J54N05l61k95L84k6j44J62j43k4J82j46mJ77k26k5K84j15j88J52L4
3137D7o5K4L3j4j70J00K90k14l04K68K12j25j89j20L15K62n28j42N61j15l28K76
$$ y = [116, -14, -95, 145, -9, -189, 91, 100, -74, 4, 12, -49, -6, 80, 98, -187, -196, 262, 190, -221, -184, 41, 265, 127, -418, -159, 496, -21, -373, 193, 79, -220, 172, 86, -227, 31, 76, -23, 78, -78, -130, 145, 48, -96, -29, 41, 42, -50, -49, 199, -22, -327, 141, 384, -162, -427, 93, 492, -46, -595, 116, 551, -285, -304, 374, -76, -292, 350, 85, -385, 59, 238, -35, -78, -78, 39, 132, -85, -41, 80, -69, 4, 65, -64, 23, 23, -166, 82, 237, -133, -289, 83, 358, -66, -441, 106, 424, -202, -203, 230, -125, -92, 346, -126, -343, 238, 204, -176, -67, -2, 46, 90, -122, -22, 108, -122, -24, 167, -108, -106, 103, -4, -28, 65, -42, -90, 34, 161, 16, -258, -12, 300, -39, -222, 24, 18, 94, 129, -290, -136, 369, 8, -287, 97, 71, -73, 89, -54, -78, 104, -42, -46, 131, -95, -120, 164, 49, -139, 13, 47, -18, 6, 39, 25, -145, -45, 245, 31, -273, -5, 207, 82, -107, -227, 88, 350, -178, -320, 241, 126, -202, 74]
3159G4l3j91K40k3j77J40m3o9K15j30j85K24O1j39qN7J8p2NJ66j24k49K90K11
3183B58l21j79K15K36m8m13J3N80k11m59L57J69l54J68J23k92J22J45j67O2K0
3204B4j56J83Q5k51K5J63n1o1K2M5l3r9J80R3l21n0M01k7k95o2J94K67k23m22
3228c69L80L26m66o1L70k07q2K67j83r5K02r4l4J32j81j9K59j12j67J36M3o0J0
3251eJ5mr8M8K27j82k67K82J87k05j29MJ82K00l58k06M87K5m15J66J65k11J18
3274B6N6j93J15O4j54J54nk32J69J52k16jJ02p0L9N5o5j10O3J96o0l13J57L06
3298B35k28j30J49j04J17J85l95p7M99j19l58K06J03r4N6p8j9J38q6o2J59j08
3320a1q4J75l8r2Q0p1l0K18r1k69J24K99p5l80N2M73j66m36L45K00m08J63K80
$$ y = [74, 41, -150, 90, 67, -110, 30, -13, -82, 133, 3, -182, 42, 103, -36, -44, 13, 31, -41, -36, 130, 6, -243, 47, 258, -63, -242, -27, 209, 161, -252, -239, 341, 130, -329, 28, 197, -157, 11, 134, -158, -36, 109, -58, 4, 24, -132, 51, 136, -115, -90, 73, 22, -39, -17, 28, -5, -104, 76, 169, -152, -202, 199, 172, -123, -185, 9, 276, 53, -369, 11, 337, -129, -190, 180, -27, -109, 158, -25, -120, 82, -12, -46, 86, -95, -114, 145, 33, -134, 2, 45, -15, -5, 10, 6, -92, -44, 183, 1, -266, 16, 203, -2, -131, -127, 55, 255, -103, -309, 178, 203, -212, -46, 119, -92, 26, 82, -111, 4, 68, -86, 68, 63, -169, 0, 152, -64, -65, 37, -33, 6, 61, -4, -114, -51, 145, 85, -228, -71, 235, 7, -123, 26, -78, 39, 224, -171, -248, 251, 132, -226, -20, 83, -11, 45, -33, -52, 86, 0, -62, 97, -11, -95, 80, 42, -50, 30, -41, -71, 147, 56, -213, -89, 210, 135, -245, -193, 280, 114, -322, 23, 223, -185, -22, 258]
3343B58m69J4N13k73l20L03J01j40On6L6J25j16n6J17m3l1N3j8K3m6j24K45J15
3367B17m16l6M71J1m56q0M76J42n29j50O09l1n48K83K91m42Q6L59l41j05L17q6
3389D2j01J04j24L5J94j85j08J95K2j25N9L2p7l1J28O9k51o8L77j0l90J01K31
3412A19o1j1j45j05M01K5n11J34M25k49j72J71k1LM9j27O2Q7j61P3J28j85pJ50
3436G2j01M1M7k22J11L30k55l55L06L78l12m35L31M88m52l87N90P5n58L02K94
3457B88n26N6N08l19k70L34L1j57O4p9kJ99j23j47J74L7j12J2Q5l7j21P3K21j88
3481Ak91L59K21m06r2K66L5j8j18j95L31K16m97p7M81q4k98J29O7k7L3r6K4J17
3505H1j21k8J63r9q9J39m3jQ5k20KL88j64m36K61M24k62m48K47N12k76n26L83
$$ y = [258, -211, -197, 316, 43, -277, 26, 127, -13, -7, -63, -27, 98, -18, -74, 43, 0, -31, 22, 4, 27, -19, -143, 102, 217, -199, -235, 236, 247, -209, -289, 187, 329, -200, -350, 259, 228, -320, -37, 254, -188, -102, 257, -84, -189, 128, 42, -59, 45, -79, -44, 150, -35, -143, 52, 74, -51, 8, 40, -37, -68, 60, 129, -122, -190, 187, 177, -213, -112, 119, 58, 47, -98, -203, 198, 223, -288, -154, 271, 22, -150, 21, 0, 3, 52, -75, -13, 74, -87, -14, 114, -71, -78, 72, -29, 12, 59, -163, -52, 278, 23, -332, -26, 352, 40, -395, -64, 424, -28, -415, 175, 250, -308, -6, 288, -238, -182, 326, 7, -263, 71, 102, -55, 9, -70, -72, 127, 4, -143, 31, 68, -44, -32, 53, 16, -105, -32, 189, 1, -290, 69, 290, -116, -208, 58, 93, 75, -43, -238, 93, 309, -188, -265, 216, 132, -166, -37, 30, 3, 36, -60, -36, 81, -40, -68, 95, -4, -93, 46, 3, 2, 87, -133, -131, 257, 93, -343, -82, 342, 80, -368, -121, 391, 115, -411, -28]
3528b8M11n11j26M93j89k80L63ol19J82J32j90P8oj20J92M2k69R4J81j49l0J12
3551E7r6l1J63kk11j7L13k6l95J31L81k74k18L75p7l01L74M1m80K14M05l69j99
3574b42L30Kj31K3m2N7J18j49p1J57Jj08J8P8rj14M6J82j31k38K63J83l30o9K68
3599I2j0q7m3p4J77J74l56r5M17l5l44J12J70p1k3l9oJ11n0j00R7L3q7L2J7j1
3625AL2j19M7K21j96k34L19J81l51j30L20J08k21j92J76K84k06l04K82K01k90
3646g1n8J91m8l6N0p3L3Q5j15PJ06j02k9J20n2k8L7q2O3J58k08j72L45Q6l83l1
3672b07L52N8l43j00L58J27l90p2L89o3k80J64J04j66P1N6j24N9O8j11N1O7j39
3695g1M0J09r6l0P4o5N2R5k08m1L21m3l52R4L38q1l29L7L60n2l92J28L40k03k03
$$ y = [-28, 383, -128, -254, 239, 50, -230, 133, 127, -192, -10, 122, -68, 10, 4, -116, 76, 118, -151, -57, 124, -25, -55, 57, -39, -70, 93, 91, -120, -137, 176, 150, -245, -114, 267, -7, -225, 150, 73, -228, 146, 187, -293, -79, 326, -43, -242, 88, 90, -41, -18, -60, -3, 115, -34, -105, 52, 53, -55, -37, 41, 32, -82, -36, 146, 15, -223, 40, 223, -107, -176, 92, 82, -5, -48, -122, 55, 229, -127, -222, 195, 160, -184, -72, 98, 27, 4, -35, -41, 70, 20, -80, 17, 50, -37, -5, 12, 1, 33, -86, -39, 182, -14, -248, 71, 252, -99, -229, 91, 199, -22, -214, -38, 246, 40, -264, 18, 219, -71, -129, 62, 14, -22, 28, -45, -12, 73, -42, -35, 71, -31, -60, 60, 8, -20, 17, -65, -2, 156, -52, -224, 121, 207, -176, -207, 145, 203, -140, -240, 118, 245, -145, -217, 172, 109, -171, -7, 97, -69, 2, 58, -66, -7, 61, -50, 1, 68, -71, -31, 78, -18, -48, 26, -39, 13, 108, -100, -141, 180, 137, -215, -121, 217, 136, -193, -156, 204, 152, -240, -112, 228, 25, -178]
3720a78K16N0j72R5L7j22Q6M9j18O7M4j50Q8R8j35j1R9o3M5K7j89P8K68j97k74
3745b62K74K32k65k21K33K61k15k99K42K83k93j87K86M6k01O3O1r9P8K9j24Q2
3767DM6j22N7Q6j22J2Q8l9J1j9j19J74J33l28p0M06j9l79N1K96Qk54r4K57J81
3792B45l05j91L56J02l27KK03n5n2K8n5N1O5j09LQ4n0l5N9Qm3k7K3J10n9k27J91
3819eK39l15j43L43L1k49M2M6J9J39j84k14L74J49m76KM15j22k45J42M6m0O5r0
3843c1q0J82%j66O7R8r4rR9n0j18J14J31j78j47K71J17l70jL92j84k64L38K0l65
3868b28K55K34m34rM38j88l03K80P9j87Q1k0j01J87J5k55J05J73j61K1O1j51J07
3891aK03k66j86L88J28m42r4M38R8m48r6M76N4m77N0M13j70k58K19Q4j84N2O3
$$ y = [-178, 38, 88, -84, 11, 48, -74, 12, 61, -57, 10, 54, -96, -8, 90, -45, -56, 43, -20, 25, 52, -137, -59, 209, 12, -262, 12, 244, -21, -242, -9, 252, 37, -262, -20, 263, -30, -217, 69, 115, -86, -23, 38, -61, 17, 46, -78, 4, 50, -72, -15, 71, -51, -39, 49, 10, 21, 2, -117, 57, 190, -138, -208, 198, 179, -200, -149, 147, 155, -99, -193, 64, 245, -60, -251, 105, 207, -120, -118, 85, 30, -22, 6, -49, 2, 67, -42, -39, 45, -5, -40, 19, 27, -16, -43, -20, 90, 31, -196, -5, 234, -81, -224, 119, 150, -99, -57, -11, 8, 147, -37, -251, 123, 272, -204, -202, 213, 91, -154, -12, 34, -6, 59, -31, -111, 71, 71, -95, -28, 70, -24, -33, 66, 16, -102, 12, 143, -35, -182, 89, 206, -164, -165, 227, 43, -221, 117, 137, -228, 27, 261, -173, -182, 256, 68, -235, 45, 124, -63, 18, -2, -103, 84, 99, -156, -51, 122, -39, -18, 43, -108, -1, 202, -64, -250, 138, 266, -176, -270, 168, 266, -182, -278, 198, 252, -225, -175, 238, 68, -190, 29, 113, -71, -19, 44]
3914D4q3L7N3j00N2O3r8kQ3k4m0l3J8J42p9k44K26K42l54j57L88K5k95P7J03m5
3940aJ19j42k17L55J74m96k0M98j47l47K05J36j35L3k0r1J62M0k22M9J77j44l6
3963g0J42j03p9K46n2k72J08L29j84l58K72L23l33k88M13J67m19k6L74j15k58
3984a83K10Q3j92M7J01q6J0N5p8K8P0r3k1Q9j0k5l6k6J46J1k82R4L21k06k89L09
4010D7J37k75J4J25q7R3L5k79J20L59l07k80M07J08l65L5K07r1k4M8j12P4J51
4033A40j94m3J80n2q9J24q2j04K50ml38J04L73k06l29K28K76j99k66J66K82j49
4055F8k92J74K59j93j87J85J01j37j8O1j8J4Rq4L0J04p6p6J11K5j16J5J24q3r9
4080i9J38P4k02k3K51o6k66J88K13k77j11L29l7k96J59J78k11n2J99n5j15Q1K3
$$ y = [44, -39, -2, 51, -49, 3, 66, -32, -34, 49, 25, -15, -48, -30, 112, 33, -211, 15, 257, -97, -254, 134, 159, -136, -59, 44, -1, 118, -24, -241, 114, 288, -208, -228, 270, 123, -224, -19, 117, -18, 15, -5, -96, 66, 106, -116, -67, 110, -34, -70, 72, -31, -110, 136, 84, -188, -80, 249, 65, -293, -21, 302, -31, -319, 94, 261, -158, -184, 190, 75, -183, 27, 110, -82, -35, 66, -20, -10, 45, -33, -5, 65, -28, -49, 40, 30, 5, -31, -57, 89, 100, -182, -88, 233, 27, -262, 47, 184, -91, -77, 48, -39, 54, 89, -190, -70, 289, -18, -298, 109, 217, -148, -113, 94, 3, -21, 27, -85, -11, 140, -54, -97, 83, 31, -58, 66, -16, -120, 130, 126, -212, -108, 265, 59, -270, -42, 234, 35, -231, -65, 217, 68, -224, -50, 209, 16, -171, 14, 115, -22, -40, 21, 3, 17, 26, -58, -28, 76, 0, -76, 35, 60, -56, -41, 83, 0, -99, 39, 113, -89, -112, 139, 73, -193, -5, 208, -69, -180, 149, 112, -184, -25, 153, -58, -110, 89, 34, -81, 0, 23]
4103B3n9O3k3o2O7K7o2pL2J8Pq7kJ69m2k27J46K02k23j10K54m3j65J54Jj75J78
4130E4Q0k97Q1K93k17j94K59O0j97M1P5o3N0J8j32Q4J08j30k6P6m5L3M4j76N7
4155f4K60j87k48K96J58l10j8K00m2m1Lj17J23J77k73j24L75Ll61J13K28j46p0
4178f5Q9p2M6J02j48n4J83l9j09P5pn4J64j05k18K73J76l81o8L90m3k77N8J45
4202F1Kqj70LL02r2l56J98L17k72j86K57J8j15N7l7n5J68l8j89J24J00j22J9M3
4227B9j20J38J16l23JM02j35l72K25K51k10j19Q0O5Q9j03k35K43K32l53j58M07
4249A50J6l30J05J42j05M2J0j32J12J32j95m2J64n3l0N7j35L8K58k04k64L39J67
4272B42l90pK81o0j27M9p1J07J63k83j25M09j3m11J50L15k35j09J56l7k9J05j18
$$ y = [23, -36, 27, 4, -58, 9, 36, -26, -33, -1, 17, 24, -63, -65, 104, 62, -165, -19, 183, -40, -150, 104, 61, -104, 50, 51, -124, 54, 134, -163, -82, 211, -6, -200, 59, 119, -78, -37, 38, -25, 25, 43, -89, -5, 103, -27, -53, 23, -22, 11, 55, -121, -64, 196, 9, -239, 57, 215, -95, -113, 87, 45, 4, 7, -110, 13, 190, -83, -207, 168, 171, -190, -77, 151, 5, -65, 24, -48, -2, 100, -48, -102, 81, 42, -67, 8, 1, -53, 111, 6, -212, 61, 237, -144, -212, 178, 135, -142, -84, 61, 63, 55, -115, -112, 190, 98, -258, -60, 257, -15, -201, 56, 74, -41, 16, -21, -76, 92, 54, -135, -11, 89, -33, -14, 29, -91, 47, 163, -160, -159, 243, 108, -264, -39, 212, 2, -117, -37, 28, 117, 14, -221, 22, 254, -99, -257, 150, 166, -164, -59, 83, -22, 20, 30, -102, 10, 142, -53, -95, 69, 16, -14, 43, -92, -54, 204, 0, -264, 75, 242, -148, -155, 126, 66, -61, -12, -83, 24, 187, -96, -221, 188, 175, -236, -86, 229, -6, -115, 41, 4, -25, 80, -38]
4295c8o1J78j1j42N7L1OM6j25n8K59k5l31J68K63k65r9K42o6j24J92r3j83K70
4319I1P9l61Q3L34k11k06K39N0j64N8M6p8M2N8j08J0Q4qo2l0Q5O1j30p3K07jk43
4346a48J23K08k31j16L04k3l20J66K54k59j47K92K5k33M6J60p6q4Q2%o7N2L6r3
4370d9K8J09r0p9J30J0j43R8R7j94rK63j18k75K23K53k95j86K81J44k31j60J93
4393@K24k15k43K40K21k83j32K68K4j55M5J6o6J28j7j69Q2J46j31j4O1q3P1J17
4417A35k49m3L56q9l55K09K37k18q9J23m2O0N2k24L5L30j86l05K81J90k88m6K09
4440H3n7o1N2k4k3P5nq4mQ4K0r3m7J49J6j75L9J96j55j41K43M1k92P0K84j60k26
4467a95J90J79j79j62J78J40j65j03J44M6j10K3J9o0P4M8j59M0J39p7q0J13p9
$$ y = [-38, -99, 79, 68, -74, -17, 14, 20, 66, -59, -117, 142, 117, -214, -46, 217, -48, -147, 95, 29, -95, 97, 4, -179, 91, 170, -191, -108, 226, 15, -191, 48, 98, -66, -8, 38, -40, 2, 60, -48, -38, 46, 38, -24, -54, 31, 92, -38, -111, 96, 95, -148, -25, 183, -48, -164, 140, 117, -203, -37, 217, -42, -189, 103, 128, -105, -59, 101, 25, -59, 23, 23, -44, 8, 44, -49, -21, 88, -2, -81, 49, 59, -84, 14, 111, -83, -92, 171, 53, -222, 1, 254, -41, -227, 54, 198, -33, -193, 0, 224, 9, -234, 6, 227, -56, -188, 80, 104, -51, -6, 10, -56, 72, 55, -114, -32, 114, -17, -31, 30, -53, 18, 135, -114, -157, 199, 110, -245, -36, 201, -17, -106, 17, -25, 35, 87, -137, -102, 228, 42, -263, 18, 208, -80, -126, 83, 26, -35, 17, -7, -30, 45, 40, -44, -48, 36, 56, -37, -84, 65, 81, -94, -55, 141, -14, -155, 88, 129, -163, -93, 191, 31, -195, -5, 174, -5, -167, 11, 151, -14, -117, 27, 73, -37, -14, 5, -55, 19, 67, -92, -52, 87, 10, -70, 43, -36]
4490c6k8K07j27k16K55J70l63m1L45p2k06P4M2K5O9j76p5L05ol46J03K79j68j43
4514a29J43L5p4L6rn1N4M1o2n2O2P9o7j07J25O7j67j6K23j16j81K12J18k77l0
4539a43K74j7k45J3K22L9k68l1K76J2k58M0K02j02n3N0m0MJ14j03q4J21K5q8M4
4564Dm1j6J67p6k31K08J82l05k4K69j14j30J81m4j59J89M7k17K7K18r2j57R2R4
4588G2o2m4L5J6l8L7J6q3L0J12q6p6J30l7j10J57qk36J79K08l08j09L47k2k56
4613a36P4J06j9K7j11p3K61J3l25Q4K81j47j69J32P0r2J9Ok7NO0k1o6K6R3o9q6
4640h4J39Rj90J18J65k51o6L18l9k98R1K26p1j56l0J44J49k17j77K96J32l23m9
4663a64K74n2j25O9Nl2O9j7p7L7N6po7l2J12Nj54P5J47j87n3K46o0k58J66K12
$$ y = [-36, -64, 143, 16, -200, 55, 225, -138, -179, 166, 94, -112, -38, 4, 29, 98, -78, -153, 152, 146, -200, -97, 182, 14, -129, 14, 49, -25, 11, 2, -49, 5, 46, -16, -68, -6, 73, 6, -101, 24, 91, -76, -92, 131, 15, -166, 46, 164, -113, -143, 131, 114, -131, -118, 104, 143, -125, -156, 120, 132, -126, -86, 116, 14, -39, 11, -29, -25, 89, -14, -98, 23, 48, -40, 4, -37, -53, 114, 38, -193, 15, 197, -108, -132, 137, 23, -107, 74, 30, -129, 60, 107, -110, -83, 135, 43, -114, -22, 72, 10, -34, 1, 17, -21, 16, 32, -51, -21, 91, 5, -71, 59, 22, -88, 69, 61, -175, 4, 212, -96, -205, 142, 120, -136, -62, 44, 25, 52, -59, -132, 129, 142, -183, -99, 182, 35, -134, -2, 68, -24, -5, 1, -26, -21, 39, 18, -48, -22, 71, 2, -84, 55, 64, -126, -8, 157, -94, -160, 158, 119, -179, -88, 138, 67, -89, -119, 25, 174, -43, -220, 76, 208, -115, -164, 110, 58, -67, 2, 7, -25, 44, 27, -50, -13, 43, 36, -31, -63, 49, 54, -100, -25, 122, -65, -118, 128, 68, -190, -24, 188]
4689A88j98j47J27J73q8k19N9K89r7k99J52K28j87r0J38k9j9P0q2m2J22Qr0j5
4713d8M1O3l0j06Q3J02j65j2J96j13j77K23R6k50m9K26N1j88j19K01J74k60j48
4736b09K91Q1k62RJ52o5j7N2q8J4J14n8q1L2O8J5p4m3J29J5j72Q2J49j96n4K61
4762A45n3k57J09K04q3j92J6K35K2k96qL24o3k82J28J59j26j5N4o6K8Q7p9n9N1
4787a7P8l7j04N4J24j20r2K09k1k33J54J93k45j04K24O7j48j09Q2J92n0l00J04
4810i9L34j97k35K19J10j67j5P8m1QL8l5m7L2P4n6r2J30M4j95Q5J79k26q5L22
4835A63n5k89J32J80j18o0j8L8J68q5k48J59K40k15j55J92Q3j44k5Q6j1m4L7L3
4859D4r1KJ16p8p3J31n5q7J91l0k67J95K05k91n5K44o7j00J17o3p6J81j3k13O8
$$ y = [188, -10, -157, -30, 143, 55, -164, -105, 184, 87, -212, -60, 168, -19, -109, 29, 0, -19, 51, -31, -73, 49, 57, -33, -48, -7, 56, 26, -80, 3, 105, -60, -72, 124, 11, -166, 57, 153, -97, -146, 80, 131, -57, -176, 25, 199, -61, -209, 82, 163, -99, -90, 62, -3, -20, 32, -56, -42, 72, 14, -67, -35, 33, 48, -26, -69, 60, 75, -97, -15, 134, -62, -116, 145, 92, -165, -56, 148, 65, -127, -111, 124, 146, -150, -158, 166, 103, -179, -51, 108, -18, -33, 21, -45, -17, 70, -9, -68, -17, 61, 24, -80, -26, 98, -22, -114, 95, 74, -159, -5, 188, -57, -161, 63, 130, -18, -127, -45, 147, 97, -203, -99, 235, 38, -197, 22, 132, -35, -50, 28, -13, -5, 33, -2, -49, -17, 57, 1, -91, 39, 83, -112, -27, 152, -74, -159, 163, 108, -181, -49, 131, 13, -47, -65, -27, 141, 56, -192, -33, 207, -8, -163, 29, 112, -32, -57, 29, 18, -26, 11, 44, -47, -45, 71, -7, -80, 51, -4, -91, 100, 70, -197, -2, 203, -88, -143, 101, 34, -66, 51, -12, -88, 93, 80, -133, -65]
4884f5J67m3j41K0J27j9j12O0L0q1O2O6j30MJ28n0p0K7k3P3M6j76J9K25j33j45
4910a34K02kj87J21J32j84p7J89O7j52j46K01J59k24j57K41Q6k02J8R0m2J4K6
4933C9o8j5O6L4o0p8J03P6j73J4J89j39j36K65J0k94R3K09j08j14L5L6J32p4k23
4958a81J49K22j87j63J72R2j09n2O1L0n3jO2o8k7J20m4q7R6l1p0J71o0k10K02
4983C4J42k85MK22j34o5J66p3j37J45R4j28j18J09J68j04k01J39J56j51o5J03
5005B1k1MM8p4j7N7M3m1q4L3J39j09j26K07Ok45J67J85k99o0K80k2j51PmJ19O2
5032A25k37l7K81k5k20L4J58l2r4OP1k1m5Q7m1j05J11O0j14M4ko7J52j5k38J59
5058eJ67k41oK12j55r1K19j4k15M0J70M7k14j10K85J23l38m3K85l1j61M0L7oK1
$$ y = [-65, 102, 59, -82, -62, 65, 46, -66, -6, 24, -57, 5, 71, -59, -55, 73, 23, -47, -20, -43, 30, 76, -100, -81, 144, 11, -134, 68, 66, -121, 0, 132, -52, -129, 60, 127, -25, -171, 30, 189, -35, -192, 49, 135, -67, -49, 41, -1, 13, 39, -29, -44, 22, 56, -4, -82, 21, 97, -76, -62, 127, -12, -148, 117, 127, -167, -74, 135, 27, -87, -52, -16, 116, 42, -181, -32, 190, 3, -160, 12, 104, -5, -57, 4, 34, -19, -20, 42, -26, -53, 67, 23, -64, 32, 1, -69, 102, 42, -168, 34, 176, -109, -105, 117, -17, -82, 84, 11, -126, 19, 113, -15, -133, -24, 144, 40, -161, -22, 134, -17, -82, 21, 0, 4, 52, -22, -39, 18, 61, 20, -64, -31, 108, -1, -127, 80, 86, -159, 8, 193, -106, -166, 114, 92, -59, -52, -56, 63, 125, -112, -149, 132, 107, -113, -79, 79, 47, -47, -41, 30, 9, -36, 51, 10, -95, 16, 76, -38, 6, 4, -63, 89, 74, -164, -5, 162, -79, -85, 127, -28, -119, 100, 86, -129, -89, 81, 128, -86, -196, 89, 212, -126, -169, 116, 85, -76, -36, 1, -5, 16]
5083A6Ol8l4M9R4j39m2J84j08j13K68o3l02K59J83l37rK55j39l3J26j32o2K05
5107I4J0j74m4J45J12j70j21J79O1j36J7M3p5P4N8j15k4P1O3m8j22Q5J56k11l6
5132a08K60j59k06L25M8l14P3J73o8pm7p9J84O8k44k9K05J1j07n8Q0N7p7%N6q6
5158d9K6J17r4r2Q4M8Jn2r7J43P2k10N7J97k41l0K87r7k24J29J11l0o8j44J47
5183iK22k15j88K24J07j52o7P0M9m5j4O0o3o7J51Lj45M2N1rO3j08n8K10o3j84
5209a35J92M5k62J50J78k12q2J35R0j0j97l3K96Ml18N8K26o1j22K6O8j2p0P3J3
5234D0j29O8J21j11l8N3j7O3nj81J37J26k31M6K11k23p4K60k7j83J1Q7J26r1k59
5259b20J90K64k22j86J83R6q7o7M3N2q5L0R7j16n1J32pp5J9m7P9Q3j86jK10j61
$$ y = [16, 22, -16, -50, -1, 93, -46, -88, 96, -12, -125, 143, 80, -222, 37, 220, -117, -126, 129, -10, -43, 83, -49, -111, 94, 104, -70, -114, 31, 143, -27, -148, 31, 92, -44, -27, 16, -59, 15, 73, -42, -66, 5, 68, 20, -102, -17, 139, -72, -108, 152, -7, -213, 112, 160, -154, -81, 92, 24, 17, -30, -109, 75, 143, -101, -130, 75, 86, -21, -79, 1, 58, -19, -19, 37, -49, -23, 94, 0, -92, -8, 40, 41, -11, -108, 35, 107, -103, -46, 151, -90, -120, 167, 70, -154, -25, 86, 56, -12, -156, -9, 213, -2, -190, 34, 141, -11, -78, -8, 41, -4, -18, 42, -21, -88, 63, 66, -79, -37, 14, 5, 68, -40, -98, 112, 49, -135, 57, 102, -160, -10, 168, -44, -126, 9, 99, 89, -108, -141, 155, 159, -159, -101, 125, 64, -58, -32, 36, 24, -46, 27, 40, -89, -21, 100, -11, -49, 4, -13, 50, 45, -136, 1, 127, -104, -58, 153, -70, -144, 116, 89, -94, -83, 4, 130, 39, -220, -30, 234, 12, -174, 9, 105, 18, -49, -6, 46, -39, -9, 88, -28, -79, 53, 46, -29, -10, -57, 22, 105, -81, -82, 128, -33]
5285c3r8K61p3k35J78J12q5q5m4J48J31k39j18K57O4j91n0J08O9q5l0Q1n2n8J36
5310F9Pj50L3O5K5k2j19O1J57j53q3K38j02j98K41O9k39K2R7J4L1j36o6K29L3
5335A23k08k2J27O9p2r6P8N4q9O2J6j10K2J04j3p7n2J16O8j75j2K26j55j43K90
5360A31ql00J48J63j61PJ9p1J16N7j42o5Q5J21n2j84P6J69q4r2P0j5nM1ln9k2
5387f0R5M3j57J0J87j58p3K66j33k25K70O8k53J03Q1j35N6J16j10j08P8J61j8
5410A04k86N2L17j08k20R1J21n1m7NL4n2K1Q5q1n3R1k7rQ7j53rK30j40j33K19
5436H8m7j90K02N9j80j2P8J09k1k27J6K88o3k21L8J28L0j09m0J06j7n8Q7j2j01
5461f9L1Q2K0q2j01J86M4k60J28J96l12K6L22k08j66K07j0o0Q4p3q8J29Q0o3j61
$$ y = [-33, -131, 130, 57, -178, 0, 112, 27, -58, -102, 46, 177, -62, -180, 77, 141, -50, -100, 8, 77, -8, -38, 43, -9, -67, 69, 76, -74, -41, 24, 49, 27, -92, -31, 126, -27, -110, 128, 26, -172, 69, 138, -101, -79, 18, 32, 63, -73, -139, 90, 123, -85, -107, 20, 89, 17, -79, -1, 53, -36, 26, 42, -68, -46, 58, 45, -32, -84, 32, 100, -75, -87, 139, -16, -159, 131, 123, -177, -29, 134, -27, -20, -1, -72, 44, 101, -41, -106, -21, 100, 48, -136, -60, 109, 25, -67, 3, -12, -17, 24, 21, -38, -60, 35, 78, -79, -69, 118, -40, -113, 153, 20, -205, 65, 133, -120, -17, 64, -71, -15, 101, -9, -117, -39, 122, 104, -182, -130, 187, 79, -141, -50, 71, 20, -27, -22, 12, -40, -19, 66, -15, -68, 23, -4, -13, 74, -79, -88, 142, 2, -131, 88, 41, -149, 53, 112, -68, -80, -2, 107, 86, -141, -125, 163, 100, -121, -83, 45, 75, -34, -74, 32, 15, -43, 44, 32, -69, -38, 44, 64, -18, -119, 67, 111, -149, -21, 175, -137, -111, 211, 3, -163, 44, 34, -26, 58, -15, -103, 26, 106, 43, -118]
5486a18J6K51l8k68Q8J56n3o5J8Pj6PP5o5j00J54qj22J56n1j88K39N7k75J13J52
5512A22k24P6J54j54o8Q9Q8K7k24o3L03K8k64rJ49P1q9q9Q0K8o9O5K1j10jP6O0
5539G3n4j45J22J47k56M3K51k84o7L52j26k16J65J8q6J25l1j26L2J38N8k06j31
5562b04K87J11k77m1J68J9o2l5M4j3n2R9Mj24O4K8m9J10q8j31K31k8k08K14K7
5587I4k71J69J42j62l0NL0J46r3j86J13J26Rj37r5J67Q6j42rM7l5M0K8k2n9j9
5613e8J38j2j73J17O6k21J67J49l09N4K28k05KJ62j53n5J38M8o6j35J6K81o5k67
5637a53N7J59K8j12o4R8K3o9P6nj07M2P6J9q5j06J72O6k31R5J93l08L8L04k20
5662a4j16K09q6n4J37m3j24K3J20R0k15j28K69J08k28o6J27O4o0n9P5j5r6J18
$$ y = [-118, -102, 149, 111, -157, -69, 87, 34, -31, -13, -6, -22, -15, 60, -5, -105, 49, 41, -81, 75, 24, -164, 75, 132, -143, -30, 122, -102, -26, 128, -26, -94, -5, 83, 110, -114, -177, 126, 154, -110, -119, 30, 101, 12, -77, 3, 31, -38, 27, 48, -62, -63, 13, 73, 19, -126, -4, 143, -113, -70, 181, -103, -170, 182, 56, -160, 5, 23, -63, 62, 31, -95, -63, 75, 133, -73, -204, 83, 194, -83, -124, 44, 63, 1, -34, 10, -3, -55, 44, 48, -76, -12, 16, -33, 77, -11, -142, 89, 61, -147, 67, 94, -177, -8, 134, -28, -58, -53, -23, 123, 30, -156, -43, 83, 92, -45, -140, 27, 113, -29, -38, 9, -26, 14, 42, 20, -39, -58, 80, 68, -105, 12, 78, -143, 24, 173, -136, -82, 146, -59, -57, 105, -48, -103, 35, 83, 17, -118, -102, 179, 114, -153, -96, 63, 91, -21, -85, 13, 36, -33, 43, 38, -69, -27, 49, 68, -17, -123, 49, 115, -116, -21, 172, -136, -98, 206, -14, -130, 79, -7, -61, 76, 33, -91, -68, 52, 142, -73, -201, 68, 176, -52, -118, 9, 73, 13, -46, 29, 14, -82, 36]
5686C6L8r6k8J4J02Oj97J12J52k52N2K61k47j14K64n7j04J05o0o5J29M5p7j62
5710a43O7K47j01k40J16J54n6j00J5P5l7m4J07k9j05N6M4L5m2j32J39J00k38R1
5734b1J87k60k8K80j20j21J13m8mJ10m5j13l0J42J21k16j35K51P2j62m8Q2M0o5
5758a8pQ2o8o5R6K6j6o0o0J55K1k21J59J14k84R2K39k14o6J50o0QO9p4p2L2J51
5785A09kk40nK69l0j80JJ06K9p0LN7o9l9J04Ln5o2K0J59r3j61K34j3k47K15J16
5812A59k84O7J35j11M8M9j07l8P1J43o8k51J12K51j08j80N6J09pq3J9P1r7PQ4
5837D7ro0p5J05J19j94k9K49k03j00L02r4k08J89Kj10J19lr8l7R7J47j33k11J73
5862a5J79j21j38J1J46Lj05K8M1p9K8O6Kp9o7J58K6k04J22R1k44J42J69k64M5
$$ y = [36, 74, -22, -50, -36, 66, 72, -125, -13, 139, -113, -61, 200, -47, -161, 103, 46, -58, 47, -13, -78, 51, 96, 19, -143, -76, 171, 70, -170, -54, 100, 44, -56, -41, 34, -3, -47, 60, 31, -74, -18, 26, 61, 19, -113, 26, 126, -112, -21, 166, -94, -122, 158, 38, -83, 30, -18, -22, 88, 43, -70, -100, 42, 163, -53, -188, 63, 135, -27, -75, 7, 47, -18, -25, 57, -11, -76, 20, 46, 30, -30, -90, 65, 86, -135, 24, 138, -146, -54, 185, -29, -95, 55, -5, 3, 72, -2, -74, -42, 109, 107, -133, -138, 131, 101, -79, -78, 28, 57, -13, -10, 47, -22, -61, 43, 46, -9, -71, -51, 108, 15, -146, 88, 75, -172, 43, 159, -125, -58, 77, -34, 14, 63, -44, -82, -11, 132, 64, -187, -75, 176, 68, -112, -56, 53, 46, -37, -18, 53, -44, -37, 47, 38, -22, -97, 8, 127, -67, -96, 153, -50, -150, 152, 58, -150, 39, 41, -69, 50, 47, -51, -88, 9, 156, 23, -188, -15, 164, 43, -95, -84, 62, 65, -40, -12, 29, -50, -22, 44, 46, -33, -100, 58, 84, -120, 2, 93, -151, -9, 160, -104, -59]
5887e9J50j73N3J23r0o4j0R5J19j71j17J31J08j7j35p4J64O6j31lL5j0J1PM3q8
5913c7l9J28l9m8J10j50pK34j84p2K37j68j21K54k8j27L5k2M2P7p0o7m3J32J52
5938A79k06j57K14J00r9r3M5O7p3OQ7p5n5L1L9R8j61r2K68p7k24K94ql17K26R2
5964A09j73P3L0j15K6J01N3j25j87K25J80k00j30P8J39mj32J9N7n5L0N2j1p9m4
5989h3J42L5j96J18P2k25J72R3k56J30R7k27J45J03j67rJ6N2R3j01j06L5J09J11
6013A53j47j93J67J43r9q1K9O1k6l5R4n2q5O3LQ9n5j80K03P7k86J84J44l17P2
6038g4K06j56J0O0j13K2P5Q0q3k13J30K30j19j61J0J12P9j20l4P8k9rM2J2l2r9
6064i6J14Q1j73Q1P0j99J46R2k22J19Q6k33J22J36j53jQj4R4J1p0r3J7K08j3k46
$$ y = [-59, 91, -82, -29, 94, 4, -60, -70, 25, 144, -27, -144, -13, 95, 78, -57, -131, 33, 99, -32, -35, 0, -10, 1, 8, 51, -37, -76, 52, 13, -35, 75, -75, -82, 152, -32, -104, 133, -35, -156, 98, 70, -57, -22, -44, -2, 75, 5, -62, -105, 27, 179, -27, -184, 30, 130, 31, -62, -17, 50, -23, -17, 70, -5, -60, -29, 10, 108, -53, -145, 123, 46, -178, 116, 108, -209, 17, 109, -64, 9, 39, -76, -50, 51, 104, -21, -208, 17, 197, -3, -133, -55, 84, 80, -52, -33, 24, -31, -1, 51, 40, -39, -83, 59, 94, -102, 16, 88, -137, 35, 128, -128, 2, 99, -128, 17, 120, -47, -56, -40, 12, 105, 4, -102, -67, 42, 153, 6, -187, -20, 123, 24, -57, -28, 33, 7, -28, 66, 14, -71, -8, -5, 84, 29, -151, 52, 129, -157, 27, 171, -146, -74, 132, -24, -14, 46, -67, -45, 30, 110, 27, -186, -56, 174, 55, -106, -96, 16, 95, -25, -59, 19, -10, -19, 23, 35, 3, -96, 18, 99, -74, 7, 77, -122, 24, 116, -106, 13, 99, -134, -12, 124, -29, -30, -22, -36, 58, 69, -1, -94, -77, 131, 118, -128]
6090a28L9J40J6p8o0Q4jo4P5J7o4k6lJ49l9j95J85K4k26K01Q0k41J03P8j37J03
6116C2M3r4k7j1J06O3j70m2Q1R0K5j60m0J42K4o1k7LL2m2L9O9q9k8K4PJ16j26
6144b1r4K30j08j54K66n9j97J59J1p9R1j5p5j2M5J62j30j68J11J23j7r5o6R2N3
6169E3o2Njj1j8J7R5p3o2R0p1L6R5j82N1J61k12L5J98j95m2J46o3J0M7m8n6oJ55
6198I2L5k25k3J77M8r0p9M6P7o1jL8l9k9kQ9Qj33Q1L0j10J45l5j60J89k8j72K04
6226G2Oj64P8J6j5N9j8n9o7P1J80j26j79J01J34k0j04j7P7j7l9N5Ol7n9O6J00
6253A00j20l8J35j32L2J28j85N1J31j95M4J62j27l1M3l7M3N0nj11o0J87Q4j92
6277d3o9J04R0l2r2L2M0m5J1L8J7q8l3J37j9j02J15q2n8J87j28n9J92j20j03J75
$$ y = [-128, -89, 51, 67, -11, -71, 13, 12, -52, 23, 40, -24, -50, -53, 96, 57, -138, 47, 71, -155, 46, 126, -115, -12, 66, -71, 32, 75, -19, -46, -57, 49, 112, -58, -100, -19, 71, 96, -64, -104, 38, 62, 1, -26, -23, 9, -33, 6, 75, -14, -42, -18, -11, 105, -21, -115, 115, 7, -147, 119, 60, -137, 22, 33, -46, 45, 30, -45, -57, -12, 150, 20, -148, -37, 86, 69, -26, -92, 0, 53, -9, -4, -5, -16, -34, -17, 78, 5, -57, 33, -38, -2, 93, -89, -38, 123, -89, -54, 144, -51, -93, 53, -10, 0, 47, -1, -57, -63, 92, 127, -98, -121, 56, 104, 14, -65, -19, 58, -3, -4, 34, -5, -34, -36, 53, 61, -72, 9, 39, -71, 74, 39, -121, 68, 40, -132, 72, 78, -86, -8, 8, -7, 52, 34, -25, -92, -21, 159, 33, -146, -45, 89, 69, -35, -52, 25, 8, -31, 24, 30, -7, -66, 0, 100, -20, -58, 77, -55, -23, 105, -80, -29, 102, -93, -49, 113, -14, -45, -2, -39, 4, 54, 49, -62, -122, 65, 149, -43, -112, -8, 82, 50, -42, -10, 30, -15, -4, 34, 51, -37, -70, 67, 48, -54, 61, -21, -79, 108, -20, -79, 113, -7, -110, 65]
6303F5k2n9L0m2j5M3R0qk14L0K05qj33n4P8Q7p1k9M9j9k2OO1J0j25P3K4p3J30
6332H7p1j17J95o9j45K19l2j66J07lj0N1j8m3q9Q5J77j08j88P2J30L2r3q2P5L4
6358C0k6NkJ4o6L8P4o5J2k7q7K04l8k07K29j3k24J84N8j43P8k4m6K4O4N8j27j22
6386a45J57Q9k2j14r4J39Q1q0n5OO2l2k4Q8l3m2k2lJ63p9j99K32lk11K22J0k00
6413a09J44j9p8J05Ll1n8k5J22K4n8o4p5J55J33j64j22P4R8oq3M7Nn7mN4P7r3
6441ej33J97jj47J86p5j40K13j03p2J93r9q7Q4rL9Qm0m9p7J66J27k12j06J04J19
6467H1pj29jO4j0J1j1M9m9p4J06Nn4R1j56J4K17k05k4K54k23n0J73q1LN5m9l5
6495c5l2J29P4j84m6N2J06O5j60r1J12P7k2p4J2M9p1J7L6L9k2j55J20J49k46R3
$$ y = [65, 43, -16, 14, -28, -43, 0, 90, 82, -132, -102, 103, 95, -38, -92, -14, 73, 2, -27, 22, 3, -19, -13, 48, 58, -67, 6, 30, -43, 87, 16, -101, 94, 25, -120, 99, 67, -99, 8, 5, -5, 46, 28, -15, -104, -19, 158, 50, -138, -66, 64, 96, 3, -79, -4, 30, 4, 9, 7, 21, -45, -7, 67, 2, 14, -13, -100, 104, 66, -141, 88, 75, -149, 35, 93, -50, 28, 4, -42, -18, 46, 104, -23, -145, 12, 101, 79, -35, -129, 10, 91, 11, -44, -38, 24, -8, -32, 56, 23, -19, -41, -44, 119, 40, -159, 73, 70, -141, 81, 91, -109, 35, 16, -62, 43, 46, 15, -43, -68, 54, 78, 20, -44, -119, 36, 169, 5, -117, -43, 55, 49, -34, 13, 18, -39, -43, 11, 88, -5, -138, 59, 58, -89, 97, 22, -118, 95, -8, -80, 113, 14, -73, 11, 2, 41, 49, 9, -40, -117, 49, 176, -36, -142, -38, 81, 74, -55, -56, 8, -2, 9, -2, 47, -2, -76, 30, 35, -19, 72, -84, -70, 147, -58, -82, 172, -51, -101, 72, -9, -6, 49, 0, -35, -67, 62, 136, -48, -94, -42, 64, 129, -31, -122, -10, 67, 45, -29, -17, 32, -39, -22, 14, 53, 31, -124, -4, 145, -101, -8]
6521hJ20k36J20Q3j59J26K6j53O3K5J4K8m7m0m6R4J69j68j51J05J06K7j24l1P7
6546B0j1j4K2K3k0j08Q7N9q3R0r2r7K54j37j09K53j44j11J63n2lO9o0k5n1R2J15
6573A30j19q2nO1J52q8j46L8R1L6p4j2O6o8j1K6O7J7j82P6J41j88Q9P8j98J28
6599B3M3j86J78J9j40M8KJ1L2K3j8j35QK22l2j40n3M0J33k2p6j0L0J4l2L4M7q2
6627a9nj9M0J55k09k7K15j93k5K18j66J9P3j30M7Q1l2pq0MM6N8O2j55j13J80Q3
6654A01m8j07rR1j1j6K4%qq8P4N7p9N9r0k7K07j39r3K34j50r2J72p9OP2p0k9j7
6683e5N7R5r1m3n2L6J88q0j56K1J01M7p8k5O9l9k5%Q4Jj44P8M0q2J56j20r4K21
6711A10j12j15K26o6p3N2m3pL1O8rj40kR3M2L9j54p6J44P2m5j02M2O8o5lM2L3
$$ y = [-8, 112, -124, -4, 79, -80, 46, 72, -81, -18, 7, 21, 49, 2, -38, -84, 10, 179, 11, -140, -35, 71, 98, -26, -57, 20, 9, -5, 17, 40, 20, -88, -1, 58, -25, 65, -27, -124, 130, -7, -116, 137, -7, -118, 45, -7, -10, 59, -1, -26, -77, 15, 130, 11, -71, -76, -15, 137, 49, -97, -59, 32, 68, -6, -18, 48, -20, -31, -5, 62, 79, -103, -27, 114, -74, 15, 93, -105, 23, 66, -120, 58, 77, -63, -15, -13, -2, 30, 53, 35, -100, -92, 130, 98, -42, -95, -55, 78, 56, -20, -30, 0, 14, -18, 16, 63, -19, -24, -43, -3, 152, -57, -84, 131, -62, -87, 131, -35, -16, 57, -73, -26, 55, 23, 16, -64, -60, -14, 44, 106, -49, -162, 18, 101, 53, -54, -63, 28, 17, 1, 25, 25, 17, -71, 3, 60, -19, 40, -50, -77, 130, -9, -102, 132, -18, -110, 62, -17, -11, 61, -9, -38, -55, 2, 97, 6, -37, -89, -53, 135, 55, -101, -80, 21, 68, -10, -35, 34, -5, -30, -30, 54, 55, -89, -11, 29, -53, 103, -17, -111, 110, -2, -117, 109, 43, -30, 22, -21, -28, 3, 71, 62, -78, -80, 13, 55, 94, -60, -136, 8, 80, 35, -67, -25, 43, -22, -25, 17, 50]
6739E0l6j22J39L9j20J23p7j01K08j16r5K37j21r2J07m4J8L6J3n4j03R4J17l3
6763F7p0r9L7J71k4j13m4O3O0o7RL8Lp4m0J53j2j29J11o8n6K03j61l2K14j71o1
6790i2J40n0K0K0l0l8n6J47M6j18m6m4J14J18j05j24L3R8K0q1J7L4j8o8J4J60
6816A11q5r2J03j04M6J43k25P7J55k30N6J26r4L0jl5j9J2J31m7j06j1k1J58O9
6841A47j80o7P2J00j5r6M4J3k5l3M3J09j33k1O5j15J65J0k32K09J5k17J78Qp9
6866c5Q4m9m0j4N8Q5q9m3l0KJ98ok02k0Q5J14n9p6L1J2Jn6O8N3r6L1o2pK28j96
6896c0j05K73j91m3J97j41L3O8j20J8K2N1K7n4%j23O2K20q7j57k8R2J22n6p7j7
6922d4M0K4n5N7J4qk1j34J71R0k51J38M5j91J83l1j26J95q1r6P3j5N0oJ6n9j31
$$ y = [50, 14, -108, 31, 70, -50, 73, -4, -105, 103, -13, -108, 129, 8, -84, 23, -21, -3, 33, 46, -8, -111, -17, 100, 67, -3, -102, -65, 106, 82, -31, -75, -12, 48, -19, -10, 28, 31, -43, -83, 70, 58, -71, 40, -28, -84, 119, -42, -74, 140, -31, -92, 48, -2, 18, 38, 8, -30, -86, 61, 107, -11, -57, -101, 13, 131, 26, -98, -65, 33, 53, -28, -11, 23, 5, -63, -49, 111, 26, -66, 37, -67, -21, 122, -103, -26, 129, -101, -45, 81, -13, 17, 16, -19, -38, -26, 105, 58, -48, -59, -80, 78, 147, -33, -100, -28, 72, 57, -39, 5, 18, -7, -40, 3, 112, -21, -42, 23, -92, 73, 83, -149, 60, 75, -142, 36, 44, -35, 49, 0, -40, -54, 4, 89, 0, -43, -73, -71, 127, 121, -81, -101, -16, 98, 39, -37, -6, 6, 7, -49, 19, 72, -24, 7, -55, -62, 166, -30, -135, 138, -53, -96, 101, -40, -7, 61, -59, -41, -19, 32, 59, 5, 5, -118, -56, 164, 77, -80, -108, -16, 106, 50, -27, -44, -4, 20, -35, 22, 36, 28, 7, -127, 44, 134, -117, 21, 66, -125, 58, 27, -99, 96, 15, -81, -8, -23, 27, 21, 37, -22, -153]
6949a53J45J21n9p5j07Q0J38j2j03n3Q0K0m1RK7M2j03n6J89q2k2J13k18R6J45
6974A21k41J33R9j76O2j0k1M5J9K7j02n3Q3K6J08p8j88O0J45L9q8q4N5K4Ll4M6
7001B0L0r4K8nj9J74j69q6K49j78j5J73j60O0N0j35N4L5K9%m3nj00Q8J51r5j01
7028f4l0N3J28l3q2m1N6L9n2K6J9J8n8r9J69J8j48J56j11n4K09j84J5J73j54J1
7054b0L6m3M0J0M0o2q2N2L8P1Kj84qJ18Q0n9q6L1L0Kk2J8M9o8qLl8J80j01j33
7084a14K21j15o6J70j36M6P2j31K4L8LK8j8K3j26jJ58Nn1q8m3J21O3n4q5J8O0
7111B2l6pPP8l5j28R4J8n6J57j68j9J94j89RJ49j21N1jo8L5PN4j6l4k3q2J21J17
7140A30r8r3j6Q1O1l5m2k4M5j8k7M5JN4j14n5J87j02j0J18j85J04P0j85J19N3
$$ y = [-153, -8, 113, 54, -21, -128, -48, 90, 78, -25, -78, 2, 22, -19, -10, 17, 59, -44, -100, 89, 7, -15, 98, -120, -24, 121, -120, 13, 112, -64, -2, -12, -33, 12, 31, 58, -44, -97, -14, 12, 120, 42, -146, -86, 59, 98, 10, -74, -19, 5, 8, -26, 20, 50, -44, -16, -21, -40, 134, -35, -121, 128, -50, -65, 108, -52, 8, 58, -77, -23, 12, 41, 41, -2, -7, -107, -19, 132, 37, -64, -94, -41, 87, 54, -28, -69, -13, 26, -26, 0, 19, 37, -21, -120, 49, 67, -81, 75, -36, -90, 119, -65, -50, 123, -31, -20, 16, -27, 13, 23, 63, 1, -81, -29, 9, 80, 82, -102, -110, 8, 88, 29, -57, -26, 4, 6, -16, 2, 51, -17, -25, -22, -60, 120, 19, -114, 107, -8, -74, 96, -40, 6, 78, -53, -29, 9, 12, 40, 22, 45, -81, -82, 76, 81, 30, -58, -101, 20, 83, 29, -56, -38, 22, -14, -21, -14, 64, 29, -99, -5, 13, -43, 114, -54, -73, 121, -68, -59, 90, -31, 20, 19, -49, -14, -7, 47, 31, -3, -26, -108, 13, 130, 32, -61, -77, 4, 65, 30, -12, -36, 9, -9, -36, 9, 10, 64, -50, -105, 82, -20, -30, 88, -97, 7, 77, -108, 11, 64]
7166F4q6M6l9j9J2L5O9q6k0m7J9J63j9j28n2N5Q9k1m0k2L1%m5M5J7J9Rj72J10
7195a3J09j89J40j0j34J71r1o7J45l8j6pk7Mj8J09pr4j6l6J19Q1q8j03NJ04K9
7222F2o3j3K7J1n9J9M7k6P9j28q1K37j19n9J72j53L7P5j54P3M7j3rk5J0p0P4J02
7250A00o8n9p4L7J50Lj06o3N8O8l5k0PM7m8n2O4l3Q9J8k23J63M7j81J63m3o4J34
7278G9j12l3P4RPk8K9r1l9J44K2qq4q4R0J15rj13l5P9Pk6k0P0Rq8L6o4N4J67k28
7309g1K6J38j76J04K2j02J22k4q1J9PK5j9P7k1j51O5M1O7K4j44n9P7J01lq5j3
7336c4L9Nn2L2N7m8O1j10n7K30j20o5J69j78P3O2j50J03L9m4ok2Qm6P6P6r0k2
7364a4q3M7J52k3j03p5O4P6j1k7j8M3m7j8K6l3J54p2j65J94p4l0J53j72O3P4j47
$$ y = [64, -22, 24, -15, -34, -22, 13, 82, -4, -24, -71, -52, 111, 92, -36, -88, -33, 56, 35, -5, -27, 4, 4, -41, 4, 21, 40, 49, -123, -13, 96, -93, 47, 37, -97, 74, -17, -84, 61, 23, 7, 0, -27, -23, -41, 68, 61, -33, -49, -85, 34, 115, 27, -76, -71, 33, 62, -1, -14, 13, 24, -35, -16, 31, 5, 84, -44, -125, 112, -7, -66, 106, -47, -10, 65, -89, -16, 31, 18, 9, -16, -6, -76, -2, 100, 32, -27, -101, -64, 86, 89, -17, -80, -22, 46, 11, -9, -2, 45, -3, -55, 9, -24, 65, 83, -140, 23, 70, -111, 52, 9, -55, 79, -33, -66, 8, 17, 24, -4, 25, -66, -105, 39, 61, 53, -31, -115, -25, 90, 81, -32, -67, 12, 19, -7, -27, 43, 52, -36, 0, -64, -10, 157, -71, -45, 93, -83, 21, 43, -59, 63, 39, -42, -23, -16, 9, -10, 67, 46, -105, -40, 1, 68, 92, -52, -111, -34, 67, 64, -21, -34, 5, 10, -42, -10, 47, -1, 60, -50, -107, 123, 3, -62, 107, -71, 2, 64, -86, 17, 56, 12, 6, -16, -8, -54, 22, 98, 8, -14, -97, -50, 102, 79, -24, -99, -35, 41, 30, 3, -15, 28, -19, -37, -11, -44, 110, 38, -127, 67, -7, -37, 116, -56, 7, 81, -66]
7391f6N3K0KK6j3Rq6jO1K1Q3r8j17L7R6O9p4o7QL7J6k7J9kL6k3j37J51K7j16J40
7422H4j42jJ58j72N8Q5q1L6l4k1LK5O2n0K5p0p2J34O8k9q5o1N3P4J2p2j9K7J3
7451Hno6J09K7j25P7q0kJ86j74J1J24j47O0ln1R1j3ll2npk8J10K6p9m8o0R3R2
7481H6k5q3m1O4K5j2k0K3K8p2L2n1J0J61j83J2J09j50J13Rj08J31m3m5J4JK0j1
7509fN7mp3Qn2Q6R4q1p5l3P4N7pm1l1M3j6jj7K0R8j29pP3j05J37m3j10J59p4m2
7540d1N8m9L8J5j2j8k5K8k7N8O7r5l7k2M7Q8j1o8m7L8M7k5j0LM7o5P%l4J46q2
7571A9r8J39j08L2O5j09Q7J5o8J4oPpM2L1p2Jl7J9J20k1p4n5K5N7M3l7n2L0J6
7601A8j8j8kJ22j01k1M9j20J58j3j28J35n9l0P2r4M0L2j0nj5J4p2M3P7j4j3r4
$$ y = [-66, -13, 7, 9, 35, 22, 31, -55, -56, 5, 26, 109, 11, -106, -69, 27, 96, 22, -45, -37, 0, 16, -11, 8, 6, 42, 19, -118, 33, 60, -56, 84, -58, -59, 99, -73, -15, 70, -11, 25, -9, -30, -27, -2, 60, 10, 35, -35, -107, 27, 95, 66, -19, -80, -27, 47, 59, -13, -32, -5, 8, 3, -63, 46, 73, -52, 25, -55, -57, 129, -45, -34, 90, -57, 3, 0, -51, 40, 27, 24, -8, -13, -20, -48, 62, 88, 9, -39, -99, -6, 86, 61, -22, -63, 1, 26, 14, -6, 17, 45, -27, 5, -46, -36, 125, -58, -46, 63, -87, 26, 35, -73, 58, 15, -30, -16, -15, 5, -6, 51, 47, -26, -18, -70, 16, 110, 29, -46, -79, -5, 52, 45, 4, -27, 16, 0, -1, -18, 2, 100, -29, -36, 37, -68, 69, 26, -84, 75, 1, -41, 17, -32, 6, 21, 9, -9, -34, -6, -33, 25, 92, -3, -40, -62, -15, 73, 62, -6, -53, -15, 32, 7, -3, 0, 47, -18, -11, -11, -45, 101, 19, -79, 60, -48, -16, 49, -60, 27, 42, -26, -12, -18, -11, -18, 24, 55, -17, -16, -53, -34, 86, 65, -9, -64, -39, 18, 61, 24, -28, 2, 18, 0, -18, -20, 102, 1, -20, 29, -91, 67, 54, -74, 61, 2, -28, 44, -50, -10, 22, 12, 7, -8, 6, -66, -23, 54, 40, 27, -67]
7629f7j5R0O7j0r9nL3K0rj0K7j9L5p2m4J56o9j0O5j50J02L3j32J09jk8L3m6Lk3
7659c6M0JJ8L1j22k2O1N9M9q4n6oQ2L5n1j4J2L5n7j5M6k2J08q6r5J47j00L7Q2
7688G7j41Q8K8r9N2j4J1J2J6Jo1K1n7N3J07n1p8m7K3J03Ol5m6jL7%m6K2Q1o7K4
7719A9n3o1J98j02m3J15j25N9L1r9P6LoJ%ro2N8J1L4J7j17l4O8P7Qo6m8QN0J5
7750B3k1k5K9N4j18L4L0n2J47j27o1J50j20N9L0q4R3j3k9mlRk9P9ml4j5q7N4J04
7780F9J3p3p8J5N5L4l3roL0Qj08P9L3n4J16j46j2J51j32O2J1o5R8o0l1K0%K5j2
7810@N1l6m1jl2J10N0p2o2l3O6M6Nn2k0K4RLp9R8J0o4Q5j64P4R4j23R4l5m9R2
7841D8p4MK3J0LMJ1n5oPKJ03j2q5m7J1R2L2l3o0QK0J8l1m2J02m2oL5j42J36K5
$$ y = [-67, -82, 8, 75, 65, -34, -39, -6, 14, 5, -5, 22, 3, 38, -34, -78, 78, 9, -1, 64, -86, 16, 49, -83, 26, 25, -3, 30, -16, -13, -36, 4, 5, 23, 54, -68, -90, -29, 30, 79, -5, -61, -67, 15, 50, -1, -15, -3, 32, -25, -40, 6, -16, 92, 6, -89, 58, -42, -5, 77, -64, 24, 52, -47, 5, -9, 2, 14, 30, 31, -30, -9, -66, -13, 94, 43, -35, -82, -59, 44, 50, 15, -31, -32, 5, 5, -41, -19, 62, -5, 19, -34, -95, 103, 1, -42, 73, -52, 7, 38, -61, 15, 18, 12, 13, 13, 4, -58, 0, 11, 45, 62, -55, -89, -21, 56, 64, -2, -50, -42, 8, 23, 2, -23, 6, 60, -58, -24, 6, -46, 101, -26, -87, 63, -57, 2, 32, -52, 41, 28, -1, -5, -8, 1, -28, 51, 47, 13, -2, -89, -35, 69, 82, 9, -69, -54, 1, 35, 2, -7, -13, 17, 25, -83, -4, 29, -25, 91, -55, -67, 84, -48, 14, 25, -40, 58, -2, -33, -13, -13, 12, 0, 51, 15, -26, -27, -59, 51, 101, 29, -33, -66, 0, 46, 51, -1, -21, 3, 12, 15, -64, 34, 44, -20, 65, -99, -25, 69, -54, 40, 5, -44, 48, -26, -22, 1, 11, 14, 18, 29, -26, -32, -25, -23, 80, 68, -17, -64, -53, 39, 71, 38, -22, -14, 6, 24, -7, -49, 53, 11, 5, 40, -102, 34, 59]
7873E9j14J25j01J0O3r3K7K1J2Lj2J1n3L4qK1R1o3p1k9M8O8K5n4n5OM0J4m4LO6
7904E0o2M4m9p8J80q0k2Q1j34R2J3r7O8JJ1nrj0l1K7l3O6N0p4l7l7L9R2Kn4n1
7935d7LN0K1l1K1Qk3N2j22K1J24j14J08o2r2J44r3MM9m9N4k1mk6PJ5l6R2j5k9
7965Il5p0P3P4K2o2o1J2L5K5k4J1j9M6pj12J06l6OJ16j69N4N0r9R2m9MN2k4j7
7995Ck8K0k9K3M2j0L6p8p1N1M5Q0n7o3k1L2M7jk9oO0n5JPq1J55m8o2J01j32P2
8026DM4j05P9%qJ1l2pk4M7k1L7M9p9l5k8L8R1Pn9o7RL7K9k1MJ4k1N9j16M3O3q5
8059d3J41j23l6J35j22O1K2p4P7j0j4l7J7j3rP4k0K7m5q4K7N9N3no9l8RN3Nj6
8089Bj5N4k9l5K5r7J30K6j13J07r8J9Q1j17P0%rL0k5j1j8K7k3K3P8o2j1o8j3R9
$$ y = [59, -55, 70, -31, -21, 42, -51, -24, -3, 9, 12, 0, 11, -42, -8, -16, 5, 96, 33, -38, -67, -19, 49, 74, 20, -35, -29, 11, 25, -19, -16, 50, -12, 32, -17, -95, 85, 5, -17, 64, -70, 22, 35, -62, 6, 7, 18, 13, 4, -6, -37, -10, -43, 23, 73, -1, -38, -75, -36, 56, 58, 4, -47, -44, 6, 27, -4, 17, 25, 2, 54, -68, -47, 77, -37, 71, 9, -83, 61, -32, -28, 21, -28, 26, 5, 1, -25, -18, -3, -39, 53, 38, 9, -26, -96, -23, 51, 73, 11, -50, -38, -3, 22, -2, 9, -10, 36, 29, -83, 23, -13, -7, 109, -60, -6, 44, -55, 37, -12, -8, 44, 20, 3, -25, -5, -34, -11, 31, 21, 57, -21, -92, -41, 4, 84, 27, -36, -57, -25, 22, 21, -8, -14, 46, -9, -8, -1, -82, 73, 25, -37, 64, -68, 4, 48, -57, 22, 22, 14, 25, -7, -14, -38, 9, -12, 25, 74, -5, -40, -68, -30, 61, 68, 9, -58, -49, -12, 17, -4, 0, 14, -7, 52, -64, -21, 42, -43, 98, -25, -61, 74, -48, 13, 35, -39, 38, 28, 14, -23, -6, -19, -28, 46, 26, 53, 8, -76, -49, 10, 63, 58, -11, -49, -40, 13, 18, 2, -13, 41, 12, -23, 2, -95, 35, 61, -52, 55, -43, -24, 57, -60, 10, 10, 1, 31, 6, -5, -23, 4, -19, 4, 82, 20, 9, -59, -72, 27]
8119B7M2j4q4j9K6K0Nj0j2L1M2r4J0K6m9J30n6q8J21j14O3L2j02Q5j5OMk5Pl8
8149d3M8nL1M5j02j6k4O5Q3n4j4o8N0L5m0OpJ8L8l5q0N5jLQ4j27L8O2j03P9l3
8180a2l1Q5m9L7k5j7nk2O4j3M9
$$ y = [27, 69, 55, -29, -48, -22, -2, 3, -7, -19, 12, 54, -40, -30, -4, -53, 77, 21, -67, 54, -60, 3, 35, -67, 18, 3, 9, 13, -12, -5, -43, 5, 0, 31, 76, -26, -42, -66, -1, 82, 28, 14, -54, -4, 31, -9, -3, -10, 8, 46, 11, -69, -14, -15, -12, 72, -55, -17, 45, -58, 21, -12, -43, 42, -7, 30, 5, -12, -17, -39, 25, 12, 61]
8191F1
$$ Imaginary data points
##PAGE= N=2
##DATA TABLE= (X++(I..I)), XYDATA
0@%%%%%%%%%%%JkLnOoQj0J1j3J4j6J9k1K4k8L2l6M0m5N2n8O4p1P7q4R3j03J12
40E8j22J32j46J61j74J91k08K27k49K73k99L29l65M06m52N07n76O58p57Q86j054
61e74J275j580K017k671L709n521R161j8610P6823J75106k49734J03649j79627
74h6577o3338K28202r2287M7205k3748j3735L2514l8807J8991p7086P8718K4574
86C4626n7463O5558o4265K8246J3587n0105J6292j1844O3396l1320j1101L4746
98C0353o5382O6354l5181q2806J00733J8385J0802L1349j35733m5616J15441L99
110I098M6955J1005j36269N7371J7484l8116O7000n2469K0209K7655l2727O265
122C461l6047M0879j0023m978L0637m8101M9074j3666l3248K3789k2204L5392
$$ y = [0, 0, 0, 0, 0, 0, 0, 0, 0, 0, 0, 0, 1, -1, 2, -3, 3, -3, 5, -5, 6, -7, 7, -9, 10, -11, 13, -15, 17, -19, 21, -24, 28, -30, 34, -37, 40, -44, 49, -54, 58, -64, 68, -78, 83, -91, 100, -108, 119, -130, 143, -156, 173, -192, 214, -238, 269, -307, 351, -406, 480, -574, 701, -879, 1138, -1533, 2176, -3345, 5816, -12794, 64029, 239135, -10599, 93050, -86577, -149915, 78287, -14000, 33205, 9457, -4278, 28236, -10571, 8420, -68666, 10052, 34626, -22837, 42721, -21544, 6702, 20289, -29816, -13524, -25368, 38028, 6708, -4393, 30353, -35029, 31325, -3856, -86662, 14071, 32456, 43258, 74607, -61126, -106742, 8699, 9098, 56053, 67058, -69211, -11840, 5644, -32472, 34528, -17941, 2268, 29923, -2804, 3461, -32586, 8293, -1730, -6708, 23929, -24172, 24902, 11236, -22012, 1777, -20427, 14965]
134A4965j8812Q827K602j8340O0705q4924p8M0897l7949J07650m2779p5899L7385
147e750m3400N6000L8266m4822O15o317p35J700N483r729O682K3155k1003k024
161a879j031m190Q325k818Q96l393J7298n437j7601J0397o988M691M649o999j911
176e991K4240M152m1804J1866j9285J4858O7472n3549k605m396l8910O3898j0369
189I577j1811J5816k4196J6554r426j490N07l45K2154k2292P494j11j1929J7286
203G788j5431M511M954L199L122j7075J3875q037j662J1302k3555J8329K1791
216B3111j8478n180j1787j7282L8142J9431k7559R073k4795n613L7754k1754P947
229C010M297j2894J4428j5073L132j980M549J1904j8859J3952o767m081J0780
$$ y = [14965, -3847, 4980, 7582, -10758, 49947, -34977, -35055, 5842, -32107, 75543, 32764, -43135, -5750, -49150, 6850, 45116, 294, 909, -5408, -6143, -4443, 1040, -8689, -2007, 21148, 145, -1879, -2910, -7100, 1225, -1593, -697, -4090, 13208, 7771, -9830, 567, -6421, -1730, 2919, -4080, -5991, 18249, 22401, -19403, -7537, -26822, -11964, 55508, 1959, -646, -5042, -43952, 19946, 9577, -2234, 13582, -10614, 5940, -3486, -4976, -4469, -4814, 17340, -4952, 2542, 2431, -9498, 7788, -7643, -3132, 1822, 5021, 8143, -8932, 4943, -3094, -4756, 6546, -17009, 1320, 23111, 4633, -547, -12334, -29616, 8526, 27957, 398, 9471, -15324, -20937, 16817, -4937, 3010, 7307, -5587, 8841, -6232, -3100, -5080, -531, 11373, -7486, 6466, -301, -4382, 6398]
242F398j6977J1457J24L439j041j0852J7029j5121M791J255j9804L3629R72j5649
256c50K661k2767O672K9874m879r074J104j7794J0302J3034j5772J1370j425k780
270A76M449j1330N664l211Q016K84j0101J3932j0464K393J007q727J1764m300
284d48N107p241J151J1684j9213R892p638l235L1771j6456q698o71j3803J9708
298A910J2969j2133l251m84p342J0116Q21q084J0537k711r89k046m179N713l520
313b673P142n209j589R654j1251L814k199o8O227n606N372p755R502L05j9119
328a3453J4674o986R013J7376k7386j077K661j764J7452j932j2225J423K098m026
342d152N590j280k075P789n051k054j921K044K969m392O230n088K380L242j0087
$$ y = [6398, -10579, 878, 1002, 4441, 3400, -7452, 9577, -5544, -753, 502, -19302, 14327, 15299, -350, 2311, -20456, -13784, 16090, 11211, 2137, 3241, -14553, -4251, 8783, -6989, 4381, 2956, 176, 4625, -6705, -1041, -4252, 3764, 4048, -6053, 7879, -2585, -192, 815, -7912, 3852, -448, 4659, -2582, -1431, 10253, -8960, 932, -6706, -9941, 21830, 5374, -3324, -3995, -17798, 1910, 14879, 2746, -505, -989, -8331, 1785, 2606, -5478, 5059, 2348, 1359, -687, -4866, 847, -2673, 4469, -740, -2329, 7325, -3926, -112, -2311, -2379, 3848, -1758, 3614, -4141, 5361, 5666, -13453, 1221, -5765, 3248, 20624, -6762, -7839, -5178, -6942, 10510, 8578, -3647, -2224, -126, -4152, 1438, 158, -1917, 5872, 821, -1233, -3154, -1110, 1859, -2533, 3697, -1391, 989, 4231, -5856]
357e856N699r01K818j384k481P304p799Q562j0286r871K2994o778N708o96k4283
372a7250J3097P535j030N191p850n107N230J407n098M979J063j167J745n459R13
387a801L40L223j349k817P230n828R37k16l907O653k628J525l688M733M075j4144
403g662P680o375M248K0042j9883k044L46o576J8287j080q464J130j218o45K128
418h6P00k500N588j166m573O05k36K817k141K444q97j148M463p735K078K786j027
435b8J291l365N638l836K178k650j2005J9168o58l931N161k0923Q599J1986n827
450G98M818o133m116M292J163k585J277M156l247J04j880j106K825J65O56k807
466a620M101j034m646L755k656L137L56k072J213n07N138j1093N99Q709n272J3616
$$ y = [-5856, -157, -1058, 1760, 376, -2105, 5199, -2600, 5962, -4324, -14195, 8799, 2021, 7729, 7033, -17250, -4153, 3382, 2352, 7543, -307, -5414, -184, 1223, -3875, 1104, 2167, 1000, 2745, -2714, -1801, -1461, 1762, 413, -2404, 4826, -1002, -65, -281, -4188, 2465, -163, 1362, -2326, 2407, 6482, -7662, 18, -6357, -2109, 17933, -1950, -3994, -3648, -10224, 8063, 6983, -1481, -351, -1569, -2214, -86, 614, -1886, 3702, 2536, -2037, -1432, -1668, 1149, -992, 1452, 555, -593, 3870, -3865, -1787, 999, -28, 1263, -2102, 3536, -300, 1878, -772, -12777, 6391, 5733, 1802, 6963, -13960, -5361, 6625, 798, 5616, -517, -4633, -341, 822, -1763, -486, 3670, 423, 527, -1353, -2459, 366, 531, 1187, -1620, 2481, 1447, -3199, 556, -2100, 1037, 1393, -679, 534, 27, 5165, -5928, -5329, 3380, -1892, 11724]
482A1724j0342j4175J3574l452O670M269j2529J932K157p08P3J799K90o92J518
497B108m755M75K804J45l74r71K874l111M61K0k735N558j679j157j34J852J258
514B639p746M730k364L700J1485j7177m13L824m550J5069m849q554M198k450J850
529f08J452k15m93J486k01m640K259J283K11J48n81Q19j791J753k626k08M761
546B809k790J05m88J473n13l202K518m234R089L221j3810M998m099J869J3625
561A0571j0352k419J932l615M988J77j249K29J380j449l123K792J43P34L48j231
577a44K03m98J105k757J508L049k862Q70r10P66k85j323O77k226Q779k183r044
594e275N186n566O445Q774j1937J082l4k178O285j701j345P18N19j683j651K820
$$ y = [11724, 1382, -12793, 781, -2671, 3999, 8268, -4261, -2329, -172, -880, -807, 992, 1282, 590, 2108, -2647, -2172, 632, 777, 403, -568, 2306, -805, -344, -324, -3059, 2499, 820, -337, -471, 1381, 2639, -5107, -377, -2741, 959, 12444, -4733, -5146, -1322, -5872, 9197, 4348, -4206, -8, -2458, -608, 844, 629, 136, 1622, 1421, -3219, -960, 323, 534, 682, 101, 920, -871, 882, -1744, -1952, 2809, 19, 124, -364, 1109, 596, -2606, -88, -4322, 4767, 7988, -5822, -824, -4923, -3054, 10571, 219, -2200, -268, -3883, 1105, 1282, 33, 262, 1642, 193, -2930, -138, 5, 739, 1087, -144, 59, -439, 666, -2091, -583, 2466, -396, 474, -436, 330, 45, -1278, -601, -2827, 5952, 3769, -5275, -89, -5655, 790, 9564, -2373, -1291, -1325, -3503, 2782, 1081, -264, 454, 973, -710, -2361, 459]
610D59l29Q92k0j716N14n9N11j963K135J729k891J117r96M98J98j015M85m01O393
629E541m808o175N544l874P476L872j2410L327K43p87O032l535j120J115l69j179
645a107n42K888o76K64l84j730J102M1K17r70J908P15l109J394n11K80N54j062
663g28J063J62L211n664l589P492k387M771j34j1725O409K092j335M522m993o94
679a527J917r37k43K98K508j564p04L4j172J677p7n8k66J026p8k938K093K67m04
698a48O48q68J350o40M60l788m97Q619l721o49m75p899R259K695n197K901m103
715b053J93L015j556M76M35J141k232r76J670o13J297l35n00J65j23m2j759K483
733F86N97j916R73l74N98j321k75J47P71N740o311l845M836l024O584P89r034
$$ y = [459, 130, 1022, 1002, -714, -200, -259, 252, -1711, 424, 2153, -738, 379, -617, -119, 79, -936, -451, -852, 5541, 733, -5442, 102, -3772, 3704, 7576, -4834, -1507, -1264, -2051, 3981, 446, -674, 441, 72, -1107, -1649, 1239, 563, 827, 443, -1287, -185, -144, 73, -897, 1011, 1726, -1383, 11, -500, -220, 334, -728, 335, 497, 3708, -1956, -5545, 1947, -440, 4331, 4197, -7528, -1119, 973, -362, 4160, -833, -1527, 390, -547, -790, -492, 2016, 452, -252, -218, -1390, 287, 210, 152, -114, 912, 834, -2104, -11, 256, -148, 500, -368, 982, 342, 802, -2986, -3483, 5136, 1415, 766, 291, -7608, 1651, 4346, -851, 2050, -2053, -1860, 1155, -401, 75, 510, 1651, -581, -1557, 113, -500, 797, 462, -38, 127, 4, -38, -1797, 686, 1283, -633, 340, -34, 564, -757, -1032, -885, -114, 5626, -685, -4530, 306, -2718, 3866, 4655, -4379]
750d379L865K6n41L140k167K50J33l37j141j30K895j171m30J93o59L91n48P29
768A19l71J138K66k721J552M51p50o97Q25K443j955P43l849j878R652k853k429
785c14J424o641N618L531m544J903j119o03M79m18R94j18J367j683j399J839m18
802a02L7k7Q20j61j190P51j220J213Q92j751P77R04N58l816p4L838j356M176l936
821C33p082P928j86m01L031o522J397K639k018J150J92P60j421q01Q22o68J886
838A039l90j087O75j18k67j224J863N82j523Q85p06M18k20q14J8J004M314m981
856e32l602M444k218N238J120r181L818J239j462L648k560l95Q62r71k03j06K562
873A701j007j398R52q58N09p5K89L17j20M14k128J002J410j556K5Q70J796k414
$$ y = [-4379, -514, -488, -1029, 2111, -56, 194, 327, -10, -1151, -1281, 1614, 443, 13, 206, -453, -62, -610, 119, -252, 886, 1152, -1569, -17, 434, -316, -1013, -188, 2255, 300, 1043, -2806, -4684, 4968, 2115, -314, 1110, -5531, 87, 3618, -926, 977, -142, -745, -266, -684, 310, 192, 1559, -124, -1523, 316, -102, -65, -92, 728, 567, -623, 128, -1092, 121, 1013, -738, 39, 943, 1501, -2315, -2389, 1449, 93, 4269, 333, -6749, 1179, 993, 592, 3623, -2899, -1502, 1137, -881, 269, 461, 1221, -200, -1001, -179, -847, 1039, 649, -438, 237, 119, -148, -1372, 491, 1073, -450, 435, -271, 147, -73, -887, -869, 135, 4449, -532, -4134, 310, -1908, 3330, 4450, -4731, -913, 326, -1136, 2512, -48, -443, 419, -552, -755, -861, 1701, 694, -704, 248, -610, -101, -176, 113, 430, 310, 724, -1404, -402, 1008, -548, -523, 347, 2143, -271]
891b71j441P07j352P012j223q065M313j263J147N461o339l16K486k049J156N2
907A5R15k95j010K03j297J888N58j372O35O1r5j433R15J281j220P86o26J6N51
926D76j114o28J18N062j931n666L280j995L348N272q933L68L146k660L716r15
942I44j728J428j028k41n33K040N85k210Q61l84j34L12n0P26m69N35j295m77K163
961A045j161o61Q64J813j089l352J897p10L208L594r252P75M299k695M886k260
977A201m355L917r87m72R97L74M48k053N06k4L8J620j298l0M09l15o23k51K185
996A287r53r68J069l53%j167N27P79J475J268o912R40N718k764K952k363n650
1013e115O295J19k036K220j774Q6k48k57R58n3J156j690q21J623o65m7K87P59
$$ y = [-271, -1712, -1005, -2357, 4655, 3432, -4633, -320, -1583, -436, 5025, -1314, -1630, 856, -1193, -37, 15, 930, 635, -375, -172, -1469, 419, 977, -395, 240, 301, 206, -1227, -312, 969, -251, 535, -91, -75, 476, -638, -1266, -1148, 3914, 1983, -3683, -403, -2398, 950, 6222, -2711, -2343, 803, -1857, 1859, 944, -784, 644, -384, -625, -1158, 882, 1467, -743, 118, -266, -400, -88, -138, 588, 119, 654, -641, -1118, 1045, -116, -777, 87, 1900, 811, -2541, -644, -1354, 1854, 5448, -3804, -3029, 1270, -1425, 3461, 1201, -3154, 763, -224, -696, 301, 675, 1123, -930, -424, -448, -410, 1210, -88, -118, 291, -24, -647, -898, 1287, 334, -634, 435, 82, 82, -1085, -558, 221, 1696, 2964, -3948, -3008, 2710, -54, 2898, 535, -5115, 1180, 1299, -737, 1483, -291, -205, -453, -710, 248, 195, 1351, -339, -1160, 463, -202, -249, 38, 797]
1031G97m57j288J062m35L54L85r28J038L36n27k970J002N308k927p90l62m211
1048d613O699J508n450K457j354o51K623j394M61K98m87o80o99K209l42r38P63
1065D10n29k7m04N15M45l42N50j252K71J024j176k99R49K218k181k644K250q44
1083a066L063J562p103K009K778k163K887j567j877K053r93k3N44P16q5j823R10
1100a78K61l58P01l64K03l18k07k2j12J297q83o19J185j64j004j059K283J052
1118A694j594M63l309J100N513l682j056J284k567K778P10k078J262l78n53k80
1134f93N34J266j180lJ38n69N96j84K44J28q9j67q90J139K08j082O06P28O5j992
1154a197mJ686k12K019k490l500M685J91j390J772k970L59K106j523O26L80k93
$$ y = [797, 340, -948, 114, -321, 33, 418, -510, 528, 864, 337, -2633, -1631, 3677, 750, -40, -402, -4613, 2086, 3594, -1856, 601, -753, -1404, 1219, -175, 286, 584, 97, -583, -1282, 927, 585, -353, 410, -119, -146, -550, -35, 410, 68, 618, -634, -363, 661, -515, -814, 135, 2353, 172, -2472, -222, -1066, 1997, 3559, -3544, -1535, 1243, -920, 1967, 400, -1477, 576, -417, -440, 104, 820, 735, -1088, -178, 83, -275, 426, 62, 265, -53, -260, -282, -394, 903, 20, -599, 586, 422, -582, -1641, 642, 1694, 100, 563, -2746, -1646, 3867, 185, -871, 413, -2154, 624, 1334, -744, 518, 140, -413, -693, -159, 1107, -73, -76, 62, -507, 89, -95, 149, 277, 188, 21, -869, 270, 478, -604, 2, 730, 795, -1197, -1201, 485, 273, 2292, -198, -3698, 987, 1178, -212, 1560, -1410, -1051, 1055, -468, 158, 538, 245]
1171B45n76o27J380j62k71M25o95K34j15k8L19O3L83j085J35R61q67k80O28J241
1191A308r74j729R96l95K137J283n033J043K401j676K062r86j907J907o06k09
1207c78P36J06j7j316N88O35n67N57k38j03p2k98L76r3N97l43p75J022k17q40
1227f40l6J449Q04k397lJ25O2L558k552k961L148p87J81J522k184M54M73q14O10
1246A2K09N20q79o72J118l97OL68j36Kn91L49Q9NM95p89L11M60q25n81O61K273
1268B008j524k134J443p37J907J639m551Q26K102j715J462j78j091P51o86K64
1284b14L62K22K01j303N14N61o62L74K02J03o58k07Q63m51R3J83j81M19o37n12
1304g28qJ855J011l814J87K213j095K208j233l153L114M9j261J450p22k16j80
$$ y = [245, -331, -958, 422, 260, -11, 414, -281, -47, -162, -190, 129, 192, 575, -510, -375, 586, -281, -561, 67, 1308, 334, -1395, -399, -794, 1343, 2626, -2407, -1364, 1037, -639, 1423, 437, -1470, 437, -169, -378, 358, 464, 447, -869, -281, 354, -213, 344, 106, 3, -69, -367, 9, -84, 513, 170, -605, 417, 200, -640, -676, 773, 1577, -820, -823, -698, -636, 2922, 370, -2591, 557, -230, -49, 1473, -711, -257, 216, -598, 12, 221, 741, -138, -810, 308, -89, -83, 285, 149, 151, -440, -91, -2, 3, 498, -291, 20, 480, -345, -926, -265, 2008, 484, -1650, -207, -944, 963, 2602, -1949, -1123, 979, -736, 726, 548, -543, 208, -478, -214, 148, 370, 571, -732, -218, 343, -319, 55, 257, 360, -298, -505, 358, -93, 0, 183, 2, 421, -216, -728, -736, 1119, 2130, -1684, -1497, 716, -379, 1829, 596, -2557, 557, 606, -655, 795, 73, -143, -323]
1321c23j85R69l56K37k96p23Q83k08j83M15P3j82q59P67N10j006M18N42J4r68
1341d61n48J087K69J343j423l423L525J422k305J530j747p80K823j331k62J001
1357G20q57j93l36R85M27j135N09j64l21M20j16M04k42j85k4l34Q54l64n58J045
1377E35J88j075j375J900J807k087Q5j021p88M365j391l005K392q56k89J602j057
1394g0K57j24o23M70NQ00n17q77R30k87l04M20K98l3r91N34N24p56K40K58L77
1415E31l41r32L0L32K365p58m023K356J546j430J872j964j413K903r97n25J215
1432G67o95k91m47O55P50r39L11n0m46M46j49L05Pk78%l78O78l6p72Q64M72q15
1454d1j470J045K331j596o08q3j442L343L97l626J706L98j234J556m02l31K05
$$ y = [-323, -508, 461, 105, 342, 46, -677, 206, -2, -185, 230, 303, 121, -738, 29, 539, -467, -49, 493, 507, -461, -1009, 78, 347, 1690, 267, -3156, 369, 1791, -514, 1016, -731, -1511, 1312, -19, -281, 720, -137, -330, -666, 319, 746, -389, 120, -44, -365, 55, -61, 343, 101, -84, -108, -442, 412, 48, -510, 535, 723, -352, -1727, 173, 1980, -107, -22, -1043, -1831, 2534, 1143, -1862, 530, -326, -615, 987, -70, 187, 63, -560, -90, -85, 715, 198, -679, 251, -36, -340, 80, 378, 345, -646, -112, 412, -344, -104, 154, 531, 190, -742, -712, -380, 1985, 1227, -2796, -440, 1106, -324, 1548, -416, -1829, 1074, 77, -448, 767, 72, -219, -666, -11, 739, -200, 111, 61, -385, 61, -88, 217, 224, -54, -54, -432, 246, 210, -562, 302, 774, -41, -1511, -466, 1865, 269, -339, -422, -1864, 1479, 1876, -1750, -44, 354, -880, 676, 274, -57, 148]
1471A48p06M88J03L11P8r91N39K23n19M00K16Mo97L8Q92o68k32O50K49m21j003
1492h98N32O02N72M06l024L49L391j772m37Q53j885J307Q94j388P98o2o51J14
1510b99J77Q06o17n10O94l83r3L37J06K0n81K58K23k95K56j42K29J76o88l82L71
1531c37J791o01k708J520R58p80J377j591j116K348o71o41J065o24k72o3K97O40
1549E92p07L4J61m15L98J3oJ22l36Q0r8K39J76n52M46L27p05n98O47J622j154
1570B86j453J094k87Q46J008k706K95J891j322L46N75q69J47j25K97M00n02J66
1588H7k83j05N65l00O5J72k94q7l9N32j26n84O61J27p57l52Q71J052j267p09N33
1609b38k95J693n9k814J427J122j344R29q5q38M93k18L07K70l94P9m13K52N12
$$ y = [148, -558, -70, 33, 344, 422, -569, -30, 193, -326, 74, 290, 294, -403, -365, 527, -141, -373, 277, 526, 105, -898, -366, 236, 808, 1214, -1810, -1461, 1930, 158, -279, 574, -1311, -4, 890, -498, 300, 238, -413, -299, -122, 684, 67, -443, 251, -132, -225, 112, 218, 238, -343, -85, 138, -157, 99, -43, 186, 362, -326, -708, -337, 1454, 853, -1855, -335, 623, -157, 1220, -371, -1487, 861, 190, -451, 614, -10, -282, -345, -48, 592, -115, -81, 80, -335, 63, 76, 70, 192, -144, -64, -162, 77, 253, -299, 147, 474, -231, -829, -182, 1440, 286, -1167, -73, -360, 486, 1494, -1212, -917, 974, -348, -2, 573, -296, -149, -274, 23, 423, -79, 87, -196, -301, 264, -36, 29, 201, -93, -180, -219, 313, 187, -397, 264, 391, -366, -718, 153, 1205, -62, -771, -238, -533, 1160, 1101, -1713, -286, 836, -508, 421, 336, -502, -9, -227, 80, 350, -44, 35, -378, -126, 386]
1628C86n22J74J46l55m2J09N04l70m17P31j61o76O2R14M55j356k50M25J15J655
1648A527j265k243K365L88j291J127o34o06Q26l45L37J49m97P3k92M80L19o66
1666b48K97O7l86J21K30L10n23k02P14m16m70M81P00j90j340L28P78Q5Q17j806
1686f53j104K924m21j449J228q02l05J037m57K03n6n31L22o7M17K6o99M19M3l49
1706b74L42J35j9m85O6O44o01j72P54J36p39q14J129P95q05O0j096K9K656j347
1726C94j649J733n83l41J133o57q8j7l17O31j04k5J5n52M71Q8k81L67j26k15j09
1747b32J79M12n87Q9O44n31o53K87J322j60j752N46M86oJ272j715j134K411n04
1766C74r38J172o66m00M66j3M47m42k93M08l35K79K05l61J68k04k1K66q3J50k93
$$ y = [386, -136, 38, 184, -171, -213, -104, 400, 30, -387, 344, 183, -493, -431, 483, 938, -418, -668, -243, -128, 1527, 262, -1981, 384, 772, -519, 608, -26, -632, 194, -151, 186, 335, -162, -89, -381, 99, 418, -248, 49, 116, -270, -149, 81, 391, -132, -334, 380, -36, -506, -25, 675, 485, -855, -527, 251, 336, 1153, -653, -1757, 1167, 746, -703, 525, -277, -582, 455, -2, 201, 145, -386, -64, -131, 286, 312, -387, 32, 75, -274, 68, 203, 184, -301, -235, 409, -192, -364, 390, 526, -213, -1027, 102, 897, 92, 152, -944, -915, 1741, 394, -1255, 478, -105, -446, 687, 30, -58, -75, -392, 239, 135, 110, 125, -427, 44, 132, -149, 218, 92, -123, -232, -53, 359, -228, -139, 505, -26, -679, -392, 930, 770, -982, -436, 50, 44, 1316, -399, -1533, 878, 374, -564, 608, -58, -458, 8, -5, 442, 0, -293, 115, -220, 59, 264, -97, 71, -133, -154, 112, 29, 179, -114]
1787a14L8K99n86P4P74J75j033r84J772Q54j741L03p8n26J904o83j487J389k62
1806H8o22R29j37k63k77k0P32l91j89M19m14m8J88J28J13m35J44K00l37J53R8
1827E9J93j8o64kM26Q92k88k089J030J756j507J17M12j207J066M22r81N97j55
1846E9m89M84O7J78l43l50O11j95k14M56j39k42j14K92K54n63J87M92m95m36K78
1867b22Q70j68j065K56J40M26R14j789n35K093p47o53J065p82k40O02j42K41k73
1886ik93L91j90J64J85m07J51l9p0K85j28%o7o0K17l20R8N91k54p34k64J321N64
1909A132j850O5J047o30O81M4j430R57M94r08O04P1n91J50J02L81j91m86M89q2
1929D9k93L93K4j71j93R4L62l85p1N22j51m69j63O75M18p09k11j45K47J334j043
$$ y = [-114, -76, 223, -363, -289, 485, 660, -373, -1357, 415, 1269, -472, -169, -247, -773, 1131, 448, -1039, 350, 88, -534, 395, 258, -5, -282, -302, 430, 39, -150, 269, -145, -193, -5, 123, 236, -199, -55, 145, -192, -39, 59, 252, 234, -430, -432, -6, 886, 598, -1491, -461, 1295, -212, -95, 317, -890, 176, 598, -383, 214, 59, -430, 54, 121, 299, -44, -394, 217, 22, -192, 264, 125, -117, -231, 61, 315, -248, -61, 431, -64, -500, -222, 648, 480, -585, -329, -189, 237, 1151, -638, -1173, 920, 173, -480, 585, -197, -437, 165, 23, 264, -9, -302, 89, -101, 63, 248, -159, -8, -47, -117, 168, 40, 40, -27, -87, 130, -190, -92, 499, 245, -489, -753, 568, 1132, -718, -653, 394, -236, 445, 489, -941, 16, 510, -398, 206, 277, -314, -164, -62, 319, 128, -358, 131, 49, -244, 149, 173, 2, -191, -97, 265, -120, -191, 331, 180, -289, -452, 223, 641, -68, -279, -424, -177, 1157, 114]
1950A14j384J637P4r29R15l04o15N32m3J70jm34K67l6n1L33k79m4Q0j54K33j0
1972G1q3N5j32J23j25j02N45po12m41P24J168j252j030J423q4l93P64r55k38J120
1993E39n44j40M95n40m2K23J55J21n06R2L60l91J42K75k36j54j6L33o5m05M91
2014A87J59o57k10O78O91r18p85R27J34K0L34j388K48J603j057m16R35o96j57
2033c68O16m4q1m07P9N10l87K6L05l91m1J82J46j9l51K36J90m69P6L92J83m42
2055e9n65N50M56Nk24j199O98J710j484p07J335o62k13R33n40k50J28p1M70k23
2075H8k35K67k96J03K92k18K9j23n3K73j76L3J43j40k0k59K27N40k44n64m40Q81
2097A08J214j655q69J788l26o23R21p37l42Q51k93K6J20m75K48R4k2K36m13NK73
$$ y = [114, -1270, 367, 441, -488, 427, 123, -492, 40, -3, 167, 166, -268, -1, -37, -88, 245, -34, -78, 2, -152, 81, 71, -12, 43, -89, 34, -91, -193, 352, 345, -267, -708, 16, 1184, -68, -1098, 325, 241, -152, 612, -343, -581, 539, -5, -145, 350, -190, -232, -9, 146, 267, -239, -147, 213, -178, -36, 239, 3, -151, -167, 166, 101, -304, 187, 346, -311, -521, 157, 848, -70, -855, 72, 206, 226, 560, -828, -580, 1023, -34, -450, 485, -211, -368, 248, 204, 123, -284, -205, 305, -82, -56, 249, -142, -183, -1, 145, 126, -225, 11, 201, -268, -192, 200, 383, -59, -624, -74, 382, 387, 163, -1036, -338, 1372, -112, -819, 516, -146, -359, 574, 34, -216, -88, -159, 311, 88, -147, 120, -176, -73, 219, 1, 30, -93, -146, 127, -49, -16, 127, -13, -33, -292, -65, 475, 231, -333, -773, 108, 1322, -333, -1202, 586, 260, -363, 558, -179, -521, 330, 37, 63, 183, -292, -44, 50, 28, 264, -149, -144, 129]
2118A29k15J82N0k55P6l9J04j2j02L60k40n65L30P12J84j322m90J956r8j474Q07
2139G8p0n32J128l63p53O53k28n1M75l22q9m9k4M60k86j68K90k72J9K71j02m0
2161B5j39J18R7l64L75L78n82n45L44J215l53j736Q63J116j015K99J53r96Q58
2180A11M16q19L85n8m01N00J2o9p2l19M03Q6l12K85j19k24K04M3M8j32k6K39l93
2203b12p4O88M4o99n90R45J098j464o91J403l69k67P55q97j68R32m55k3K86n34
2223b92J77K23o5J53l65j2L55k48J10J18k75P1M9J9O6j25J80j54l99M66M65k82
2245B35q16j28J552r1j697P58O84q71O08J47r47N00K81k94K86k91j61L52j64J50
2265I3O4l71J71O8m8J74k23j1J58j97J02J49J1j03m19K58N37j06m23o08O32J224
$$ y = [129, -86, 96, 146, -109, -33, -72, 32, 20, -82, 278, 38, -527, -197, 515, 699, -623, -1113, 843, 745, -729, 78, 8, -524, 604, 241, -512, 141, -87, -138, 337, 15, -74, -123, -147, 313, 27, -141, 149, -123, -104, 167, 65, 25, -114, 4, 101, -263, 112, 490, -92, -637, -293, 922, 569, -1167, -304, 812, -203, 96, 249, -747, 111, 527, -292, 93, 35, -366, 134, 146, 77, 5, -314, 89, 175, -137, 148, 29, -195, 9, 52, 100, -32, -58, 181, -212, -286, 402, 446, -253, -843, 102, 1200, -264, -955, 448, 79, -188, 567, -330, -498, 434, -21, -44, 242, -292, -115, 108, 43, 196, -169, -181, 174, -74, 36, 154, -121, -50, -1, 18, 84, -41, 139, -15, -414, 52, 517, 235, -581, -709, 843, 752, -945, -187, 497, -374, 234, 381, -566, -66, 215, -79, 207, -84, -245, 107, -57, 93, 157, -214, -43, 25, -23, 151, -72, -83, 75, -122, -20, 129, 140, 37, -382, -124, 413, 307, -116, -724, -92, 1132]
2287A132j267q05J430k88o28R05l98n67N74J1J5l1l81L43O1k70L52j25k81J85
2307c3P2P9j33j40L07j64k74M01K10k81m77J91P60k58n06O7j47O90L57j414K34
2328d59J170q65j15P48o68j58N38m7m2k63k5M16k84p0L60l14j41K66N8n9j86J51
2350A1J55m23J06N59k17o30j7R12J73j174J25Q17m35J43K05q82M74O67p79J17
2370i3L20n13K64K69k53J1j49P3K72k63K1J29k46J36J06j20P2n3m8j6%L29p8n18
2394c48N8M63L91n69q82J011O91j206J07P06p35J67O29n71j33K22oK11k14j60
2414a68L07k16l0L34j98j72J11Q0O3k11M4K90l47k21M85K46m20n24M68O72n82
2435A1l18L13k20M14K89r83K07P69o03qM34m93nL65q8k5j70j7L05j98m0J99k18
$$ y = [1132, -135, -940, 490, 202, -426, 479, 81, -486, 88, 99, 114, 83, -298, 45, 106, -164, 188, 63, -218, -33, 39, 118, -15, -155, 152, -12, -286, 115, 325, 44, -433, -242, 518, 260, -246, -179, -326, 364, 721, -693, -459, 711, -154, -269, 479, -189, -347, 191, 144, 102, -161, -186, 230, -54, -124, 236, -78, -219, 47, 105, 46, -140, 11, 166, -257, -151, 408, 191, -439, -456, 456, 629, -545, -420, 397, -38, 105, 310, -572, -98, 569, -210, -93, 227, -286, -22, 247, -6, 5, -144, -71, 201, -62, -41, 88, -158, -22, 84, -36, 36, -17, -65, -81, -81, 248, 170, -348, -290, 173, 564, -5, -887, 124, 815, -391, -284, 422, -313, -146, 483, -88, -221, 1, -5, 206, -8, -168, 139, -77, -107, 227, 29, -143, -32, 48, 111, -100, -56, 234, -113, -334, 151, 397, -23, -547, -79, 593, 11, -307, 6, -214, 200, 489, -494, -287, 482, -121, -129, 305, -188, -193, 172, 84, 59, -111, -128, 177, -21, -61, 138, -80]
2458h0j2J79q9J3Qk7l5j19K94J89m83k30L45N11j43j030L51J146p76n34Q50l39
2480a1l74P46j94m39K11M5J44m5k81K52J5k65L27K8l03P1J28M9j29q4K96j56l92
2503c61M00L88l73n77K85Q74m12q30N93K29m02M75k36o02P22J39n48K83l1k37
2523b21L60m4j45P1j63J37J80k24J9L0o2J60j18m3K27j96j83K28K60j12m94Q0
2545b53N85j35k59j25j61O96J73j088K89P88o82NN17n18r0M10m4q2j62jL16j76
2567Cj07K41k05o7K47p1o1L2l4%p8K05J56m53j37M54K84k49p48K63J102o17q71
2590g11R07R7o97N94Q6o37K53K73o6j04k17K22J86l30J31J79l47P2K45r7j01m
2612f6J23l1k24L11J66n19j31N50L30n61o60P91O99j045j95Q55m56j76O60m37
$$ y = [-80, -92, 87, -2, 11, 19, -8, -43, -162, 132, 321, -162, -392, -47, 464, 321, -709, -358, 788, 12, -522, 328, -11, -385, 361, 167, -272, -61, -16, 128, 83, -198, 54, 69, -196, 131, 159, -144, -73, 55, 104, -25, -109, 187, 31, -361, 39, 427, 54, -523, -238, 636, 224, -606, -13, 216, -186, 289, 53, -549, 173, 312, -236, 47, 16, -221, 139, 95, -50, 21, -142, -5, 175, -49, -30, 0, -62, 98, -20, -63, 164, -32, -215, 13, 273, 161, -333, -253, 332, 197, -62, -187, -348, 348, 521, -567, -278, 510, -172, -167, 350, -168, -258, 152, 108, 26, -136, -137, 179, 3, -104, 137, -68, -135, 112, 41, -20, 12, -22, -22, -100, 105, 261, -192, -329, 125, 409, 160, -588, -325, 777, 160, -711, 196, 293, -404, 190, 276, -361, -108, 165, 99, -5, -222, 0, 186, -144, -13, 166, -181, -109, 136, 39, -62, -66, 57, 26, -198, 113, 279, -240, -371, 179, 509, -52, -712, 79, 778, -267, -462, 393, -63, -239, 421, -16]
2632a6l60M67M5q9q3j70K98J5k72K64k8k96K33J47j58r6M1J59j16j50L65j3n19
2655c32J16N58L7p03k27R92O7j013L53N16n86K52L32o41Q1M54k06m3o6p9K95j18
2677C9j60K64j75j66L28j5j86j6P8J11j66m1L13k18l40L91L46l29n32L00P77m76
2699A27p06O79J96n51L82P6n79L91K90l67J5J6k6K38k09p7K26k16qK91j52j74
2721a38J21O3J2j49O6J71k63r0M37k2m55p4M98K94p04k72Q40p2o08M63J5m78M78
2744A33J38m84J12J59m3J03k02nK24j92J0K20k31q3K16mq4l8L4O4j57R2K45k60
2768c3k56K96L06j97n11J64P19l64n98N80J17n09L79J49n28K09K83k08k9l6J8
2789d9J85j60n1J85j67l9K23r2j02P9k0MK9J8k0k01R3L15j56k74L7K54K46l99
$$ y = [-16, -376, 91, 136, 47, -36, -206, 92, 107, -165, 99, 71, -225, 8, 155, -3, -99, -58, 101, -15, -165, 200, 187, -332, -216, 342, 379, -324, -551, 441, 508, -505, -152, 364, -222, 30, 362, -279, -198, 256, 50, 7, -59, -138, 157, 39, -121, 143, -32, -198, 130, 115, -71, -87, -9, 102, -64, -105, 208, -10, -350, 41, 387, 58, -474, -174, 603, 127, -579, 100, 296, -255, 127, 203, -376, 15, 305, -62, -47, -31, -57, 181, -28, -105, 121, -95, -103, 188, 36, -138, -17, 46, 58, -91, -25, 146, -117, -207, 230, 208, -247, -321, 177, 471, -233, -505, 335, 263, -345, 118, 133, -345, 133, 271, -213, -101, 58, 15, 118, -84, -89, 135, -57, -47, 173, -58, -141, 75, 71, -13, -51, -17, 47, -110, -18, 227, -33, -289, 7, 313, 116, -395, -231, 488, 124, -474, 106, 223, -286, 93, 242, -286, -77, 206, -2, -31, -67, -49, 136, -24, -75, 110, -57, -96, 127, 35, -67, 12, -8, -4, 25, 43, 23, -178, -85, 230, 74, -200, -163, 91, 337, -62]
2813f2m10O31K12o63K06L30m58J33L47l40r2K12k6N3p8j13J80j8j03J24p5n9J20
2836E1p6K1J28j77r8J86J59j28l40J68L93k36j97J20r2J87K33n43m3N85k59k19
2858a77K88j76o9K86j40r0J20j34R3J42k09l3J44Nl2n4M5Q3k32M8L62j79m10J84
2882a35M74o5o32M0P47k44n87M77Q9m54M17J36n94J97L81k35p1j1pJ97j21j16
2904a17K20j41j20K80o0j70J05K3l2M6J9k1j85Q0L42j73l74J60K80R5l11l80N28
2927I4L98p25q2O26l38k02M81k50k67L51Oj44N3j00P9J55j85j7Q8n1N9o4kJ67
2951A30k13j64M20J01m53j58M75L14n58l71P08J11o19K60K24n02L09L78n93n8
2971b59M48j10r8k2o4J92l8j85K10l6k37K54R0k44M0Q2n7L6M9j1j65k3L68j8m65
$$ y = [-62, -472, 159, 371, -292, -86, 244, -214, -81, 266, -74, -166, 46, 20, 73, -5, -118, 62, 44, -59, 65, -10, -69, 51, -25, -4, 124, -53, -151, 35, 194, 66, -274, -106, 287, 51, -146, -26, -118, 69, 302, -241, -284, 301, 42, -177, 111, -65, -134, 152, 12, -78, 42, -92, 1, 143, -66, -99, 45, 50, 18, -36, 9, 92, -140, -92, 270, 91, -319, -135, 339, 274, -358, -318, 429, 185, -402, 75, 164, -290, 127, 263, -331, -134, 247, 12, -59, -70, -77, 120, -1, -117, 103, -38, -158, 122, 62, -108, -3, 20, -12, 34, 53, 32, -153, -73, 269, 96, -278, -118, 162, 257, -54, -434, 94, 492, -233, -315, 311, -27, -229, 252, 2, -265, 86, 92, -52, 1, -99, -20, 135, -50, -67, 21, -30, 29, -35, -37, 130, -83, -247, 173, 274, -179, -337, 138, 452, -106, -477, 231, 342, -277, -17, 207, -295, 14, 392, -201, -259, 189, 79, -19, -41, -105, 87, 49, -136, 74, 38, -199, 55, 145, -99, -59, 23, -34, 2, 51, 40, -125, -148, 220, 202, -263]
2996b63P7L33N9j53l79J68O39m01n50O00J16m66K82R5l81K25J63k14P0n2q8K47
3018A27n1k21R8R9l1o1k9J74j00k70L47K62n11k38N36L16n11n08O25N37p77k78
3040d65Q08k09m86N88m2n82M13K82l78o2J04P4P1j85k9J97j07l5J21j22OQ8j62
3063a12J30J74l16j58L85K05m03l31M92L91o30j74N72j94k15M30k81l41N86N7
3083B67m99J33J91n5K7j50K0J98j73l0K21j97r8K62o2j25J01m8n3J28N6j36j88
3106b10J89L20l25k63L28P7j13N9k63M3N03k94m20M23J14k65J12j8j06K13p0j29
3128i5K04j36j00K78o4k49J55Q8q4oK1%q8K5K48j68l19K77K59k27j88mK43K28
3152B98m49k29N91Qm66K28J34k58J81Q1k55J23P0j39J57k2k25J86J40k00j8J03
$$ y = [-263, -186, 147, 206, 53, -326, -158, 481, 80, -470, 130, 246, -220, 62, 157, -224, 1, 164, -50, 20, -32, -120, 127, 76, -145, -47, 52, 21, -40, -69, 105, 5, -265, 82, 344, -167, -405, 131, 447, -64, -572, 53, 590, -187, -465, 343, 134, -352, 236, 194, -388, 25, 307, -71, -133, -29, 45, 116, -69, -98, 99, -8, -43, 78, -44, -38, 50, -112, 18, 192, -124, -282, 103, 308, -95, -426, 66, 457, -173, -347, 225, 31, -184, 246, -35, -376, 210, 267, -232, -99, 92, 37, 64, -86, -66, 132, -41, -71, 150, -47, -145, 117, 55, -70, 31, -17, -70, 58, 114, -22, -210, -21, 299, -26, -289, 39, 116, 3, 62, -201, -158, 345, 51, -369, 54, 168, -97, 15, -3, -109, 104, 34, -95, 109, -27, -127, 151, 87, -162, -7, 81, -3, -9, 12, 12, -76, -51, 197, 29, -290, -13, 246, 19, -169, -173, 70, 298, -151, -380, 211, 219, -247, -19, 115, -143, 38, 119, -136, -13, 57, -82, 75, 53, -172, 14, 154, -46, -64, 39]
3174C9j8l5j2J11n4k20K00K60l46j75K82J78j09l24kN36j00n68K93L35l81JK47
3197A38k61L0K37j82l3J26j47R4J36k32k5K17n8r1L1M0Jp3P2J31k52r4L73Nl52
3222a69NK23J63j88l72K92M20m56k21M66r2k32K54p1j99K36j1j39J42r9q0K53
3244A25n6k40J52R7j03J0J5ol5J7J57r8k53K29K49k76j54J23J31J18k81k33M47
3267A35J44m97P2L10k08LJ33j99O4J35j63N9Q5k03Q1K05k04p8J63l0l3O7o3p4
3291i6P6J38n6k59J04L43k17k28K20Jk9J69k62j48M72m3m47J97K20j74J8lp9J50
3315F7l1j37J55l1j40J50M4j66O1L2n9J48m8k31J08K95j14l40O4M45r9m94K56
3338f5L54l89l7L75l30j33N14j65m13K91K03k45qL3qJ20j00j01J29pp3P1j0k6
$$ y = [39, 21, -14, -26, 85, 31, -189, 11, 271, -75, -250, 32, 210, 101, -223, -225, 311, 211, -357, -64, 271, -110, -109, 138, -123, -93, 144, -38, -71, 55, -92, 2, 138, -94, -119, 98, 40, -51, -20, 20, 21, -52, 20, 151, -101, -195, 178, 183, -169, -164, 59, 222, 34, -338, -46, 374, -82, -303, 163, 71, -161, 93, 22, -177, 59, 48, -91, 51, -48, -128, 125, 69, -171, -19, 78, -25, -15, 0, -6, -41, -24, 133, 35, -218, 11, 260, -16, -170, -47, 84, 202, -79, -312, 135, 279, -218, -146, 164, -44, -41, 92, -107, -43, 92, -71, -12, 73, -130, -49, 156, -48, -126, 37, 7, -26, 41, -22, -96, -20, 118, 62, -197, -93, 250, 33, -195, 25, 26, -3, 166, -96, -244, 228, 185, -262, -65, 155, -19, -1, -4, -83, 67, 36, -101, 54, 23, -117, 33, 77, -89, -28, 4, -55, 93, 45, -186, -78, 217, 103, -237, -173, 272, 173, -321, -65, 289, -100, -137, 238, -92, -225, 289, 124, -289, 2, 205, -40, -48, -15, -23, 97, -3, -104, 25, 18, -55, 16, 6, -20]
3362b0J5r2J31J43l27r7M55L5m78k9M51J32n00j74N86Q2o23J75M34l95q4M15k30
3385Ek32L59pk33J20j5n0J80j14j70K06O2j78L9O8p2j0Q2M6j87o9L14M3m08O7
3410a54L19r7j16k9n4K61R2m79N1N04k26k97K43O0q8O1q9%J38j38qJ67j38q3J89
3435H9m9p1Q7j46L3K88j96l48K95L49k84m20K91N10m03m62N29K56o11J11M54m31
3457a29j33N56k21l96L78J36k66N5J5m7J71o9j91J58J05j58OQ3k8q7N4J53j17
3480B8k69K68K54l84j51L44M7j57n0j01K35K14m30j58N11nm18J41J74r6J4l7k7
3503e3J37p8r1J57m5j24J35J4q4R2j19m9L15r3m14K25M26k60m35K25M86k39n34
3526d06L16M93m57k86N27m3m01L11J32l79J14K37k08j1R4j22J10R1k47M0K34j31
$$ y = [-20, -5, -97, 34, 177, -150, -247, 208, 243, -235, -264, 187, 319, -181, -355, 231, 313, -310, -135, 299, -96, -180, 235, 5, -227, 132, 125, -108, 12, -3, -53, 127, 13, -157, 49, 111, -67, -28, 40, -32, -42, 40, 86, -101, -170, 144, 187, -221, -154, 165, 68, -48, -77, -131, 130, 222, -257, -206, 298, 72, -225, 18, 78, -10, 51, -38, -38, 100, -38, -46, 121, -17, -100, 89, 40, -31, 56, -90, -57, 231, 35, -313, -18, 331, 47, -373, -82, 428, 25, -437, 92, 348, -263, -152, 302, -129, -262, 294, 73, -323, 55, 191, -75, -20, -5, -52, 119, 50, -141, 17, 122, -36, -30, 53, 25, -62, -8, 145, 28, -241, 27, 281, -103, -254, 90, 137, -20, -70, -171, 64, 278, -152, -310, 201, 196, -222, -81, 93, -3, 11, -26, -53, 84, 6, -85, 72, 27, -97, 38, 52, -32, 60, -59, -108, 207, 114, -300, -75, 351, 91, -344, -119, 367, 128, -406, -90, 403, -54, -340, 187, 144, -257, 54, 186, -193, -79, 158, -50, -61, 33, -89, 21, 112, -135, -95, 139, 8]
3548Hj00J31l3o7J38oj94LK67Pl59N1M18k02l32L54P4l51K28J78m50J02M47l09
3572Ck97L71P8k37L5K1NJ14j08j12J55N0j37K5P2k1q0L4J27o3k13K02K18l32j07
3597a97L25mj76kkJ13J24k75j46M26J6l95Q7K46j01q6J6rQ5j1j14P8N8r1NM4l3
3624a9L5n9mJ74j05k45K47K34l47j50L48J11k60j51J82K48j85l25K60K74l12j26
3646a75K58j4j13P3m5j7J07q6m8J22p0p6J28j4r6O8k3rJ28j28j63K88J02l54n6
3671b13L62L7l18r4L34J33l59j13M04kl40J10K10j78j2J13j12J9R7j04mJ20j18
3694b8l3J46p6q8J04k1j3Q3j45n8K69ol34O7L45r4l34P3L37k7l86P3L81j51l03
3719b19K41J30k28N7J12j40L9Q9j16K1Q4j14K1J19j21m4J16k4l9N5j14K6K15j40
$$ y = [8, -92, 39, 6, -61, 77, 71, -123, -120, 147, 154, -205, -154, 264, 62, -270, 84, 158, -193, 35, 213, -237, -135, 312, 3, -294, 77, 155, -82, -47, -26, -21, 93, -15, -127, 28, 78, -59, -34, 38, 17, -63, -29, 98, 35, -178, 24, 242, -90, -197, 128, 124, -52, -54, -56, 57, 181, -94, -240, 186, 202, -193, -106, 140, 39, -47, -31, -40, 45, 34, -80, -2, 56, -35, -30, 14, -19, 16, -43, -47, 127, 22, -223, 24, 258, -89, -239, 109, 220, -40, -191, -9, 239, 54, -271, -11, 263, -49, -175, 83, 69, -44, 29, -16, -33, 74, -12, -60, 62, -8, -84, 44, 30, -66, 2, -21, -30, 98, -30, -193, 95, 197, -157, -213, 149, 186, -132, -226, 108, 241, -118, -231, 173, 171, -169, -59, 151, -27, -39, 74, -38, -19, 78, -26, -30, 90, -28, -61, 85, 9, -79, 25, 4, -9, 74, -71, -129, 140, 134, -200, -133, 212, 118, -216, -143, 194, 167, -219, -146, 235, 84, -219, 22, 152, -76, -19, 93, -47, -8, 81, -35, -14, 70, -44, -23, 96, -25, -69, 47, 23, -16, 39, -75, -49, 166, 26]
3743B6k78K52K52k86k30K55K48k20k84K21L04k58k55L06J10k48J6J40r6K1O9j14
3765d9L4R0j03KJ08j00l8J25m4o1M6o1Q4J28k56r3L69J6m11M1L52m0k57o5K36
3790E3J60k74k10L61J37l52l1K57l8j20M4j0J9Q1j00l2J26m5o0O4J3n4JJ2Q3o0
3816B5j74J35K31k63j88L34Q5k87J1J32j4N0r4j98K86J83m24p6M57q5l22J59J26
3839H9j04K6j8q3J41M8j91M4J34p3o0J05k9j02Q7J19j53j34K22J41l32o1L91j01
3863A06l37K67J64l74J07L16l49j42M65j07l88K62J80k57L6R0j13J16O5k38N3
3884g8K25j37r5J25q2J8J82j84j99L35J67m13j17M31J00m38j10M61Q3m88JM46
3906B33r0l68J98J83k09j0J20r0KP7q7jQ9p2l5J04l1p1L3K8P6n2j89J45K52k78
$$ y = [26, -252, 0, 252, -34, -264, -9, 239, 19, -265, -44, 260, 2, -253, 53, 163, -85, -69, 71, -25, -4, 65, -49, -15, 75, -28, -26, 82, -18, -56, 69, 25, -36, 10, -51, 33, 161, -95, -188, 181, 197, -214, -173, 179, 139, -118, -183, 53, 213, -61, -271, 90, 227, -125, -156, 101, 63, -57, -13, -23, -4, 77, -23, -55, 71, 26, -34, 30, 43, -11, -10, 2, 85, 25, -149, -14, 217, -46, -234, 100, 185, -102, -91, 41, 27, 77, -17, -215, 71, 254, -170, -246, 211, 126, -196, -37, 89, -15, 11, -7, -90, 51, 99, -92, -48, 86, 13, -47, 58, 29, -73, 14, 133, -20, -154, 68, 209, -123, -184, 207, 106, -231, 36, 200, -174, -67, 249, -100, -242, 223, 116, -272, -10, 170, -87, -51, 39, -74, 42, 107, -131, -78, 147, 10, -85, 40, -42, -24, 158, -26, -225, 110, 277, -136, -253, 178, 278, -160, -270, 191, 274, -214, -213, 233, 143, -225, -27, 156, -53, -63, 57, -33, -31, 46, -41, -42, 47, -25, -60, 44, 13, -58, -25, 3, 79, 27, -162, -17, 235, -43]
3932d3k15L90R4l72M7K16q6Mk6j81K39K06m41r8N19o9m33J83K34j85k7O0p9Q8
3956B5R4k16kK08r5j12J42l8j03J82Ok53P9L06j53l27K24L28k79l29L73K47m23
3979a16j11M05l3l39J72J90k19j4J51q7m4R4n7j9Q3p0n1R9J1q2J0RP8J9k16K5
4005a12L21j62l12K69K18l02n5K10o2j8Q5j97K9L31k15l20L70J94m05k2L06q8
$$ y = [-43, -258, 132, 226, -146, -99, 117, 31, 35, 9, -172, 67, 273, -168, -266, 253, 184, -249, -66, 168, -17, -44, 16, -63, 25, 119, -97, -99, 109, 14, -98, 44, 6, -97, 85, 91, -162, -83, 223, 70, -257, -33, 295, 16, -313, 60, 307, -116, -227, 178, 145, -194, -22, 168, -51, -65, 86, -1, -45, 49, -8, -27, 56, -14, -65, 34, 45, -37, -27, -18, 60, 79, -137, -112, 209, 47, -265, 4, 222, -80, -135, 75, 13, -5, 80, -117, -88, 243, 28, -292, 78, 272, -133, -155, 151, 63]
$$ [...]
8191C0
##END NTUPLES=NMR FID
##END=
