##TITLE=1H_DE-80H_X3
 200.13MHz, d2o
 8 sc
 
 19ns.26.2.2025
##JCAMPDX= 6.0         $$ Bruker NMR JCAMP-DX V2.0
##DATA TYPE= NMR FID
##DATA CLASS= NTUPLES
##ORIGIN= UXNMR, Bruker Analytische Messtechnik GmbH
##OWNER= pz
$$ XWIN-NMR		Version 3.5
$$ Fri Apr 11 15:28:45 2025 Russian Standard Time (UT+4h)  Yarkov@DPX200
##.OBSERVE FREQUENCY= 200.1313
##.OBSERVE NUCLEUS= ^1H
##.DELAY= (6, 6)
##.ACQUISITION MODE= SIMULTANEOUS
##.ACQUISITION SCHEME= undefined
##.AVERAGES= 8
##.DIGITISER RES= 18
##SPECTROMETER/DATA SYSTEM= spect
##.PULSE SEQUENCE= zg30
##.SOLVENT NAME= DMSO
##.SHIFT REFERENCE= (INTERNAL, DMSO, 0, 14.3821)
##AUDIT TRAIL= $$ (NUMBER, WHEN, WHO, WHERE, WHAT)
$$ ##TITLE= Audit trail, XWIN-NMR		Version 3.5
$$ ##JCAMPDX= 5.01
$$ ##ORIGIN= Bruker BioSpin GmbH
$$ ##OWNER= Yarkov
$$ C:/Bruker/XWIN-NMR/data/yarkov2/nmr/H-C/1/audita.txt
$$ ##AUDIT TRAIL=  $$ (NUMBER, WHEN, WHO, WHERE, WHAT)
(   1,<2025-04-11 15:28:16.53 +0400>,<Yarkov>,<DPX200>,
      <created by zg, POWCHK disabled, PULCHK disabled
       configuration hash MD5:
       00 E9 B6 7A A2 85 ED C7 34 08 36 98 17 FE 4E 26
       data hash MD5: 16K
       F5 33 CC 51 CB A7 B2 EC 32 A8 FD 1C F0 21 44 DA>)
$$ ##END=
$$ 
$$ hash MD5
$$ 25 45 C5 15 64 12 E2 8F CA DB 29 E2 8A DC 89 94
##$RELAX= 
##$RELAX= 
##$RELAX= 
##$RELAX= 
##$RELAX= 
##$RELAX= 
$$ Bruker specific parameters
$$ --------------------------
##$DU= <C:/Bruker/XWIN-NMR>
##$EXPNO= 1
##$NAME= <H-C>
##$PROCNO= 1
##$TYPE= <nmr>
##$USER= <yarkov2>
##$AMP= (0..31)
100 100 100 100 100 100 100 100 100 100 100 100 100 100 100 100 100 100 
100 100 100 100 100 100 100 100 100 100 100 100 100 100 
##$AQSEQ= 0
##$AQ_mod= 1
##$AUNM= <au_zg>
##$AUTOPOS= <>
##$BF1= 200.13
##$BF2= 200.13
##$BF3= 200.13
##$BF4= 200.13
##$BF5= 200.13
##$BF6= 200.13
##$BF7= 200.13
##$BF8= 200.13
##$BYTORDA= 1
##$CFDGTYP= 0
##$CFRGTYP= 5
##$CHEMSTR= <none>
##$CNST= (0..31)
1 1 145 1 1 1 1 1 1 1 1 1 1 1 1 1 1 1 1 1 1 1 1 1 1 1 1 1 1 1 1 1 
##$CPDPRG= <>
##$CPDPRG1= <>
##$CPDPRG2= <>
##$CPDPRG3= <>
##$CPDPRG4= <mlev>
##$CPDPRG5= <mlev>
##$CPDPRG6= <mlev>
##$CPDPRG7= <mlev>
##$CPDPRG8= <mlev>
##$CPDPRGB= <>
##$CPDPRGT= <>
##$D= (0..31)
0 0.7 0 0 0 0 0 0 0 0 0 0.03 0 0 0 0 0 0 0 0 0 0 0 0 0 0 0 0 0 0 0 0 
##$DATE= 1744370896
##$DBL= (0..7)
120 120 120 120 120 120 120 120 
##$DBP= (0..7)
150 150 150 150 150 150 150 150 
##$DBP07= 0
##$DBPNAM0= <>
##$DBPNAM1= <>
##$DBPNAM2= <>
##$DBPNAM3= <>
##$DBPNAM4= <>
##$DBPNAM5= <>
##$DBPNAM6= <>
##$DBPNAM7= <>
##$DBPOAL= (0..7)
0.5 0.5 0.5 0.5 0.5 0.5 0.5 0.5 
##$DBPOFFS= (0..7)
0 0 0 0 0 0 0 0 
##$DE= 6
##$DECBNUC= <off>
##$DECIM= 32
##$DECNUC= <off>
##$DECSTAT= 4
##$DIGMOD= 1
##$DIGTYP= 9
##$DL= (0..7)
0 120 120 120 120 120 120 120 
##$DP= (0..7)
150 150 150 150 150 150 150 150 
##$DP07= 0
##$DPNAME0= <>
##$DPNAME1= <>
##$DPNAME2= <>
##$DPNAME3= <>
##$DPNAME4= <>
##$DPNAME5= <>
##$DPNAME6= <>
##$DPNAME7= <>
##$DPOAL= (0..7)
0.5 0.5 0.5 0.5 0.5 0.5 0.5 0.5 
##$DPOFFS= (0..7)
0 0 0 0 0 0 0 0 
##$DQDMODE= 0
##$DR= 18
##$DS= 0
$$ [...]
##$SUBNAM2= <"">
##$SUBNAM3= <"">
##$SUBNAM4= <"">
##$SUBNAM5= <"">
##$SUBNAM6= <"">
##$SUBNAM7= <"">
##$SUBNAM8= <"">
##$SUBNAM9= <"">
##$SW= 18.0517328524113
##$SWIBOX= (0..15)
0 0 2 0 0 0 0 0 0 0 0 0 0 0 0 0 
##$SW_h= 3612.71676300578
##$TD= 16384
##$TD0= 1
##$TE= 0
##$TE2= 300
##$TE3= 300
##$TEG= 300
##$TL= (0..7)
0 120 120 120 120 120 120 120 
##$TP= (0..7)
150 150 150 150 150 150 150 150 
##$TP07= 0
##$TPNAME0= <>
##$TPNAME1= <>
##$TPNAME2= <>
##$TPNAME3= <>
##$TPNAME4= <>
##$TPNAME5= <>
##$TPNAME6= <>
##$TPNAME7= <>
##$TPOAL= (0..7)
0.5 0.5 0.5 0.5 0.5 0.5 0.5 0.5 
##$TPOFFS= (0..7)
0 0 0 0 0 0 0 0 
##$TUNHIN= 0
##$TUNHOUT= 0
##$TUNXOUT= 0
##$USERA1= <user>
##$USERA2= <user>
##$USERA3= <user>
##$USERA4= <user>
##$USERA5= <user>
##$V9= 5
##$VALIST= <valist>
##$VCLIST= <CCCCCCCCCCCCCCC>
##$VD= 0
##$VDLIST= <DDDDDDDDDDDDDDD>
##$VPLIST= <PPPPPPPPPPPPPPP>
##$VTLIST= <TTTTTTTTTTTTTTT>
##$WBST= 1024
##$WBSW= 4
##$XGAIN= (0..3)
0 0 0 0 
##$XL= 0
##$YL= 0
##$YMAX_a= 300037
##$YMIN_a= -226891
##$ZGOPTNS= <>
##$ZL1= 120
##$ZL2= 120
##$ZL3= 120
##$ZL4= 120
##$ABSF1= 10
##$ABSF2= 0
##$ABSG= 5
##$ABSL= 3
##$ALPHA= 0
##$AQORDER= 0
##$ASSFAC= 0
##$ASSFACI= 0
##$ASSFACX= 0
##$ASSWID= 0
##$AUNMP= <proc_1d>
##$AZFE= 0.1
##$AZFW= 0.1
##$BCFW= 1
##$BC_mod= 2
##$BYTORDP= 1
##$COROFFS= 0
##$CY= 83.5205535888672
##$DATMOD= 1
##$DC= 2
##$DFILT= <>
##$DTYPP= 0
##$F1P= 10.8118882576601
##$F2P= -7.23987719738617
##$FCOR= 0.5
##$FTSIZE= 0
##$FT_mod= 4
##$GAMMA= 1
##$GB= 0.15
##$INTBC= 1
##$INTSCL= 1
##$ISEN= 128
##$LB= 0.25
##$LEV0= 0
##$LPBIN= 0
##$MAXI= 10000
##$MC2= 0
##$MEAN= 0
##$ME_mod= 0
##$MI= 1.114404
##$NCOEF= 0
##$NC_proc= 0
##$NLEV= 6
##$NOISF1= 3.799351
##$NOISF2= 2.8
##$NSP= 1
##$NTH_PI= 0
##$NZP= 0
##$OFFSET= 14.38212
##$PC= 1
##$PHC0= -938.3354
##$PHC1= 1.33371
##$PH_mod= 1
##$PKNL= yes
##$PPARMOD= 0
##$PSCAL= 0
##$PSIGN= 0
##$REVERSE= no
##$SF= 200.129724274929
##$SI= 16384
##$SIGF1= 3
##$SIGF2= 2
##$SINO= 400
##$SIOLD= 16384
##$SREGLST= <1H.CDCl3>
##$SSB= 0
##$STSI= 0
##$STSR= 0
##$SW_p= 3205.1282051282
##$SYMM= 0
##$S_DEV= 0
##$TDeff= 0
##$TDoff= 0
##$TI= <>
##$TILT= no
##$TM1= 0
##$TM2= 0
##$TOPLEV= 0
##$USERP1= <user>
##$USERP2= <user>
##$USERP3= <user>
##$USERP4= <user>
##$USERP5= <user>
##$WDW= 1
##$XDIM= 8192
##$YMAX_p= 0
##$YMIN_p= 0
$$ End of Bruker specific parameters
$$ ---------------------------------
##NTUPLES= NMR FID
##VAR_NAME=  TIME,          FID/REAL,        FID/IMAG
##SYMBOL=    X,             R,               I
##VAR_TYPE=  INDEPENDENT,   DEPENDENT,       DEPENDENT
##VAR_FORM=  AFFN,          ASDF,            ASDF
##VAR_DIM=   8192,          8192,            8192
##UNITS=     SECONDS,       ARBITRARY UNITS, ARBITRARY UNITS
##FACTOR=    0.0002768,     1,               1
##FIRST=     0,             0,               0
##LAST=      2.2672688,     0,               0
##MIN=       0,             -226891,         0
##MAX=       2.2672688,     300037,          0
$$ Real data points
##PAGE= N=1
##DATA TABLE= (X++(R..R)), XYDATA
$$ [...]
1009DO218q556k421Q303j203n547K565K110j359Lr25J03K248j334j830J966N64
1026I09j165R7m72O70J441k116r43K757k42j625L89l88J528J319m729M20P160
1043E010m542o857Q738L189j0618J680Q854m792m622M863Q80k389N57n13K98J818
1059A554j903j117K430k72j359N90k28N91Q31k183l7K662j187j528J118j05R24
1076G81K67l762K073N022o065l366R283o26r407N009O674p159k470N912p62k726
1092a322J273j55L07J054k020j75K321j014j228J034l9K74K31j762P90K015j816
1109b32r30J509j22L02l97k253K895K532o114K3Q031m100p055P204L502p859J63
1126b901N779k097k469J774J10N0L30j594O19J753j460p90J185j1k8j83j026J203
$$ y = [4, 6222, -2334, -4755, 3548, 2345, -3202, -637, 1473, 114, 117, -808, -705, 1543, 209, -1621, 345, 909, -256, -159, -631, 39, 1480, -636, -1579, 1178, 936, -689, -300, -688, 840, 2159, -2570, -2150, 5010, 468, -6389, 2349, 5538, -5080, -3400, 5454, 662, -3960, 903, 1783, -606, -49, -562, -264, 1554, -349, -1466, 964, 692, -667, -77, -305, 286, 1117, -1066, -1103, 1559, 372, -1156, -38, -143, 781, 1048, -2714, -641, 4381, -1684, -5050, 4233, 3607, -5800, -791, 5883, -1276, -3746, 2166, 1404, -1322, -49, -204, 103, 1157, -863, -1038, 1283, 269, -959, 75, 36, 310, 541, -1221, -431, 1584, -232, -1162, 347, 225, 527, 130, -2123, 772, 3304, -2810, -2787, 5244, 1144, -5911, 1293, 4795, -3064, -2901, 2878, 781, -1688, 86, 196, 246, 576, -1018, -399, 1354, -106, -896, 289, 278, 250, 67, -959, 244]
1144B44J099j957l28J539j72k61o65o30K717j06m723K474N018n562l292P453M00
1161C248o859K306M511l043j870J987K93l67k33o98R35P72j412k91J095K2l87
1178Il62p0R50L8j316K29J063j57o61m28O47J276j514j601K832J175l731P2L858
1197B309j240l236J838K074j832j218J386O64q51m58N42L43k22k99n6L86K79n78
1215a69k46O91L2m48P0mJ57L11o93o4J104o49q85J243r1j232J216K62j565J185
1235B25Q56k035M17J617j480l66J482p16m26R67p33k55J056p48l78J017m64k62
1253b26O01p46J51J003j070k41J219o47k56M66r99J200J112l313P57M374l718
1270c33l651N804Q89o047J966M316l080j533K473l17p32L82o72N66R57j350l67
$$ y = [244, 1343, -614, -942, 597, 425, 164, -501, -1131, 1586, 1480, -3243, -769, 4249, -1313, -4605, 2848, 3248, -3611, -1305, 3206, 163, -1707, 280, 573, 206, -27, -725, 210, 982, -430, -721, 374, 396, 9, -353, -423, 527, 565, -751, -522, 541, 384, -277, -705, -58, 1218, -296, -1897, 935, 2110, -1621, -1549, 2309, 1069, -2167, -329, 1745, -87, -1305, 81, 745, -106, -564, -22, 321, 99, -200, -256, 130, 409, -169, -415, 276, 308, -140, -70, -74, 83, 394, -299, -363, 741, 92, -793, 450, 359, -873, 343, 605, -960, 225, 1081, -954, -537, 1080, -400, -766, 716, 0, -426, 541, -192, -447, 609, -139, -517, 500, 36, -226, 375, -371, -220, 783, -287, -528, 691, 44, -212, 254, -745, 455, 1567, -1746, -989, 3385, -333, -3984, 1820, 2709, -3338, -1372, 2944, -136, -1669, 804, 487, -245, 137, -535, 31, 988, -362, -729]
1287g29J293k44n11O3j93O97K26j248J92J111m32o03j6M29R14j135j596K406J299
1306A923l522n2L764j080k925J721J820j647j060J179O43q95m68O88K06m19K2
1323a02J8J2L64l54l56O25n0m45M64j30l16N81l80l11R00o55l73J592j240j547
1343a703K971j13l760K536K909l936n23L707j541k106J897J51q75O80n61j18J231
1360H46q79r05J171J56n62J21l07L60O16j026l03J176o4o56j40J45J072l06k003
1379a488J373K293k386j627K854M75k626J50J843l74j256K84J050l23q28N34M41
1396C89n28J20J28m38M26J49n84M31J50o26N42N5p63O83K02o63O14m63n69J903
1416A158r19k473L348J551m833Q70M487l248k790L789N10k827P82J276n61q9l11
$$ y = [-729, 564, 320, -191, -128, -321, 376, 602, -646, -454, 657, 225, -378, -394, 35, 949, -186, -1782, 624, 1923, -1599, -1651, 2113, 1033, -1892, -171, 1649, 2, -1058, 121, 764, -131, -599, 89, 295, -124, -102, -84, -72, 292, -62, -418, 207, 157, -288, 176, 46, -270, 311, -69, -380, 520, -135, -508, 1084, -156, -1703, 1268, 1155, -2605, -69, 2840, -1096, -1619, 2088, 547, -1559, 338, 489, -386, 294, -267, -385, 846, -33, -938, 233, 389, -173, -52, -359, 1, 617, -409, -712, 464, 400, -256, -396, -251, 821, 515, -1488, -115, 2178, -208, -1835, 1019, 1494, -1132, -982, 861, 487, -769, -485, 565, 242, -586, -52, 389, -139, -19, 109, -329, 97, 246, -338, 93, 243, -383, 159, 214, -549, 134, 336, -327, 287, -176, -745, 1158, 239, -2234, 1114, 2665, -2168, -1298, 3189, -59, -2849, 940, 1450, -1377, -595, 681, 120, 31, -280]
1433b80j65R38j46r06L37N68j23l60j77M04K78m08k47K29L67k6p34J95R96q16
1453g6o42J196m22p38J471m80j485J874K97k430J126J526j771l1J215p73J07M59
1471D23j048M21R92j003k40P49k11K1j19m92P85L53j046L8P37Ok99o78L69J420
1491A178j045j587J729Q86j881j45J346k2p24k65O24N56r11k61J092m14n96P85
1509C45l36m86Q63j99n76N86j50j84M88o47q3J062n47o96O49O2J58j25j228J232
1529A88J565k678q22L357p30k977J783J872j806q78J345N71q61n21P46L06o85
1546b25J34K79m13L22J76n58L45J58n18N03j5p19P28L04q26K48O4q3Q73j101r29
1567a253K621k21l302J845K569l019j125K970n6k078N00J228k65q14J02O11j83
$$ y = [-280, -445, 493, 347, -559, -222, 346, 223, -137, -314, 90, 368, -40, -287, -58, 309, 283, -451, -256, 740, -76, -718, 478, 56, -682, 789, 309, -1176, 698, 995, -1435, -309, 1217, -554, -585, 630, -143, -36, 423, -625, -204, 788, -215, -455, 294, 83, 104, -15, -507, 278, 631, -415, -377, 360, 366, 67, -611, -242, 1178, 133, -1454, 275, 1161, -720, -865, 481, 459, -265, -530, 94, 650, -261, -522, 570, 156, -440, 345, 9, -477, 386, 187, -389, 197, 47, -137, 351, -296, -379, 683, 136, -560, 89, 151, 309, 184, -1044, 188, 1753, -925, -1747, 1610, 880, -2097, -314, 1558, -248, -1126, 219, 790, -71, -592, 154, 460, -225, -91, 188, -225, 97, 273, -285, 60, 218, -300, 203, 188, -531, 197, 501, -325, -77, -13, -96, 777, -324, -1253, 1368, 1147, -2155, -310, 2259, -760, -1885, 1085, 1029, -1049, -549, 679, 414, -400, -298, 313, 130]
1584A30k77K20j80N6L61m52JM63n06R0N05p08N8P19n10p1J36m99J021J69k141
1605a415J204K270k763j226L393l30k883J237J781j201r20P52O13m07n05L86K05
1622A91k95J77p9k36M45j12l39M80k38l26P35k96n91O56J6k01J68p53N61J297
1642A260j856p42K847n56k755J656J754j932q22J423M06q55m05O63L20o13O3L56
1660B12l93J33L04m82J46K84l80K99O4o55N18M26p20LL02O0K67p91k47J645n27
1681D68j745J428J091j656l70J142J28o03l92N20N16p49j54P25m26j47N98m95
1699a21k38O44k24k25K02k14K49K77o69l3O72j10l64j61L04N52o41n01R88J7p54
1720c50L96m6j52O92o75n65J316j63j125P06K89n54L94j44l80O43l8o22K80K74
$$ y = [130, -147, 73, -107, -51, 310, -142, -141, 322, -184, -94, 411, -297, -239, 480, -30, -101, 35, -464, 557, 726, -1415, -211, 2059, -704, -1930, 1463, 1133, -1750, -513, 1268, 67, -853, -101, 512, 105, -400, -14, 191, -104, 73, -6, -242, 203, 91, -248, 232, -6, -332, 403, 107, -484, 172, 188, -13, 155, -598, -37, 1260, -596, -1338, 1509, 953, -1802, -146, 1608, -324, -1146, 277, 683, -172, -577, 86, 406, -207, -144, 212, -181, -48, 256, -226, -80, 204, -176, 123, 187, -468, 50, 476, -244, -241, 61, 121, 388, -403, -650, 995, 468, -1277, 151, 1242, -414, -784, 358, 486, -117, -509, 11, 527, -222, -376, 349, -77, -224, 374, -121, -359, 285, 61, -164, 38, -176, 73, 350, -319, -352, 320, 210, -154, -315, -11, 541, -100, -601, 387, 404, -350, 46, 0, -152, 540, -135, -700, 616, 453, -672, 34, 323, -231, 163, 19, -361, 282, 244, -378, -98, 176]
1740A76q7j38k01K37K60k45j92N9L02P3n97K30O04p84J18R30j261j99K001j200
1760H6j704K302O58k363M16J541p71n89L79J33Q0j44k31J81J72l3k52n5M02j47
1780F1k92L57j22k22M52k33k13L56l30K71M56j280L29J799j610j337K413L02k218
1799a061M48J476n05q68K21P01j50o29L57K68m69K49K02n10K43K43l09J43o8k39
1819b57N04l4n64K25L50n1l16k63O72J56r02L46N00o11M08R4j001R70O88j641
1839g27K26J335q06m85O21j43M5J40m73J30M44k06l03M3L27K1l90J56J35j75K16
1860A31j27k53M63k65j99Q24q31o23J938n22k230J784J497k258m38J867j16j133
1878d91P5P54L0o89J71M61m56P7L52m74P7L58l02Q8K2l20M46J26n63O8L48J06
$$ y = [176, 89, -49, -250, -13, 247, 2, -190, -131, 171, 244, -353, -123, 481, -303, -185, 745, -516, -715, 1286, 86, -1618, 684, 1342, -1021, -605, 936, 165, -424, -45, 88, 168, 24, -207, -26, 146, 113, -139, -194, 208, 61, -231, 126, 4, -218, 234, 1, -212, 144, -186, 85, 541, -739, -410, 1389, -221, -1558, 855, 1157, -1061, -613, 863, 358, -510, -289, 412, 262, -367, -10, 258, -211, 38, 240, -270, -27, 216, -93, 50, -18, -257, 247, 213, -351, -126, 224, 173, -143, -406, 266, 422, -480, -134, 366, -245, 163, 257, -744, 226, 914, -727, -501, 834, 28, -457, 164, 21, 66, 206, -267, -137, 307, 101, -202, -159, 168, 189, -201, -45, 90, -85, 131, 4, -249, 214, -51, -250, 574, -257, -880, 1058, 536, -1694, 90, 1587, -671, -1109, 758, 642, -491, -416, 338, 368, -321, -150, 311, -145, -68, 284, -190, -113, 245, -57, 31, 53, -267, 179, 305, -258, -190, 158, 264]
1900B64l33l84O54K57r31L93M41q72P14N05j676O28J627j605p30J645j20r08K86
1919a45K06P5J5l18QK78P3j89k69L48J79m55K23J65m59L21K01m51K23j31j3P36
1941F21q92o76J788j23j842Q64J125q04n00J99M88J98q43N3Q15n23j93N17m67
1960a95pO07l90l31L23J57l4k58l7L16n5q5q4r8M60k16m77P99l51q21J584j78
1982F29k190J681J524k530l24K204l97j374L91Q40j13p72K05O11m82o8M39m44
2000a70l4M56k55m8O1j86L42M8m63R3L17J17l73l44P99j9r00Q45Q5j327J340P01
2022A085k343P18K144j718j125J687K66j025j42N48K42m39j00L03j76P2J87l94
2040b10J63J87l29L14M8n21L38L40l15k36K2N50n0q74N54M94q82O00K65j379R99
$$ y = [264, -69, -453, 201, 458, -473, -80, 361, -511, 203, 708, -968, -340, 1287, -318, -1048, 597, 477, -431, -145, 61, 136, 151, -167, -159, 119, 192, 3, -266, 82, 261, -194, 29, 194, -265, 56, 257, -194, 29, -102, -115, 621, -271, -947, 841, 718, -1124, -260, 865, 61, -439, -240, 248, 446, -397, -344, 471, -52, -245, 272, -195, -202, 405, 15, -316, 7, 164, 130, -128, -165, 151, 96, 11, -73, -171, 289, 73, -404, 395, 44, -777, 807, 629, -1561, 120, 1644, -886, -1210, 994, 597, -777, -386, 454, 341, -431, -226, 385, -97, -165, 274, -170, -204, 252, -3, -51, 10, -176, 166, 214, -249, -156, 161, 278, -95, -439, 360, 341, -559, 286, 371, -956, 384, 1085, -1258, -540, 1604, -114, -1239, 448, 714, -311, -453, 95, 337, -102, -202, 101, -75, -3, 184, -210, -47, 140, -189, 125, 173, -348, -10, 330, 15, -221, -199, 351, 301, -573, -19, 475, -407, 193, 458, -921, 78]
2061G8J087j974n3J896p23j055O65M20j99l05k0K72m5k2j8k35L11Q3l84L06Lm07
2083c19M57J45m95M0J94K77j84o62O44M71r19L36K94q18Q93L10j645P63J378j382
2103b22n47J087M2m57j04J30K37j17q0k1q5L09r3l30L52o4k84M79q6m57K66K11
2125A66K9l15l11P69K0q54N78J18o11R30k36j297J328O82j712J37J192l66n30
2144b83R2K79R9k35j0M1n8K49j70k32L72j66j36M04k77k78L87J25j52l57Q8O81
2166D63n01l99Q54n13l00J185r61r24J859k0j730P27J040o31n44K62M38j67l39
2185b01K46k5j28K83j74j50K57j85O8K20l81rL44J6k30l07M72K83q10L55N20j108
2207f44O33J046j753o6J989q98j378J059P00o53n16L70N39m41k31M59k46j20L88
$$ y = [78, 1165, -809, -862, 1034, 311, -744, -79, 341, 142, -163, -183, 89, 44, 22, 4, -231, 80, 163, -221, 85, 88, -319, 138, 283, -212, -172, 22, 299, 115, -547, 97, 568, -351, -15, 279, -539, 354, 664, -981, -218, 1160, -222, -769, 318, 360, -97, -201, -71, 166, 49, -31, -52, -137, 172, 79, -251, 101, 37, -247, 232, 146, -311, -45, 166, 195, -120, -431, 338, 358, -496, 82, 200, -411, 519, 283, -1014, 314, 996, -716, -579, 613, 247, -283, -191, 88, 187, -48, -58, -17, -75, 174, 4, -228, 144, -22, -158, 246, -31, -309, 78, 203, 51, -306, -218, 463, -38, -437, 417, -96, -396, 789, -172, -1096, 763, 743, -987, -260, 780, 149, -395, -133, 305, 138, -201, 45, 20, -108, 175, 1, -149, 108, -77, -9, 211, -170, -179, 165, 181, -49, -356, 116, 399, -411, -56, 464, -644, -11, 1035, -718, -784, 1205, 307, -1071, -12, 688, 35, -481, -111, 428, -13, -244, 215, -31, -151, 237]
2226B37k07j80J45K6J34j56j87K03P2J8j82j95N23j86m41Q20m38q18J485m8j771
2247a146R88J152j137m83N86M43j57o99L01N80n20j8L06l76R9L46k29k13Q2K97
2267B02o3l58K39Q9k27K54r4k05K37j90K28K24r03M05R29r59k61O58k38K66j27
2288A06q44R01N62j132%O79j18j54j16K8J78k4Oj97j1L85k54j46L54k84r0M35
2310B64j42k77n2L20K92p19L9P92p75N4R58j343j53J941r93j455J424O69r93m08
2330e57N37M82n01k93N19j74k01M02j85k29K02P2P4k12j19K93l7j1p7k02M23j25
2352H1l38O78n48n43J426l47j410J015O41p06j35j64M30N25q94j76P57j69k09
2371h6Q8j53J46J43p2j68j18M02l3l80L41m4l18M05M8l22p1J45M79m74m52R15
$$ y = [237, 30, -150, -5, 21, 155, -1, -188, 15, 87, 105, -77, -272, 251, 65, -376, 444, 6, -812, 673, 625, -1146, -158, 994, -143, -626, -40, 403, 246, -453, -152, 428, -92, -110, 196, -180, -81, 265, 36, -177, -95, 202, 139, -219, 20, 109, -118, 136, 42, -163, 74, -116, 112, 336, -567, -162, 767, -192, -453, 205, -33, 233, 106, -738, 163, 725, -407, -407, 272, 154, 0, -116, -88, 90, 66, 72, -125, -136, 249, -5, -151, 203, -81, -171, 264, 122, -155, -207, 113, 405, -314, -275, 517, -258, -204, 754, -589, -742, 1199, 206, -1249, 175, 844, -149, -557, -20, 462, -39, -332, 187, 13, -188, 214, 29, -200, 2, 74, 148, -64, -183, 110, 73, 62, -15, -217, 206, 81, -257, 421, -127, -670, 756, 409, -1001, 14, 655, -51, -186, -350, 80, 605, -289, -465, 292, 123, -86, 2, -151, -5, 138, 66, -102, -220, 182, 149, -231, 110, 66, -252, 153, 201, -121, -192, -47, 432, -42, -494, 421]
2393D21l57n05J107p87r20J911r6j895Q49J134p04o72K71O65k58n42M42M2l37
2412b31L63J6l13M7J44J64j96k10K80l4j5R8k91K04P4l08N76l25p56J172J34j161
2434e68M63K65j40M44q07k32J239l50q60M15L36m8k33j00K06m3N1N8l08J92J30
2455A10k26K19p6k63K61J46p5l17LO25m75l02Q96p26m43J599o53j444J313O49
2475H21r88k69K96N32j19p20L58L42l33J38kk48J69J48j1k90j4M18k42j49L42
2496A79k66q8L12j6j32l05L31M49p81J11O40q78M11R29j505j25J687o09j073N28
2516b01O31j43o23R1N71l18j49L42k61j05K63L6j44k15K48J73l28J19P8k34K12
2537D3J6l2n5l14N32J88q42M43K43n75P77j83j110J076O07j214j19P66J19m67
$$ y = [421, 64, -441, 666, -121, -1041, 870, 774, -1121, -272, 862, 158, -514, -243, 422, 164, -378, 64, 106, -231, 132, 148, -165, -118, 26, 190, -6, -216, 64, 30, 15, 113, -178, 26, 100, -208, 368, 43, -713, 459, 593, -568, -105, 160, 20, 464, -343, -575, 664, 314, -546, -131, 205, 157, -76, -176, 30, -13, 38, 96, -212, -20, 110, -116, 103, 27, -236, 25, 171, 96, -221, -218, 407, -68, -370, 526, -200, -643, 956, 303, -1141, 172, 821, -167, -436, -140, 392, 273, -447, -89, 253, -80, 58, 56, -192, -23, 125, 114, -176, -190, 228, -14, -163, 179, -87, -175, 137, 121, -11, -316, 15, 464, -317, -206, 434, -444, -33, 896, -609, -734, 953, 344, -729, -201, 430, 287, -336, -245, 326, 8, -141, 201, -60, -165, 98, 134, -10, -225, 23, 196, -132, -13, 65, -169, 43, 59, 27, -28, -342, 190, 378, -464, -21, 222, -353, 424, 241, -869, 207, 814, -400, -519, 247, 366, -101]
2557a01k28M73L3l39K65j0k68J78J12l8j56o8K77r1j09J15j61J21O7j42K34l28
2579a64j42P95m31n14O34k50L8N27r13k9J111m71p16L93M22j27m06J43L06k65
2599e9M9J64k36J4J19M1l6j86J26R8j00O9j42J1J66k03K40j5n65N74K77p20K62
2622e2Q0k51O78l48p52Q12L52p01j53L67K28k82j86L11r4j08K42r3j34M8P1J12
2644A47j66n2J19o7J06m8j34J67k00J68K82o30J58N02m51Q5R7n26O60L19r65J04
2666c25O84j38m18l2L74Jl23K01N5k05J51Q0q1r6RK09j09q8J18j23N8R4r4P7k46
2691a67P9M75m88r1M23m58K62L97q84J58Q82m49n32K74L88r2m27J83K34k65O6
2712c2J47j75n0J17J30j30j31K09n0j14J83q7j04L4J07J65m05K2M81m32L1M76
$$ y = [-101, -329, 144, 177, -162, 103, 93, -175, 3, 115, 77, -79, -147, 130, 39, -70, 45, -116, 5, 72, -70, 164, -164, -306, 489, 58, -456, 178, -72, -34, 493, -420, -449, 662, 191, -525, -132, 290, 163, -243, -100, 206, -59, -10, 154, -82, -68, 51, 92, 56, -130, -4, 94, -6, 63, -79, -68, 98, -105, 135, 120, -445, 129, 406, -314, -52, 28, -223, 455, 107, -645, 167, 519, -182, -335, 32, 260, -22, -208, 103, 9, -99, 143, 50, -84, -36, 35, 147, -19, -71, 48, -19, 87, 39, -95, 72, -128, 40, 322, -308, -150, 352, -99, -14, 83, -443, 217, 536, -429, -325, 359, 221, -197, -229, 145, 146, -177, 24, 79, -126, 25, 105, 24, -72, -63, 146, 37, -51, 67, -56, 2, 96, 2, 79, -167, -88, 387, -101, -192, 231, -227, 35, 432, -452, -294, 588, 139, -393, -119, 269, 177, -250, -67, 167, -98, -32, 115, -60, -110, 7, 137, 7, -124, 85, 35, -79, 104, 17, -87, -53, 54, 219, -186, -164, 317, -115, -84, 392]
2734C92p84O3R53n80n62N41L18k20l85J26L93k34j44J74j18nJ22Mj05r3K11Qj75
2757a00J54l0j52J47Q5m0k51R8L77l98J4M64o48M3P87o31m00O02R0j16k66j18
2779b89N10rl81O2J13P7o1q1P8p9K5J16j34K9Rn3J30l5n8m2K8K02k03l1K48l74
2805b03J85M26o07j8M05k47K75j16n77N76L54o29j55L54K34k68k19L21k3j78J67
2826E7Kj46J7J08O8j98J9J55j57P8O9r7k1q0L13k2m74L98M0m53O62p8q35O49M64
2851E38o16k29K33L63j31m20K13J70j31N3l4n0KM0J06j49k6J34j24N2Q0j03n3
2874h2nK42j09k61L58j62k33N96l03m42N57l3j07Q3m34L17M92n11k68L09K52j55
2896A01l05K21J20k30J21O7j30n0P2J51j58q2J70j05jJ03n7m3j33K16J89m82K09
$$ y = [392, -392, -329, 624, 44, -518, 23, 341, 121, -264, -138, 255, 21, -123, 51, -67, -72, 50, 54, -51, -144, 67, 75, -100, 54, 24, -128, 19, 104, 64, -187, -89, 288, -110, -96, 368, -280, -237, 550, -81, -481, 121, 211, 95, -171, -289, 221, 212, -169, -107, 6, 83, 22, -59, 19, -60, -35, 81, -53, -24, -15, -68, 62, 27, -31, -73, -45, 157, -46, -77, 171, -203, -18, 408, -199, -217, 188, -59, 216, 100, -477, 99, 453, -176, -331, 23, 257, -11, -230, 91, 68, -110, 57, 59, -87, -70, 38, 106, -92, -73, 82, -75, 3, 72, -25, -46, -126, 187, 165, -309, 89, 129, -324, 338, 260, -575, 74, 538, -78, -307, -74, 289, 158, -262, -49, 121, -10, 43, 9, -41, -39, 1, 107, -42, -68, 66, -58, -6, 74, -29, -82, -87, 155, 46, -215, 143, -19, -252, 344, 41, -401, 156, 123, 16, 99, -335, -18, 474, -37, -305, 4, 256, 101, -204, 17, 137, -93, 28, 95, -35, -85, -13, 138, -20, -102, 68, -37, -38, 65, 8, -35, -168, 48, 237, -245, -36]
2919c6K69n77M63L06q90K28O53k88l22l4L21J82l85j0J66j0L7p3j7J6l6J16m4
2942C5p3N8n9M8O2o6k3q3J57J9k07K40j58j82M95k12k84L47k67J29M38o46j56
2965c88O55Rm00j37L34J65l55N5J65j54K6R7j3j16rJ88r2q9J33p9o7Q0J04o1k67
2990b16K74J03l75L49Jn12M51K01m15O7m6J18K93l88k05L51J38j48k28J57J73
3011A43j98L4J01j13k3P1Q5r4p7J42o4m8J06k3o7p5J60J32l77J61K10m51L37K44
3035C16o43J54M18j63j37j49J78K45k34j25Q7R9L5j59N2P1r3N7M5m0l1k5R9l2
3059B5m4P7q1J4L1K0O5k58J16K53l58J74J86n39K78M10m46j60K13J75m6k85Q8
3082i2J84o9k3n6K2N9o4P5l2m9M2mL7k3m0N7n1O3J0n5N2j58J40J61l24J44J40
$$ y = [-36, 233, -344, 119, 425, -465, -237, 416, 128, -194, -228, 93, 275, -110, -120, 46, 36, 73, 0, -17, -1, -37, 79, 35, -38, 20, -39, 9, 71, 5, -18, -101, 56, 75, -132, 108, -50, -232, 263, 51, -233, 114, -153, -24, 414, -232, -388, 267, 276, -124, -261, 73, 238, -117, -62, 103, -51, -25, 72, 59, -57, -66, 122, 30, -59, 74, -5, -72, 8, 112, 51, -216, 58, 161, -214, 135, 136, -376, 75, 276, -139, -72, -118, 0, 293, -95, -300, 51, 189, 41, -187, -30, 143, -55, -21, 80, -33, -56, 15, 100, 6, -71, 71, 7, -41, 65, 42, -25, -100, 60, 192, -185, -24, 186, -265, 72, 316, -327, -173, 245, 82, -55, -204, -26, 219, -15, -140, -53, 46, 81, -78, -26, 45, -48, 9, 54, 14, -17, -42, 57, 25, -19, 58, -23, -9, 22, 42, 107, -151, -35, 218, -140, 34, 220, -319, -41, 369, -77, -237, -24, 151, 105, -180, -92, 92, 23, 0, -56, -34, 25, -39, 36, 4, -45, -3, -7, 30, 7, -33, 24, -27, 36, 46, -9, 43, -115, 25, 186, -138, 6, 146]
3109A46l73L25J77n21J03L19l8j92j34K34R6j84LrL3L3n0M1l0l1N9j2K0j8l8O2
3135B1m3M8j5l9N4q2J30N2k98K14N1k58L44l6m21K93K29k28j35J1K44l8j98N7
3159d3M3J9jn3L9k7pN3l8Rk8pO5m5K8j0l0M4n3J42o9k02K90q0j86L74k16k83L97
3188A25P0k40q1O7K32j06j77P9N6L8q2l5R5o2mN1j2l4n1P3K0o1N3k1m2L2J2J28
3216A23j97k6K77k69K6L05l80l5L79j13j12p4N4K34j22j75N0J23N8j64j1J12q6
3239b3kN4Oo9n4J42k5q9J01l9m7LJ05J9k54J67J17k88K73N1l68K21R2p5P1k34
3265a45P8K96j46k04J6K15M5k61Q8Q4q7LP4Nj13NJ28q6l0P7n7l6%J32o9j38K08
3292H2j26o2L02k83l2K11k21K28Q3m58J43L31o8k53o3K84K4j70M1MJ1jJ3M3r2
$$ y = [146, -227, 98, 275, -246, -143, 176, 138, -54, -188, 46, 142, -42, -39, -48, -15, 18, -32, 9, -21, -52, 7, -5, 15, -3, -41, 21, -22, 26, 11, -28, 26, -56, 74, 126, -172, 42, 93, -165, 179, 143, -278, 15, 244, 16, -119, -108, 136, 98, -100, -43, 0, 19, 18, -35, 4, -23, -30, 23, -15, -6, -34, -41, 24, -21, 7, -3, -33, 11, -42, 100, 31, -171, 119, 39, -147, 227, 11, -272, 125, 195, -45, -126, -59, 173, 67, -110, -31, 25, 63, -19, -54, 41, -21, -25, 26, 14, -20, -71, 2, 22, -39, 14, -7, -49, -17, -5, 123, -74, -100, 177, -92, -66, 239, -141, -176, 203, 90, -22, -96, -42, 192, 70, -105, -55, 68, 126, -38, -49, 63, -23, -25, 29, 35, -34, -88, 54, 29, -60, 41, 2, -45, -42, 63, 82, -172, -5, 112, -176, 97, 148, -220, 1, 93, 18, 89, -145, -67, 229, 83, -121, -105, 110, 155, -106, -18, 66, -21, -18, 56, 61, -52, -47, 81, -5, -35, 42, -15, -51, -51, 81, 12, -126, 82, -44, -106, 196, -87, -119, 92, -129, 99, 182, -276, -133, 198, 130, -123, -186, 98, 122, -48, -7, -3, 8, 7, 20, 63, -29]
3317b9NM0j5N3n7j5K7l7P1n0L2l2j51L13p3k79L67k29k10N20j24l40R3J43J74
3342A97j72k18J49J43K0j82k8J78q1l5Q6j7n6m4J21J1j37R3Mo2J3P8M4k53J06
3367d2K08l37K26J25m35K48J00j36K00k95r9M40jl04j20K57J62k70jJ01n0J8%
3390eP3p5o6J24m1RK1o4K5l5R6k4n6R1k14J27K38l96J85J32m46L88K04m31l9J38
3416d1J84%l08L6J52Q9p9j73J56J9q9P3L7l5j00N5J43j49J7N9o3k6N2J63k24p9
3442a31L12k70M8L02m22R0J40k02L75j55m32L01K68j01k98LK91p5p6J6m0P5n4
3465c5M3L9q9K5k3N7M9r3L5j8NKL3J29l13P1L26m07K05K25n42J97K47j34P4k94
3491a86J7L77l5k56j40K66J13k42N8M6o0QL4Q5j23k2P5m9L8K8k3m2l0J41j04M8
$$ y = [-29, -24, 16, 1, 54, -3, -18, 9, -28, 43, -7, 25, -7, -158, 155, 82, -197, 170, -59, -269, 251, 127, -213, -120, 23, 197, 25, -193, -44, 99, 119, -63, -91, 87, 6, -29, 57, 40, -16, -60, 61, 72, -65, 28, 32, -30, -17, 61, 105, -148, -42, 166, -171, 55, 180, -255, -7, 93, -43, 157, -138, -237, 203, 202, -102, -222, 35, 197, -73, -74, 27, -23, -5, -5, 68, -7, -73, 51, 10, 19, 40, -24, 1, -34, 62, 38, -18, 73, -141, -14, 224, -172, 13, 145, -301, 87, 291, -140, -179, -41, 143, 143, -165, -129, 23, 112, 33, -140, 16, 35, -54, 19, 56, 21, -79, -24, 119, -30, -13, 46, -17, -43, 9, 172, -52, -131, 181, -89, -41, 261, -161, -71, 69, -133, 242, 87, -345, -44, 224, 123, -175, -172, 119, 44, -32, -16, -56, 19, -35, 8, 47, -42, -17, -40, 17, 66, -27, 8, -10, -5, -3, 30, 159, -154, -83, 243, -164, 41, 266, -276, -79, 168, 34, 108, -186, -169, 208, 173, -83, -223, 43, 156, -86, -28, 18, -42, -34, 0, 85, -38, -60, 15, -34, 4, 32, 9, -33, -63, 78, -26, 22]
3517B2R1l37K78J22l80M03j10m42M57J25k18j06r2K87R2j89j57O5K34j05j13J05
3539C2l9l6LR3Rj76R7L4o4N1L3k3j43J18J42k47K19n4k81M05j54j00L41m38m7
3564b25M84r5k13j38J72K18j55j00m8R3J14j40M2J3n2pJ6J33j42n9J22o1lM6N5
3589G0j15j18K86j28q5L01l73O3K64k74K50l0m25L11K43j40k02o5K58K4r6n8l1
3612g0J18k9k5O0o1j2n0J20L0j62Q6rk9PP4N0k69J49J23k89L25o3l01L22j53K4
3638c4K98m05r5L07J12j12k32J03J27Pk6j21P4J9l4N6k2J4j04K4J21q5lL3l0m8
3664e6J9J77j82o6K37k90J44K13l45J80o0j94M34q4l11L6J80J39j63j07M3O2J01
3687A07j12j8M5n2K9OQ0p0j07J34k9m3N9Ll8j12K03n2j40K35k47lK86k66J64L8
$$ y = [22, 113, -224, 54, 176, -204, 199, 89, -353, 104, 229, 11, -95, -187, 100, 192, 3, -154, -89, 145, 40, -73, 32, -7, -43, -40, 53, 62, -114, -17, 17, -47, 4, 37, 14, -129, -11, 131, -116, 103, 49, -232, 173, 19, -81, 260, -178, -225, 259, 164, -49, -187, -15, 203, 48, -52, -100, -7, 107, -33, 9, 22, -30, -37, -21, 112, -30, -89, 33, -28, -31, 15, 70, -45, -163, 123, -5, -90, 211, -162, -99, 165, -109, 141, 111, -314, -3, 240, 100, -102, -167, 91, 115, 19, -39, -70, 48, 19, -6, 54, -7, -19, -69, 51, 81, -81, 5, -4, -33, -26, 48, 98, -171, -22, 101, -188, 137, 74, -227, 95, -58, -34, 264, -141, -236, 71, 183, 71, -161, -58, 69, 76, 50, -71, 3, 22, -12, 44, 22, 36, -68, -44, 77, -8, -11, 22, -8, -56, -37, 140, -42, -108, 129, -161, -17, 196, -149, 31, -29, -223, 211, 127, -184, -148, 32, 171, 8, -99, -56, 6, 107, -5, -23, 22, -30, -1, 5, 85, 15, -92, 42, 13, -30, 29, 32, -6, -118, 85, 33, -107, 128, -119, -122, 164, -102, 62, 100]
3713A00l84K35K15r8j39j07J89Q5m5j05m8J47j7l9M3j4l1o3J32L6j40Q2k9k2J4
3738cN5L9j71J09l5r0K69k22m7K31l22J74K45l21m7M6J20J08j71j04O0J61rj67
3762i2Q2Nj3jO1L1j45M5O1m9O3k8j1l6K1M4o2J45j50j20L14k27K5K76l95L3J78
3789E5m1J14j94j33K00J41p8k17Q6R4l1J9k3J9o5J3R5n1L4m7n1J09m3K3kK6q8
3816c6p1K73j67o1K33l08Q3K10j96J60j35k12L21R5j55j89O0J78l9k9q8L7N0m0
3840b6L6Jln3m5J62n3m0M7m0j3j6J53j07o8J59k29J78J37l04K46j05k45L64K5
3865A61j49j00n5K26O1j32j53O8J66p9m3K8nl8l9J29k7n7M6o5O2J5nj6j2K4j32
3892a21K16K5k86K83j28j78L72j37l1J2k35K52J73j68j93K9K23k7o5n3j4P7m3
$$ y = [100, -284, -49, 166, 68, -71, -178, 11, 96, 51, -54, -102, 45, 28, -11, 32, 18, -13, -76, 56, 92, -48, 34, 5, -17, -3, 52, 91, -80, 29, -6, -96, 173, -49, -96, 135, -187, -13, 232, -89, -136, -90, 30, 138, -33, -137, -77, 84, 75, -92, -10, -5, -18, -19, 42, 73, -72, -27, 34, -15, 48, 20, 9, -27, -6, 38, -24, 121, -29, -149, 165, -62, -37, 239, -156, -123, 55, 14, 128, -66, -199, 1, 142, 64, -153, -67, 27, -4, 15, -8, 11, -54, -41, 54, 3, 37, -10, -61, 48, 5, 28, 26, 52, -36, -107, 166, -1, -62, 171, -137, -54, 156, -40, 120, -15, -227, 94, 189, 34, -155, -95, 83, 44, 15, -73, -36, 14, -26, 10, 11, 8, -45, -90, 72, 19, -21, 26, -14, -27, -43, 110, 3, -65, 94, -135, 43, 180, -124, 122, 17, -228, 136, 161, 12, -88, -143, 83, 144, 12, -141, -73, 93, 14, -29, -1, -6, -44, -83, 46, 19, -38, 8, -57, 5, 20, 15, -1, -13, 11, -121, 95, 120, -166, 117, -11, -189, 183, 46, 15, 27, -208, 44, 217, 49, -144, -115, 108, 81, 16, -37, -51, 26, -17]
3915a7L2Mj8k4q3J35K2j06N3mj9n7J59k2j53J89j86K2K71l11J71N8l81L13J30
3940A78j08q2j66J86J46m4j97l4K09l6n7J6Rk0p4J05Rm9L2r4N6K6k6JJ6K8j95
3967a65J93R9k74K72j26k02L25j52Q5J04l57R9K12M9j54j51J07Q9O0j11n5R4m3
3990b%jN5j2j34R6K6l5K3pj7p6J08l4rJ56l16J29J71l14L20j5k63J39o1J45J06
4017A78k49q1J20J83o7j51L6J8P9n7RK6n5Pm1P6L4r9M1Kk5l1R7Oj57J62j31j6
4045h6K65k94J21O9l11K79O8j05k9j36J30J55l0j78m2J80Ll8j4j1K5n3N5RMJr4
4072e7P6Qk0ML3lj54J70l0j00K11k13MJ64k25K13K3k44O0N1J28k7j47m1J00J24
4098A08r4o5N0Qnk8O6j5l6L1n3Q0ol8J0Kpp4J45l1j37J89j71J2J80k00J39j9k00
$$ y = [-17, 15, 19, 1, -23, -106, 29, 51, -55, -2, -6, -25, -82, 77, 55, -98, 91, -95, -73, 198, -113, 58, 116, -265, 48, 178, 70, -12, -178, 8, 154, 110, -87, -121, 88, 52, -5, 11, 20, 0, -74, 31, 40, -9, 23, -71, -15, 11, -15, -14, 2, 30, -165, 28, 127, -147, 125, -1, -203, 122, -30, 55, 159, -198, -99, 113, 162, 8, -143, -36, 53, 113, 2, -53, 41, -2, -2, -3, 52, 40, -94, 2, 28, -7, 16, 9, -8, -84, 24, -10, -19, 137, -179, -50, 121, -193, 127, 112, -151, -12, -73, 72, 178, -71, -152, -32, 151, 84, -67, -31, -13, 66, 9, 18, 44, -11, -4, -45, 31, 65, -34, 7, 9, -16, -47, 50, 56, -101, 61, -70, -86, 179, -115, 6, 75, -236, 43, 111, 6, -23, -159, -29, 126, 96, -82, -124, 56, 59, 21, 7, -4, 21, -32, 23, 32, 36, 37, -57, 19, 27, 7, 11, 44, 41, -113, 57, 27, -73, 138, -75, -71, 93, -132, 81, 104, -140, -80, -29, 99, 72, -75, -116, -16, 108, 14, -51, -1, 7, 2, -26, 40, 25, -11, 20, -33, 47, 41, 3, 13, 15, 8, -66, 79, 48, -89, 100, -71, -59, 121, -79, 60, 41, -159]
4127a59J66O0rq5p0O5Q2L4j36j3Q2j7Mj4M2m2k7N9m1O2k6l2K2j4J3k7J22r2q5
4156g6J75j66P0J22k00J20p4r8K27l2r0p7L5J07J7o3r1P4N1l6j2mK8l5PM5k6J9
4184A7k9%K0m%nP3j20PJ26j43J26j7j43J67j20K6J75j41o7pO5R8n3q7n4J26J1
4212D7n5j2KJ9l7L6MnK5o0K2K6k1RJ6K7j19R7L3j15J73j44j2J39j93J57M1j48
4240d8J7k2J05N0j02r1K5J47n0n4nOK4m3L9kQj2n1P4k0k6K8K4k5p1J22p1M0Q0
4270I6k29J81j1j47K52j10p1K1n8J67K0j14j01P3J25n9l0m6K9L2l2J8rK5p0kP2
4297B2l6RjK1n8J3M5r3J87j38q6K35k24J13J17j96J30j38j2K22j5j09j29R6R6
4322G1J1n6j09Q3K3qk7K3K8j01O9plK6n8K5pL5q9O1J23k40J62l6j40K68j82N6
$$ y = [-159, 7, 67, 58, -27, -97, -32, 50, 84, -52, -65, 17, 0, 4, -10, 32, -10, -37, 22, -19, 43, 17, -15, 7, -7, 6, -21, 101, 9, -76, 99, -67, 3, 125, -75, 45, -29, -127, 100, 68, -22, -99, -64, 43, 60, -3, -94, -20, 31, -5, -17, -21, 7, -28, -21, 24, -2, 17, -12, -12, 8, 4, 4, -1, 72, -48, -41, 85, -58, 68, 51, -92, 75, -45, -19, 156, 15, -52, -59, 6, 104, 51, -36, -90, 36, 47, -8, -20, -18, 1, -36, 0, 4, -1, 24, -36, -14, 12, -9, 0, 16, 43, -76, 21, 54, -61, 112, -32, -44, 95, -98, 59, 100, -48, -31, -53, 52, 102, 0, -91, -66, 81, 31, -23, -28, -22, 2, -41, -2, -4, 4, -8, -59, 15, -5, -31, -3, 21, -4, -75, 47, -24, 16, 96, -133, 48, 37, -110, 142, 32, -39, -18, -76, 91, 111, -3, -104, -31, 94, 35, 5, -41, -12, 20, -12, 6, -3, 22, -48, -50, 22, -14, -5, -6, 15, -43, -30, 15, -78, 109, -29, -115, 120, -104, 9, 126, -70, 60, -78, -90, 132, 117, 8, -121, -25, 71, 82, 26, -83, 0, 23, 15, -12, 11, 39, -62, 7, 0, -3, 23, -35, -10, -17, 18, -71, -10, 113, -127, 35, -1, -141, 127, -55, 1]
4350AJ11k83J17J09L9l5j69J8J22J23j28j17Q1L0K1n0M2k1j3J2q2J23k6o0K0K8
4376A3j6p4J56j17K0J11k86K48j2k01L02j76n2O2q3K19j3j54r9J06J71p3o7p1
4400h6O5Q1m2j8LN6j01K1P1m2L0m4J4k4L3k5o0K21k45J1J90k83K59m2j41K39k84
4427a43K9J69K4mj97J0Q4J52m7j71N5N3K9m8J4Rk1K8q5Q5L8p8J7J2K3j24J49m5
4455A7m6J80l21J71Q3k47L05j22q8Q0j68J97P9q6j57rJ82K3pj45J2Q6jqm3Q5p9
4482b7j2N9m0P6m4j0KM2n9q7K53k05N2J07k98L03j30o6K49k31kJ1N2J41j01j22
4508h7p1J90P1r5m8m1Q6qJ5l7L3L2j11P5J6j0KpJ6m7R9j62J08J40l00K37j06r8
4536a08K50k31J70J9k34P2M3J35n3j21o6P3J74q8p8qL4RqL3m5P0p2l0Q5j8ok0
$$ y = [1, 112, -171, -54, 55, 94, 59, -110, -92, 30, 153, 25, -92, -11, 19, 40, -10, 32, 11, -2, 10, -72, 51, 25, -35, -15, 13, -3, -77, 79, -38, -18, 93, -193, 55, 43, -158, 144, -32, -84, -22, -105, 114, 101, -53, -152, -46, 125, 52, -15, -86, -21, 60, 18, 0, 3, 59, -42, -21, 50, 8, 38, -6, 8, -16, 17, -8, -68, 153, -92, -81, 109, -174, 85, 43, -98, 141, -143, -114, 55, 79, 75, -122, -112, -28, 124, 77, -94, -39, 14, 43, -5, 9, 18, -3, 25, -60, 25, 63, -15, 2, 14, 37, -87, 62, 17, -29, 151, -170, 1, 84, -163, 142, 20, -68, 12, -156, 41, 120, 34, -123, -132, 50, 73, 66, -79, -67, 19, 18, 10, -33, 52, -27, -39, 20, -20, 56, 12, 2, 4, 46, -13, -100, 153, -52, 0, 107, -191, 112, -18, -84, 165, -66, -68, -57, -5, 136, 35, -87, -158, 32, 103, 8, -40, -81, 5, -3, 12, -25, 8, 40, -71, 4, 20, 10, 12, 5, 21, -26, 73, -89, 19, 159, -141, 96, -10, -108, 142, -89, 81, 100, -134, -62, -19, 116, 63, -58, -124, -51, 123, 35, -43, -51, -17, -8, -16, 17, -28, 42, -30, -60, 25, 7, 1, -19]
4564a9P6r3L7M4j63K81j74n5K06k70J67Lo9J73j83o7P9J12M1j50n6k2J66J7j01
4589b0l0K8L4o4P0l5K0J8r8P0OMm0O8j0r7J50j70J20J04k57K44j27p5J66j25J62
4616A16m8j43JP7J26p8o8p5O5R3k8l7l8N2o5L8K0l9O6p5J1J6K7m1MJ02j56J30
4644E3p8p2K52k39J16N1j81J36r8R2J00j18r2j4J49M4m5q9m7R8J8mm6L9n0pL4
4671Bl1P0m0l1KL6k8m5J44j28P5Lj87K47j27LJ56j86J00r8j1J61J3o1j39M1Q7
4698B8O5l1j05K0K7K6m0L6j4k2L0o9O0Pj4k7L1J3r1J19j19P2R8k31J82q6o0J75
4726H0j25J09n7j09N0Q4Q3q1p5m7Q4Q4l3m9k9L9l1N4nj9M9q3J5J1J6l4L1J5p1
4755d4J10j50N3J22j82J60o7p9J21j52J32N3o4n8n6Q7P7L0j13m8M6M2K4l8J5l7
$$ y = [-19, 57, -36, 1, 45, -118, 163, -11, -66, 140, -130, 37, 40, -29, 144, -39, -106, -27, 85, 126, -24, -80, -102, 64, 81, -20, -50, -22, 12, -52, 18, -17, 3, 21, -77, -7, -1, 3, -37, 31, 21, -76, 74, -96, 24, 128, -129, 115, -12, -87, 79, -46, 116, 68, -75, -74, 3, 129, 51, -17, -92, -27, 66, 38, 1, -37, 15, -50, -12, 8, -31, 35, -40, -29, -13, 14, -27, -23, 79, -77, 53, -25, -97, 155, -84, 32, 83, -98, 38, -60, 32, 132, 14, -78, -92, 57, 101, 56, -33, -80, 18, 36, 32, -14, 25, -25, -32, 2, -29, 41, 1, -30, -28, 8, -20, -65, 79, -49, 26, 29, -158, 89, -38, -35, 121, -65, 35, -63, -74, 87, 100, 39, -100, -59, 28, 93, 62, -43, -23, 4, 30, -10, 26, 12, -10, 20, -49, 11, 18, 4, -23, 8, 21, -70, 49, -70, 2, 100, -131, 51, -35, -95, 80, -45, 64, 7, -102, -52, 32, 115, 34, -41, -88, -4, 80, 47, -2, -31, 8, -23, 31, 26, 7, 56, -27, -12, -1, 15, -19, 12, 27, -44, 66, -84, -31, 91, -91, 69, 2, -77, 44, -108, 24, 77, 13, -45, -101, -14, 63, 93, -20, -68, -22, 20, 44, 6, 21, -16]
4781a6L5k8rO9k8rpJ4l7L7j0n9J53j50J6P7j59J90r1j3J11j72L4J2P8O0q0r3j6
4810i1J24K2j7o6KK1J1K0m5Q3o0j9J6j5M4j4J4m1P4n8o7J37j27R9Mj36J60j38
4838f3K4R0o2O8r6m4K8R9K2q7m1j1R0J0mm3J8J6n3N0k0L7nl0JK2Ln6J00n9MO0
4870F8j57J49o0k7J22j24N9m1o9R5L4Mq0l5lQ6L8o5k3j1M6j9L1l6J7L1n6K5J0
4899IJ3j8J2j3mM8j13J16j4o1J07j32O4J1q3J07j4lm7m1M1N8K3o4m6NL6J7qk2
4929a6KK3l8K5%J1J4l0J1rK1m3N6Km1Q1j25O2L7q2R5n2J7Kn0M2J0K4l3l0j4L9
4961A1L3l5k0j3J7j1K1j0%J8l0mK1j0PJ1pj8M6n9M3Ol4O6p1K6K3m2L9rMKj5k4
4995a8K8J8Jj8l3QJ8J3j8qoqK1j1nKOrNJ2k1K9j6qM0m8L7j0lL4m5K2jLmRPj7L
$$ y = [-16, 19, -9, -18, 51, 23, 14, 7, 21, -16, 21, 11, -48, 105, -45, -29, 48, -111, 79, -12, -25, 86, -86, -52, -40, 38, 98, 18, -75, -91, 33, 55, 38, -28, -26, -5, 6, 26, -19, 64, 4, -15, 1, -14, 30, 16, 30, -11, 63, 5, -62, 75, -52, 47, 51, -85, 75, -63, -39, 51, -11, 57, -39, -83, -55, 44, 66, -21, -62, -73, 17, 27, 23, -20, -2, 14, -39, 11, -9, 28, 23, -7, -6, 16, 19, -37, 63, 4, 8, 68, -89, 60, 0, -27, 95, -29, 30, -11, -80, 15, 49, 53, -27, -62, -65, 21, 59, -6, -29, -40, 6, -13, 18, -18, -1, 30, -26, -1, 9, 22, 4, 16, 3, -1, 47, -66, 50, 36, -25, 82, -50, 14, 25, -58, 49, 35, 32, -15, -56, -15, 43, 66, 2, -44, -39, -3, 14, 6, -16, -14, 9, -29, -4, -4, 7, 21, -9, 2, -7, 14, -29, 27, 29, -12, 69, -56, 6, 43, -39, 56, 4, 21, 23, -27, 15, 25, 49, 16, -14, -28, 11, 44, 9, -11, -24, -7, -18, 3, -7, -7, 11, -19, -23, -2, -12, -5, 6, -1, -19, 27, -32, 11, 17, -17, 49, -22, 4, 27, -15, 24, 15, 19, 21, 6, -18, 10, 28, 29, 11, -22, -14, 4, 17, -1, -9, -15, -23, -2, -13, -18, -16, -10, -19, -14, -2, -23, 6, -10, -18, 22, -26, 11, 1, -2, 32, -13, 9, 8, 11, 7, 16, 23, 6, 9]
5034I%J1j5K0j3jPk3J7nkMj3KLmj2J5k4K5Kj5Oj2J6%nLkJ5k0K0Pk0J2%J2j0Qk5
5074gJ3J9njroJ0rN%k1J3j4j2K9jLk0j%LL1l4J2j6k4N3j6J8ol5J6J4Qjj1pK5J8
5113C4l1OKNJ0j0qj0K2j6J0pOmk1KK2Qm8M9n6K2J9l6N7n4J1Mk4N6J3k1m2NJ7L5
5149B7On0J3OMQ%jJ7j4l7L7j5K4j1j6j5K1Mk6O0o1K3J4o8Q6o2J1K2n3O0k3k0j7
5183d6N0J8lj9n7M8M3Ml4k5NK9J7k3L9m5Qj8NK8J8j0o3N2m5N3J4p0Q4r8K1K3k1
5216a8Q2o8l0k4N0K9kl3l9M4J7mk3J6j1L5k2k6N0j0J8k5JLJ7j7j7N8p8O5l0l1
5248b3R2r2M8j4k7O0o9J2LM8k7k0l5lP1Pj7n0kK7N6k9j8Pl9L0jJ8J8Qn3pL4k7
5282a4R8q5KL7r2J11m9K3J3q1K7j7N2K4l2o5QM6K1Ll5k5J6J4k6L7omPm7L1J9J4
$$ y = [9, 9, 20, 5, 25, 12, 11, 18, -5, 12, 7, 5, 9, -4, -2, 1, -3, -15, 0, -24, 1, 3, -12, -6, -18, -2, -2, -7, -4, -6, 9, -11, 9, 16, -4, 8, 8, 20, 10, 18, -7, 6, 25, 20, 19, 10, 4, 14, 5, 10, 10, -11, 2, -12, -24, 5, 4, 7, -13, -14, -14, -11, 20, -14, -2, -18, -42, 11, -5, 13, 7, -28, -12, 2, 10, 9, -2, -9, 16, 34, 3, 9, 11, 16, 26, 16, 8, -2, 20, 4, 14, 7, 13, 9, -12, -10, 12, 20, -28, 21, -35, -13, 6, -30, 27, -27, -16, -12, -36, 20, 33, 12, -30, -25, -8, 27, 33, -17, -4, 2, 6, 14, 14, 13, 30, 16, -21, 16, 1, 25, 14, -2, -17, 4, 8, -18, 42, -19, 4, 18, -50, 36, -26, -15, 7, -46, 14, -9, -29, -46, 4, 22, 19, 0, -57, -9, 34, 38, 4, -21, -16, 13, 30, 7, 46, 1, 9, -9, -4, 24, 42, 32, -31, 21, -24, 29, 43, -27, 57, -41, -20, 3, -18, 64, -4, -34, -58, -8, 21, 19, -14, -53, -9, 8, 4, -19, -3, -14, 21, -1, -27, 23, 13, 31, 6, 7, 10, 27, 10, -7, 51, -27, 38, 8, -23, 69, -23, 25, 11, -16, 44, -25, -13, -10, 38, 11, -9, -44, -47, 24, 31, 14, -36, -38, -11, 45, 16, -2, 5, -34, -4, -5, 13, 31, 39, -14, -21, 13, -14, 84, -1, 1, 38, -54, 57, 8, 31, 44, -37, -10, -27, 25, 49, 17, -48, -40, 6, 27, 30, -5, -30, -14, 0, -26, 11, 5, 1, 8, -39, -8, 11, 25]
5315B5k3Pl4K0N1o9Q0m7l1N6p3R7l5k6Mk4N0Mrm2K6KJ6j3l9OL2J3m2J1m0M4J8
5348A5k0Lj3J6j4K7l1M4l1l1O5p3R3m4k4O2p4O2m7L0K0qk5l4L0J8L2k6m8kK1K4
5380A7J0k8m5L9j5L2lprqk2RO3m7M6o4rN7n2Q4m9j4L0n6N1%L8l2m4j6L5N9ql4
5414Hl6NK1M4l4Lk7j1K6j1L0lj3l6lON5Po2L5o9M2L7l6R2r3mmJ5O6nl4n6PM4M3
5450D9Ro1k9J0L4J6Kk8J0k3JK4J4Kk6l2j2N0k7N5k9m8M6p7R7k7KK0q8M0ON7J7
5483E4n9m3KP2QJ6o6j3L1J8J0j4Qj8jk4K8K4jj9k5k9L5L8k9K9q0L3%k7J02o8K6
5516A8o4l3P6K4L8p3m5RO5M7l6k2m7K6K3K6Jj8nk1J6j1N4Mm4j7j8J2N9k3pj0p0
5549f6Q0l2L6M0q6K4p9O5O7j2j7q4OK6Q8j8n2j9k2O7PNoj1oj7L9j0M6m5k5Rk4
$$ y = [25, 2, 9, -25, -5, 46, -23, 57, 10, -21, 35, -38, 59, 24, -2, 2, -22, 28, 32, 23, -19, 7, 9, 25, 12, -27, -21, 11, 24, -18, -7, -47, -3, 15, -5, -2, -15, 1, -13, 14, -17, 27, -4, -35, 30, -43, 50, 6, -18, 44, -30, 32, -15, 15, 35, 27, 2, -32, -2, 16, 48, 22, -26, -28, -7, 17, 27, -1, -46, -7, -22, 10, 7, 0, -9, -17, -39, -30, 33, -14, 32, -32, -41, 16, -36, 48, -1, -15, 15, -41, 10, 10, 48, 16, -28, -44, -9, 50, 42, 8, -28, -23, -2, 42, 8, 11, -16, -27, -1, -12, 18, 15, 2, -34, -37, -31, 24, 31, -31, 4, -65, -23, 14, -22, 70, -23, -27, -31, -16, 50, 45, 11, -45, -38, 6, 49, 58, -3, -32, -22, 12, 28, 30, 2, 12, -11, -10, 14, 28, 30, 4, -28, -40, 10, -17, 38, 9, -39, 7, -70, 27, 0, 2, 22, -66, -26, -20, 37, 54, -5, -48, -46, 26, 34, 50, -16, -29, 2, 20, 30, 16, 24, 6, 5, -19, 9, 33, 32, 13, -12, -41, -6, 32, 3, 32, -48, -15, -15, -42, 60, -8, 18, -46, -79, -3, 21, 59, -14, -59, -50, 15, 62, 26, 4, -43, -17, 6, 32, 33, 15, 10, -11, 5, -6, 48, 52, 8, -9, -27, -15, 44, 21, 14, 4, -66, 14, -18, 18, 58, -28, -4, -83, -18, 49, 37, 20, -64, -58, -32, 56, 38, -14, -33, -55, 12, 19, 24, 18, 7, 1, -16, 23, 13, 59, 14, -11, -2, -26]
5582b6P6qm2J9m4J9K7k6N5m6l6lk0Q8J0k8n7l1O5L8L0p6k2qL3M7j4nl7J8qL1M
5615B3j0K4p7N4j5K2M7r9M9k1JL4m0K3J0j2j5j2pN1ol5k4PK4K5j4l1nK1K7nl3
5648a9LK4oNj4nK9j3%L1n2N0m4oN7m5M9n7j2M9%K2m5k3j4M6K3j3k9l7L4NJ0Ol1
5683b2J6j2qJ0K8poj3k2N2nQMl7J1j1PM6k1Nqm0L3J0L0j9m1k3L0L8Kk1m1qK6R
5719@J9k9mKj5K4jj1lRk4M5j8lL1n2L2J0j5K2k5K5Orlj7PK6nl0J6kRPj7%rkPM
5759Gj4MK5k4ml2K4J6j2J4l4J9LLJ7j3pJ2k3J9J7Nok1lJ4K9j0k1j7PJ9JQk3k0
5795b1L0j2K4pk1%J0j1Rpj5L2m0K9Ll4K5l0L7Ql2J9m3N2Okj4k3L1mL6l2Nj4rM3
5831B8k6K0j8QkmjKK4m6L5n2L0L5n8N1o9L9Ol5N4l8J5qj3j3K0J6J3j1k6MK1J2
$$ y = [-26, 50, 42, 0, 19, -25, -6, 21, -5, 50, 4, -32, -35, -55, 33, 43, 15, -42, -73, -8, 30, 60, -16, -38, -46, -13, 34, 20, 15, -22, -4, -12, 19, 23, 13, 37, -40, 14, -1, 21, 68, -31, 18, -3, -2, 32, -8, 15, 25, 13, -2, -14, -21, 30, 24, -11, -35, -28, -4, 21, 7, -24, -29, -8, 19, 14, -19, -16, 8, 2, 7, -7, -12, 17, 4, 4, 35, -17, 33, -11, -17, 40, -5, 44, -13, -25, 24, 24, 46, 1, -22, -36, 10, 33, 20, -9, -46, -12, -7, 3, 9, -22, -6, -18, -26, -16, 12, 5, -1, -14, -36, 16, 11, 19, 23, -14, -3, -14, -7, 39, 18, 23, 15, -25, 8, 18, 48, 29, -12, -35, -5, 33, 35, 14, -27, -35, -9, 0, 19, -10, -14, -12, -27, -3, -4, -15, -18, -9, -33, 12, -6, -9, 22, -30, 2, 12, -3, 19, -6, 19, 25, 16, 13, -4, 3, 29, 24, -6, 10, 8, 17, 24, 7, 7, -2, -4, 3, 7, -7, -3, 22, -2, -6, -38, -14, 2, -10, 4, -30, -11, -8, -5, 12, -1, -8, 4, -19, 0, 17, 22, 16, -5, -8, 6, 35, 25, 4, -13, -6, 13, 14, 22, -1, -21, 9, -3, 21, 14, -7, -7, 3, -8, 1, -6, -21, 11, -29, 0, 3, -31, -6, -36, 1, 9, -23, -4, -47, 5, 11, 9, -5, -28, 3, -1, 35, 3, 8, -6, -15, 28, 2, 22, 4, 12, 10, 6, 5, 7, 31, -15, 20, -32, -2, 33, -25, 26, -43, -4, 2, -33, 21, -17, -2, -10, -23, -36, -16, 0, 13, 2, -24, -20, 1, 13]
5865A3J3l1JJ7J3Nj3j8QK3l2J8k6MM3n0L5m0pN3n2M6j6k3K1n1L8J8NKn0k2L5K8
5899HK7j9n2mL6L8rj6l2J5K6pJ7l9J5L9l7K3j7l2N5l9L3Rp2O0n5NP3n7K6o3j2
5932e7P0OK7n8m2nN1N4k0k4o4L2L3J6K3n8J1K0k8M6k1j4M2m1J4L4p4O8l8k9J04
5963G8j00O6n9n3J03k2N4p1o2J0L8Q5l7l4q9M8O0J5L3j08K5rJ1N7l7J6kl2NM6
5993C5o2P1l5k7Q6r8R1n5n2R3n8Q6o3o3K8KJ08l5n4p6J8P0K2L7j15j0mL6R0p0
6023dLk4k5O3mj9N3p0J9L3o9J02m4k5N1p9J12n0n2M3m5R0mn3l1l6P7O4Jr8m7J2
6055e6N4R1p1l7m6j2J12k8PJp9O8k0pQ4r1M6k5m8J07o1M0j5m9O3lpj0m8L9N4k1
6087C2k3o1rQ9K9Nq8n3K9Q0K6l6l1j02J00j1N2K5j33J24j14M6O2r1J28j20L4k
$$ y = [13, 26, -5, -4, 13, 26, 31, 18, 0, 8, 31, -1, 17, -9, -5, 38, -12, 23, -17, -24, 29, -23, 23, 7, -16, 5, -46, -8, 10, 15, 17, -33, -55, -20, 8, 35, 16, -36, -40, -4, 34, 25, 9, -23, -8, 18, 11, 28, -11, 4, 43, 6, 29, 12, -20, 35, -4, 29, 38, -34, 26, -29, -24, 49, -8, 18, -45, -57, 13, 19, 46, -12, -54, -59, -8, 46, 26, 2, -62, -30, 3, 19, 42, -16, -5, 15, -13, 33, 12, -2, 40, -1, 13, 47, -27, 41, 3, -26, 78, -22, 44, -15, -68, 35, 13, 67, -4, -66, -56, -18, 67, 30, -4, -93, -45, 15, 30, 63, -45, -20, -29, -18, 39, 2, 18, 16, -16, -11, 35, -27, 44, 9, -18, 68, -30, 61, 6, -46, 47, -11, 75, 12, -51, -23, -21, 87, 52, -2, -78, -60, 10, 32, 69, -46, -56, -60, -24, 66, -4, -1, -25, -50, 13, 9, -10, 43, -27, -8, 25, -44, 58, 14, -11, 40, -39, 73, 23, -29, 14, -31, 59, 55, 2, -29, -65, 12, 76, 77, -21, -68, -56, -2, 89, 18, -19, -65, -77, 35, 7, 14, 15, -64, 4, -16, -23, 61, -30, 16, -9, -57, 50, -11, 29, 14, -35, 28, 25, 18, 8, -40, -1, 53, 32, 9, -52, -61, 28, 57, 62, -26, -79, -50, 30, 56, 20, -11, -113, -13, -24, 28, 53, -80, 44, -70, -24, 38, -53, 75, -45, -11, -13]
6115a3j3Q8m9Qn0L1nL4lm6N5m3N8n8j5L5j4Q3q2j6l2M0K7K3j0j09Q7p1J04j2r5
6146f3J20j51J43n8n0J19j14J31j15KK8jQ7p2J6r5P3K0K5K3j10N8n9N6K3l0K6
6173C2n2LJ5MK2J1m9oNk7J11q1Rqn2J11p6L8l3k8Q6l3K0m1j9N7L8pm9n7RQ3M1
6206G7l1n6m8K5R0l%o9n1P7l7J06p3l7O3j20J30p3L8M1j06O0o8O4J4ool9K8k6
6236c6Q1n7J9pl0Q4p3N9l8MK7l4J3k1L4OJ8o5PQQO3j06O1n8J2P3q7N7p0M7L1o2
6269c2K6m2L7M7k1k9l0j3O0N8l7m0m7K5O9L6l8l0p0N9N8k0M0j15N3k1QR1j15Q8
6299E5p5j1N1n8R8o5J1l3lL7%L9p4L7o0M4L1m1N0p3L3mj3M7l2K2j2k0LL4j3N1
6331E6n7j6K3j1Q2o6mj4k0P7k6j1k7j1L7J6l0j4j2QO3n2J2n9K7N6nJ0q5J2OP3
$$ y = [-13, -26, 62, 13, 21, -29, 2, -3, 31, 28, -18, 37, -6, 52, -6, -21, 14, 0, 83, 1, -15, -47, -7, 20, 43, 33, -76, 11, -60, 44, 32, -63, 57, -94, 49, -9, -59, 60, -54, 77, -38, -36, -8, -9, 78, 6, 22, -73, 0, 20, 45, 68, -42, 16, -43, 13, 36, 6, 32, -20, -17, -2, 2, 24, 35, -14, -20, -15, -42, 69, -12, -3, -11, -63, 48, -28, 10, -23, -51, 35, 2, 22, -19, -38, 19, 57, 50, 1, -56, -47, 36, 77, 46, -10, -58, -33, 57, 54, 54, -15, -66, 11, -26, 80, 7, -30, 33, -87, 43, -30, 8, 49, -57, 3, -65, -1, 13, 7, 1, -38, -10, -36, 45, -12, 7, 0, -30, 54, -19, 40, 2, 6, 33, -1, 12, -9, 25, 31, 49, -16, -9, -1, 7, 70, -36, 25, -33, -21, 52, -35, 22, -48, -1, 30, -32, -6, -48, -11, 36, 15, -14, -44, -57, 3, 61, 24, -16, -63, -38, 31, 67, 29, -1, -71, -12, 46, 26, 66, -49, 4, -17, -9, 82, -33, 55, -20, -31, 20, -38, 60, -5, 6, -27, -30, 7, 7, 46, -28, 9, -51, -7, 24, -17, 33, -40, -7, -11, -24, 23, -9, 13, 1, -19, -16, 18, 5, 56, -1, -17, 6, -5, 77, 11, 7, -7, -27, 50, 24, 13, -14, -25, 12, 28, -2, -16, -28, -20, 43, -9, 3, -56, -29, 27, 22, 32, -53, -41, -35, 38]
6363C8j9pm2k0Q1j8N8q3pM5n0R4q9L2J5k8L6o6L3QJ7K4p3j5PL4M5k1n9k3OP0L1
6396E4l4o2j1K2M5N5q2J5p0M6O8m4P2j18M5qk6R8r6Q5n7pJ9k5O2k9K8o2oK0K2
6427A9L1m0j1n7L9L9Mkm8k5M2oO0k6n4L2o6Q1jrL6j06P9m8N8K5n1L2p1O2j5L4
6459C7nk9j0l6O1k2M4k5l3J5j6M7j4j3Jl9NL6j6N0o2j6J5l5J06n3J9l2m7Q5l4
6490a6M6k4j9Qk7N9nJ9l9rnJ8J6k1M0n8J1QrM9l4nml2L3PJK1o3RkK5L9n6K3n6
6526e2K9M1l3N1o9J7nK3K9j9Jl7K9j3M3mk1J8n1M8k4L1Rn0K5l6J6L5k5J4j8l0
6558b8L8k2M3j5m8K0l0P0k2mPm4L1pL6k0ppj0L4pM0l7lj2j0N5k7L4m8j9L5j7M0
6592C9k5qj6k2L5K%Kl9K2j1J5J7k5J1k5RJ2pK7k6Jj0QK0NRl4Nj2M1J7l3J4m4N0
$$ y = [38, 19, 12, -30, -50, 31, 13, 71, -12, -19, 26, -24, 70, -19, 13, 28, 0, 36, -30, 3, 11, 28, 52, -21, -36, -29, 5, 50, 29, -30, -53, -47, 23, 54, 20, -42, -53, -31, 14, 69, -13, 2, -68, -22, 46, 2, 74, -44, 1, -7, -33, 65, -31, 54, -3, -10, 9, -16, 46, 17, 45, -17, -23, -3, 19, 50, 10, -1, -58, -19, 20, 24, 22, -26, -51, -9, -15, 45, 19, -35, -3, -69, 12, 11, 2, 38, -68, 11, -37, 21, 46, -5, 27, -44, 18, 3, 37, 32, 3, -7, -43, 18, -4, 40, 15, -18, -3, -19, 28, 14, 1, 2, -37, -32, 4, -12, 38, -24, -40, -25, -60, 46, -7, 12, -20, -67, 18, -16, 30, 6, -13, -5, -32, 27, 22, 41, 2, -7, -12, 6, 22, 1, 41, -17, -6, 2, -7, 42, 8, 3, -1, -33, 0, 7, 8, 29, -34, -25, -27, -2, 37, -19, 4, -52, -23, 18, -15, 36, -33, -16, -21, 2, 31, 12, 13, -24, 5, -8, 35, 31, 10, 28, -23, 25, 1, 32, 41, -9, 16, -20, -4, 31, 6, 20, 2, -28, 10, -12, 31, 16, -32, -12, -42, 28, 6, 2, 9, -35, -4, -11, 25, 5, -2, -9, -19, 15, 8, 48, 11, 8, -4, -14, 41, 14, 48, 0, -19, 16, -1, 39, 14, 6, -10, -32, 3, 5, 5, 7, -32, -10, -21, -6, 11, -14, -3, -28, -19, -7, -14, 13, -13, -12, -22, -14, 6, 11, 20, -14, -9, -21, 20, 37, 4, 18, -26, 24]
6628B4j4JJ5l7K6k6K6Lk2J4j6LknJ3rKj0j8K5kOK4m9PPJ9jj7Qj4K5KJ1j4mNJ4
6666B0Nk3J6k7K7LnOl6L7k1KNk0OlK0j6J1l0J3J2qJ8l8K7k2K2Rl5M3m3M3k0qM2
6702C2l5L5l3qK5j7L7k3k2K7l6M1nj0K4m8L2k0J5K3n1K5m2M3qrJ4m8M0l3M5lj7
6735a0jm2N8j9L2j9k5L4l9O7m5J0J6l7O0m1J6j4RQj4Lj6K2j1L0m9J5j2PM8o3L5
6768A3m7J4L2l5M6o8M3Mk5M5o5M6%lK5o0K8J2oM6n4K1ok8O7l6K8j6l3L2m1P9m5
6801A3kj9l2O5j9M7n5k2pQN8m5J6n4J6L6j7L9p6M9l2K7K5n1M0l4N2j4j7Nj9N0
6833C1k3K2l2J4kJL2p5O6n1L9pm9R1j00P6o0nN8p3J00q7K3Kn0R3o2N6l4l1M1l3
6865b9M7k2j0L2k8j2L5j2L8j5l5J1m2R6k2j3Lq3J05l2ONo4O2l3L8Rp9O6m8L6M
$$ y = [24, 10, 11, 26, -11, 15, -11, 15, 18, -4, 10, -6, -3, -5, -10, 3, -6, -4, -14, -32, -7, -9, -3, 21, -28, -21, -14, 5, 4, -13, -5, -19, 6, 8, 19, 5, 1, 6, 20, 25, 2, 18, -9, 18, 21, 16, 22, -14, 23, 2, 4, 9, -11, -5, -8, 12, -4, 7, -23, -10, 2, -6, 12, -26, 1, -21, 1, 10, -25, 18, -25, 18, -2, -10, 32, -3, 32, -1, -9, 16, -1, 36, 13, -9, 18, -18, 23, 18, 8, 32, -16, 16, -4, 11, 34, -17, 8, -34, 9, 1, -8, 6, -42, -2, -35, 10, 7, -10, -11, -53, 5, -14, 18, -1, -26, 8, -31, 36, -9, 1, 17, -20, 40, -1, 15, 1, 10, 18, 4, 7, -9, 13, 2, 32, -17, -2, -14, -7, 41, -22, 13, -34, -20, 12, -23, 23, -45, -2, 2, -23, 22, -43, 3, 3, 0, 25, -35, -7, 5, -1, 45, -9, 12, 6, -22, 45, 9, 37, 21, -12, 20, -21, 58, 13, 11, -8, -40, 25, 6, 53, -2, -24, -31, -23, 35, -10, 6, -48, -32, 4, -13, 26, -50, -1, -33, -6, 19, -32, 8, -26, 26, 12, -5, 0, -19, 31, 8, 30, -2, 12, 10, 11, 43, -32, 34, -17, 22, 15, -34, 57, -43, 33, -27, -32, 26, -47, 53, -34, -11, -9, -59, 34, -28, 28, -6, -37, 4, -29, 18, -4, -14, 18, -10, -22, 13, 1, 39, 24, -11, 0, -42, 54, 32, 19, 22, -61, 44, 12, 18, 23, -41, 21, -12, 26, 35, -44, 22, -26, 10, 14]
6897A4n9N5m4L4K4m7L5n9K5M3l4N4n5oJ6k8Q8l8J1j8n6O3NM6m5m6K1jN0rl7rr
6930a6K6J9k8rpqM9m3J5k5qN8n1N9o0kK9k7N7m2L5l5k0N6k3O5o3j4oPN7j2%o0
6964b7K1J1K9Nn2K0l6N6j6rOm3N8l0K1l4j4N0m2N2n0K1j5j1M2k9N0n1K1k4j4O9
6996C5k6L2o5J0RJ3M8o6K7l9M5J1k0J4n1M0jPj5k6K8k3L1k3omj8N0m0K8j6j0J2
7029ij5L9k6L6n6RK6%L6l7ok2J6N1j8Jn6M0JK3j1l9L0k7M6k4j4J4j7M2m0J8j3
7062bj7L0k6K2pRk2k6K8OJ9j4k5j2L4K3J1k0m5K8KM6k2l2J6k0M6j0j3J3l2M7l0
7095ELmj9K7l3L1j1oJ1l2J0J5oJ7n0QK7J5J9n0nKK0M8m2j3j3J5L9j4Kj3j2K3j2
7130BJ5%Okk5J7Pj2Lj2j0K4rRl5jK4j2M7p1J8QmM5o3K5k7K9L5m5L3l9J9J5k8M4
$$ y = [14, -45, 10, -34, 0, 24, -23, 12, -47, -22, 21, -13, 41, -14, -20, -4, -32, 56, 18, 29, 11, -45, 18, 23, 69, 24, -22, -1, -2, 48, 39, 2, -7, -16, 10, 29, 1, -8, -15, -23, 26, -17, -2, -27, -35, 23, -28, 31, -29, -31, -2, -29, 28, -14, 21, -14, -34, 22, -1, 64, 1, -13, -19, -12, 45, 33, 33, -27, -6, 5, 34, 39, -13, 7, -29, 27, 11, 2, 8, -35, 23, -7, 14, -20, -34, 16, -26, 26, -24, -3, -18, -29, 13, -16, 34, -17, 4, -20, -34, 35, 9, 41, -24, -14, -5, 8, 56, -10, 17, -22, 23, 34, 14, 28, -23, 17, 16, 23, 8, -18, 10, -13, 18, -5, -11, -15, -33, 17, -23, 5, -11, -21, -9, -24, 15, -11, 25, -31, -22, 4, 4, 40, 3, -3, -25, -9, 42, 24, 25, -31, 9, 10, 33, 22, -17, 13, -14, 32, 8, -6, 8, -9, 33, -7, 11, -2, -19, 11, -15, 7, 0, 9, -13, -39, -11, -5, 14, 0, -25, -37, -3, 20, 31, 11, -34, -6, -4, 42, 20, -12, 4, -16, 30, 20, 7, 20, -12, 35, 5, 8, 4, -15, 12, -21, 10, -1, -7, 4, -28, -18, -3, -9, 8, -42, -34, -7, 8, 27, -23, -28, -26, -6, 42, 0, -13, -26, -11, 28, 14, 16, 3, -9, 14, 2, 17, 17, 23, 21, -4, 13, 20, 8, 11, -1, -11, 13, 4, 13, -22, -23, 1, -11, 36, -35, -17, -9, -13, 32, -31, -6, -33, -4, 31, -14, 19, -20, -1, 14, -14, 30]
7166C0k6J3j2jJQJ5j4rqK4j4J2k2lK5k8L8n6J1K1mJ4n1K5jJ9Ol3J5j6L0kj7Rj2
7202a3L3k3J4j5KJ3%kmQlkm%PlqnK2%Ml4mJ4K6Jl8j1OJ3J9mk2j5J8J7lOk7Nj4
7243b6K1QRj%j1lK1rRj2J3onK0l3J4JROl6K2j2K5j0j9Jj3L0j7Oj2oJ8j2KpJ3k
7282drOrRMNrPmJ8j7PNJ1mj1JRRjk1jMNJ3k4pJ2nlJ6k0rRmnRmJmKoJ9qJ7k6K8
7329A1j1N%j3J9j1K2p%KKRj9PljPpkjMqj1J0%nLoKn%J4j5oJmJ7onJ7j3jOQMj2
7375bK1k1J1LMKlj4J3nOJJj4nJ7oN%j7jLllJ7j3poJ4Pj6Qj0PmlK0lkMj8J1OJ0
7419A5J4j7p%mK8k3J6j2j0K0pJ3k3kj3KMK6j0rj4k2L7Njj0j2OnJ3mOJ1k4RjMK3
7458B2npj3j0L0K5l0J0k5OJ4%J6k5qnqL1Nk2%j7J3J4k1J4l4J7J2qJ1j9J9Lj0J
$$ y = [30, 4, 17, 5, 4, 5, 13, 28, 14, 5, -3, 21, 7, 19, -3, -6, 19, -9, 29, -27, -16, 5, 1, 15, -36, -11, -12, 7, 13, -20, -5, -21, 9, 7, -10, -1, -13, 20, -3, 11, -4, -2, 11, 11, 9, 5, 13, 10, 8, 4, 4, 11, 8, 0, -5, 17, 17, 21, -13, -17, -3, 23, 24, -14, -25, -19, -6, 13, 9, -13, -28, -10, 7, 4, 10, -17, -12, -26, -5, 3, 12, 11, 11, 0, -3, 18, 9, 18, 6, 19, 13, 8, 28, -5, 9, 10, 19, 25, -11, 11, -1, 24, 14, -5, -4, -17, 13, -4, 2, -10, -16, 2, -10, -8, -15, -2, -4, -13, -7, -16, -7, -3, 2, -7, 0, -4, 14, -3, 4, 9, 20, 16, 5, 6, 15, 24, 23, 2, 1, 5, 10, 23, -1, -8, 4, -1, -4, 12, -8, -17, -8, -12, -17, -8, -12, -11, -15, -13, -19, 0, -8, 9, -17, 11, 0, 5, 5, -8, 11, 0, 22, 15, 15, 17, 19, 28, 9, 16, 13, 12, 19, 12, 10, 9, 13, 5, -6, 4, 4, -1, 2, -4, -2, -7, -7, 7, -8, -14, -13, -17, 0, -6, -11, 6, -7, -8, -2, 6, 10, -2, 19, -2, 9, 12, 16, 18, 15, 1, 14, 9, 15, 16, 17, 3, -2, 15, 9, 14, 14, -3, -4, -1, -4, -7, 10, -3, -10, -16, -2, 5, -11, -3, -13, -6, -10, -13, 7, 4, 2, 6, -12, -1, 5, 15, 29, 12, 5, 5, 1, 29, 6, 22, 10, 0, 20, 13, 26, 3, 1, -12, -10, -6, 20, 10, 1, -13, -35, 2, 7, 6, -4, -16, -10, -15, -2, -6, 0, 11, -13, -4, -5, -1, 22, 17, 10, -3, -13, 17, 42, 12, 22, -3, 3, 17, 17, 33, 8, 0, -5, -13, 18, 23, 1, 1, -16, -3, 11, -10, 4, -30, -13, -1, -9, 2, -17, 2, 5, -5, -4]
7494dnJ2Mmj8J2kM0ok6%j8L7qJ7j7j5JKjL3j3k3Lk6M6mj7Ql1M2k0oKk4M4l0mp
7533b6K0J6pj7oK5rM4n1kJ1kL1j6Onk4K3PK3j1l2j1PPM7n4rRrM0n6L3nmJ7l9J6
7571a3K4%j4ml3M1J5rJ3n2L5mJ6K0m5M3m4PL1llk2j5J2M4l0L3o0K9J0m7N6m8N0
7605C3j9l7Qj8M7J8l1l5jJ0N3j3k6Ml9N5j1K1J3l7lrL9J2Jn2J2OK0L4q3P4n0J6
7639A2Mn8R7m2J2m2n1Q3mL4o1l0J6L2J9j0k0nprL1K1pk4k0NM8rrOm6P8m3J8K2
7674D1n0P9j00L4kj3R4j00J1k0K7N8n9J3m8L5kJ0j0l2M1m8M2j8J3K0m7N3k9J5
7704Hrk3K6L9n0K1m0L3M4m7K1m6L7K8n3K2j4K5Qk4k1LK1Rll4LRPJ5k9K6m8lM0
7739AKJ2l0k6%N6j2J5n0J5L7n1O6n5N5J1p2M0o2R4J8n8rm2P3j4J8k5j7LnM0k8
$$ y = [-4, -9, 3, 7, 3, -15, -3, -5, 35, 29, 3, 3, -15, 22, 14, 31, 14, -1, 0, 2, 1, 34, 21, -2, 1, -25, 21, 17, 0, 8, -23, 19, -1, -7, -5, -29, 15, -15, -19, -26, -6, 10, 3, -14, -20, 5, -4, 40, -11, -13, -2, -4, 27, 11, 17, 12, -12, 11, 18, 41, 30, -2, -13, -6, 1, 48, -6, -15, -6, -15, 25, -31, 2, -3, -7, 10, -29, -13, 11, 11, -3, -7, -40, 1, 16, 7, 20, -32, 3, -1, 15, 35, -10, 33, -11, -4, 27, 24, 21, -1, -16, -4, 40, 10, 43, -17, 12, 22, -25, 31, -17, 33, 14, -23, -15, -33, 14, 32, 1, -34, -35, -25, 28, 15, -11, -7, -46, 9, -2, 19, 32, -5, -8, -17, 22, 34, 35, -17, -5, 1, 21, 55, -28, 46, -4, 12, 16, -42, 55, 13, 25, -17, -68, 15, 11, 45, -16, -46, -30, 2, 21, 11, -9, -14, -21, -30, 1, 22, 15, -9, -29, -24, 24, 15, 6, 12, -34, 44, 1, 19, 41, -9, 70, -30, 4, 2, -11, 83, -17, -6, -26, 1, 59, 0, 13, -35, 0, -2, 8, -2, -34, 7, -41, 1, -17, -4, 16, -31, 22, -7, 8, -1, -24, 2, 41, -9, 12, -28, 5, 49, 2, 23, -23, 14, 42, -11, 11, -3, 22, 30, 6, -15, -12, 9, 18, 15, -19, -16, -7, 0, 15, -14, 12, -36, -39, 1, 3, 15, -15, -41, -41, 15, 3, 18, -32, -17, 20, -31, 35, -20, 35, 46, -26, 14, -48, 46, 64, 6, -3, -45, 28, 14, 32, 7, -10, -7, -12, 28, 0]
7772@K8k9l2L2j8M2k9l4L8k4K5pj9M7j6j4Rl9P8j8j3j2k5O4k2Pl2K0K3j0kk6K4
7805A6j1L4j7l4J9l9M1oRnm7J2L1J3j8j3k6L8jj6L5n2P1o2k7N2k3Q8o8j3nJ2P6
7838F4l2km4J2J5J0Nj8J4m6J7K7k5L1m0OJ5p%k2J4K2k2j6%JM8l7k2K2JK6k6l0
7872c9N0j0K6l2k6K9K0J5j6j2j4K3mK4Om0%k2K2M4k4l0lKL3l2mL4k0J8n7kO1k1
7906aJ6o1J9L7%kk9J3QNpqRPK5k2nOj4J8jK0j9k4LK5J0j0j7j8L7l1J5j6JN5p7
7943c3PpL3M3o5qj8M2K6j4pj7J8j3J8qMK4m1K8%j4JoL5onl4K0K1J3l3j7M1l4J6
7979A0l4J0M7l0mn4K4L5JLm8J3QK2j6jK3l9K2oK4J4m3K2%J0j8j4K9J5qj8lnM3
8014C4k8qJ6j6L9o5LL1J4J4p2J4mM0%m0J8k5K6mRJ1l7L1l4K7J2k7J8mK5rj5j3
$$ y = [0, 28, -1, -33, -1, -19, 23, -6, -40, -2, -26, -1, -8, -27, 20, 4, -10, -1, -40, 38, 20, 7, -5, -30, 34, 12, 19, -13, 7, 30, 20, 18, -8, 16, 5, 39, 22, -12, 7, -32, 9, 3, 12, 7, -40, -28, 3, 16, -2, -15, -41, -3, -4, -20, 15, -37, 34, -28, -55, -3, -26, 62, -6, -19, -24, -12, 64, 32, 30, -14, -2, 13, 23, 28, 10, 24, -22, -5, 22, -3, 28, -12, -6, 9, 2, 2, -20, -6, 16, -6, -22, -22, -21, 27, -10, -32, -10, -9, 17, -9, -39, 11, 1, 27, -5, -31, -2, 18, 33, 17, 5, -9, 14, 10, 34, 40, 0, 0, -22, 0, 44, 20, -10, -13, -11, 22, -10, -14, 20, 0, 18, -39, -41, 20, -1, 15, -46, -27, 10, 10, 8, -21, -8, 0, 5, -2, -10, -1, 6, 31, 9, 4, 10, -4, 14, 13, 33, 14, -10, -7, 18, 28, 18, 1, -17, 20, -11, 4, -12, -11, 44, -33, -26, -33, 0, 43, -22, -30, -48, -6, 20, 6, -1, -18, 0, -13, 5, -3, 1, 25, -16, 12, 12, -2, -1, -7, 28, 22, 17, -17, 3, 24, 37, 4, -13, 28, -6, 10, -24, -14, 33, 3, -1, -55, -31, 4, 5, 8, -40, -27, -19, 3, -13, -14, 9, -30, -8, -14, 10, 24, -19, 3, 3, 13, -5, -19, 10, 25, 17, -1, -4, -9, 34, 6, -2, 14, -2, 37, -28, -25, 6, 20, 34, -38, -24, -28, 12, 12, -28, -10, -35, -9, -13, -4, 7, -30, 1, -33, -6, 6, -21, -3, -7, 18, 9, -6, -19]
8048a9M8l2J1prM2l3J0noM2o0KkL5J0k6k4nJ9J3JJk8J2k3L3J9k8Mk0J8J5j9lJ7
8084CPlj4kL6j9J5j7j8M5l3K%J1L4m0j3%J4K5rom4K4rJ8Kj4kk2J0K6j4nlJ0J1
8121Fk6J3J7j7J5l0QL8k2Nj3J1K5k4oMKK8j1k7NjJ5Jj1mnlnJ8nj7J8k7L4k5qK6
8159Bj6K2l5J5J9j4ljJJ6j2NnOK0Jl3K9j4K5%l3MkK8j0jj2j2K3l0L9
$$ y = [-19, 29, -3, 8, 1, -8, 34, 1, 11, 6, 0, 42, -18, -16, -18, 17, 27, 1, -23, -28, -9, 4, 5, 6, -22, -10, -33, 0, 19, -9, -5, -25, -7, 8, -11, -14, 3, 10, 7, -7, -9, 27, 8, 23, 6, -12, 33, 0, 2, 2, 13, 47, 7, -6, -6, 8, 33, 24, 18, -26, -2, -11, 7, 9, -5, -7, -29, -19, 7, -7, -12, -15, -5, 6, -20, -7, 10, -7, 8, -22, -14, 24, 2, 7, -6, 5, 30, 6, 0, 4, 6, 34, 23, -4, 1, 0, 15, 16, 5, 1, -4, -7, -12, 6, 1, -16, 2, -25, 9, -16, -24, 2, -14, 8, -27, -12, 7, -7, -10, -11, -10, 6, -6, -1, -6, 0, 20, 21, -12, 17, 3, 28, 28, -5, -1, -3, 25, 15, 14, 2, -10, 13, -17, 22]
8191B2
$$ Imaginary data points
##PAGE= N=2
##DATA TABLE= (X++(I..I)), XYDATA
0@%%%%%%%%%%%%%%%%%%%%%%%%%%%jKmOoQj2J6j9K1k3K9l5L9m4N1n9O7p4Q2r2J02
49E4j15J28j40J52j65J79j92K04k14K20k20K10j85J28j7j93O06j476L577j0197
69g656O0841K46852l75283j19763L32526o5211j43915O5216J9772j4788K267M991
81E849P294n0863L2936O1652p0725j7810M5339j6686K8336j6823o1141P0825K8209
94D6392p3425J3537K4849j2914l031J1099K4436q0355r189K03935j10477k50325
106b15468K86200J47503l76803K6879K91258j37961j21827J16625J0021l3164
116f737Q002l239K563j4425K0327K2849n3420L107M1072j8637Q846j6361l2211
129c8264O7992J518p3987L4635L1302k6112L700k594j31r117N972O4622q2773
$$ y = [0, 0, 0, 0, 0, 0, 0, 0, 0, 0, 0, 0, 0, 0, 0, 0, 0, 0, 0, 0, 0, 0, 0, 0, 0, 0, 0, 0, -1, 1, -3, 3, -3, 5, -7, 9, -10, 11, -12, 17, -18, 21, -23, 28, -31, 36, -38, 44, -48, 54, -61, 67, -73, 79, -86, 93, -99, 105, -109, 111, -109, 101, -84, 44, 27, -166, 440, -1036, 2541, -7656, 53185, 300037, -75246, -195009, 137517, 72306, -71609, -6393, 13379, -1409, 858, 5849, 13143, -37720, -4784, 56868, -13857, -31667, 13672, -3014, 25322, 8499, -52642, 18183, 46392, -27033, -13496, 11353, -1561, -4592, 6507, 30943, -49412, -58601, 145334, 34857, -215468, 70732, 218235, -158568, -131689, 159569, 21608, -100219, 16406, 26427, -6737, 1265, -1974, 589, -13836, 6491, 29340, -24080, -20973, 20099, 1462, 10308, -6053, -38264, 29728, 31246, -42741, -8106, 23196, -2916, 784, -1810, -1941, -11058, -5086, 59536, -23237]
142b3237q9495K00474J5248k61245J15260K05293j87261p4608J52210j8779n8926
153b5066K4620n114P353Q711j4130M589p730K864J6524j2945O07p705q731M6793
167C0640j7904n6250N1995K2885m4237J0014m090n03L6715l1066k0383K6007q359
180d536L2799j1404q8744Q5244P8631j45696j0198J29011m9405n6540M4259k420
192A001N614Q709l8844J4744K9599k3510m596R908l292n40Q73J0259j1991j8509
206b0575L3223M314l4661J3129K855M524K9208o1191j7954J06413l5165r4321
218g0201P6937L8709o0981P194P422n886K8627k2391k1318L0144j769l199K78
231C566k5830K6644K5016m3860j504L0093j2308k798J881r280J3022J762j1156
$$ y = [-23237, -112732, 87742, 102990, -158255, -42995, 162298, -24963, -99571, 52639, 33860, -25066, -446, -5560, 1793, 10504, -3626, 963, -6767, -3903, 12621, -324, 283, -7422, -16153, 30640, 12736, -43514, 8481, 31366, -12871, -2857, -6947, -7450, 29265, -1801, -22184, 3823, -4536, 28263, 16859, -71885, 13359, 91990, -53706, -63904, 65107, 15702, -40838, 3421, 1001, 6615, 15324, -23520, -8776, 20823, -2687, -7283, 2625, -667, -1207, -334, 9925, -2066, -20575, 12648, 16962, -17699, -4570, -1715, 2809, 32017, -29174, -47128, 59285, 24120, -70201, 6736, 45445, -15536, -8342, -920, -6806, 21821, -570, -21888, 8256, 6487, 3288, 3566, -22264, 4380, 29396, -14464, -15968, 14125, 1817, -981, 900, -8380, 4642, 6404, -4752]
244d752M701r93k64L057K307K886k8376J1316O4560o0160o7805J19306J9263j41484
258g6438M6425J01560q1608l5136O5713o842k4383J1929j100k002J858K901J803
271D680j3782M564J5391j1278l404K474m444J7084n976k5935K3557J3871k4607
284g805M056N008n315J3950q597j2963J3642L47M560k410l0073K9551L4317n9583
298b1315p743O3565k3649l6822K7982M352n587N836j7843N729K0787j7376p644
311i728J3853k959k166K632k453n5j093M712K079j0559K645N610l52P296k1099
326a1637p895N1850j9055o5508N8583M3413p9907m08O7265k8702l1712K9173K214
339G674j2252N830n08k561l22L759M564j1033j306J3438n027n264K634m111J0039
$$ y = [-4752, -51, -1044, -1308, 1749, 4056, 6942, -21434, -10118, 54442, -5718, -73523, 45783, 65046, -76438, -30013, 71547, -10061, -45197, 20516, 13674, -10709, 1220, 120, -1882, -24, 2877, 4680, -9102, -4538, 10853, -425, -3829, -1355, -5799, 11285, 5309, -20626, 2931, 16802, -7805, -3749, 1259, -4056, 9894, 1297, -11666, 1976, 2323, 6883, 4473, -25600, 3951, 38268, -21315, -29058, 34507, 10858, -25964, 2018, 6370, 783, 6619, -11224, -5495, 15292, -2084, -9728, 4125, 1166, -1000, 1632, -821, -876, -1969, 2743, 4822, -5737, -3092, 2518, 2166, 9462, -11637, -19532, 32318, 13263, -52245, 6338, 49751, -30156, -30564, 36701, 7999, -23713, 5460, 7674, -4578, 1252, 744, -1817, -2139, 1620, 6184, -4849, -6155, 7283, 2256, -3008, -374, -4485, 5554]
354E554K383k0049R172J5681j5404j956O295n420R214n13j4563Q853O187m568
368H66J795j2281N798K4828k5845j9037L8095J78l0004J1784R558n247M464j0808
382e856k086J8968q221j2302J1722P83m339L153m174Q20M831l761p0J063k396
397a865J527K112K504q291q376K6013K043m4947K2443M7959n1134k6955O3525
410B6558n387n0561K5366K2152k2779m2P050m692M755o46n061L664K25r38J591
425A255j542p24m72L105L113r722l26J2946n645o820M616l186Q997L818k7119
440a7706J1545L3508l3891j9770M5251l757l6091J9000J5118j7450J130O156n093
453b050J750K396j312k461j602O870J13r096M007M904l429J075m190r75J2099
$$ y = [5554, 7937, -12112, -2940, 12741, -2663, -4619, 1676, -3744, 5470, 4957, -9606, -753, 5434, 866, 2661, -9620, -3822, 21006, -4839, -23876, 14219, 14397, -15607, -3823, 5735, 488, 4952, -5856, -7942, 11026, 2805, -9497, 2225, 3008, -1331, 1822, -2352, -1532, 3299, -462, -532, 531, -1865, -338, 1774, 4278, -4013, -12389, 13624, 15667, -29280, -6837, 41122, -10012, -36967, 26558, 21171, -29390, -4024, 18128, -4651, -4693, 2357, -2335, 2420, 1774, -3287, 377, 602, -336, 1255, -287, -1011, -1483, 1622, 4735, -4987, -5313, 7633, 1988, -4832, -216, -3402, 5595, 9413, -17706, -6161, 27347, -6544, -26314, 18937, 15180, -20911, -1911, 13207, -4243, -3113, 3043, -2050, -300, 2096, 784, -1677, -3279, 3591, 3704, -5392, -1385, 3519, 90, 1165, -3025, -4000, 8099]
468H099o135j1671J1890L068p783L862m268m70J3041j0218j0500J6955O99j2498
482e929N142J130o10O045r106l587J3391k774q353L531Q28L105M78r953M971R491
498G800r415k671O047k088K648r54p904Q012M992j0583J643N499m283K057Q37
513A637m939L085K658j229j970n007Q497P678j8717j746K3579q773j8165J4095
527F83O659r142Q44j264J214P355q116m800J0887j429o099L572j238P47L992o425
543b560o09P165l655k553L845k175r70L167j87l036k581O933M920j5752p05K3642
559A4889r712k2269J9351J1683k0094n21J1075l407l63j235l866P919L45r364
573e569M569M448m399J167n91j933N045j530m737M387P84l208K442p8k725J444
$$ y = [8099, 1964, -9707, 2183, 5251, -2532, 1330, -2938, -3408, 9633, -585, -11085, 5870, 6569, -5929, -787, 343, -267, 5778, -3328, -6915, 6476, 3702, -4651, -1120, -292, 2813, 3291, -6662, -1691, 7800, -1615, -4286, 1761, -327, 2321, 1367, -6537, 1475, 6467, -4116, -2473, 3026, -1257, 800, 1637, -3302, -217, 2441, 1212, -758, -5765, 2732, 10410, -8307, -10053, 13526, 4753, -13412, 683, 7342, -1800, -956, -2220, -1006, 6349, -1767, -6567, 4320, 2891, -3208, 364, -874, -127, 3865, -2560, -3169, 3996, 341, -2212, 1633, -542, -1512, 1655, 1468, -1568, -4149, 2784, 7704, -8048, -8753, 14889, 5177, -17092, 2259, 13942, -6152, -6673, 4402, 995, 632, -603, -4469, 3450, 3795, -5569, -1000, 3448, -951, 216, -375, -2308, 2737, 1207, -3530, 857, 1641, -1567, 875, 797, -1928, -484]
589d84K619l85o042O63J2055o101j5272J5351J1883k1269k365J8832n903r746
603f164O113R44J63J114o257K794O669o659k348N448j514j05Q75m041L037L324
619C393n442N06L630k794N08J663l006N53K577n12k096k324M789M229j0023j736
635f085J3591l657j1597P717N540o751n88J508L96L063m116l075O800l95n161
650b810K431O51l01K369m111j153O278k545l863M102o22j022K644m098k96O608
666D262l927m485N866M41l523J625r13j45L347k694k395L732M75k218m35K80K471
683A764k69m231J900L365k699q38O80m01K788j362m407M158K444m567Q12J152
699B89r25L759m146n595J1521J526j5206O552J2859j2356n693J2160j915p438
$$ y = [-484, 2135, 1750, -4292, -3629, 8426, 2325, -12947, 2404, 14287, -6982, -9347, 9485, 3582, -6164, -51, 893, 1056, 2170, -4087, -1293, 5376, -1283, -3631, 1817, 303, 198, 1073, -2968, 69, 3393, -2049, -1543, 2087, -707, -199, 1464, -1542, -989, 1588, 1076, -1020, -3344, 1445, 5674, -4349, -6085, 7506, 3849, -7748, -31, 5509, -1242, -1830, -322, 74, 3137, -979, -4054, 2746, 2351, -2810, -379, 272, -29, 2340, -1771, -2924, 3354, 809, -3054, 1048, 426, -596, 2048, -2050, -2346, 4262, 335, -4150, 1716, 2157, -1366, 259, -654, -799, 2548, -146, -2541, 1191, 1666, -552, -987, -707, 1764, 1495, -2736, -836, 2529, -170, -1008, -328, -729, 2059, 697, -3710, 448, 2892, -1675, -863, 289, -636, 3123, -1023, -6618, 4903, 6429, -8777, -2225, 10634, -1722, -7415, 4745, 2830, -4608]
713d608M965J492l381J931L88j754J034L72m48J13o33M05R12o22p82k0J274N65
731A203k445r3K763p72j376j12l21L826n88q837N608J1228j2815p449J8217m98
747G539j7154P923J0025j0721k281P395j959j598J356k098J928J864m095N98L129
762A851j994l63R93j288J141O12k166J181J132j882Q56P56k016R53J640j652j035
779a281J166J631p75l126J911M108l963l106N298O18m697J010K381n42n24j405
795a296M76K831j772k422K429Q14j156J01j144R54K279l016j088L766q24j748
811h16Q80j642K536L123p897K8J1760o483j0546J1887L993j3322L001R471o484
826e11l078N675j295j801J871j630J74K203k018n54J973j074m28J056q87M2R28
$$ y = [-4608, 357, 1849, -1532, 399, 787, -967, 67, 439, -9, 104, -529, -124, 788, 166, -616, -636, 638, 1203, -1242, -1335, 1428, 656, -720, -832, -1153, 2673, 2085, -6752, -1144, 10084, -2731, -10180, 8037, 7539, -9615, -1692, 8333, -2388, -4669, 2726, 767, -831, 525, -1573, 355, 2219, -1876, -1278, 1851, -143, -506, 487, -801, 340, 952, -1214, -33, 1099, -783, 73, 829, -1187, -234, 1406, -246, -1281, -115, 1516, 741, -2385, -474, 3634, -329, -3435, 1863, 2481, -2216, -1206, 1175, 633, 109, -1296, -820, 2011, 239, -2183, 246, 1060, -96, 5, -1139, -185, 2094, -922, -2010, 1756, 932, -816, 64, -1578, 958, 4081, -3816, -3788, 7972, 1489, -9057, 2830, 6823, -6499, -3498, 5973, -511, -3589, 2086, 791, -1010, 861, -769, -595, 1608, -410, -964, 1009, -65, -493, 563, -324, -282, 646]
843F46q93Q3N69r70N52R50j447m85J834M83k138q54L109Q33m640L28N402k686
861F76m658M473K521m344l80K540l5m29j142m51K662k43k809J223J464r05j02
878F1q26K31K457j753k418K940P93k017L78j153J241M064n791l822J0561q19j2296
895h169P074R462j1173l145J1200k572p046M636J685k774J241q02p63K931j348
910D37k348K496K52j556J005n65j84J802j753j049K687q46j455J798j037l88K561
927A857k578j739M922j226m626M346J869n144J455L269l316l77K762j658q53J989
943I52p50r38J052k01k95M76n84R8P96o62n03P39J37k99k12j94O25N20j137p14
963a094J549R55k169j116L138Q73m228L40M893k097m412L538K787l826j114K697
$$ y = [646, -247, -164, 405, -565, -13, 937, -510, -995, 839, 1322, -816, -1670, 1439, 2272, -2368, -2040, 3362, 676, -3982, 491, 3012, -1332, -1712, 828, 793, 364, -778, -1229, 1433, 1190, -1619, -396, 1068, 163, 61, -765, -534, 1923, 170, -2248, 692, 1485, -532, -154, -1307, -66, 3998, -1793, -5615, 4946, 4127, -8169, -1095, 8367, -2806, -5951, 5249, 2677, -4369, 267, 1952, -822, 419, -383, -1146, 1785, 437, -1911, 585, 837, -719, 286, -279, -463, 1339, -414, -1463, 1224, 378, -1077, 721, -316, -704, 1857, -721, -2460, 2462, 1236, -3390, 956, 2825, -2319, -864, 2405, -911, -1288, 1474, -184, -1037, 952, 202, -736, 316, 115, -180, 296, -288, -190, 606, -56, -559, 180, 317, 18, -194, -388, 237, 757, -380, -1094, 455, 1410, -759, -1875, 1263, 2136, -2092, -1752, 3141, 1044, -3368, 170, 2957, -869, -1983, 714]
979G14K72j061n66K0J396nj811N01J410n78o06j90L56J214r19j622J625J206j479
998a23n45L0R88J742l097k149O230O9q300L785P566p498m414Q803M49p130K258
1015a336L750k202p85K03k00J818o94k239J820J223j749p8L44J38J117j389j380
1032a639K644L23k410N38O26L24J104l087q30O186k317p449O818N362j0107o61
1048d575J0181l575o874N251K496l822J71Q51l70J431j142j655K372L84k081O43
1064c14N16j25P09j443o00K648o43k248J377O58l11M84k391N98M715l974m549
1081d893P959J554r747K930Q323o520m606O903N71m409J358J105o15Q86j270p66
1097a237K387m79j901J237N00m69L09j095J78K089j416j555J867L14p68J53j384
$$ y = [714, 986, -75, -641, -621, 775, 770, -1041, -540, 870, 292, -314, -504, -148, 1066, 147, -1475, 150, 1356, -123, -668, -638, 350, 2092, -1005, -3154, 3076, 3145, -5155, -1370, 6196, -1302, -5716, 3087, 3536, -3594, -1336, 2414, 212, -573, -370, -570, 1248, 554, -1685, 135, 1358, -391, -469, -125, 13, 1130, -259, -1639, 1005, 1328, -1082, -544, 82, 406, 1510, -1577, -2407, 3779, 1462, -5987, 831, 6193, -3914, -4575, 5606, 2031, -4843, 408, 2904, -918, -747, 104, -266, 1165, 23, -1632, 740, 1124, -957, -314, 202, 77, 786, -657, -1257, 1391, 748, -1500, -123, 535, 224, 708, -1683, -1085, 3630, -344, -4893, 3066, 4620, -5127, -2197, 6126, -394, -5000, 1903, 2474, -1935, -577, 528, -87, 799, -471, -1237, 1150, 671, -1230, 7, 507, 38, 347, -748, -570, 1519, 103, -1452, 415, 729, -39, 114, -1270]
1114a270J451K705m552j585P366k066p930N894N455p882j517P095j393m130K213
1129a46J057r16L33r51O6J871j151j334J472K76o54N1n82O51J192j684p70J884
1147F65m1r48l4l46J593M90l845J122N172m043m354O790J924p458J119N812k960
1164F58l152K677Q72j156j14k79N41Q42j265n29J325R7p52j12Q4O65J23j198J11
1183e62J243k66q19p8N65Q94r81j528K170J509l382o30L898p33l658J618K656
1200A916j895j588J628R07j072n36O82L99l79l06N6L53J94m87l03O81J38o08M2
1219a78K54k5K06m19k46R33k71j088R98M44j335P10Q48j521M65J307j747k55J995
1238A075j031j037J640k33j039R55k11p00J045k86q17J034r2p31O49k72k98J010
$$ y = [-1270, 181, 2886, -1666, -3251, 4115, 2049, -5881, 13, 5468, -2414, -3931, 3164, 1771, -2359, -146, 911, -5, 328, -623, -557, 1314, 163, -1171, 301, 577, -77, -26, -608, 43, 1235, -449, -1219, 665, 624, -324, -358, -704, 889, 1379, -2466, -1344, 3828, -215, -4569, 2221, 4145, -3313, -2194, 3618, 658, -2494, 183, 1055, -101, -215, -494, 47, 889, -376, -905, 420, 517, -235, -347, -263, 402, 525, -673, -562, 681, 415, -404, -482, 83, 977, -4, -1532, 638, 2147, -1235, -1865, 2033, 1300, -2358, -740, 1916, 21, -1567, 61, 968, -104, -640, 42, 441, 62, -244, -188, 165, 359, -128, -431, 250, 388, -220, -178, 76, 51, 257, -162, -408, 525, 254, -834, 164, 608, -727, -17, 831, -690, -225, 1082, -665, -920, 1075, 44, -993, 647, 414, -625, 330, 119, -581, 464, 178, -639, 395, 303, -428, 221, -51, -349, 661]
1256F61o49p47J298k52q67P40m14K12J272k305m20M034k234m287M955K459o176
1273b720O95N438k780k934K978L85j658N37q8J7R88j058p29J442nr62K64J19K59
1292A88K98j036n0J267m00q52L30M10M49o54j358J764J604l029p10L776n44l456
1310b003J477K331j778j387J421P90j010n42P84L49n55p7K27n0K12j63m05N19
1328A40J77n95K95J79m68M14K0n68P16j03p95J177l39j747K160R21l536J342L573
1347B963l427j833M012o64l046J941J050j484M30J42n25J023l86j194J144N35
1363F81r52R4R7K7N83p06n13J206Q2r82Q0L42N58j04j583P59K254j933k087K685
1383E88J030k824r4K248l02j479L56J129k59r29L96O71n73j63L68l37J60L58n71
$$ y = [661, 12, -735, 563, 311, -556, 184, -230, -18, 1254, -1051, -1471, 2563, 329, -3958, 997, 3456, -2720, -2025, 3413, 633, -2301, 677, 1062, -596, -59, -147, -130, 858, -200, -929, 513, 508, -454, -190, -71, 188, 486, -550, -600, 667, 267, -585, -255, 155, 604, -50, -1408, 356, 1960, -1069, -1779, 1997, 1453, -2003, -526, 1805, 27, -1360, 61, 851, -159, -701, 83, 432, -123, -200, 27, -23, 189, 26, -379, 140, 317, -278, 17, 196, -272, 142, 162, -406, 310, 207, -588, 589, 250, -1497, 663, 1584, -1952, -610, 2963, -464, -2297, 1715, 1051, -1995, -54, 996, -488, -58, 84, -441, 582, 196, -998, 146, 681, -271, -177, -80, -53, 530, -176, -689, 517, 599, -383, -303, 39, 597, 493, -1090, -331, 1923, -10, -2097, 588, 1618, -1206, -1300, 948, 646, -833, -477, 652, 393, -536, -140, 531, -42, -205, 163, -174, -14, 344, -227]
1402b27J42M36o24K19M17p57L57N72q10K30K30p52J212J7k364K124K230m318m83
1421b149M876k224l787L785J626l432L37K093q21n86J54j49P05M0j009K88P67
1438E14l02m14n2L74K52m30k69L66K45j17n37M9R11m95q97J070J72j071R94K17
1458E80j656J199J011k313M57K144j582p64J649n20n70P19o80j4J141q13o18R72
1476C42p1l79J38l39M46N05j008j31R39j24m90k86K36J085o60j625J422J321j900
1495e79m69J693j4r91p2N97M58p19m91J029o3r29O64J36p05O88J49q09M74K03
1515B50m59L93k15l65R42k61r58P07L35l34M4p40N57J520j984j343L163P3l276
1534a951J390K471j910j282J599O35j064n34P61M36p38r6N03l24O2L45n16R1M05
$$ y = [-227, -85, 351, -273, -54, 363, -394, -37, 535, -275, -45, 185, -567, 645, 662, -1702, 422, 2652, -1666, -2149, 2727, 503, -3284, 501, 2127, -1305, -968, 1125, 304, -282, -128, -277, 428, 468, -541, -253, 514, 212, -202, -254, 120, 372, -58, -327, 39, 284, 167, -370, -321, 590, 95, -802, 268, 440, -631, 363, 580, -1076, 123, 1134, -1179, -722, 1422, -160, -924, 725, 205, -365, 354, -326, -340, 801, -12, -630, 342, 271, -108, 30, -309, 137, 642, -366, -497, 442, 318, -172, -458, -222, 863, 203, -1422, 0, 1321, -579, -1048, 645, 631, -360, -432, 165, 623, -96, -587, 442, 379, -550, 114, 250, -455, 233, 382, -427, 47, 250, -209, 184, -31, -396, 546, 285, -673, 34, 369, 35, 79, -661, -104, 1416, -568, -1911, 1252, 1325, -1951, -561, 1910, 0, -1282, 317, 952, -112, -646, 115, 551, -187, -283, 220, -104, -42, 303, -213, -122, 283]
1553B83m86J82L27o98L88N92q83pN39l02M46m06j056J888M63l126J007L125k553
1572b77j883L158M63k581M10J588m23r49J47O90j22m70K33M2j16L38k95k13N23
1591B63k77k30N78m35k65Q12l39m44M44k70L66M79j665M25K350k040j881L248
1609A119M40l272R11K366j315j277R87O96n24n68L75L76l74OJ27k62K98R2m73
1628b72L36R0m71N34M7p56N57L29n37J65k77R5J143j183j161K440J32k941J169
1647e61K310j916j240J748N37j104l69O92M06o42j43N15k61j16M02l76q0M69l29
1666e8j3K97n44K29O14p06j84N72n3K0l75l61J280o8j827J001J478j639p02J448
1686D09J77q42k28M86N12o12l91Q07j59m66N80k20m66O48l4m83L01j7l4L11m86
$$ y = [283, -203, -21, 306, -392, -4, 588, -295, -302, 237, -65, 381, -25, -1081, 807, 1270, -1856, -849, 2276, -277, -2160, 998, 1461, -1120, -710, 878, 455, -494, -347, 343, 221, -249, -16, 26, -90, 248, -47, -260, 263, -14, -244, 334, -101, -366, 446, 107, -337, 107, -163, 203, 682, -983, -558, 1792, -248, -2129, 1119, 1559, -1713, -802, 1564, 249, -1028, -41, 655, 131, -437, -62, 314, -60, -54, 73, -189, 109, 201, -272, 64, 154, -317, 217, 264, -492, 65, 394, -143, 22, -255, -160, 983, -200, -1361, 1079, 1211, -1730, -561, 1749, -167, -1407, 341, 878, -226, -595, 97, 503, -139, -282, 233, -28, -144, 258, -118, -198, 271, -58, -71, 226, -318, -89, 525, -181, -365, 207, 154, 174, -201, -562, 718, 650, -1177, -176, 1302, -337, -1039, 409, 586, -256, -484, 2, 514, -98, -489, 318, 159, -307, 273, 53, -413, 235, 201, -282, 19, 2, -32, 279, -207]
1707b07j62P22q8n15K9K77L80m21o00Q31L14r43K20L71l58M36k22p34J061K28
1727F19j333N11P28p21J23K33m66M48J94p20K19M59k26j69p5J62K85k89k12J85
1747d5J99M7m31OO68n12l14R39p03o66J741m59j983J858J239k484o1K020p12j022
1767f75O17K79j27r3j97J74K10j20j96k7L25k4l88K74J13l50L24K1m11L66n0j33
1789h8M89p78j66J637r71j676K120Q44k427J49J877n59j117L63P25j33o80K54
1807a37M70m69J9L84m50L6M29l40k8J57k48L19J27o05J84M53j67k86j41M62K65
1828D34q12P1P83n59n5M49p91M21R61j384k83J610o13r29Q19J03k93K07l27nN09
1849C16k06l69J32K91K6l63L4K98j94N6O2l02L21M3m29N91k45q61J434J37k222
$$ y = [-207, -369, 353, 265, -250, -221, 56, 436, 15, -585, 246, 560, -383, -163, 208, -150, 286, 64, -670, 391, 619, -714, -203, 525, -196, -73, 160, -306, 142, 336, -384, -165, 294, 68, -101, -176, -14, 271, -18, -230, -45, 154, 201, -230, -224, 444, -68, -382, 557, -146, -812, 929, 470, -1513, 345, 1584, -900, -961, 1059, 347, -675, -58, 221, 94, 1, -196, -22, 188, 68, -128, -155, 170, 146, -242, 32, 145, -205, 119, 140, -271, 95, 45, -88, 401, -377, -543, 1094, 123, -1553, 567, 1411, -1016, -867, 1010, 451, -666, -303, 422, 289, -391, -137, 333, -136, -117, 267, -183, -147, 282, -58, -86, 71, -177, 142, 269, -336, -152, 301, 134, -152, -293, 169, 434, -378, -307, 476, -83, -138, 311, -480, -59, 902, -482, -765, 845, 232, -697, 122, 225, -68, 139, -188, -193, 316, 110, -259, -127, 164, 190, -173, -139, 159, -35, 21, 83, -219, 102, 145, -284, 307, 62, -799, 635, 772, -1450]
1870a450J213J973k151r62K175N3j497J55Q84pp03M1O18l44k10M56l16j47M84
1889B65k48j35K15k56K27K53n73OM89m4k93k68M60M11q45K3P89o90Q2Q10j269
1910e91KJ800j217j244J753K65j337L17N03j52k0k27k1L24J7k16j85K41K74m32
1930a46%L78l90P8L91m60K4K27k11M63l81q15J411L30j951N61J554r50p43N23
1950a07L82Q6o60j29Q85l06n32N87j96k74O09k40n02M23J98j69j94l7L17Mk34
1971h9K9l7K66J3n58N14J61r11R61M27k023R55J987k247r53K525j24j818M91J046
1991F15k57p59J08P08l46l67N24k40k55N39j88k68K43j38J54J58m70O5M17l7l02
2012i6k56N44K66r28M09N93j187O19J166j974j1K395j331j689J826O19j388j26
$$ y = [-1450, -237, 1736, -415, -1377, 798, 851, -646, -491, 393, 386, -317, -276, 342, -2, -212, 244, -72, -219, 265, 17, -118, 97, -159, 68, 321, -252, -246, 243, 199, -94, -362, 98, 509, -336, -313, 476, -214, -132, 678, -591, -589, 1211, -6, -1250, 503, 768, -569, -252, 251, 99, 79, -148, -169, 155, 172, -44, -229, 12, 286, -146, -146, 232, -158, -80, 311, -149, -125, 102, -109, 354, -27, -842, 569, 899, -1052, -491, 1063, 113, -630, -107, 275, 361, -299, -428, 457, 151, -381, 206, 10, -264, 345, 105, -397, 26, 224, 55, -139, -176, 141, 145, -89, -60, -97, 169, 182, -376, 138, 299, -612, 349, 776, -1247, -292, 1695, -552, -1505, 1020, 896, -922, -431, 615, 358, -401, -293, 415, 69, -298, 226, -14, -269, 270, 82, -186, 57, -81, 73, 231, -239, -174, 243, 206, -96, -352, 192, 458, -470, -61, 532, -655, -36, 1130, -844, -855, 1540, 209, -1480, 346, 965, -423, -549]
2030e49P34J97m49k09L89m8j27K26k81l3L62k94O3K30m73J81M54m05k32J68L54
2051B58L7p60K68P77p84J9O97j098L40J384j608o04K084m21j496P88O64m46l14
2070b15L3L05Rj68L5j34J54K08l96J21K49m31K63L05n48ML63N1j19n06L60O77
2092F20q63q5P14o69K87O81j379K21J631j176r66J325K09p66l3K41J95j03j89
2111a05O7k7J71L7l73K51J65l96L34J12n43K42L20j66j86k25N30K38r11L07N66
2132D08p14M56K80j258Q16J089j639k65J539l28q29K64L50K7k55p2J68o6J33l4
2152G0k91L00M8l02L34q1l93L95J78k76j91N3N61k68o19P15np00R39l01j189J525
2174E02M77j915M69J426p85p43M58M30j62l96J93J84k28K02k0k89K89m3j24K60
$$ y = [-549, 185, 382, -67, -276, 113, 65, -62, 164, -117, -150, 212, -82, -19, 211, -262, -81, 373, -32, -264, -96, 258, 295, -465, -197, 580, -204, -185, 512, -586, -246, 1138, -470, -1074, 1010, 589, -907, -119, 545, 99, -215, -182, 123, 132, -36, -1, -135, 19, 227, -169, -48, 201, -230, 33, 338, -210, -206, 157, 208, 89, -417, -57, 620, -243, -328, 386, -283, 4, 685, -694, -473, 1158, -18, -984, 341, 550, -216, -249, -8, 187, 84, -105, -38, -65, 106, 143, -230, 21, 186, -210, 124, 236, -307, -65, 255, 89, -97, -322, 208, 446, -465, -158, 408, -306, 150, 430, -828, -12, 1077, -562, -827, 712, 384, -445, -181, 169, 196, -59, -131, 37, -29, 104, 70, -221, 79, 127, -175, 159, 78, -315, 80, 258, -18, -209, -156, 405, 137, -482, 233, 228, -472, 467, 166, -1023, 502, 979, -936, -467, 959, 174, -569, -111, 319, 157, -239, -46, 138, -90, 112, 92, -197, 92, 49, -75, 185]
2194A85k69j15M08m2k53j47K83L58o62j1P54p79oJ225j280o43K033m99j773J110
2214a23R91q82n48M67N32l75m10M79k4l17L79o6l17K24O9Kp5k00K21J25j25q7
2236f0j35L33R1n70N13R4r43R98M72j774N78J553j205p56R25L62l28n45J61P02
2256D66m29l21M53k19j04M11k14k60J56K50l8l76J54K69k88J13J00l12K37Qq4
2277b8K91n83K0J017p35o50R47q4k09J51o56N23Q03j117k71R66j39l62J2L0K02
2298A28m5r1n3o5L16j03l21L51p0k54M23q3l47J09K33J88m82k26Q31l85m91J000
2320E63p17o72J800m69j820J343J052j284m78P50M24m80m35N44O1l93L50k3l54
2339b38K49J22o8j23j23K91K5j83M5j50K52Q3m48M37m4p31J056J62j565P69J062
$$ y = [185, -84, -199, 209, 167, -86, -233, 50, 408, -254, -265, 489, -290, -296, 929, -351, -994, 1039, 540, -1233, -123, 868, -14, -562, -95, 437, 62, -348, 131, 107, -210, 169, 103, -214, 10, 79, 81, 6, -194, 27, 152, 27, -60, -195, 138, 229, -341, 172, 266, -677, 321, 793, -981, -403, 1150, -55, -811, 114, 476, 148, -397, -236, 466, 37, -284, 169, -50, -154, 257, 43, -217, -61, 189, 151, -225, -71, 198, -90, 23, 123, -189, 48, 56, -28, 263, -320, -300, 717, -18, -668, 279, 195, -14, 137, -519, 4, 807, -310, -581, 385, 246, -116, -104, -74, 128, 83, -8, -61, -126, 190, 87, -234, 117, 47, -207, 216, 133, -214, -105, 128, 316, -166, -392, 439, 54, -437, 563, -154, -826, 974, 505, -1315, 28, 1080, -204, -682, 68, 492, 12, -423, 121, 182, -211, 139, 116, -238, 11, 133, 65, -58, -181, 110, 135, -48, -3, -153, 99, 182, -266, 171, 127, -604, 452, 614, -951, -182, 880]
2360H80r75k85K69J97M31o83m08R08m0m99J95m3M7J81j52j32l6K79P8m39J95K11
2382A79l90K78J79m02j2K01K61k43n44P06J40q45Q11r3j148J462M29k031N84J522
2402A044q70q46M90O15k04o36L57L02m47K38J68l94P5K06N5j49k30K57J09j91
2422e1J22j71L1K70l34K57O7p91P97N30j318K38P79m33J92l36m39J124o9j117
2442f52M64N54k39k32o5K28K1q5R1k32P3K77k68O3J01l06K20J99k01j76k7N02
2464C10j84n68P48j71p91J259o6j691J107J061j253l56O21L35j14o74K19N94m09
2483b3p3J76k28J25J96j16j91l7L76j11l21L43q7k34L57k2k20j06J70M28n46k57
2505d01Q15n30j86J039j038n90J735l18j419O64P93l43n60N5O24k05l69L58r9
$$ y = [880, -95, -380, -111, 86, 517, -166, -574, 334, 294, -205, -10, -53, -6, 175, 23, -109, -145, 134, 212, -227, -32, 179, -211, 67, 246, -156, -168, 33, 294, 51, -493, 213, 353, -492, 319, 226, -922, 540, 969, -1062, -478, 1044, 174, -672, -182, 433, 229, -407, -50, 252, -195, 43, 211, -183, -108, 98, 153, 4, -226, 31, 140, -51, 71, -100, -69, 201, -133, 124, 191, -600, 197, 727, -591, -353, 426, -7, 185, -151, -590, 534, 465, -652, -188, 366, 127, -105, -170, 58, 79, -6, 85, -147, -74, 203, -65, -2, 99, -207, 13, 212, 11, -165, -192, 310, 126, -442, 306, 135, -656, 603, 537, -1154, -47, 1014, -239, -595, 26, 361, 247, -427, -208, 386, -23, -96, 80, -148, -23, 173, 57, -134, -171, 205, 94, -227, 116, 29, -205, 152, 130, -90, -196, -26, 402, -144, -401, 414, -116, -302, 737, -301, -891, 844, 526, -893, -229, 564, 221, -339, -284, 340, 135, -234, 124, 25]
2524B5k35L27L7k04j23J67K41l19l4K38k16R3J50j90K1j55K50L33p65J08O56o16
2546b11K96K91j090O90R29j271l10J029M8n58k01M64J63m32J45J51l05J49J88
2565A65j52j09k7K35Nk23J36n7j5J76j90Q8k9k84O30j27p57O17J36l97N10n14
2587a83l60J132k62r73N10N33k62l87J00L79k19j19K56k02n6K07k8n1j29O2J82
2608A30j38j5K0q7J89j15mJ70m44K85M82p48J6M78l51L59j4q29O50N70q32j99
2630d27N20J73k66k38K92N9k25J99l4j78R8Q3L9j27j04J94l5j0N0j71J37j9m4
2653c4K87m06j13O48l51k47L82l98K85N04r04r4Q64j92n17N9L78M1l58J18J85
2674A37k31Q9J43j41o8J6J66m6j69J29j7m5J36j15J6n4m2M02k73l56N35k21j32
$$ y = [25, -210, 117, 154, -50, -173, -6, 235, -84, -118, 120, -96, -3, 147, -43, -22, -177, 73, 406, -359, -251, 405, -211, 85, 376, -714, -24, 905, -366, -676, 353, 401, -157, -358, 106, 269, -163, -18, 133, -172, -23, 165, 13, -96, -123, 112, 117, -106, 30, -27, -42, 134, -56, 32, 3, -281, 349, 222, -535, 82, 218, -179, 331, -183, -543, 589, 327, -646, -136, 397, 135, -252, -152, 227, 8, -111, 145, -57, -113, 94, 66, 15, -114, -52, 130, -8, -23, -3, -90, 99, -16, -20, 150, -294, -9, 473, -275, -259, 219, -132, 227, 213, -616, 34, 604, -228, -427, 93, 266, 0, -238, 54, 113, -112, 87, 53, -125, -27, 56, 95, -32, -136, 58, 23, 13, 63, -108, 29, 10, -34, 253, -153, -266, 382, 31, -216, 166, -232, 53, 557, -347, -441, 423, 231, -286, -227, 151, 192, -166, -48, 137, -94, -5, 138, -3, -71, -55, 111, 65, -104, 25, 8, -37, 99, -16, 0, -54, -96, 306, 33, -323, 212, -9, -141]
2697a41N39o50j33R80l78p30M31M07j76m01J13L58k47o7K24j56q0J47R1j17j67
2718a53J94N2j96J49Kj47R6O4Q7k33j34N08k41k88N38m47k40R81l86q05O52L82
2740D35l73l27J40L93j78k82K30pr3J38j4r8n8J49R0k38Q5P8j76J19J11j02j43
2763a21L0L38k27k47M88l40k80Q21l84o50P21J97l77j09o2M11Q2n01P8K33j0n5
2785C6j07P0J2n2J37j11m1R4o1O6Rj13M5oJ38r7j63K80j82r7M81m35k57N88j64
2810G0q7J26n02L89N03o73k20N08J69k86k31K84J07k72J39P4j90K9J27M4j70m2
2832a04K00j03k6J31j31k5RJ38P7m28J95L37n18L55K37q46M23O89p35k89M35K46
2854B67j31m15J62L14j99j9M9q6M6K6P4j09q5J72m9n1J23j11n7O1J25j6k80K33
$$ y = [-141, 398, -252, -385, 595, 217, -513, -82, 325, 149, -252, -139, 219, -28, -95, 129, -27, -107, 40, 131, 14, -153, 41, 93, -103, 46, 48, -99, -3, 61, 148, -85, -219, 289, 48, -240, 298, -149, -389, 592, 206, -599, 53, 435, 62, -265, -125, 268, 90, -192, 38, 31, -62, 76, 62, -36, -94, 55, 145, -93, -8, 70, -106, 13, 124, 22, -121, -91, 247, 20, -227, 261, -79, -359, 462, 78, -572, 149, 346, -31, -140, -202, 209, 291, -210, -132, 101, 91, 36, -71, -1, 11, -41, 96, -15, -56, 38, -23, 43, 52, -61, -16, -22, 116, 19, -144, 136, -46, -143, 338, -97, -354, 234, 70, -17, 109, -393, -4, 499, -174, -394, 114, 283, -3, -234, 50, 157, -115, 24, 98, -92, -63, 64, 108, -62, -104, 96, -7, -33, 98, -33, -58, -49, 89, 166, -262, -67, 270, -248, 107, 344, -502, -79, 610, -125, -414, 21, 267, 136, -279, -117, 197, -2, -21, 28, -58, -12, 14, 88, -21, -106, 66, 17, -34, 89, -22, -79, -18, 107, 91, -189, 44]
2878D4P9l58M27qo05N17J98m07J42k08J04N24m62l78M41K15k15k79J71K42k44
2899f0J5J54j54l5J03P1q3j36J85j5r5J29o8o0k5R8K06l69m4M58m39Q3N15p62
2923c28k8Q57l50m60J55K72J44l72j03L18m3o1Jm6N9l0O8oj08P6mj5P3p9j8j9
2949d7O7J05k15J03N0k62L74Qm85L54mj71M56m41l32P31M2n32n6L44J75l56p0
2972a62K87j36m2J33m5r4j1J65k5j67J45j4j08J07N4n5j74J32K24l50J12K53n12
2995b83K44M22n13l5J96l3K44k79k87M18J33k36j67J43K03j95n0J73j09n1J09
3016D7K9o4j04J29K5j20J06pq9J1P4J26k75j5L54l65P8M02n76pN77k31k44J2J27
3041@K32k20j92J72Q8qj19rJ28r6J7P2o7k9lP5J3j04P1k7l1P4j9K8j38lL17k75
$$ y = [44, 123, -235, 192, 184, -421, 96, 294, -113, 29, -179, -75, 449, -13, -391, 50, 265, 50, -229, -58, 184, -60, -45, 109, -45, -80, 23, 94, 11, -125, 60, 45, -50, 79, 11, -49, -74, 24, 230, -139, -183, 275, -164, -81, 434, -328, -356, 501, 151, -309, -154, 118, 262, -110, -213, 105, 62, 1, 2, -44, 15, -15, 53, 47, -61, 15, 11, -4, 69, -10, -28, -47, 20, 125, -90, 13, 63, -199, 175, 183, -302, 52, 48, -123, 333, -108, -440, 291, 333, -199, -255, 89, 264, -92, -162, 125, -11, -53, 80, 35, -59, -70, 95, 70, -97, 48, 34, -74, 33, 87, 32, -142, -10, 214, -136, -24, 229, -283, -39, 383, -130, -165, 31, -2, 242, -37, -324, 94, 227, -9, -176, -33, 170, -25, -75, 98, -11, -62, 47, 76, 12, -92, 37, 62, -58, 48, 41, -48, -37, 37, 163, -112, -127, 227, -138, -60, 342, -234, -241, 336, 105, -139, -127, 0, 232, 12, -180, -8, 80, 72, -47, -56, 72, -24, -7, 65, -2, -31, -34, 41, 54, -50, 21, -6, -37, 37, 18, 46, -92, -95, 222, -53]
3069e3o5L43m12N7N12m29k65L64J29r1k45M7K52r0q9RPP1o6K7J6q0N1J2K0pq0
3096e5O5qpN7p9M0n0J0J99k39l8K77k95J05L14m86k0M52r9k40o0K08J23k17l3
3121g6R3j2K5m1KJ3m1O3Ol4J0m9N2%j2L1o3M6k1J4J04k28M8K25k71J42J65m61
3149b70K17L23k86j56J13J83ok32O4J06k6Ko8M1kj7M7ql4mpO3l1j8K5n8M7j0L8
3178C6K3k02J80J10k98K63j3l88L67J62l37l5J32J51p2k30J23R7j6m2p2R2jo3
3202c3P1j9k5l0M4N0r4L1L2n7K9J7N2r6j04K84j36j56L24k27j68M34q9k46L8N4
3228b0J93q9k39J08J29J9j43m9J51m4n5Q2j6n1l1J03J8j26P4J7q1L9N8J0j88P9
3254e2K20k58P8K03l96J30K62k15L4r6k7L29j49k55R8J96L4k54K7J78j05j2Q7
$$ y = [-53, -118, 225, -187, -130, 382, -47, -312, 52, 181, 90, -155, -108, 144, 54, -35, -26, -19, 52, -14, 13, 29, -51, 0, 12, 32, 25, -55, 10, 2, -5, 52, -27, 13, -37, -27, 172, -67, -105, 172, -123, -18, 296, -190, -210, 242, 143, -97, -157, 51, 174, -43, -76, 17, 5, 30, -11, -9, 4, -37, 26, 32, -2, 8, -41, 11, 11, -1, 30, -33, 13, -8, 6, 110, -118, -70, 155, -116, 26, 191, -270, -53, 270, -16, -172, -59, 124, 118, -114, -50, 56, 30, 32, -36, 5, 3, -14, 33, 25, -9, -13, -20, 43, 12, -6, 19, -39, 8, -2, 36, 59, -143, 37, 147, -151, 112, 99, -289, 78, 240, -97, -132, 0, 151, 79, -151, -28, 69, 53, 11, -61, 31, 30, -33, 38, 19, -6, -36, 8, 58, -36, -5, 27, -30, -1, 16, 68, -28, -132, 152, 16, -140, 184, -43, -211, 223, 134, -112, -74, -20, 173, 84, -155, -47, 82, 101, -42, -91, 60, 16, -39, 43, 27, -24, -55, 48, 66, -60, 14, 31, -50, -11, 47, 57, -131, -52, 168, -90, -12, 191, -205, -75, 187, -28, 6, -90, -117, 212, 63, -192, -94, 102, 136, -118, -91, 87, -18, -30, 57]
3277E7j1p9k4J40m4j00J07m0m0K9O4j3j55J59K1j95K63j16k04L22j43j2J93m13
3301b34O6M34j52k62KK72L8k49L5Q5l2J5kJ8m9j9O4j6K0l6m7O0j4L4j0n4O3j26
3329i6J80P4l68K62M2l60M61L4m97J88J92M2j22k40J95J58p6j21m9J70k6j06J01
3352C8po6j1Q7N3j54M2P3r5L1N7K6j66nK87k55j1K89l88O8L22k58R0q5j83M27
3378B06J6l88l6K62J65k72q6J96o5j1K9J8l0q8J13L0q4N3n1RJ9J7L0j06P4n2k6
3405e8K70k96m9L28l89J64L73m92q4K86R0k8k84K7K53Qq9j68J33J05j40M7M1n3
3429en3K5J54j25o2J22p9j4O0Q7j18j59K96r1j84L87l15j24L64k10J26O1m65K70
3453e2L52k22k59K6L17m4j89O1j2L4jj0M3q6J2L1QO2j18J6N3n5O5k2P3j59q5L88
$$ y = [57, 46, -33, -57, 83, 39, -61, 46, 6, -34, -5, 59, 46, -109, 50, 71, -124, 139, 23, -181, 141, -2, -14, 179, -234, -168, 266, 114, -148, -146, 126, 164, -85, -50, 35, 3, 18, 16, 34, -15, -34, 30, 14, 34, -2, -49, 11, -3, 31, 21, -33, 30, -96, 84, 158, -210, 52, 94, -266, 195, 229, -268, -80, 112, 154, 32, -208, -13, 145, 69, -52, -101, 69, 43, -63, 38, 31, -35, -46, 41, 94, -60, -18, 55, -40, -9, 48, 74, -92, -97, 190, -65, -76, 213, -175, -107, 215, -43, 47, -38, -221, 206, 222, -166, -202, 60, 225, -47, -133, 63, -2, -13, 16, 34, 4, -84, 29, 59, -25, 28, -23, -14, 5, 22, 52, -54, 20, -32, -58, 212, -84, -133, 195, -194, -30, 343, -149, -233, 53, 143, 115, -169, -142, 111, 119, 30, -138, -5, 100, -40, 7, 48, -5, -58, -33, 121, -4, -66, 56, -23, -37, 23, 110, -8, -167, 129, 38, -146, 241, -74, -198, 166, -44, 82, 143, -322, -52, 300, 78, -181, -155, 162, 118, -71, -10, -22, 12, 11, 1, 44, -42, -30, 1, 9, 71, -47, -31, 22, -33, 32, 10, 83, -76, -161, 227]
3481B27k65r9M17m80J9M63k49n7r1n3L91n8l15n1K49J49k70j3J50p4j5M2M8p4
3505ir4J47m1j3N1p0Mj9J03qj07J43k19O0L12l94J68J65n05L62K89l95o5K5K08
3530I8J12k68r5R8J91n7j95J31J5p6M7O1%j53N1J31j22M0K5m5o1L0J95k15K1J64
3556A23l25K77Q8l40L20j92k33N49r1l42MJ58K17j65j62L8R9R9j43k8Q9p3J4M0
3580B1N7p1j16J51j4o4O3Om2j21K08K7k53K70j57j57M05k34qJ80m21K24L56k82
3604B8j86K5K54L3j97k7J1J05J4q4O3n3k0J5N8P0j82L5Q3p8L6K9M2j63J2K58k80
3631i9J00J54l75K48Q7k09K98k63k14M18O2j90j84J04K01o5n3q4M8P2p0M8Jl7
3655bl6j2J40o5q2R8n7j0J6J15q1j73K57j27p5L21l14jJ97k68K98N4m16J01K27
$$ y = [227, -38, -137, 280, -200, -181, 282, 33, -24, -115, -168, 223, 165, -150, -201, 48, 197, -73, -86, 64, -10, -25, 17, 65, -9, -103, 44, 3, -10, 41, -29, -25, -44, 59, 51, -56, 87, -132, -72, 240, -154, 14, 179, -326, 36, 325, -70, -135, -110, 98, 210, -58, -153, -55, 136, 79, -116, 15, 30, -46, 1, 62, 62, -91, -40, 91, -31, 9, 34, -11, -72, -42, 153, -62, -41, 123, -202, 75, 163, -177, 143, -49, -282, 267, 176, -166, -162, -4, 213, 48, -114, -76, 23, 122, -21, -49, 40, -33, -19, 21, 78, 7, -109, 42, 28, -36, 27, 33, -9, -130, 78, 105, -148, 122, -35, -192, 213, -21, -29, 151, -270, -46, 310, 28, -158, -133, 121, 154, -43, -70, -59, 46, 60, -24, 39, -14, -34, -19, 39, 109, -73, -38, 45, -33, 3, 32, 74, -89, -77, 181, -99, 1, 155, -220, 28, 115, -94, 204, -59, -273, 145, 207, 17, -167, -63, 138, 73, 20, -64, -16, 56, -14, 34, 35, -2, -38, -50, 90, 25, -57, 41, -16, -26, -10, 105, 24, -149, 108, -19, -94, 227, -87, -88, 109, -159, 139, 193, -223, -122, 105]
3680A05P4j65j57J26O2N0p9o9Q0m7J7L2J3k5j14J28L2q9N8j4k2o6J16P1k21J65
3706F1n2j77L56j78q1K16l45J32L30k15j60j9J74J11j34r2j6J43J0q5M4j4k5k3
3730c9N9Q7j62K1O2o0L7K4K1j18L5R9j64K13o5k21L03j78m5L32k90j39J95N7N5
3755A19j76r4J34J13kj81M7P6n1K1J8K2j04oJ30o7K0J1o3K2mQ5o9L1Mj97K84m3
3783H0k16L24k58j32L56q5j1p8j71K34J31j30j83O4J74p0k8mLj2j6J03m0m1Ln7
3809f0J02Mm5J5j0j7p2J86k4k30K77j61j02L30k02oM8k38K89J28k40j31Q9J94
3833A24l9j00m1J7R2n1OL0m9j6l3J32j8j19Q0ll7J4P3j9j50J71q6l1K51l00N8
3860d4J56l21L13J26l09j6J3J82O3j83j00P1J81q2j06P3k7jk6R4J7j38O8j1J0
$$ y = [105, 179, 14, -143, -17, 45, 95, 16, -53, 27, -20, -3, 29, 42, 17, -97, 31, 63, -26, 32, 18, -4, -70, 46, 117, -104, 61, 9, -168, 188, 10, -71, 145, -200, -68, 262, 47, -113, -132, 42, 153, 19, -73, -89, 54, 64, -21, 23, 9, -16, -39, 20, 107, -55, -34, 28, -32, 5, 29, 50, -68, -33, 66, -98, 115, 50, -171, 132, -46, -91, 241, -49, -188, 7, 64, 119, -57, -151, -17, 96, 94, -87, -40, 36, -15, 6, 24, 46, -58, -64, 66, -1, 19, 30, -33, -11, -15, 70, 1, 32, 36, -161, 123, 80, -136, 188, -70, -202, 154, 69, 58, -20, -191, 43, 174, 44, -139, -75, 99, 29, 1, -3, 0, -12, -28, 75, 35, -6, -3, -60, 42, 46, 1, 16, 6, -11, -83, 103, 79, -151, 126, -35, -137, 193, -9, -15, 33, -205, 84, 212, -28, -159, -70, 124, 85, -15, -56, -39, 53, 2, 8, 38, -11, -27, -60, 72, 54, -65, 15, 12, -25, -11, 62, 43, -107, 64, -22, -53, 198, -102, -44, 112, -209, 104, 230, -79, -95, -82, 100, 163, -20, -120, -49, 132, 50, -56, 17, -10, -11, -37, 57, 74, -64, 4, -7, 3]
3885CN7n4Ol6M1q0Q6J44l31J63J07l08L43pk53J45j63J58K30k59j54O7K38k8j62
3910d7KNQ2l3j2M8n9Kn0Q8O9j59M3L4l4pQ1M3j97J34k0j34L09k07p4K50l54J74
3938b3K76k72n2n1J39J70j25j77j2K19Lj27L5Mjn0O7O8j16K6m3K4P4o7K5j4K5
3965B5j02N6K08k95J08J01l14L08Lj59K00l01L5L10n7j71j26J58J12k6p7r8J15
3988A3L1o0L3J2jj20P8J02j00L2rj2l5M0N3j02J52j77n6L19k82J00J73l66J43
4013c9Q0j3J38k52q6J90J38q6j90Q2N4K3rn5N1l8LMJ2Q5j39J7M8k9JM2L7j53Q7
4042CL2j40K60j69j04K57l04J59K20k63j0k7R0J58j06j53l0J96J9j13J2j3M7l3
4066a2J5M5n1K4o7L3N6n3J8jJ5j07Q6J13j91J43o4j51K73j61K5J53k89O9J32K5
$$ y = [3, 60, 6, 12, -24, 17, -63, 23, 167, -164, -1, 106, -202, 141, 134, -119, 26, -137, 21, 251, -8, -162, -95, 143, 115, -47, -45, -40, 42, 9, -3, 45, -14, -12, -62, 26, 95, -64, -21, 13, -21, -28, 53, 96, -101, 33, 13, -121, 188, -19, -93, 157, -197, -23, 253, -19, -71, -122, 17, 187, 62, -115, -127, 92, 95, -32, 3, 7, 6, -44, 23, 91, -25, 1, -42, -18, 56, -11, 14, 0, 25, -77, -21, 187, -108, 0, 101, -213, 95, 98, -61, 139, -162, -127, 183, 126, -45, -171, -13, 99, 73, -4, -102, 13, 44, -16, 17, 29, 28, -92, -14, 88, -12, 20, 11, -1, -36, 4, 57, -45, 107, -70, -126, 193, -89, 11, 184, -182, -39, 41, 28, 166, -86, -172, 18, 156, 70, -120, -38, 16, 39, 30, -25, 26, -12, -9, -5, 7, 92, -47, -30, 18, -11, -10, 32, 69, -84, 3, 35, -105, 155, -14, -118, 139, -165, -6, 214, -49, -59, -86, 4, 162, 56, -97, -127, 69, 88, -25, -13, -26, 21, -12, 3, 48, -3, 21, -46, -13, 43, -10, 8, 7, 22, -85, 1, 114, -77, 66, 2, -149, 124, -37, -12, 141, -148, -79, 53, 78]
4092G8lj81J6J06J09r8j20J02nOk3M2Mp3M5j5K9K7p2K3kK1n9O8O4j89J33j9j23
4121a09K35j46qJ12k26J51J17j07n9o7J15P9k3j05m0J14lk9jQmm4O1Jj5K1n4L1
4149EqJ3l1P0j2j45J65n3o7K10k07K2Q8j56K09oj63NL8J04j0r6n6N4R7o4j4jJ4
4178Eok6N4k7L%m0L9lRrL1m2o0J60r8j7J11k03J37K1j04J90j34j11Q9N0Q6r4q6
4208g5kJ19M3j13NJ2K0j2pL2l1J2k9PN1l8J5qM0q6K6J11j43R7l1j15J91j25J7
4237a7J44k03J3O8L1N8j34n4N3J16j3j08L7jK6rmK7l7J1m4N8K3o5K8PLq0R5J3
4267D2r3J42j82N6J50k20J88jj89J00k4J07L2j55m6P8J36p3q0j1K7O1n4NJ6Mj6
4294@m2R2l9l3L7nj9j9Q0p4P3j3j90K59q2j03K30k28M7L7j14K39n0j46n8R8J40
$$ y = [78, 75, -106, -90, 16, 125, 27, -93, 9, 4, 10, -13, 29, 33, -40, 5, -10, 19, 46, -26, -3, -5, 16, -43, 25, 89, -100, 33, 14, -109, 126, -20, -28, 84, -142, 9, 126, 19, -40, -107, 8, 87, 64, -41, -81, 33, 30, 1, 0, 8, 4, -40, 21, 22, 7, 28, -26, 5, -3, 10, -21, 49, 37, -108, 57, 4, -63, 147, -60, -38, 50, -106, 103, 97, -66, -61, -23, 81, 71, -25, -81, -27, 70, 6, -8, -9, 5, -1, -27, 27, 0, 3, 3, -37, 2, -1, 8, -1, 30, -12, -72, 88, -10, -27, 84, -119, 18, 39, -65, 125, -9, -120, -31, 19, 105, 11, -75, -77, 42, 85, -28, -23, -11, 9, -3, -10, 22, -9, 3, -26, -19, 32, -6, 9, 1, 41, -45, -19, 92, -51, 46, 15, -100, 91, -34, -17, 127, -76, -63, 5, 36, 94, -40, -94, -41, 75, 62, -46, -9, -10, 16, 7, 3, 30, -7, 4, -40, 18, 41, -24, 4, 11, 14, -66, 29, 42, -51, 91, -91, -35, 115, -105, 83, 82, -107, -7, -31, 76, 108, -47, -93, -15, 121, 48, -32, -43, -16, 45, -9, -4, 12, 16, 0, -42, 50, 11, -22, 15, 10, -9, -28, 52, -22, 51, 38, -152, 107, 25, -78, 152, -76, -29, 8, -106, 133, 83, -63, -121, -23, 117]
4321A17o6n4q5P3Q7o1k1RL6q0K6P0n6L4l7%K2rj6j4J43j81KJ44k19K39m4j55K16
4350A20k41M0K22p9m1j52O9J37M6r0j68J21N4nl4oL8o4N2n0O1L9j13L8K2Mp3Q7
4378C4J6j27J75j82M3K03l04K24j3k23J91p7J28K7k06k7J03J69j13j09RL6J02
4401G9n8l9OL8m3m1J33o5rJ5l6K3nL3q7J47q2j62K96k22P3J64k89K07r8j28K77
4428A27m3n2j46J9J56O5n1j94O3R1Mk2l8M3m4L8m9J6R9j26J7L1J1n8N0O8j35J61
4456A01j56n9L06l09J69O9k57J76r9Q5J38j85q8RK08Jr4p6l2J49j9l1k8N0j9q4
4482g5J23o0L9Mn9L4jJ6j02J88o5j47K32k45J22J43k82K75j51j28J76l2J23j00
4506B8j47K3J61R1j77m8K2O5K6m4Pj7N3r4K9Q7o9K1l7M0n3N4k3n2K17k75Q3J38
$$ y = [117, 51, -3, -88, -15, 72, 11, -10, -1, 35, -45, -19, 51, -5, 29, -8, -8, 14, 5, -11, -25, 118, -63, -61, 83, -136, 103, 59, -96, 120, -121, -81, 141, 62, 21, -131, -62, 75, 121, 31, -137, -16, 38, 33, -1, -7, 31, -33, 19, -31, 30, 69, -44, -6, 16, 20, -53, 34, 50, -77, 98, -84, -41, 162, -142, 82, 69, -154, 37, -40, 88, 115, -91, -118, -15, 154, 41, -68, -59, -23, 79, 21, -18, -12, 26, -17, -58, 75, 10, 1, 16, -20, 3, -2, 31, -56, 91, 9, -153, 143, -79, -6, 158, -131, 76, -22, -150, 127, 84, 32, -114, -95, 61, 126, 75, -119, -56, 35, 39, 17, -21, 22, -22, 16, -33, -17, 82, -44, -27, 4, 15, -43, 7, 75, -60, 101, -55, -114, 192, -117, 52, 121, -136, 40, -59, 26, 164, -21, -109, -100, 108, 109, 15, -61, -93, 56, 37, 6, -22, 28, 9, -75, 48, -12, 27, 31, -28, 6, 5, 21, -81, 107, 42, -105, 127, -118, 4, 147, -135, 140, -11, -139, 37, 5, 128, 28, -119, -96, 65, 156, -21, -69, -47, 18, 44, 0, 7, -10, 43, -51, -22, 65, -4, 17, -20, 20, -33, 21, -2, -54, 163, -112, -29, 109]
4534A09k72K85j10n8J79k70P6J21L5k8j78K3R3J40r9j10K4L7M7n1K9l0J3Pq0J12
4560D4k3j1k3M5k4n7J24j49J39K0k43K70j62j2J99k00J34q0j21J59O2J0j52l4
4584h5L8J22M1j64QJ9N0l8J8J9m2M6q6L8N2k2j9J4N4j38J14l6n5K20k64R7P8k12
4612a33K31p9mN7j88O8Q5Q2q8j15J6O9R9o0o7RL0j8rN8m7L8l7l3O3j5kk2R1j07
4642b8%R3j79K48j16r8K04k30R8M2m5J31j49n8L4J28M1j12n5k9J11L0m9l2K5J6
4668B1n7O3j5J7Lp5L8K0Ln0R8n3n9J25j92J49M4j80K23j59j7Q0r6J75l2j05p6
4695a07N1J27J2m5j03J8P3Pk6j1L8p3N1l9L2M8n3%j0L7p7O7K4r3J71k06O3J06
4723H2k00K06p0l1N5j65R4Q7L1q3q6J5Q0Q9p6n3j2M7kRJ5l8M4n4k1O6k5Pk3N6
$$ y = [109, -163, 122, 12, -46, 133, -137, -61, 60, 95, 67, -111, -88, 5, 145, 46, -64, -40, -3, 44, -7, 22, -8, 5, 12, -68, 44, 21, 10, -13, 32, 8, -49, 75, -74, 65, 85, -158, 112, -50, -62, 137, -63, 71, -9, -130, 29, 91, 101, -51, -85, -47, 75, 116, -48, -40, -21, 29, -9, 9, 28, -14, 32, -54, -16, 36, 14, -5, 9, 63, -75, 39, 3, -52, 168, -96, 1, 79, -133, 98, 19, 15, 72, -116, -48, 37, 119, 31, -84, -68, 1, 100, 40, -27, -18, 12, -6, -15, 43, -4, 34, -3, -36, 27, 12, 10, -12, 79, -28, -28, 65, -114, 134, 18, -80, 124, -106, -8, 34, -11, 120, -29, -87, -53, 75, 116, 4, -51, -80, 31, 61, 12, -20, 5, 21, -36, 27, 12, 29, 32, -43, -5, 15, 18, -32, 66, 13, -46, 79, -113, 36, 80, -100, 123, -36, -53, 27, -69, 106, 74, -31, -107, -56, 71, 83, 38, -65, -47, 26, 33, 7, -4, 34, -39, 12, -27, 5, 53, 0, 0, -10, 27, -50, 17, 41, -52, 119, -87, -24, 82, -118, 88, 18, -13, 42, -123, -29, 58, 89, 6, -80, -65, 15, 104, 28, -25, -37, 10, 8, 17, 32, -6, 38, -16, -37, 29, 4, 11, -12, 44]
4753D4q7N8or0J98j67L1R2j72J56p5LJ19j31l6l0J14P4l8r7o1J05L8J6n1Jj5l
4781a0K8m4Q2l2l4J1jJqM6p7R3l9j20J80j38Q7N7j59J57j24k3J03JL9r7n8L3J09
4810F3L0q8l2j6O0J0Kl7K5Mn6M8mPNj5p%L7r5J14k2o1J18j84J26j0q8J55q6J4
4841A7k7p0R7N8%j21mJ7O7L3o0j6j2M6l4M0j5j0K4o4K9J9J2m1L7K2q4R2j28P3
4871cQ3j42J37p7l6P1r2J00K6l9n9l3N8N3K4r9%J2M6nk5K0l5M0m4J1M1k7J2k0
4901bJ4l7N4n9J8Q8j25J01p4k6J12j19R4Lp0J8m1N0O0no8l6K6M6J9l1j0k1L7k1
4931enM0l4K8k9lNJ9j6lM6p0N4m3k5J09r6N8j3n4O8o9M9J7%l8k5J3L8M5m8l5k
4964b4K9J1qJ1k9J8k1KK7j0LnJ2l5M5l4j2O6p1N4k4k7O1n7L1J3j7J2l8J3J2J7
$$ y = [44, -43, 15, 9, -81, 117, -50, -19, 73, -99, 57, -18, -15, 104, -27, -63, -93, 21, 95, 57, -40, -101, 4, 42, 58, 7, 8, -7, -10, 18, -26, 56, 24, -10, 1, 0, 1, -7, 39, -38, 55, 16, -104, 76, -62, 25, 82, -77, 80, -44, -67, 36, 37, 76, -21, -79, -46, 63, 93, 5, -27, -43, 17, 27, 29, -8, 17, 21, -35, 13, 9, 16, 21, 6, -1, -1, 36, -59, 55, 33, -28, 90, -94, 32, 22, -66, 89, 3, 17, -10, -80, 17, 75, 75, -46, -50, -33, 34, 67, 7, -9, -21, 25, -9, 31, 16, 6, 30, -34, -5, 14, 26, -15, 22, 44, -40, 52, -76, -3, 80, -62, 75, -2, -38, 33, -59, 41, 67, 28, -31, -64, -6, 47, 71, -28, -28, -16, 30, 25, 0, 20, -15, 25, -19, -8, 33, 6, 18, -2, 12, -25, 29, -30, -12, 76, -49, 52, -22, -48, 64, -55, 39, 42, -28, -10, -51, -1, 59, 54, -14, -50, -24, 22, 41, 10, 0, -21, 16, -5, -10, 30, -4, 24, -5, -8, -3, 16, 0, -3, 43, -27, 27, -16, -41, 68, -28, 30, 17, -37, 31, -38, 11, 28, 28, -10, -35, -22, 16, 61, 13, -22, -24, 5, 16, 8, 19, -10, 8, -13, -11, 16, 6, 9, 4, 16, -19, 26, -8, -20, 46, -25, 29, 5, -22, 39, -18, 13, 26, 9, 21, -17, -4, 8, 25]
4996B5nk6pJ2K0Knk4J0KmK3k3jlLkK2j7j2K5k0K8k4j2L2k6L3k0j0J9k3J1PpJ1
5032A4j8jNLmjlJ8j8QJ0k1OJ0nKJ1k3J3JrJ2j2K2j9qJ7pPj5jJ8j1J7k0MKJ3j2
5071EJoKK2k6K0j8j1K9Kj4LKj7nOK2Rl1%qJ9Q%oj6K5m0M8j0l1K5l1PK9ojj4NO
5111DJ7k6lJ7Plj6JJJ8j6QklmkLJ8Jk9Rjj2P5o9K3Mn4M9k0M9Jm2k5NN0Opm3oJ7
5152@J5omQj2K6n0L9J9j6Rl4j0J2K0k7K9rk8O5p5M7Qn9O6n8N1pm6K0K3K8n2mm4
5187e6O7M9k7l4j9QJ7L5l7J4j0k7MJ5K3Nj3o0L3J3j2Q3j03M2j5m4J06n6M7m1n4
5218d7L0L9L1l7l2k0M5K3l0j1OQPll8N4Jj4rk2K7kJ5l8M5l9mN1q5J04n7k5P1q9
5252d5P4m4qL8NMm9LnP8nn7j5kL7K9no3K5j9L1J2j0J2k3k4k0Q1m1M8k5p7J03q7
$$ y = [25, 20, -6, -13, -1, 19, 21, 16, -8, 2, 4, 0, 23, 0, -1, -4, -1, -3, 19, 2, -10, 15, -5, 23, -1, -13, 19, -7, 26, 6, -4, 15, -8, 3, 10, 3, 14, -4, -5, 0, 3, -1, -2, -5, 13, -5, 3, 13, -8, -2, 8, 3, 5, 16, -7, 6, 7, -2, 10, -2, 20, 1, -7, 10, 3, 10, -5, -6, 12, 1, 18, -2, 2, 4, 17, 5, 6, 0, 2, 24, -2, 18, 0, -11, 18, 20, 6, 9, 11, -6, -11, -5, 17, 26, -5, -5, -13, 6, 14, 14, 8, -8, 17, -23, 25, 15, -16, 9, -22, -15, 14, 8, 7, -7, -2, 4, 21, -5, -8, 9, 16, 13, -3, -2, -1, 17, 1, 9, 7, 4, 0, -2, 1, 19, 20, -9, 0, -1, -13, 62, -7, 16, 20, -34, 15, -5, 44, 45, 3, -22, -17, 33, 39, 32, -11, -17, 0, 15, 9, 5, 13, 1, 27, -23, 16, 35, 19, 28, -6, -16, -4, 16, -11, 18, 9, -19, 46, -29, 18, 26, -33, 33, -25, 26, 19, -27, -7, 16, 44, -8, -12, -56, 11, 60, 33, -1, -20, -12, 5, 40, 3, 17, 7, -20, -16, -1, 22, 27, 14, -46, -13, 0, -12, 71, -32, 10, -5, -49, 57, 1, 48, 7, -47, -17, 22, 53, 16, -16, -36, 9, 32, 2, -9, -3, 5, 12, 9, -29, 25, 26, 12, 3, -19, 8, 6, 21, -17, 28, -11, -15, 36, -49, 55, -2, -27, 44, -45, 29, -15, -23, 15, 20, 24, -25, -22, -27, 51, 46, -11, -26, -28, 9, 38, 33, -30, -5, -24, 7, 19, 9, 21, -2, -26, -46, 35, -6, 42, 17, -60, 43, -44]
5286d4P0K2n7N4r5L2L3K6Jn7k5j3Q7mrl7k2M8lLk5M5l7Kj0QM4j7k6qQk8Q1o0J2
5321aL6r8J07o5L8L1q6M2l0M2Kj4k1NM1j9Jm6K9K6%l4kJ2J5K6m5Rj1J8pJ5j5q
5355gK7o4P3m0J3M6r3Q3o0J5L0m0N4l9j6j7L7L8%l5n4L6L9K7m1k3k4K9J8KQk5
5387cRmlkN7n0j2J7o1J07o3K2K4q2N9m7M7K4j3k6n0K2M3M9k4m8l3K0M2J7j8l2
5419a2J2k6N1p%lk1k1J5K5OK4q5M3qk2R7o9L4l7m9N8pO3k8n2l5L4N4K1j8o5oJ9
5453a5M1J3k0l8LJ1jK9lPk0k5KM5jqMq1P7k3J8L4o5L7p1K7O2J1lp7rJ3P3kk8l5
5489a8j9N5%J3j8j2k3J8%J1L9k3k7j7nL6L3m5J3l2j8P9o2P8k8n6K5o0J05Qj2n2
5521a4m7M8N1L9p3k6j8K9N6k1nk3kqJ1NK5J7o5LKJ2N5l4l9J9m8N8K6m2N9q3J0
$$ y = [-44, 26, 48, -9, 45, -50, -18, 15, 41, 42, -15, -40, -53, 34, 30, 21, -16, -38, 10, 7, 10, -15, 30, -7, -5, -15, -7, 37, 20, -6, -14, -6, -34, 47, -13, -1, 35, -63, 44, -21, 17, 48, -38, 4, -26, 16, 18, 4, -17, -12, 29, 10, 11, -35, -6, 20, 20, -14, -16, -4, 11, 37, -8, 1, -10, 8, 1, 16, 1, -7, 20, -44, 29, -11, 2, 48, -45, 38, -22, -7, 23, -17, 37, -2, -18, -35, 2, 40, 40, 5, -49, -13, 26, 53, 12, -11, -35, -6, 12, 14, 22, -3, 6, 2, -1, -3, 54, 4, -8, 9, -52, 55, -8, 14, 38, -44, 15, -32, 15, 39, 26, 0, -50, -28, 15, 64, 40, -8, -41, -21, 21, 38, 20, -12, 0, -26, 25, 18, 18, 15, -6, -27, -12, 13, 19, 43, -42, 1, -7, -29, 68, -1, 33, -4, -53, 5, -2, 61, 33, -19, -54, -20, 34, 55, 37, -28, -34, -15, 26, 39, 19, -19, -16, -5, -6, 23, 20, 27, 7, -18, -16, 29, 28, 20, 24, -57, 20, -3, 15, 49, -16, 21, -50, -23, 39, 50, 47, -30, -39, -26, 47, 45, 17, -18, -37, 18, 18, 31, 13, 1, -22, -4, -4, 7, 46, 23, -4, -21, -26, 10, 43, -2, 11, -21, -39, 40, -22, 56, 28, -28, -3, -63, 42, 50, 38, -14, -61, -13, 38, 77, 4, -22, -40, -11, 45, 24, 19, -4, -6, -14, -3, 2, 27, 44, -21, -18, -16, -4, 51, 17, -22, -3, -51, 7, 33, -9, 50, -33, -23]
5554b3J0J2Q7n4n0m9M4N1L9k8r1K9rO3K3m7pk8K6lM0k3J4k9m7N9j0K5J4o4J8q
5586a6kO1l3MLo3M5j2M8K0o4k5j5Q0J5Mp6k8M8QO5m2m7QjL4j0K1l8K3m6K1M7n1
5620a4O2p9J3L5k6L8l2KL0k9jj1J1K1J0n0RqM4Ql1l2J5L2jRm2J0J8MOj6k0K3N
5655A3j9L8m7OK0m4P4l7nLm6O9Jkm4k0K9L1K6l3qm0L9K5j7Qk9Oj2J9nJ5J0m1Q
5690il1M9J4j8J6n4K3K3rL0k0k1Kl4M5K3nk0m4J5L0K3Kl9l0OO0j0Ok1k1K7KPj4
5725CNpoOKK3l1J4j0KJ5m3L4j6J0K2k7Qj3J9J0Lk9pJ8pK1k4NNJKqmPQrj0nQJ8
5766A3nnj2mK7j6J4kk4LmK1K2j6j6j2NL4Rj0l0j0J1K9jj1k0j8L7QMj2k6J0J5j1
5802cnL0l0J8k0oL9m6L3j1mM9o0K4j9K6J1j6pm0M2j1L5k3k8K7j0M3k6j1Lj3J7
$$ y = [-23, -13, -1, 86, 32, -18, -67, -23, 28, 67, 39, -52, -23, -32, 31, 54, 7, 0, -28, -2, -5, 35, 12, 26, -3, -50, 9, -1, 24, 38, -26, -8, -16, -18, 43, 10, 14, 17, -46, -1, -13, 35, 55, -9, -34, -49, 31, 46, 50, -26, -54, -6, 2, 67, 25, -22, -14, -15, 19, 9, 30, -8, 15, -31, -10, 37, -14, 48, -31, -18, 17, -9, 29, -3, -1, 29, 0, -1, -12, -1, 20, 30, -20, -11, -19, 25, 33, 2, -30, -15, 17, 16, 25, -17, -7, 11, 15, 21, 5, -15, 8, 13, -6, 32, -15, -9, 11, -33, 41, 4, -1, 2, -44, 25, 26, 24, -20, -40, -11, 20, 46, 13, 5, -35, 4, 29, 12, 20, -9, -3, -15, 4, -1, 14, 24, -17, -9, -40, 9, 23, 5, 21, -33, -10, 13, 4, 34, 14, -7, -5, -39, 6, 29, 24, 4, -40, -25, 5, 28, 30, -9, -39, -33, 27, 17, 23, 2, -19, 8, 10, 17, 3, 8, 1, -5, 1, 3, 26, -5, 9, -1, 1, 16, -27, 7, -9, 1, 23, -4, 4, -9, 10, 20, 23, -6, -13, 5, -2, 19, -5, 0, 5, 6, 8, 0, -4, 3, 11, 2, -8, -13, -5, 13, 8, 3, -9, -13, 14, -2, 12, 10, -14, -11, -15, 6, 28, 12, -4, -16, -11, 23, 32, 22, -8, -18, -7, 22, 21, 10, -10, -28, 9, 17, 21, 9, -17, -7, 8, -3, -8, 22, -8, 10, -10, -16, 23, -23, 10, -1, -5, 44, -16, 8, -11, 15, 26, 10, 3, -37, 5, -6, 29, 6, -22, 5, -5, 38, 12, 1, 4, -9, 8]
5835HnljL2l4lJ0k4P0o7K9Ll9O3n4L9j6j1K2l8K4KK0j0nk4j3N1j2Pl3mK7jPj7
5871@jqL2k5lJ8k4N4n7J5Lm4Q2l7LLl6L6k4JN0j9k3j4j8M5K3%k3m7J1L3L2j8k0
5906@l3K5L7k2Lj0k2M7k7oJ6l6N9j1m0M4n7L5jl3R7o5j8Nl7R2Lj4l6n7L8L8N6
5939G0n3l4m1M3P2l6Jl1l4O0j8J0Jj8J5mk3M5l3OM1q1R8n6pK3p1J04rj2k6q8Q3
5972cL6M7m8o2k8K5J02m0K0p8k7P2mM0m0l1K8j5jL5k4ML9j00J05n0j0N8j19J23
6002E4l4pJ5j14Q5K2L8j6r7%K0J01j3pr5j3O8lP5o5n3K9j6M4K7m8L8l8l1O1l7
6033a0L6J6j09J00n3M0K4j07R4l6L9L4j09JOQ3L2m2r0j9M9O8N1q9o3J9kJ02j0
6062E5n2Qo4M0N9n7O4o3l0O5p8R4j2n3M6p2O0J7l3Lj6QP1n0l0j8lR1Rm3o0l3O4
$$ y = [8, 3, 0, -1, 31, -3, -6, 4, -20, 50, -17, 12, 15, -24, 39, -15, 24, 8, -3, 19, -19, 5, 7, 27, 17, 12, -12, -25, 26, 14, 21, -12, -16, 11, 10, 17, 0, -1, -9, 23, -2, -5, 13, -11, 43, -14, 1, 4, -40, 42, 5, 8, 11, -25, 11, -13, -12, 38, 19, -4, -18, -36, 9, 32, 32, 9, -38, -27, 6, 38, 20, 0, -33, -8, 29, 7, 10, 0, -22, 25, -2, -8, 8, -28, 31, 20, -20, 24, -33, 2, 1, -32, 65, 0, -18, -13, -50, 42, 45, 31, -5, -62, -24, 14, 70, 17, -17, -58, -15, 57, 21, 22, -9, -43, 17, -1, 9, 10, -8, 7, 3, -20, 25, -8, -2, 39, -42, 56, 0, -7, 16, -55, 49, 40, 28, 2, -86, -3, 33, 80, 32, -30, -58, -33, 69, 29, 49, -29, -56, 16, 12, 52, 12, -19, 9, -6, -7, 28, 4, 8, 47, -53, 52, 2, -8, 50, -69, 54, 20, 13, 28, -86, -1, 21, 59, 43, -54, -54, -34, 67, 54, 47, -48, -61, 7, 4, 79, 14, -39, -10, -26, 18, 45, -3, 35, -3, -34, 27, -10, 26, 42, -67, 33, -20, 20, 44, -63, 31, -5, 34, 68, -41, -40, -34, 49, 81, 39, -51, -70, -21, 47, 98, 9, -54, -35, -37, 65, 55, 3, 11, -53, -13, 46, -11, 53, -10, -40, 25, -53, 41, 29, -24, 22, -50, 10, 27, -6, -3, -19, -11, 60, 10, -20, -38, -41, 50, 59, 16, -44, -77, -13]
6095a3P6Oo7k1o0P6O8o3O3j39O0K9o3J52j29N9k8p5R9o2R1m3l7J0j0M1nJ4p3O7
6125B3j9MK1r9J07l4K9k0n9K5K6N5m5Qr7Q0J5k4R5j58J08o6J1Q0j39J59r9L5%
6154B2r7J13l5O4o0l9rK5Q5n9M2r9J6N1k8P7r3L8j9k7M3KJPk8k6O0m6P8l3o4O5
6186B7p9J06l2l6L0o8J12l8l5lk9O3L8l5m8k6K5P9J5n9m8j5N1O1jn1k9n6J12p
6216B4RJ3j14J00p3O8L1r5R7j03L3PpP3p5J8m6M2KJ6nm3N6n9O8l4mK9m9P1o3M
6248iORJ2qk3j9N4j8O3q9pM9n9J14r6J5J1k6P7q0K0j4J7N4l8l1l2L9M5L5n6n9
6280d4j3M5N8J9p3k1j9M0Q3o9K8p3j8J03o5R4q5pL4p8J17p5N5j8n1L9m2P9k4K1
6310D0o0lJ7mO0o9L8l6JL4k1L7j5k1Mj0jL7k2J0j8l4M9k1N7k9o4M9k4O6k3l5o
$$ y = [-13, 63, 69, 2, -19, -79, -3, 65, 2, 65, -74, -14, 15, -48, 104, -25, 34, 6, -69, 30, -32, 59, 16, -21, -11, -21, 20, 15, 29, -44, 23, 4, 8, 29, -70, 37, 3, 32, 12, -47, -22, 4, 59, 14, 22, -75, 5, 20, -4, 91, -67, 41, -25, -14, 66, -73, 86, -13, 22, 22, -75, 38, 3, 67, 7, -32, -41, -16, 69, 10, 52, -47, -31, 20, -8, 69, -24, 14, -5, -32, 11, 13, 14, 21, -7, -33, 27, -19, 59, 26, -38, 27, -52, 54, 22, -14, 16, -52, 60, 22, -13, -16, -45, 18, 56, 21, -27, -53, -28, 51, 66, 7, -41, -56, -5, 56, 55, 4, -25, -81, 31, 24, 33, 46, -68, 32, -41, 27, 58, -37, 60, -43, -10, -3, -10, 63, -12, 6, -40, 2, 4, 20, 15, -28, 28, -31, 37, 3, -1, 28, -21, 50, -13, -9, -3, 6, 18, 10, -13, -32, 22, 4, 67, -22, -29, 20, -39, 75, -21, -6, 5, -21, 56, -24, -4, -18, -1, 53, 15, -16, -48, -9, 36, 71, 15, -44, -57, -12, 46, 65, -8, -29, -48, -8, 75, 6, 34, -39, -57, 46, -19, 75, -10, -17, 17, -61, 56, -19, 36, 18, -33, 6, -36, 43, 19, 40, -20, -23, -6, -10, 50, -19, 19, -17, -16, 18, -3, 34, 19, -2, 2, -8, -9, 28, 6, 16, -2, -36, 13, -8, 49, 20, -44, 5, -19, 47, 24, -11, -17]
6343a7%M3Ml4k0PMP0n0k1j4jQ2l0qn7J6L9K8po2J3k9R0j5j6mp8J00n0N4l1m0P9
6377D5o9N0m3lM9k5K6m9j5L4M0Rl1o5mN7M4J6o5n1ON6J9M1r0j0K2k6J15r7N0n1
6409a5m4J01p8R8o2j0L8q2Q3l1M3j8l2oj9M9ML1n3k6j2L5N2j3k0m3nM8J8Kkq2
6441e1M0%J4P2j04O7q9L2M9l7P8r7K1j6PN3l7K1m4J3j8L9J3j2mn4M9j0K2K1l4
$$ y = [-17, -17, 26, 30, -4, -24, -17, -13, 57, 7, -14, -28, -29, 53, 23, 15, -42, -26, 13, 41, 34, -28, -15, -44, 46, 31, 15, 11, -67, 33, -17, 37, 6, -34, 45, -24, 26, -17, -20, 29, 4, 30, -19, -34, 0, 40, 49, 18, -47, -51, 6, 50, 66, 1, -50, -44, 12, 31, 72, -18, -28, -6, -32, 83, -14, 36, -15, -59, 42, -36, 62, 0, -10, 28, -54, 29, -2, 41, 23, -9, -15, -34, 15, 19, 50, -3, -29, -41, -6, 46, 33, 13, -30, -35, 13, 31, 33, 31, -51, -11, -11, 3, 75, -29, 38, -51, -19, 30, -7, 71, -26, -5, -21, -14, 39, 2, 23, -21, -8, -26, 13, 26, 14, 10, -44, 5, -5, 17, 38, 4]
$$ [...]
8191A0
##END NTUPLES=NMR FID
##END=
