##TITLE=1H_DE-80H_X3
 200.13MHz, d2o
 8 sc
 
 19ns.26.2.2025
##JCAMPDX= 6.0         $$ Bruker NMR JCAMP-DX V2.0
##DATA TYPE= NMR FID
##DATA CLASS= NTUPLES
##ORIGIN= UXNMR, Bruker Analytische Messtechnik GmbH
##OWNER= pz
$$ XWIN-NMR		Version 3.5
$$ Thu Apr 10 15:36:10 2025 Russian Standard Time (UT+4h)  Yarkov@DPX200
##.OBSERVE FREQUENCY= 200.1313
##.OBSERVE NUCLEUS= ^1H
##.DELAY= (6, 6)
##.ACQUISITION MODE= SIMULTANEOUS
##.ACQUISITION SCHEME= undefined
##.AVERAGES= 8
##.DIGITISER RES= 18
##SPECTROMETER/DATA SYSTEM= spect
##.PULSE SEQUENCE= zg30
##.SOLVENT NAME= Acetone
##.SHIFT REFERENCE= (INTERNAL, Acetone, 0, 14.3821)
##AUDIT TRAIL= $$ (NUMBER, WHEN, WHO, WHERE, WHAT)
$$ ##TITLE= Audit trail, XWIN-NMR		Version 3.5
$$ ##JCAMPDX= 5.01
$$ ##ORIGIN= Bruker BioSpin GmbH
$$ ##OWNER= Yarkov
$$ C:/Bruker/XWIN-NMR/data/yarkov2/nmr/H-C/1/audita.txt
$$ ##AUDIT TRAIL=  $$ (NUMBER, WHEN, WHO, WHERE, WHAT)
(   1,<2025-04-10 15:30:38.01 +0400>,<Yarkov>,<DPX200>,
      <created by zg, POWCHK disabled, PULCHK disabled
       configuration hash MD5:
       00 E9 B6 7A A2 85 ED C7 34 08 36 98 17 FE 4E 26
       data hash MD5: 16K
       A7 70 5D 80 94 CB E5 65 E5 26 70 AC B5 8F F1 C4>)
$$ ##END=
$$ 
$$ hash MD5
$$ 73 E4 63 D9 F6 CE 3A 87 D5 3E 1D 7A 8C 52 96 EF
##$RELAX= 
##$RELAX= 
##$RELAX= 
##$RELAX= 
##$RELAX= 
##$RELAX= 
$$ Bruker specific parameters
$$ --------------------------
##$DU= <C:/Bruker/XWIN-NMR>
##$EXPNO= 1
##$NAME= <H-C>
##$PROCNO= 1
##$TYPE= <nmr>
##$USER= <yarkov2>
##$AMP= (0..31)
100 100 100 100 100 100 100 100 100 100 100 100 100 100 100 100 100 100 
100 100 100 100 100 100 100 100 100 100 100 100 100 100 
##$AQSEQ= 0
##$AQ_mod= 1
##$AUNM= <au_zg>
##$AUTOPOS= <>
##$BF1= 200.13
##$BF2= 200.13
##$BF3= 200.13
##$BF4= 200.13
##$BF5= 200.13
##$BF6= 200.13
##$BF7= 200.13
##$BF8= 200.13
##$BYTORDA= 1
##$CFDGTYP= 0
##$CFRGTYP= 5
##$CHEMSTR= <none>
##$CNST= (0..31)
1 1 145 1 1 1 1 1 1 1 1 1 1 1 1 1 1 1 1 1 1 1 1 1 1 1 1 1 1 1 1 1 
##$CPDPRG= <>
##$CPDPRG1= <>
##$CPDPRG2= <>
##$CPDPRG3= <>
##$CPDPRG4= <mlev>
##$CPDPRG5= <mlev>
##$CPDPRG6= <mlev>
##$CPDPRG7= <mlev>
##$CPDPRG8= <mlev>
##$CPDPRGB= <>
##$CPDPRGT= <>
##$D= (0..31)
0 0.7 0 0 0 0 0 0 0 0 0 0.03 0 0 0 0 0 0 0 0 0 0 0 0 0 0 0 0 0 0 0 0 
##$DATE= 1744284637
##$DBL= (0..7)
120 120 120 120 120 120 120 120 
##$DBP= (0..7)
150 150 150 150 150 150 150 150 
##$DBP07= 0
##$DBPNAM0= <>
##$DBPNAM1= <>
##$DBPNAM2= <>
##$DBPNAM3= <>
##$DBPNAM4= <>
##$DBPNAM5= <>
##$DBPNAM6= <>
##$DBPNAM7= <>
##$DBPOAL= (0..7)
0.5 0.5 0.5 0.5 0.5 0.5 0.5 0.5 
##$DBPOFFS= (0..7)
0 0 0 0 0 0 0 0 
##$DE= 6
##$DECBNUC= <off>
##$DECIM= 32
##$DECNUC= <off>
##$DECSTAT= 4
##$DIGMOD= 1
##$DIGTYP= 9
##$DL= (0..7)
0 120 120 120 120 120 120 120 
##$DP= (0..7)
150 150 150 150 150 150 150 150 
##$DP07= 0
##$DPNAME0= <>
##$DPNAME1= <>
##$DPNAME2= <>
##$DPNAME3= <>
##$DPNAME4= <>
##$DPNAME5= <>
##$DPNAME6= <>
##$DPNAME7= <>
##$DPOAL= (0..7)
0.5 0.5 0.5 0.5 0.5 0.5 0.5 0.5 
##$DPOFFS= (0..7)
0 0 0 0 0 0 0 0 
##$DQDMODE= 0
##$DR= 18
$$ [...]
##$SUBNAM2= <"">
##$SUBNAM3= <"">
##$SUBNAM4= <"">
##$SUBNAM5= <"">
##$SUBNAM6= <"">
##$SUBNAM7= <"">
##$SUBNAM8= <"">
##$SUBNAM9= <"">
##$SW= 18.0517328524113
##$SWIBOX= (0..15)
0 0 2 0 0 0 0 0 0 0 0 0 0 0 0 0 
##$SW_h= 3612.71676300578
##$TD= 16384
##$TD0= 1
##$TE= 0
##$TE2= 300
##$TE3= 300
##$TEG= 300
##$TL= (0..7)
0 120 120 120 120 120 120 120 
##$TP= (0..7)
150 150 150 150 150 150 150 150 
##$TP07= 0
##$TPNAME0= <>
##$TPNAME1= <>
##$TPNAME2= <>
##$TPNAME3= <>
##$TPNAME4= <>
##$TPNAME5= <>
##$TPNAME6= <>
##$TPNAME7= <>
##$TPOAL= (0..7)
0.5 0.5 0.5 0.5 0.5 0.5 0.5 0.5 
##$TPOFFS= (0..7)
0 0 0 0 0 0 0 0 
##$TUNHIN= 0
##$TUNHOUT= 0
##$TUNXOUT= 0
##$USERA1= <user>
##$USERA2= <user>
##$USERA3= <user>
##$USERA4= <user>
##$USERA5= <user>
##$V9= 5
##$VALIST= <valist>
##$VCLIST= <CCCCCCCCCCCCCCC>
##$VD= 0
##$VDLIST= <DDDDDDDDDDDDDDD>
##$VPLIST= <PPPPPPPPPPPPPPP>
##$VTLIST= <TTTTTTTTTTTTTTT>
##$WBST= 1024
##$WBSW= 4
##$XGAIN= (0..3)
0 0 0 0 
##$XL= 0
##$YL= 0
##$YMAX_a= 188876
##$YMIN_a= -151132
##$ZGOPTNS= <>
##$ZL1= 120
##$ZL2= 120
##$ZL3= 120
##$ZL4= 120
##$ABSF1= 10
##$ABSF2= 0
##$ABSG= 5
##$ABSL= 3
##$ALPHA= 0
##$AQORDER= 0
##$ASSFAC= 0
##$ASSFACI= 0
##$ASSFACX= 0
##$ASSWID= 0
##$AUNMP= <proc_1d>
##$AZFE= 0.1
##$AZFW= 0.1
##$BCFW= 1
##$BC_mod= 2
##$BYTORDP= 1
##$COROFFS= 0
##$CY= 83.5205535888672
##$DATMOD= 1
##$DC= 2
##$DFILT= <>
##$DTYPP= 0
##$F1P= 10.8118882576601
##$F2P= -7.23987719738617
##$FCOR= 0.5
##$FTSIZE= 0
##$FT_mod= 4
##$GAMMA= 1
##$GB= 0.15
##$INTBC= 1
##$INTSCL= 1
##$ISEN= 128
##$LB= 0.25
##$LEV0= 0
##$LPBIN= 0
##$MAXI= 10000
##$MC2= 0
##$MEAN= 0
##$ME_mod= 0
##$MI= 1.114404
##$NCOEF= 0
##$NC_proc= 0
##$NLEV= 6
##$NOISF1= 3.799351
##$NOISF2= 2.8
##$NSP= 1
##$NTH_PI= 0
##$NZP= 0
##$OFFSET= 14.38212
##$PC= 1
##$PHC0= -901.6975
##$PHC1= 2.933677
##$PH_mod= 1
##$PKNL= yes
##$PPARMOD= 0
##$PSCAL= 0
##$PSIGN= 0
##$REVERSE= no
##$SF= 200.129724274929
##$SI= 16384
##$SIGF1= 3
##$SIGF2= 2
##$SINO= 400
##$SIOLD= 16384
##$SREGLST= <1H.CDCl3>
##$SSB= 0
##$STSI= 0
##$STSR= 0
##$SW_p= 3205.1282051282
##$SYMM= 0
##$S_DEV= 0
##$TDeff= 0
##$TDoff= 0
##$TI= <>
##$TILT= no
##$TM1= 0
##$TM2= 0
##$TOPLEV= 0
##$USERP1= <user>
##$USERP2= <user>
##$USERP3= <user>
##$USERP4= <user>
##$USERP5= <user>
##$WDW= 1
##$XDIM= 8192
##$YMAX_p= 0
##$YMIN_p= 0
$$ End of Bruker specific parameters
$$ ---------------------------------
##NTUPLES= NMR FID
##VAR_NAME=  TIME,          FID/REAL,        FID/IMAG
##SYMBOL=    X,             R,               I
##VAR_TYPE=  INDEPENDENT,   DEPENDENT,       DEPENDENT
##VAR_FORM=  AFFN,          ASDF,            ASDF
##VAR_DIM=   8192,          8192,            8192
##UNITS=     SECONDS,       ARBITRARY UNITS, ARBITRARY UNITS
##FACTOR=    0.0002768,     1,               1
##FIRST=     0,             0,               0
##LAST=      2.2672688,     0,               0
##MIN=       0,             -151132,         0
##MAX=       2.2672688,     188876,          0
$$ Real data points
##PAGE= N=1
##DATA TABLE= (X++(R..R)), XYDATA
$$ [...]
1109d506R160o601j663R112q399L621K024p019N389J183p647J1071p693k376J0442
$$ -4506 4654 -1947 -3610 5502 -2897 724 2748 -4271 1118 2301 -5346 5725 -1968 -4344 6098
1124F098q453N70P333q954J848N484p879O103k049k805N008l274o76O997q793
$$ 6098 -2355 -1785 5548 -3406 -1558 3926 -3953 2150 101 -2704 2304 -970 -1646 5351 -3442
1139c442L304L371p661O319k63m817M860j198m054Q752p541Q59M783o059K531
$$ -3442 -138 3233 -4428 1891 1628 -3189 1671 473 -3581 5171 -2370 -1511 3272 -2787 -256
1154b56M036n934J863J204l265M454l614J988O06l298K932K543o603M493K89m643
$$ -256 3780 -2154 -291 913 -2352 2102 -1512 476 1082 -2216 716 3259 -3344 1149 1438 -3205
1170c205M843p72k278K002n96q95K371k727J636K04p13m4J563k397P02J38L36
$$ -3205 1638 866 -1412 590 -6 -901 1470 -1257 379 583 -130 -174 1389 -1008 -306 -168 168
1187A68k93r71K688k272P06J67J353l481K266O44k152L36K369j479j863L911k877
$$ 168 -125 -1096 1592 -680 26 193 1546 -1935 331 975 -1177 -841 1528 49 -1814 2097 -780
1204g80j89J987o17j284K049k474K056j33j973K622j673j020K630r68j154K403
$$ -780 -969 1018 401 -883 1166 -1308 748 615 -1358 1264 -409 -1429 1201 233 -921 1482
1220A482l024K798p49k453M382l074k243O519m750j522O014m905L51M036m255
$$ 1482 -1542 1256 507 -1946 2436 -638 -2881 3638 -1112 -2634 3380 -1525 -1174 2862 -1393
1235a393J423J297l860M964l491o95M630n058J332L949n510K915K075o044N803
$$ -1393 30 1327 -2533 2431 -1060 -1755 2875 -2183 -851 3098 -2412 503 2578 -3466 2337
1250B337k178l412P024m960j687P146o790J526M991o557K625J472m089M544j942
$$ 2337 159 -3253 3771 -1189 -2876 4270 -2520 -994 3997 -2560 65 1537 -2552 1992 50
1265E0k228N693o567K725M346p830M451J879o707O381l87n360O806m271j368O289
$$ 50 -2178 3515 -3052 -327 4019 -3811 640 2519 -4188 2193 1806 -3554 3252 -1019 -2387 3902
1281C902o220J485L823o502M457R44m437M684k382j680M914m962J534L852p527
$$ 3902 -2318 -833 2990 -3512 945 1889 -2548 2136 -246 -1926 2988 -1974 -440 3412 -4115
1296d115M963J574o445O281n43m996N888k578k038M710m291R34K412m357L730
$$ -4115 848 2422 -4023 2258 1715 -3281 2607 29 -2009 2701 -1590 -656 1756 -2601 1129
1311A129K54l693M645k837j233M192l932J053K809n148L143J535m951M776o62
$$ 1129 1383 -2310 2335 -502 -1735 2457 -1475 -422 2387 -2761 382 1917 -3034 1742 1080
1326A080l684M375j499j633L046k374J28J117j699K030k74j801K653k127o17L199
$$ 1080 -2604 1771 272 -1361 1685 -689 -561 556 -1143 887 613 -1188 1465 -662 -1279 1920
1342A920k808O27J565k476R53J693k587J446J15j881J813K80q24L40k3q28O51
$$ 1920 -888 -261 1304 -1172 -219 1474 -1113 333 448 -1433 380 660 -164 176 153 -675 -24
1359b4K75L89j109M12O2m13K65N59o25l92J408o84k22L25J42j660J855k86j432
$$ -24 251 640 -469 -57 5 -408 -143 416 -209 -601 807 123 -99 226 368 -1292 563 277 -1155
1378a155J994n70j168J948r79j297K530j616K3J260j795N03P84j388J847j152
$$ -1155 839 269 -899 1049 70 -1227 1303 -313 -290 970 -825 -322 462 -926 921 -231
1394b31j82J911k351O82J459l392K208J599l950L832q34k769L465j329k162M015
$$ -231 -413 1498 -853 -171 1288 -2104 104 1703 -2247 1585 751 -2018 1447 118 -2044 1971
1410A971k785K52K538l598K076J52k180K744j105j939M636m175J048K619n079
$$ 1971 -814 -562 1976 -1622 454 606 -1574 1170 65 -1874 2762 -1413 -365 2254 -2825
1425b825K873K237m576L860k2m989N659k632j196L580l024K03L411m239K651r3
$$ -2825 48 2285 -2291 1569 1547 -3442 2217 -415 -1611 1969 -1055 -852 2559 -1680 971 878
1441H78l781M916k504r87M012l744k44M787o212L161J959n035M173J00m338M508
$$ 878 -2903 2013 -491 -1478 2534 -1210 -1454 3333 -2879 282 2241 -2794 1379 1479 -2859 1649
1457A649j514k330M731m006J321K009l193J898L65m027N276k165j460M333m715
$$ 1649 135 -2195 2536 -1470 -149 1860 -1333 565 930 -3097 2179 14 -1446 2887 -1828
1472a828N56L844m045J114K762n766M807k10k594K604j731j479L663j958K12J783
$$ -1828 -1272 2572 -1473 -359 2403 -3363 1444 1234 -1360 1244 -487 -1966 1697 -261 -49 1734
1488A734m146L255p13j423K750j291k006M378l571J80K827l712J144J993k665
$$ 1734 -2412 843 130 -1293 1457 166 -1840 2538 -1033 -853 1974 -1738 -594 1399 -1266
1503a266J594J477l275K473j859L65J078m37k28Q82k237J895L28k050K520k041
$$ -1266 328 1805 -1470 1003 -856 -491 587 150 -78 804 -1433 462 790 -1260 1260 -781
1519g81K81J565m17j742K214k570J034J361r98k31P04k96o47J316j316K88k73
$$ -781 -500 1065 648 -1094 1120 -1450 -416 945 -53 -284 420 124 -523 793 -523 -235 -508
1536e08J524j360N68n94L79k73O72J25j311O12N42j83n34J389k555J736M29p61
$$ -508 1016 -344 224 -370 9 -264 408 533 -778 -166 376 193 -341 1048 -1507 229 658 -103
1554a03K20N75k301J940N59k082K425j235p21J061Rj168J705j705J170l16r66
$$ -103 117 692 -1609 331 890 -1192 1233 -2 -723 338 347 -821 884 -821 349 33 -933
1571i33K305j408j243K845k553j57L790l851R23J225k761J951J674l575L279j859
$$ -933 1372 -36 -1279 1566 -987 -1144 2646 -1205 -282 943 -1818 133 1807 -1768 1511 -348
1587c48j100L537k637J0J350k361J648J538l235L588k694j022M052l261m12M139
$$ -348 -1448 2089 -548 -538 812 -1549 99 1637 -1598 1990 -704 -1726 2326 -935 -1347 2792
1603B792m671J149L418m882K671O26k744K409l82k117L910l317O91K493m308K713
$$ 2792 -1879 -730 2688 -2194 477 1103 -1641 768 386 -1731 2179 -1138 -447 2046 -2262 451
1619D51R84l456L214o18l018M989l275o71M079m670J261L599n074K543J183l653
$$ 451 1435 -2021 1193 575 -2443 2546 -729 -1400 2679 -1991 -730 2869 -2205 338 1521 -2132
1635b132L085n29j688K671k456P48K572m484L281L4l764L831k77l157M280j998
$$ -2132 953 424 -1264 1407 -1049 -301 2271 -2213 1068 1102 -2662 1169 892 -2265 2015 17
1651A7j563L709l496R52J902l092J610J352l241K903n04j683K109j715L66J498
$$ 17 -1546 2163 -1333 -381 1521 -1571 39 1391 -1850 1053 549 -1134 975 -740 -374 1124
1667A124k322J820M90l393L594n56k594L268j035k241L151j447l58J330j380N74
$$ 1124 -1198 622 1112 -2281 1313 757 -1837 1431 396 -1845 1306 -141 -499 831 -549 25
1683B5L57r21J183m13j357K040j457N58N38r58K95L58r69J302J12j836J970q37
$$ 25 382 -539 644 231 -1126 914 -543 15 553 -405 -110 248 -721 581 693 -1143 827 -10
1701a0j031J368L68j642J099M48j010M20P43q54n91N16J25R2J44N78q92l99M47
$$ -10 -1041 327 695 -947 152 600 -410 10 753 -101 -692 -176 -51 41 185 763 -129 -528 -81
1720h1N56r66Q71l34p11J267m11k78O66j262j30K085j957N13J513k320N05J594
$$ -81 475 -491 380 46 -665 602 191 -87 579 -683 -813 1272 -685 -172 1341 -979 -474 1120
1738A120k046R05M40o09P21j044M64O21j708J526P78l266L026j26j975K527j377
$$ 1120 -926 -21 419 -190 531 -513 -49 572 -1136 390 1168 -2098 928 802 -1173 1354 -23
1755b3j589K649j523J09K212l439J588J169k302J882Q8k347K239j085NJ755k738
$$ -23 -1612 1037 -486 -377 1835 -1604 -16 1153 -1149 733 821 -1526 713 -372 -367 1388 -1350
1772a350J833N05k997L084K74l703L931j412k400L916j706n69K010k730R88J437
$$ -1350 483 988 -2009 1075 1349 -2354 1577 165 -2235 1681 -25 -594 1416 -1314 -326 1111
1788A111k385K572j035k296L366j460m28K353l439J296J638k729K852n16l597
$$ 1111 -1274 1298 263 -2033 1333 -127 -555 1798 -1641 -345 1293 -1436 1416 900 -2697
1803b697M041r07k284L957k472q86K799j963L22P69k277K333o78j205L043k368
$$ -2697 1344 437 -1847 2110 -362 -1248 1551 -412 -90 679 -1598 735 57 -1148 1895 -473
1819d73l90K761l086L58K297l113K267M04k655K578m98j810K785j684j182K773
$$ -473 -863 1898 -1188 -830 1467 -1646 621 1025 -1630 948 450 -1360 1425 -259 -1441 1332
1835A332j664L33O07j572J084ko20J917k013j67K305k383L48J651k481J113J630
$$ 1332 -332 1 608 -964 120 118 -502 1415 -598 -765 1540 -843 -495 1156 -1325 -212 1418
1852A418k097J126k14j017J189k86p51J048p37K82P32j014M17k72m7P50o83l87
$$ 1418 -679 447 233 -784 405 119 -632 416 -321 -39 693 -321 96 -176 -223 527 -156 -543
1870e43J184j203L62J029j340M2J411r24l92Q26j062Q5Q94Oo34N86l65K8K04l26
$$ -543 641 -562 -200 829 -511 -469 942 18 -374 452 -610 -525 369 375 -259 327 -38 -10 194 -132
1890a32r7J03J85K49k39k56L64n69P12k6r69Q43N28j424J377o77j501K047J15
$$ -132 -229 -126 59 308 69 -187 177 -392 320 294 -675 168 696 -728 649 -28 -1529 518 633
1909F33r58J223r45j102J833j040L86Q3p73R68K50p62J102j515m57K031j808J138
$$ 633 -325 898 -47 -1149 684 -356 30 113 -660 308 558 -204 898 -617 -1074 957 -851 287
1927B87R22k196R50J039k616K453k00j871K203j031p39J795j199l57J230j897
$$ 287 1209 -987 -37 1002 -1614 839 639 -1232 971 -60 -799 996 -203 -560 670 -1227
1943a227K022j37j248J528j699o02K862k032K70J811l246J749J291k511J651L9
$$ -1227 795 658 -590 938 -761 -1363 1499 -533 -263 1548 -1698 51 1342 -1169 482 521
1959E21k312K885r12p77J548j674L06J380j800J506j42j977K668j718n29K476
$$ 521 -1791 1094 182 -595 953 -721 -415 965 -835 671 529 -1448 1220 -498 -1027 1449
1975A449j846k91K659l377J151J442k588J873K08j818J787j55j407K127k240P86
$$ 1449 -397 -688 1971 -1406 -255 1187 -1401 472 680 -1138 649 494 -913 1214 -1026 -240
1991b40Q12j249J333lj953K043q53j218L022k326J85J612j751k4J859k422J189
$$ -240 572 -677 656 653 -1300 743 -110 -1328 1694 -632 -447 1165 -586 -610 1249 -1173 16
2008A6N54j348J464l95m71N31q11r6J266j530J590l42j222J282k11j271J982j145
$$ 16 570 -778 686 291 -180 351 -460 -556 710 -820 770 428 -794 488 277 -994 988 -157
2026a57p99J962j403K41P92q26m50J306j222Q93k73j58Q1k42L84K5l52J72M88
$$ -157 -956 1006 -397 -156 636 -190 -640 666 -556 337 64 -94 -13 -255 129 154 -198 -26 462
2045D62j241J379n75m01M01M14j070R76J2r60Q67p1m15K35M95j152R96m62j2J27
$$ 462 -779 600 25 -376 25 439 -631 345 357 -603 264 193 -222 13 508 -644 352 -110 -122 5
2065EK51l45L33l37M3j5k67Q35r41M15L75l40l61J371j881N07R48j132N36P52
$$ 5 256 -89 244 -93 -50 -65 -332 503 -438 -23 352 12 -349 1022 -859 -352 596 -536 0 752
2085G52j234K33R82j448J177o13q9M31k15j59P95j323J031J14j253J648j043l39
$$ 752 -482 -249 733 -715 462 -151 -240 191 -24 -183 612 -711 320 434 -819 829 -214 -553
2103e53J366r50q54K368k346R60J166k075Q29O50j108Q05J24j286J455j163R46
$$ -553 813 -137 -991 1377 -969 -9 1157 -918 -89 561 -547 258 382 -904 551 -612 334
2120C34M55j680J039L61j601K013n45j806K178r57l40J917j603m16J650k137J195
$$ 334 789 -891 148 509 -1092 921 376 -1430 748 -209 -549 1368 -235 -651 999 -1138 57
2137E7P39j594J080R3j086J417p60q7Q95j947J382L91j482J741j66k478K654o82
$$ 57 796 -798 282 375 -711 706 -54 -141 754 -1193 189 580 -902 839 673 -1805 849 167
2155A67q00J875j538m82J148o81L65O47j791J491k57l76J152j254l11R81r11Q32
$$ 167 -633 1242 -296 -778 370 -311 54 701 -1090 401 144 -232 920 -334 -645 336 -575 257
2173B57M46j737J603j19j346J675n14j528K108p44p17J074o23N9M38l78K84k34
$$ 257 703 -1034 569 450 -896 779 265 -1263 845 101 -616 458 -165 -106 332 -46 238 4
2191Dn07J241j084k05J085j035M39R22j214M71J79r61Q68o5q54J106q6q63R87
$$ 4 -503 738 -346 -551 534 -501 -62 860 -354 117 296 -665 203 138 -716 390 304 -559 428
2210D28l06l58L44J15m34j25L47L33m67p2N38p18K73J034r01o00P54n58J95O54
$$ 428 122 -236 108 223 -211 -336 11 344 -123 -195 343 -375 -102 932 31 -569 185 -373 -178 476
2230D76m47l56N86k42K32J85r70K71K73j71K81K59o27J39K42M2j86j90L75k52
$$ 476 29 -327 259 17 249 434 -536 -265 8 -163 118 377 -250 -111 131 173 -13 -203 172 -80
2250h0m93J017l47q16J411m53q44J073j75r20J042o93k03P62l88N29p2o99M89
$$ -80 -573 444 97 -719 692 239 -605 468 293 -627 415 -278 -481 281 -107 422 350 -349 140
2269A40l3m96Q11p88R6O28o33P38n5j269J295r7j205J665p70j061J575m06o42
$$ 140 107 -389 422 -366 -270 358 -275 463 408 -861 434 337 -868 797 27 -1034 541 135 -507
2288e07J085p01L9L87n89O13n53m51J236q95J7J325j312K72O52j410P81M70j304
$$ -507 578 -123 -84 303 -286 327 -226 -677 559 -336 -319 1006 -306 -34 618 -792 -11 459 -845
2307h45J464m95r14J586o05o52J074q61k28Q95o87O07n40k43J034q29L7J239j642
$$ -845 619 124 -790 796 191 -461 613 -248 -476 419 -268 339 -201 -444 590 -239 -202 1037 -605
2326f05J85J303j735P20O18j101Q24L19r77R32n80l82R37q43J39N73n53M04J40
$$ -605 -420 883 -852 -132 486 -615 209 528 -449 483 -97 -479 458 -385 -246 327 -226 178 318
2345C18o66P59o69JJ015j247J73J031j325M51J019j318L61O37q45L50Q7m46L30
$$ 318 -348 411 -258 -257 758 -489 -316 715 -610 -159 860 -458 -97 540 -305 45 132 -314 16
2364A6l11L96K55m63K85J1o96O56j18l86P32o38J4P03n80m8P58j016J53O99n58
$$ 16 -295 101 356 -107 178 189 -507 149 31 -355 377 -261 -247 456 -124 -172 586 -430 -277 422 -136
2385a36k7M12l76j48M33K6L9l54L33k89k90M57J40n52N34J06o05N99j91m49L76
$$ -136 -163 249 -127 -275 158 184 223 -131 202 -87 -377 80 220 -332 202 308 -297 302 111 -338 38
2406C8l1m05P68k82l44N33l19l40N87j41k13L17j79m5j78K13J78l14J25N06q27
$$ 38 7 -398 370 88 -256 277 -42 -382 205 64 -149 168 -11 -56 -234 -21 157 -157 -32 474 -353
2427c53L87M18r60L24M54o60N93L88r27N51k37l36N31q3l47M63k76J04K25m64
$$ -353 34 452 -508 -184 270 -390 203 591 -336 215 -22 -358 173 90 -257 206 -70 34 259 -205
2447b05L70m12K3O53n77p3P69j033K68Q21j047L84N86j017N18K15o55O01j73j81
$$ -205 165 -247 -224 429 -148 -221 548 -485 -217 604 -443 -59 527 -490 28 243 -412 189 16 -165
2467a65L84l02Q9K70p00O36k25l16Q76o11l12Q70p92K9J071j231L12N27p86L33
$$ -165 219 -83 6 276 -424 212 -13 -329 547 -64 -376 494 -298 -269 802 -429 -117 410 -376 -43
2487d3M38q15M96M2k33N08o22J95L2m12N50J67p62R84m59n73R91p38k45R90o73
$$ -43 395 -420 76 118 -115 393 -229 -34 -2 -414 136 303 -459 525 66 -507 484 -254 -499 491 -182
2508a82n4Q69q86K04K94n57K36K00j86L40l73P9J77m78N23K9o76O95j4o16Q04
$$ -182 -236 633 -253 -49 245 -312 -76 124 -62 278 -95 -16 161 -317 206 235 -441 254 240 -376 428
2529D28m82m73P36p3l46P05o11j39M11k92J17k7k1L8J52j12K99o95M14J13m97
$$ 428 -54 -527 209 136 -210 495 -116 -255 156 -136 -19 -46 -67 -29 123 11 310 -385 29 142 -355
2550c55N01K6o05N64K61p56O97k98l18L38J49m69L77j39r7K81k6L3k36L8r4O4
$$ -355 146 172 -433 131 392 -364 333 35 -283 55 204 -265 112 -27 -124 157 131 164 -72 -34 -128 -64
2572f4l8M50n47J50K44l99K08M04p20J03N04o51M85J45n58N3M71l78M24j75k06
$$ -64 -102 348 -199 -49 195 -204 4 408 -312 -209 295 -356 129 274 -284 -231 240 -138 286 111 -95
2593i5q6J6K88j31r3J79j3k11P42o98j49L15k75k3P70o16j17N76o09K73K39l80
$$ -95 -181 -165 123 -8 -101 78 65 -146 596 -102 -251 64 -211 -234 536 -80 -197 379 -230 43 282 -98
2615i8j24L98m26L83j60M3L8k39L84n0m05M49j65o36R91m48k06O56l32l76P72
$$ -98 -222 176 -250 133 -27 16 54 -185 199 149 -256 193 28 -608 383 -65 -271 385 53 -323 449
2636D49n79m1L26m21K60Q3o5L4M8k10M27m84L13p1m42M74L4m64O25o7o92R65m48
$$ 449 -130 -171 155 -266 -6 77 12 46 94 -116 311 -173 140 69 -373 101 135 -329 296 229 -463 502 54
2659E4l88M89j66m49P43l30K9J57k31K62k91J08J11k57o1N51o87M27J99n63M97
$$ 54 -334 155 -11 -460 283 -47 -18 139 -92 170 -121 -13 98 -159 -220 331 -356 71 270 -293 204
2680B04N9n47M76q1o07O78j99j75M40%l37K57j82k0j12L4K87m08K61L56n28M1
$$ 204 263 -284 192 111 -496 182 -17 -192 248 248 -89 168 -14 -34 -146 -112 175 -233 28 384 -144 -103
2702a03M94p32K21M22n31J48L01n27L83K3k63L25q3j78J63l0k90K51j45K85j61
$$ -103 391 -341 -120 302 -229 -81 220 -307 76 99 -164 161 78 -100 63 33 -257 -6 -151 134 -27
2723b7J01K68m78K4L85m94p8O84o01O1N60l70j79M22l80J7J17j13Q8r5Q8P1m4
$$ -27 74 342 -136 -112 273 -221 -299 385 -216 -155 405 35 -144 278 -102 -85 32 -81 7 -88 0 71 27
2746B7l1J71k94J80j10j88L90k95mN02l98j63N60m39k34O39l41k41M25j64n3N0
$$ 27 -4 167 -127 53 -57 -245 145 -150 -154 348 -50 -213 347 -92 -326 313 -28 -269 156 -8 -61 -11
2768a1J46q5j28J71J05l67J27J89m76L73J45l02L58r7l41M06l26k32N02k03j49
$$ -11 135 50 -78 93 198 -169 -42 147 -329 44 189 -113 245 148 -193 213 -113 -345 157 -46 -195
2789a95N35k31k76K65j50j4r4K31j7k79L11J86n37K49K75o03L59K86n08K24P0
$$ -195 340 109 -167 98 -52 -66 -160 71 54 -225 86 272 -265 -16 259 -344 15 301 -207 17 87
2810H7l19L25m4q7J72p9j43K37j74q6R1m9J67j52K15ol84K00K82n13K02L25n96
$$ 87 -232 93 49 -38 134 55 -88 149 -25 -111 -20 -69 98 -54 161 155 -229 -29 253 -260 -58 267 -329
2833c29K46M12m34J0K33k93J26Q4j6j02m7R8O9n0J06o4j93K38j74O3J70l16J15
$$ -329 -83 329 -105 -95 138 -155 -29 55 39 -63 -110 -12 57 7 113 49 -144 94 -80 -17 153 -163 -48
2856d8K97l56R0L13m98N3M10l52L0K40j98j14J46P9j21l9J51l7k52L67j21k75
$$ -48 249 -107 -17 296 -202 -149 261 -91 -61 179 -19 -133 13 92 -29 -68 83 46 -206 161 40 -235
2878b35K91m4j63L71j60k51L30k97M8L00k21j21L73k68j2J77j58l6jK47j28r8
$$ -235 56 12 -151 220 60 -191 139 -158 -110 190 -31 -152 221 -47 -59 118 -40 -76 -77 170 42 -56
2900e6J64pl93M39Lm30M66m3l42K87jk96K99r1r2K06j31J4L8j66P2K4P1Q0j58
$$ -56 108 101 -292 147 150 -280 186 143 -199 88 87 -209 90 -1 -93 113 -18 -4 34 -132 -60 -36 35 115 -43
2925d3N1L2k89L11Q6m76M51P4l94L64Mm92L04J03j88J91l1l6mj1Q1j27j07K88
$$ -43 8 40 -249 62 148 -328 123 197 -197 167 171 -321 -17 86 -102 89 58 22 18 7 88 -39 -146 142
2949A42k12J04J30l36J19J86k70K14J37m94L43J8k77J92R6k49J48J30r5l3j6O5
$$ 142 -70 34 164 -172 -53 133 -137 77 214 -280 63 81 -196 -4 92 -157 -9 121 26 -7 -23 42
2971D2k04R4K25k01l2K83l47J05K96l20K1J20k47J27K32l04Q8Q7n9J06P1k09j54
$$ 42 -162 -68 157 -44 -76 207 -140 -35 261 -59 -38 82 -165 -38 194 -110 -22 65 6 112 183 -26 -180
2994a80K5J82m2P9J05k92M8K55j79j79K75k93N2L40j31j54J27r7r4L05j04o4L6
$$ -180 -155 27 -15 64 169 -123 -75 180 1 -178 97 -196 -144 196 65 -89 38 -59 -153 152 48 -16 20
3017B0m4r4R3P4p0P1R4r9p3J35j51j70K39l3j11L33n3k58J80k8k54K06Pj60J61
$$ 20 -24 -118 -25 49 -21 50 144 45 -28 107 -44 -214 25 -8 -119 214 161 -97 83 55 -199 7 14 -146 15
3042A5R4j51P7Rr1N6J2mj53J07L6j23J34J24k66K26J21m07K07K8l02K87J27k65
$$ 15 109 -42 35 44 -47 9 21 17 -136 -29 7 -116 18 142 -124 102 223 -184 23 51 -251 36 163 -102
3066a02J94%r8O9k3m4p1LJ54j24J6J94k94J31K17l25Q8J55l94J62K25l19K44J35
$$ -102 92 92 -6 63 40 -4 -75 -72 82 -42 -26 168 -126 5 222 -103 -15 140 -254 -92 133 -186 58 193
3090A93k76J54Pj60M1k9L6Nj0J88j06j35L40l55K5K88l17mK99l43R4K97l40K13
$$ 193 -83 71 78 -82 -41 -70 -34 -29 -39 149 43 -92 248 -107 -82 206 -111 -115 184 -159 -65 232 -108 105
3114A05Jj22%N2j48O1l5J48Or1K66l25l0K01j75j03L60k84pL46k81RJ57j69j3
$$ 105 106 -16 -16 36 -112 -51 -86 62 68 -23 243 -82 -112 89 -86 -189 171 -113 -120 226 -55 -46 111 -58 -71
3139g1J66j42K7k7M7j1j1J36l1j52K55k08j30K58k03MK38j21j19L36k44k6Q6j08
$$ -71 95 -47 -20 -47 0 -11 -22 114 83 -69 186 -22 -152 106 -97 -93 145 24 -95 241 -3 -29 57 -51
3163e1q1J25P7j16M6N5m6o3K32k48o0J34n9q5K67o0j43J67q3r5P9J12k12J09K2
$$ -51 -132 -7 70 -46 0 55 9 -54 178 -70 -130 4 -55 -140 127 67 -76 91 8 -87 -8 104 -108 1 23
3188B3q2Q9J43j85m6R9p8O3J75j97j79J86o8Q9P6Qk70J55J20j31m4O2j76J0M20
$$ 23 -59 30 173 -12 -58 41 -37 26 201 4 -175 11 -57 32 108 116 -154 1 121 -10 -54 8 -168 -158 262
3213B62k43k3R3j97nK16j70QO0l1M7M9k3o2k1K5Kr2L09k62J8J80k27K7K74k03
$$ 262 19 -4 89 -108 -113 103 -67 -59 1 -30 17 66 43 -19 -40 -15 -13 -105 204 -58 -40 140 -87 -60 214 11
3239A1j60L26k78P2J64j51l9L0N0K8q0P2l5j37K29p6j99K25m5j24L21k73p4K90
$$ 11 -149 177 -101 -29 135 -16 -55 -25 25 53 -27 45 10 -127 102 26 -173 52 7 -117 204 -69 -143 147
3263A47k16M6J41k60K4K40l6n1k3o8L9n3K13o7l07M00j14j54K70j31k70L13j7
$$ 147 -69 -23 118 -142 -118 122 86 35 12 -56 -17 -70 143 76 -231 169 55 -99 171 40 -230 83 66
3286F6j68K75k29M3N3r4L5Qk4O6m6QL7j19J85j00k00K89k9k14L65k01k48L44k6
$$ 66 -102 173 -56 -13 40 -54 -19 -11 -35 31 -15 -7 30 -89 96 -4 -204 85 56 -158 207 6 -242 102 76
3311G6j15Q5k1j18J17N0%j67K0J78j52J54lk21J41Rr1J38q7j28K56p4j26J90j35
$$ 76 -39 46 25 -93 24 74 74 -93 -73 105 -47 107 104 -117 24 33 -58 80 -7 -135 121 47 -79 111 -24
3336b4o8Q6K9q8JJ53p8j49J78N0k19K17j2k84K01R7j44J16n1p8J02O9m5o0p7n
$$ -24 -92 -6 23 -65 -64 89 11 -138 40 90 -129 88 76 -208 -7 90 -54 62 11 -67 35 104 59 -1 -78 -83
3362h3Q4R8l1j29J24n6o6K28j65j86K26j3j36J93j1j74Q3R2q1q1J08Ok08J96K6
$$ -83 1 99 68 -61 63 7 -59 169 4 -182 44 31 -105 88 77 -97 -14 78 -3 -84 24 30 -178 18 44
3387D4j61J86K1j78J05kj29K05j22o4J45n3jR9m8q0K4M8Kj35J60l2k18K91K2k61
$$ 44 -117 69 90 -88 17 15 -114 91 -31 -95 50 -3 -4 95 47 -33 -9 39 41 -94 66 34 -184 107 129 -132
3413a32K70jl14J73k4j07J63Nm9K3pR0q7o8M8j60J32J55j45J40p1k23K70K0k41
$$ -132 138 137 -177 -4 -28 -135 28 33 -16 7 0 90 3 -65 -17 -177 -45 110 -35 105 34 -189 81 101 -140
3438a40K65j11k10K86m2r0P1Kj4RL4O9k39J4J76k71K11J61k48J18J01l03K06m7
$$ -140 125 14 -196 90 48 -42 29 31 17 26 60 129 -110 -96 80 -191 20 181 -67 51 152 -151 55 8
3462Hj85K21q4k9J52l6o8N1r7P7r4N8J06k51J55J23k29J97J34l59J58P6k32J67
$$ 8 -177 44 -40 -69 83 47 -21 30 -67 10 -84 -26 80 -171 -16 107 -122 75 209 -150 8 84 -148 19
3486A9L6j14Q3J4L8j0p1N6j18J0J42j31J9J50k65J58J00k09J67O1k96J33M4j61
$$ 19 55 -59 24 38 76 66 -5 51 -67 -57 85 -46 -27 123 -142 16 116 -93 74 135 -161 -28 16 -145
3510a45J51K1k4j5P3J4j06o7J25k08J21K26k07N8J11j91P7J15k53J27Rk9O3J0
$$ -145 6 27 3 -12 61 75 -31 -98 27 -181 -60 166 -41 17 128 -63 14 129 -124 3 12 -17 46 56
3534E6p3j3O5M6o6j4Q3k32J16J14j94R9J73k33Q5J00k16Q1K7q6J1N1N1K0m2N7
$$ 56 -17 -30 35 81 15 1 84 -148 -32 82 -112 -13 160 -73 12 112 -104 -23 4 -82 -71 -20 31 51 9 66
3560F6j75N6J77j65j3J02k16J60K20k73R4K6j49J35O6j80MOR2J9k3R2j96K0J75
$$ 66 -109 -53 124 -41 -54 48 -168 -8 212 -61 33 59 -90 45 111 -69 -65 -59 33 52 29 121 -75 -55 120
3585A20j96k0K04k37J10J34k25J07R3j48N6K1j23J00qJ5l5l9J42o6j6J43k34J
$$ 120 -76 -96 108 -129 -19 115 -110 -3 90 -58 -2 19 -104 -4 -12 3 -32 -71 71 5 -11 132 -102 -101
3609a01K21j88nK39k44Q5J68k45P4L9o0M8n0j7N2l9J64j17j47J95j35N5J69k84
$$ -101 120 -68 -73 166 -78 7 175 -70 4 43 -17 31 -19 -36 16 -23 141 24 -123 72 -63 -8 161 -123
3633a23n0K53j52J23J06k97P3J01mRo7n7J8L1J87q1j78J91j49j3K67k22m6K03
$$ -123 -173 80 -72 51 157 -140 -67 34 30 39 -28 -85 -67 -36 151 70 -108 83 -66 -79 188 -34 -80 123
3657A23j91K7K18k19O4M0j48P9N5j6Jq8K8K0m0K24j83j39K06j16j6K39k63n7K36
$$ 123 -68 -41 177 -42 22 62 -86 -7 48 32 33 -55 -27 -7 -47 177 -6 -145 61 -55 -71 168 -95 -152 84
3682H4j33J02J7j25kN3J7M1j21Q9K2j13K20j66q2K17j09p4J99k01mK23j80KP7
$$ 84 -49 53 70 -55 -57 -4 13 54 -67 22 44 -69 151 -15 -97 120 11 -63 136 -65 -69 154 -26 -24 53
3707E3r7N9L4l7j9q5J40j5j09J39q4j08K72j33j42K28j52k8J87j42k5J15q0O6
$$ 53 -44 15 49 12 -7 -92 48 33 -76 63 -21 -129 143 10 -132 96 -56 -84 103 -39 -64 51 -29 37
3731C7k7pJ4m9P8k5j22J71j6j35K34j90p1K45j36o0J67j44k0J46r5jl8N5L2q3
$$ 37 10 3 17 -32 46 21 -101 70 54 -81 153 -37 -108 137 1 -59 108 -36 -56 90 -5 -6 -44 11 43 -40
3757d0J04m8j71K07l6j47K03p5j22K60j40q6J75j60L4R7p1K1K9k3Qo2R0J2j49
$$ -40 64 16 -155 52 16 -131 72 -3 -125 135 -5 -91 84 -76 -42 55 -16 5 34 11 19 -43 47 59 -90
3782i0J93q8j58K60n7j66K35j43p6K13j00n0K0n7L7M8MN4j69Q2N1j39J82o8j77
$$ -90 103 15 -143 117 60 -106 129 -14 -90 123 23 -27 -7 -64 -27 21 25 79 -90 -8 43 -96 86 18 -159
3807a59J91l2j15K67j60r6K01j19nR2q1k3K6K1Q1j19J22jk25J80K8j97K10kk24
$$ -159 32 0 -115 152 -8 -104 97 -22 -27 65 -16 -39 -13 8 89 -30 92 91 -134 46 74 -123 87 85 -139
3832a39K30o0p5J61j33l6Q4p1O1Qo9L5o6Q1J08j80J32o0k31K84qk02K46n3j80
$$ -139 91 31 -44 117 -16 -52 32 -39 22 30 -39 -4 -70 11 119 -61 71 11 -220 64 56 -146 100 47 -133
3857a33K60q6p1N8r3N2NJ4R6j18k3J60k18J39Q8k16J32k6j71K49k2j95K23j19
$$ -133 127 41 -30 28 -65 -13 -8 6 102 -16 -39 121 -97 42 130 -86 46 20 -151 98 76 -119 104 -15
3881a5n4J76q4r3O%J01o1N2P3k39J28J24k36J17Q7k49K00M5j58J44m0l3R6j00
$$ -15 -69 107 23 -70 -64 -64 37 -24 28 101 -138 -10 114 -122 -5 82 -167 33 78 -80 64 24 -9 87 -13
3906a3qM3o3P1m1J0R1j01Q7N4k81J56O6k09J98M1k37J61M0j31R3l9j3PqP3j18
$$ -13 -21 22 -41 30 -11 -1 90 -11 76 130 -151 5 71 -138 60 101 -136 25 65 -66 27 -12 -25 -18 -26 47 -71
3933g1qJ61j38M0J14j76R8N1k03J15L2j14K19l2j22Q6l2k2Nj2J9p7J01J08k05
$$ -71 -79 82 -56 -16 98 -78 20 71 -132 -17 15 -99 120 88 -34 52 20 -2 3 -9 10 -67 34 142 -63
3958f3M2J27j96J00J47k84J15M7r3R0k4n8P1oMK1j29Q9n8J3J14j34Q3J03k21J04
$$ -63 -21 106 -90 10 157 -127 -12 35 -58 32 8 -50 21 15 19 40 -89 0 -58 -45 69 -65 18 121 -100 4
3984DQ8k22J78O1k16J11L3m5P5l8j4m2RJ45j26j03J61j63J16J99k57K5P4j84J64
$$ 4 92 -130 48 109 -107 4 37 -8 67 29 15 -27 -18 127 1 -102 59 -104 12 211 -46 -21 53 -131 33
4009C3M9k27J44j9k0J13m5p4J5m6J28m9n8J91k54N3J94j96M5K00k76Q3J13k00
$$ 33 82 -145 -1 -20 -40 73 28 -46 -31 -77 51 2 -56 135 -119 -66 128 -68 -23 177 -99 -16 97 -103
4033a03J49k3q8R7j4J7Q0j69O9n4l6J94j32n2J74j85L7K12l08Q7J25j82J09N0
$$ -103 46 23 -65 32 18 35 115 -54 15 -39 -75 119 -13 -65 109 -76 -39 173 -135 -48 77 -105 4 54
4057E4j66J02J1RK6q6O8pr7J82j33r6K61j55J3J50k04qK10j84Q0M9j86J56j1j6
$$ 54 -112 -10 1 10 36 -50 18 11 -86 96 -37 -133 128 -27 -14 136 -68 -76 134 -50 30 79 -107 49 38 22
4083B2Rn8K1L0q8J74j12r8K02j63j5K10j70l6J66k02R2O6q6L0j4rL6KL6m1j11
$$ 22 31 -27 -6 24 -64 110 -2 -100 102 -61 -76 134 -36 -72 94 -108 -16 50 -36 -6 -20 -29 7 9 45 4 -107
4110a07J62n9k8J45j64k8K09j67L0J24j69K5R3n8j3L2n4N0o3J08n8p6J38r1n4
$$ -107 55 -4 -32 113 -51 -79 130 -37 -7 117 -52 -27 66 8 -5 27 -27 23 -40 68 10 -66 72 -19 -73
4135g3J54j02p1J98j77K7J25j41M8N6r8M2J0J2%o8J09n4o5J88j16q7K10j58m0
$$ -73 81 -21 -92 106 -71 -44 81 -60 -12 44 -54 -12 -2 10 10 -58 51 -3 -68 120 4 -83 127 -31 -71
4160g1K04j81K0J24j22N5L5q6M9m6J2N7j08J03j8j20J76p7j16K12j43p3K45j93
$$ -71 133 -48 -28 96 -26 29 64 -22 27 -19 -7 50 -58 45 27 -93 83 6 -110 102 -41 -114 131 -62
4184f2l7J94j77N5P4q4N8j5l0O5j17J04M7j84J92m1j60K42q3j48K42j80l1K21
$$ -62 -99 95 -82 -27 47 -37 21 6 -24 41 -76 28 75 -109 83 42 -118 124 41 -107 135 -45 -76 145
4208A45j90N6N3j28Q6K0n1O1j23M2R6j88K00k6k05K40n3j69K47j30j35K56j48
$$ 145 -45 11 64 -64 22 42 -9 52 -71 -29 67 -121 79 53 -152 88 35 -134 113 -17 -152 104 -44
4231d4J7J27j43L1L6o8J05o9rQ8j67J30O5j93J95l8j85K42o8j63K21j36n3J78
$$ -44 -27 100 -43 -12 24 -44 61 -8 -17 71 -96 34 99 -94 101 63 -122 120 52 -111 110 -26 -79 99
4255I9q1rK4n6N3n1pP5j41Q9R5k14J59J5j73J97k6j69J63o1o5J62p7k8M7k4N3
$$ 99 18 9 33 -23 30 -21 -28 47 -94 -5 90 -124 35 50 -123 74 48 -121 42 -19 -84 78 1 -27 20 -4 49
4282D9l1k1L9j22J09P4j59J21J0j75J74Pj65J61o3p9J05k3j9NpK8m6M4L1j37O0
$$ 49 18 -3 36 -86 23 97 -62 59 69 -106 68 75 -90 71 8 -71 34 11 -8 -3 -10 18 -28 16 47 -90 -30
4309c0N5j33J72J3j69J47n8p5J35m5p8Q5k2K6K3m6K8q1P4Q7j67R5K6j85J70M9
$$ -30 25 -108 64 77 -92 55 -3 -78 57 12 -66 19 -3 23 46 0 28 -53 21 108 -59 36 62 -123 47 96
4335I6j78J59k2j28J32n2n7O3m7N6Lm6P2r4MJ16j95J16Q4j87J36L5k02J92j1j64
$$ 96 -82 77 55 -73 59 7 -50 13 -34 22 25 -21 51 -43 -39 77 -118 -2 82 -105 31 66 -136 56 45 -119
4361a19K05q0m6R2o7oL7l6J19p7m5J55k15N0J44j96Q9J24k19J70Kj85J54n0q1
$$ -119 86 6 -40 52 -15 -21 16 -20 99 22 -23 132 -83 -33 111 -85 4 128 -91 79 81 -104 50 0 -81
4386h1J39o9k1Q1j23J02m6l4J46j54J6J54k31Q1J35k26J46J05k07J46k2j34J19
$$ -81 58 -11 -32 49 -74 28 -18 -52 94 -60 -44 110 -121 -40 95 -131 15 120 -87 59 37 -97 22
4409B2l6K1O0q7N9J1r7J38j19l4J55j31M7R5j90N7J23k00J65J4j59Q9Ko2M7j9
$$ 22 -14 7 67 -20 39 50 -47 91 -28 -62 93 -38 9 104 -86 -29 94 -106 59 73 -86 3 5 -57 -10 -29
4435b9J5L1n9J49j39n4J34j22K4J74j68J8J06j40P2M9j11P9Kn1P1l8jj9kP2n0
$$ -29 -14 17 -42 107 -32 -86 48 -74 -50 124 -44 -26 80 -60 12 61 -50 29 31 -20 51 13 12 -7 -9 63 13
4462A3jQ0j53J0J40j42M4R8j29K3P8r9J7LRoMO0m5p0R4n6k0J23j28M2O0j09N8
$$ 13 12 92 -61 -51 89 -53 -9 89 -40 -17 61 -38 -21 -18 -9 -15 -11 49 4 -66 28 -28 -48 75 -53 -11 49 -60 -2
4491bM9j06Q7M9r4N4j8k0ooP2n5k6J44j63nJ31j37J6J34j37N2N6j32P6k0k4O8
$$ -2 47 -59 28 77 -17 37 19 -1 -7 -13 59 4 -22 122 -41 -46 85 -52 -36 98 -39 13 69 -63 13 -7 -31 37
4519C7n9J1K2p0Q0l7m5J46j15j2J52j72J3J58j99Q9R4j39Q3L7r9N5k1k4R4j37
$$ 37 -22 -11 11 -59 21 -16 -61 85 -30 -42 110 -62 -49 109 -90 -1 93 -46 37 74 -25 30 9 -15 79 -58
4545e8J15j0j36J64o6q5J90j40k9J52j59J7J39j82Q8O6j40J10l4m4O1o5M3L7j25
$$ -58 57 47 -89 75 9 -76 114 -26 -55 97 -62 -45 94 -88 0 66 -74 36 2 -42 19 -46 -3 34 -91
4570i1J63m4j39K02r7q8K05j33m3J81j67N6N5r4N5L0p3P2m6l1J01j36J21l4r8
$$ -91 72 28 -111 91 -6 -94 111 -22 -65 116 -51 5 60 -34 21 51 -22 50 4 -27 74 -62 59 25 -73
4595g3J39n0r8J77j25o6J77j22j3J21j25M0M7o6O4n3K3K7p8O7L6j07J08j9j02
$$ -73 66 16 -82 95 -30 -96 81 -41 -54 67 -58 -18 29 -37 27 -26 -3 24 -54 13 49 -58 50 31 -71
4620g1J52p2p2J33q9%R1q0jL3k2MJ6mln0O4J3j04J25o7o5J06l3o4J08p6l0P9m0
$$ -71 81 9 -63 70 -19 -19 72 -8 -9 24 2 6 22 18 15 -35 29 42 -62 63 -4 -69 37 4 -60 48 -28 -58 21 -19
4650a9J7Rj8rMM0Pp0P3k0o8J42q0n7J10m6m1J11r2k7P7l7K7k7mJ0m3P7nj16J08
$$ -19 -2 7 -11 -20 -16 24 31 -39 34 14 -54 88 8 -49 61 15 -26 85 -7 -34 43 6 33 6 2 12 -31 46 41 -75 33
4681C3k1q3J49p3q1J39j02qJ28j15MM7o3O3j3l5O2p9O7M9j24R7oj31J66k0j16
$$ 33 12 -71 78 5 -76 63 -39 -47 81 -34 -30 17 -46 17 4 -31 31 -48 19 68 -56 41 35 -96 70 50 -66
4708f6J65j05m9J58j06JN7r5M9K5m3P6j14J0J00j19R7K3j91J51J3j45J78p9r7
$$ -66 99 -6 -55 103 -3 -2 55 -40 9 34 -9 67 -47 -37 63 -56 41 64 -127 24 37 -108 70 -9 -106
4733a06J75q8k2J00j11K9N2p6R2n2l1J14j15M0Q2j60J09L8j47J44oj40J55o6p4
$$ -106 69 -19 -41 59 -52 -23 29 -47 45 -7 -38 76 -39 1 83 -77 32 70 -77 67 61 -79 76 10 -64
4758f4J36p1j1N1q0M9Qn6R3j15K9R4j20N9N1j56J07M1j34J26j1q5R5l5l4O6n4
$$ -64 72 1 -10 41 -39 10 18 -38 55 -60 -31 63 -57 2 53 -103 4 45 -89 37 26 -59 36 1 -33 33 -21
4785b1K3K1l8N6o8K8N8p6K7O5j17N9K9j10Q9J8o0M7nn5K5k0J3OoL6m9J6L2q2M2
$$ -21 2 23 -15 41 -27 1 59 -17 10 75 -42 17 46 -64 25 43 -17 30 25 -30 -5 -25 -12 -6 -12 24 -25 -9 23 -59 -17
4816a7M1p2N0K6q4O1Nn1N8j0LJ3mlm6J5M6n7M8M3j09Q3J3r4N3Oo5Q1J3m4J4l0
$$ -17 24 -48 2 28 -56 5 10 -41 17 7 10 23 19 16 -30 -15 31 -26 22 65 -44 39 52 -42 11 17 -48 33 46 2 16 -14
4848a4ml%M2m9qO4q0N3L8j14P7M1j11R4j3q6Q0j3j6O0k1rjl9P7o0KR7j14L7Q9
$$ -14 -18 -21 -21 21 -28 -36 28 -52 1 39 -75 2 43 -68 26 13 -73 7 -6 -22 38 17 8 7 -32 45 -15 -13 84 -30 7 96
4880I6j50P6M8j48J14K9j06Q0l7o4R4n6K1L9o2M6m7l8J00q9J6J10j38O0Q0j62
$$ 96 -54 22 70 -78 36 65 -41 39 2 -62 32 -24 -3 36 -26 20 -27 -65 35 -54 -38 72 -66 -6 74 -88
4906h8Q0M6j38J18K5q2Q5m7k6O1n1O3rq5J17r0j3J10j04J3J06j30O1O1j63Q2K0
$$ -88 -8 38 -100 18 43 -39 46 -1 -27 34 -17 46 37 -48 69 -21 -34 76 -28 -15 91 -39 22 83 -80 2 22
4933B2q1J01po8O5p0L0J2m6O4m0k9J02p7l5J26j17K3Q9j02L5M5p0K9J5l0O2j5
$$ 22 -59 42 35 -33 32 -38 -8 4 -42 22 -18 -47 55 -22 -57 69 -48 -25 64 -38 -3 42 -28 1 16 -14 48 33
4961C3j6J1n4O5l0l2Q3p1PO9p8pP2r4L9N2q3K2J9l0MMRrlM9o2nM6l8J4O1o8NO5
$$ 33 17 28 -26 39 9 -23 60 -11 -4 65 -13 -20 52 -42 -3 49 -34 -12 7 -23 -19 -15 -6 -15 -18 31 -31 -36 10 -28 -14 47 -21 -16 49
4996D9p5L6nj4K1J4%j4%J3k8nO4q0jQ6q1RP5j11M1M4n5J4%k7J6j0J1J6m2Q7n8
$$ 49 -26 10 5 -9 12 26 26 12 12 25 -3 -8 56 -24 -25 61 -20 -11 64 -47 -6 38 -17 -3 -3 -30 -14 -24 -13 3 -39 48 -10
5029a0m3Q2o1KR8j17J6Q4q9O7K8j06N4L5n3N2n4K5Lk7P2l3p5J06n4m7J39j22k1
$$ -10 -53 29 -32 -30 68 -49 -33 51 -38 29 57 -49 5 40 -13 39 -15 10 13 -14 58 25 -50 56 2 -45 94 -28 -49
5058d9J08j04L4O6j09N3J9p1O2pl5N7o9L9K7o9J04o6o8J30n4k6J21j36j9J31r7
$$ -49 59 -45 -11 55 -54 -1 18 -53 9 2 -33 24 -45 -6 21 -48 56 -10 -78 52 -2 -28 93 -43 -62 69 -28
5085b8O6K6j07N6J7k8O7j02J0N5n9Q0kj18J12l4o7J24j02k3J27j13%P6q4K3M1
$$ -28 38 64 -43 13 30 2 69 -33 -23 32 -27 53 51 -67 45 11 -56 68 -34 -57 70 -43 -43 33 -51 -28 13
5112A3n3L5j1lM6p7O6Jp1J03j6q6J00l3n9J09p2pP5n8QL5n3K3Ol0K6m2M7On7N8
$$ 13 -40 -5 -16 -19 27 -50 16 17 -54 49 33 -53 47 14 -45 64 -8 -15 60 2 10 45 -8 15 21 -9 17 -25 22 28 -29 29
5144B9k6o6R9k6o6Q4o4mO3k2k8J2pK9kj1%m6O1j1qM7l0l7P4k0l9N2l7mL2j0lK
$$ 29 3 -63 36 10 -56 28 -36 -40 23 1 -27 -15 -22 7 5 -6 -6 -52 9 -2 -10 37 7 -30 44 24 -15 37 0 -4 28 18 15 17
5178A7J2j6l6L6%n1O4l3m1J04n7l1P4p1oN8m3J9J3m4M7k5J6J7n2M6Mp2R9l9o4
$$ 17 29 13 -23 13 13 -38 26 -7 -48 56 -1 -32 42 -29 -35 23 -20 -1 12 -32 15 -10 6 23 -29 17 21 -51 48 9 -55
5209e5J29n1l8J03q1k2Q3p2NL7o9N1qj3N3p3K4L7r3O4J6j10J27m3p2J31o6n3J12
$$ -55 74 23 -15 88 7 -15 68 -4 1 38 -31 20 12 -1 52 -21 3 40 -53 11 27 -83 44 1 -71 60 -6 -59 53
5238E3r6j2P9o4N1ll7N4l8J5O7j20N6M0j11J12J1j18J31l5q1J38p9k9O0p3K0M9
$$ 53 -43 -55 24 -40 11 8 -29 25 -13 2 69 -51 5 45 -66 46 57 -61 70 35 -46 92 13 -16 44 -29 -9 40
5266D0m9M9l0l6N9p1L0M4j01O1M3j24J32k1j09J08k6m4Q4m4l0M9n7P3ql1N5o0
$$ 40 -9 40 10 -26 33 -38 -8 36 -65 -4 39 -85 47 26 -83 25 -1 -45 39 -5 -35 14 -43 30 22 -9 46 -14
5294a4OP0r6L4N1j17J19K4j02O2k0o6R1k6l9N6m1JJ3j6K5l2OL8p7L0M0p4M9K1
$$ -14 -8 62 -34 0 51 -66 53 77 -25 37 17 -49 42 16 -23 33 -8 -7 6 -10 15 -17 -11 27 -50 -20 20 -54 -5 16
5324A6p4P2J7n0J9j2l0M6J0KjoJ8n4M9J1o1N5Ko1N7J5n3O1k4k7J8J2j4k6j3K4
$$ 16 -58 14 31 -19 0 -12 -42 4 14 16 15 9 27 -27 22 33 -28 27 29 -32 25 40 -13 48 24 -3 15 27 13 -13 -26 -2
5356bj9M5M0j02L7No0N7K0q6P2Nk8N7m9l2L3oM1qk6L3m1QO1p7L3O1j20P7J5r9
$$ -2 -21 24 64 -38 -1 4 -56 1 21 -65 7 12 -16 41 -8 -40 -7 -13 28 20 -6 27 -14 -6 55 -22 11 72 -48 29 44 -55
5388e5Q4Kp5Q7k6k6O1p4Okk6Q5m8k6Q5r1L0P7j40N2O2j12J00J2j24J07jn3Q0n1
$$ -55 29 31 -44 43 17 -9 52 -22 -16 -18 -44 41 -7 -33 52 -39 -9 68 -72 -20 42 -70 30 42 -82 25 24 -29 51 0
5418@k5N6n8O4k1l5P6o7mJ00j16PJ06j36O7N4j15P4J0r5P4k3k4O4o0J0Nm0P8l6
$$ 0 -25 31 -27 37 16 -19 57 -10 -14 86 -30 -23 83 -53 14 68 -47 27 37 -58 16 -7 -31 33 -27 -17 -12 -52 26 -10
5448a0m5J05q5J3R1j25J0Q8r8P7L5j00O6J1l5K9k0j5L9m0N2k8n5Q2l0m2Q8q2J
$$ -10 -55 50 -35 -22 69 -56 -46 42 -56 21 56 -44 22 33 -2 27 7 -8 31 -9 43 15 -40 42 12 -30 58 -24 -23
5477b3R0q7J1L4p0L0N6o2K1j9QRl3N4m8pO2l1l0P5p1lO0m4J2M8n1kK4k8L4KJ5
$$ -23 67 -20 -9 25 -45 -15 41 -21 0 -19 -11 -2 -35 19 -29 -36 26 -5 -35 40 -31 -34 26 -18 -6 42 -9 -11 13 -15 19 21 36
5510C6n0J2L1j1qK9o1kO5m9J7K5p6K2M6k7Ql4J2j0K0K5l2l0O5l7JO5j00L5M5o0
$$ 36 -14 -2 29 18 10 39 -22 -24 41 -8 9 34 -42 -20 26 -1 7 -27 -15 -25 -5 20 -12 -42 23 -14 -13 52 -48 -13 32 -28
5542b8K6M6o4M6ll8M1j9K0lm7M9k3j2Q4q9k4J05q4KQ4r7kP0r3O6kl7L1k5j1L6
$$ -28 -2 44 -20 26 23 -15 26 7 27 24 -23 26 3 -9 75 -14 -38 67 -17 -15 69 -28 -30 40 -53 13 11 -26 5 -20 -31 5
5574En1N4%o1Q8l5m8R7p7k8J16j01K0Q7r2K0O1p5N7j2k3L0o0M8K6p9P3rr2J34
$$ 5 -46 8 8 -53 35 0 -48 49 -28 -56 60 -41 -21 66 -26 -6 55 -20 37 25 2 32 -28 20 46 -33 40 31 -61 73
5604G3o6p7J21r0j8J12r0J5O5j04N2J3m7M1j4lM3n5M2J7r2J04j4q8J28o1n8J07
$$ 73 7 -70 51 -39 -57 55 -35 -20 45 -59 -7 6 -41 0 -14 -17 26 -29 13 30 -62 42 28 -60 68 7 -51 56
5632E6o3k3R6o3LN2o5L3j2k8M0m8L5K4n5M3j3p4J03m0o4R9p1k1R5m5k6M2l9PJ2
$$ 56 -7 -30 66 3 6 58 -7 26 14 -14 26 -22 13 37 -18 25 12 -62 41 1 -63 36 -35 -56 39 -6 -32 10 -29 -22 -10
5663a0LMk9L1K7m7M2jn3O3j8m6O8k1k1M7k0l2M0j3j5Rj4j3j0N7j7m0M8j2l6P7
$$ -10 -7 -3 -32 -1 26 -21 21 20 -33 30 12 -34 34 13 -8 39 19 -13 27 14 -1 8 -6 -19 -29 28 11 -29 19 7 -29 48
5695D8n1m9N8l6OL9j6Nk2K0lqJ3On7P0qm8J11o8m3P4l8j4Q1q7LL2j0N4l4k0Nl7
$$ 48 -3 -52 6 -30 -24 15 -1 4 -18 2 -1 -9 4 10 -47 23 15 -33 78 10 -33 41 3 -11 70 -17 -14 18 8 62 28 8 13 -24
5729b4L4M3r1M4mp0J14k3p6P7m7k8J04q3j1M2m4M3J8k9M4l6j7N3r4O2M6r4P4K8
$$ -24 10 53 -38 6 2 -68 46 23 -53 24 -23 -51 53 -30 -41 1 -43 0 18 -11 33 -3 -20 33 -61 1 47 -47 27 55
5759E5j17J23k4r1J14o0j0O4o6J2L0m4N5l7k6O0o8J1O2j10P1L8r9J05j5j10R2
$$ 55 -62 61 37 -54 60 0 -10 54 -12 0 30 -14 41 4 -22 38 -30 -19 43 -67 4 42 -57 48 33 -77 15
5786A5j4p7J12n9rP6l7Rj0m6O9l5oP7j00K0P9r5N5N0j17P3Qp6O9k7m2P2l2JK8
$$ 15 1 -76 36 -23 -32 44 7 16 6 -40 29 -6 -12 65 -35 -15 64 -31 24 74 -43 30 38 -38 31 4 -38 34 2 3 31
5817C1m4L2m3j1N3n7J1P5r3K5O8r0M3J9p3L8L2m1L6mj7K1NJ4l3lK8l2J8M2o5K0
$$ 31 -13 19 -24 -35 18 -39 -28 47 -46 -21 47 -43 0 19 -54 -16 16 -25 11 7 -10 11 16 30 -3 -6 22 -10 8 50 -15 5
5849EN3o2PK1n5L8L1m5J7jj4j5K2Ol8K8K4o2K7K3n1K6K8n0M2Mqj2noJ1J9L0k6
$$ 5 58 -4 3 24 -31 7 38 -7 10 9 -5 -20 2 8 -30 -2 22 -40 -13 10 -41 -15 13 -37 5 9 1 -11 -16 -22 -11 8 38 12
5883A2j9M8n7L7K5q4M6L8n4M8Jq1N0%k0L9k0rmj2K9k8pO7q9K7O6r7L2M6q8N0L9
$$ 12 -7 41 -16 21 46 -38 8 46 -8 40 41 -40 10 10 -10 29 9 0 -4 -16 13 -15 -22 45 -44 -17 49 -48 -16 30 -58 -8 31
5916C1p1O1ln1N7l9J5L6m0L1j1l8P9n3j5Q7j05J7Q3r6L1O0r5M5K1p8O4k0k6L9
$$ 31 -40 21 18 -33 24 -15 0 36 -4 27 16 -22 57 4 -11 76 -29 -12 71 -25 6 66 -29 16 37 -41 23 3 -23 16
5946A6l8J9L0o5N6l0l7R6p0j5R1q1%J00j18L8L9p8O6J5m6M4l1kL4m5N0lo0O4j7
$$ 16 -22 -3 27 -38 18 -12 -49 47 -23 -38 53 -28 -28 72 -46 -8 31 -47 19 34 -12 32 1 -1 33 -12 38 35 -25 39 22
5977B2n1R4p4j8Q7p3mP7r0QM3o7N5mj2Rk1J6J0m6N4k0l5P5l0l6Q4n2m3P8n5K0
$$ 22 -29 65 -9 -27 60 -13 -17 60 -30 -22 21 -46 9 5 -7 2 -19 -3 7 -39 15 -5 -40 35 5 -31 53 1 -42 36 -19 1
6009AL1k5OJ9opmNrk3M4k8j4L7k0k6O5n2j7N2l4k9L5j3oJ9%j6j2N0m4nK8j9k0
$$ 1 32 7 13 32 26 19 15 20 11 -12 32 4 -10 27 7 -19 46 -6 -23 29 -5 -34 1 -12 -18 1 1 -15 -27 23 -21 -26 2 -17 -37
6044c7N4j9j7M7l0J9Qj1k2K2NrOJ4j9k0P1n5k4O7p7nQ9o9J4L9o9L1Qk5J6k6MK8
$$ -37 17 -2 -19 28 -2 17 25 14 -8 14 19 10 16 30 11 -9 62 7 -17 50 -27 -32 57 -12 2 41 -28 3 11 -14 2 -24 -20 8
6078Hl5L8%n7O5pn3Q0m6l5Q7p0LR3p7mL9n8M9mm0L7j5J7M6p6M5Oq7J09m4o7R0
$$ 8 -27 11 11 -46 19 12 -41 39 -7 -42 45 -25 -22 71 -6 -10 29 -29 20 16 -24 13 -2 15 61 -15 30 36 -51 58 14 -53 37
6111C7l7n9J19o8j5P0r3M9pm0M4j3k2N9n2L7L2q7O7%q3R1oq1J24m7m2R0n3j8M1
$$ 37 0 -59 60 -8 -23 47 -46 3 -4 -44 0 -13 -35 24 -28 9 41 -46 21 21 -62 29 23 -58 66 19 -23 67 14 -4 37
6142C7m5J2K0m3N4l3J9K9q6L8K5o9O3Pj06R0Mn4Q1l9o4P1k4%Kj8J2NJ7L5n4NM2
$$ 37 -8 4 24 -19 35 2 21 50 -36 2 27 -42 21 28 -78 12 16 -38 43 4 -60 11 -13 -13 -11 -29 -17 -12 5 40 -14 -9 33
6175C3p3N6J8p4M6K9m5N4Lo5M0Jk2J2kj2MLJ2l2L2om2K7J8o2M5J2n2M2J5l3nK3
$$ 33 -40 16 34 -40 6 35 -10 44 47 -18 22 23 1 13 11 -1 3 6 18 -14 18 12 -30 -3 15 -47 -2 10 -42 0 15 -18 -23 0
6209@k3lK7%l4M8pk6M4j2l5L8Ll4M7k5nJ7NJj0%Ok8J3J8p7O9J0o8P1po5M9j0m3
$$ 0 -23 -26 1 1 -33 15 8 -18 26 14 -21 17 20 -14 33 8 3 20 25 26 16 16 22 -6 7 25 -52 17 27 -41 30 23 -42 7 -3 -46
6245d6O2k2k4L6j2jjj5L6k7jL9o2M5K4p5O1L2r4Q1Oq0O3rm3P1l3lK1l8L6k4k3
$$ -46 16 -6 -30 6 -6 -7 -8 -23 13 -14 -15 24 -38 7 31 -44 17 49 -45 36 42 -38 25 16 -27 44 11 8 29 -9 27 3 -20
6278b0N8o0pQ3r8M0N2j04M6N0j12Q9Lo9P1l3l2O2k6PL0n7N6m0j7Q7q0J0Q4r6K4
$$ -20 38 -22 -29 54 -44 -4 48 -56 -10 40 -72 17 20 -49 22 -11 -43 19 -7 0 30 -27 29 -11 -28 59 -21 -11 73 -23 1
6309AP7j24N2M5q3N6J4o0N7l3j8L9m3K7Ml8N4n1j2O1o8J2P0p7J0O9r3L9L5n5M1
$$ 1 78 -46 6 51 -32 24 38 -22 35 2 -16 23 -20 7 11 -27 27 -24 -36 25 -43 -31 39 -38 -28 41 -52 -13 22 -33 8
6340HK1m9L2j2MJ2j5L9k6j2M0m1j2O7m7rN5o6J1M0m7kL4l4OLNk4JK7k6RL3m2k5
$$ 8 29 -20 12 0 4 16 1 40 14 2 42 1 -11 56 9 0 55 -11 0 40 -7 -9 25 -9 -3 0 5 -19 -18 9 -17 -8 25 -17 -42
6375d2N9m0JL4j3j3M1l2oJ6Lj3J9K7l9K1J7m4OL0n6K7L4m7K3Rj9j0K0krj0K6m0
$$ -42 17 -23 -22 12 -1 -14 27 -5 -11 5 8 -5 14 41 2 23 40 -4 2 32 -24 3 37 -10 13 22 3 -7 13 11 2 -8 18 -22
6409b2jM5m9PM3n0J8N6p5J3L4o0L1K2l1K3%MJ5l1J0%l0P4k8l2Q5p4j9Q8q7J1O8
$$ -22 -23 22 -27 -20 23 -27 -9 47 -28 -15 19 -41 -10 12 -19 4 4 8 23 -8 2 2 -28 46 18 -14 71 -3 -22 66 -21 -10 58
6442E8r9M1M0n1K6jl0K8k7RK2q0P6j4m3P5l7m1R9p4k3J03q2mO8o8L0M2n1K5jp
$$ 58 -41 0 40 -11 15 14 -16 12 -15 -6 16 -64 12 -2 -45 30 -7 -48 51 -23 -46 57 -25 -29 39 -29 1 43 -8 17 16 9
6474IK4m9K6J2n4Q5k4o4Q7m5m7R8n9k5Q2p7KM8m1PLl9L5oLK3p0O2Nm8O5j8o8Q6
$$ 9 33 -16 10 22 -32 53 29 -35 52 7 -40 58 -1 -26 56 -21 -19 29 -12 -5 -2 -41 -6 -12 -9 14 -56 6 11 -37 28 10 -58 28
6508B8k2m7P4l6k6O0j4j2L3l1J6nLmk8L1rl0M4J4n9M4k3l3L5Lm6M7%k8L2lk0r
$$ 28 6 -41 33 -3 -29 31 17 5 38 7 23 18 21 17 -11 20 11 -19 25 39 -20 24 1 -32 3 6 -40 7 7 -21 11 8 -12 -21
6542b1J6%rJ8j7k1M9mk5L2j1k2K6Pm2L6P%J5J2m0qL3k4j7L0j7k6O3k8k0K6k2l9
$$ -21 -5 -5 -14 4 -13 -34 15 11 -14 18 7 -15 11 18 -24 12 19 19 34 46 6 -2 31 7 -10 20 3 -23 40 12 -8 18 -4 -43
6576d3M9j8PmMLk4M0rn2N4j7k6O4l3l7O4l7mO6m1j5K9l1J2J5nMk8K8K7n5M7mn9
$$ -43 6 -12 -5 -9 -5 -2 -26 14 5 -47 7 -10 -36 28 -5 -42 22 -15 -19 47 6 -9 20 -11 1 16 11 15 -13 15 42 -13 34 30 -29
6611b9O7k4o6P4jo7R4m9l0M6l1qK2k6J7Oj8M9m8J5L2p4M7L0q6P5J1q1J01k8o1
$$ -29 38 14 -52 22 21 -46 48 -1 -31 15 -16 -24 -2 -28 -11 -5 -23 26 -22 -7 25 -49 -2 28 -58 17 28 -53 48 20 -41
6642d1P8k7j7M8m8ORj6M2k4jK9n9K5M1q0K8L5o4O3Pp7O6k2m5M4pk4L1j7J1Kj9
$$ -41 37 10 -7 41 -7 -1 8 -8 34 10 9 38 -21 4 45 -35 -7 28 -36 27 34 -43 23 1 -44 0 -7 -31 0 -17 -6 -4 -23
6675b3M6m7K1L0m3KN5p9L9L6p2N2K3m7K2J0l6K6oj7K2j5J7j9MJ4l5J2M4o0J5L1
$$ -23 23 -24 -3 27 -16 -14 41 -38 1 37 -35 17 40 -7 15 25 -11 15 9 -8 14 -1 16 -3 1 15 -20 -8 36 -24 -9 22
6707B2n7K4L5n7J1M0m3J8J6j3j3K4Kj5J1K9m3MK1k6J4L0k9lK6k4oK0kl5K8J0k0
$$ 22 -35 -11 24 -33 -22 18 -25 -7 9 -4 -17 7 9 -6 5 34 -9 -5 16 -10 4 34 5 2 28 4 -2 18 16 -19 9 19 -1
6740aJ4Lm5K4K4o3M7Nm3L1J8l9J3LJj8LK2k9K3J9l8K2K3m0M6J0o8L9J9l3L8Jm5
$$ -1 13 16 -29 -5 19 -44 3 8 -35 -4 14 -25 -12 -9 -8 -26 -23 -1 -30 -7 12 -26 -4 19 -21 25 35 -33 6 25 -8 30 31 -14
6774a4K3JMJ9l1Qj3QL6o0KL4m5J6N1q4L0M3q4N9K4n6L7lm0L4mKJ4m0M9j9j0N2
$$ -14 9 10 14 33 2 10 -3 5 41 -19 -17 17 -28 -12 39 -45 -15 28 -56 3 27 -29 8 5 -35 -1 -5 -3 11 -29 20 1 -9 43
6808D3n9j7O9n6K3N8q3K6L3n3L2J1n6L8Nj4J8l3J7Kl3N5k8l6O4l9k2P3p2RO7p2
$$ 43 -16 -33 36 -20 3 61 -22 4 37 -16 16 27 -29 9 14 0 18 -15 2 4 -29 26 -2 -38 26 -13 -35 38 -34 -25 42 -30
6840c0J3K4m0J8L5l7J1MJ3J8k3J3j4j2M6k5l7O6l9k4P1n2j8N5l0k1L1k8PK4j4
$$ -30 -17 7 -33 -15 20 -17 -6 -2 11 29 6 19 5 -7 39 14 -23 43 4 -20 51 -1 -19 36 6 -15 16 -12 -5 19 5
6871Erj4K3ok1K2j9j5N0j5l4L8j8j5N3j4l7K5J6l3L8j1j6QK0j0JJ4k8MJ5oj8K9
$$ 5 -4 -18 5 -1 -22 0 -19 -34 16 1 -33 5 -13 -28 25 11 -26 -1 15 -18 20 9 -7 1 21 11 12 26 -2 2 17 11 -7 22
6905B2j0j0QQl7K9mk6PK2k0mM0n9OL9k9jL1m3J3K6Jj3oJNNK3k7j6M6k4PM5n1j7
$$ 22 12 2 10 18 -19 10 6 -20 -13 9 -11 -15 25 -34 -28 11 -18 -19 12 -31 -18 8 9 -4 -10 -9 -4 1 24 -3 -19 27 3 10 55 4 -13
6942a3N3l7qM7n6J2K4k4MK0k1Lj7J7j2j8L8k5k6N8rm9P2o2j1N7k9j2M6l6PJ8j1
$$ -13 40 3 -5 42 -14 -2 22 -2 2 22 1 4 -13 4 -8 -26 12 -13 -39 19 10 -39 33 -29 -40 17 -12 -24 22 -14 -7 11 0
6975@J1j2OkqK9Kn1N3qm1N4qn5P0k6m8O0k9qM0l9j1K0j1J8k8MK0k9L2J2m6K3K3
$$ 0 11 -1 5 3 -5 24 26 -25 28 20 -21 33 25 -30 40 14 -34 26 -3 -11 29 -10 -21 -1 -12 6 -22 -18 2 -27 5 17 -29 -6 17
7010A7p8Q7j1n7O7k6j8N2rj4J3j0k%R%k2J2J9l7K6Nn3M5%l8M2nm6L2Nl1K2Rj5
$$ 17 -61 26 15 -42 25 -1 -19 33 24 10 23 13 11 11 20 20 -2 10 29 -8 18 23 -30 15 15 -23 19 14 -32 0 5 -26 -4 5 -10
7045a0pMj1KJ7Kk6K9K0l9J5J3m0K5L3l6J6K7l6KK7k3kK1%k8K6j9pJ8pj5kK3l6
$$ -10 -17 -13 -24 -22 -5 -3 -29 0 20 -19 -4 9 -31 -6 27 -9 7 34 -2 0 27 4 2 23 23 -5 21 2 -5 13 6 -9 -11 12 -24
7080b4K3qonK4j2j7L4k2j4L5j4l3N4j9k4M8j5k2K5Mj2J8j2j3J5jRj6J8J2l6K7
$$ -24 -1 -9 -15 -20 4 -8 -25 9 -13 -27 8 -6 -39 15 -4 -28 20 5 -17 8 12 0 18 6 -7 8 7 16 0 18 30 -6 21
7113B1Rm3L9nm5M7pm2M7j5l9K9kj3J5j3Jk0K3K5l5LK4l9L6K9p1L7J3l4O0ln7L5
$$ 21 30 -13 26 21 -24 23 16 -26 21 6 -33 -4 -6 -19 -4 -17 -16 -36 -13 12 -23 -20 4 -35 1 30 -41 -4 9 -25 35 32 -25 10
7147A0%j5L9j7j0mLJ6j6rM1n7K1L6n9K1L0o7K6K4l3L4km0J9JjJ9k9J3j0%K9k5
$$ 10 10 -5 34 17 7 3 6 22 6 -3 38 -19 2 38 -21 0 30 -37 -11 13 -20 14 12 -28 -9 -8 -9 10 -19 -6 -16 -16 13 -12
7181a2j2M4m7J4O3o5K4K6m9J6L1n2K8L3m7J9j4RQLj4j6j6M9k2pL7m7qM9l0%K6
$$ -12 -24 20 -27 -13 50 -15 9 35 -14 2 33 -19 9 42 -5 14 0 9 17 20 6 -10 -26 23 1 -6 31 -16 -24 25 -5 -5 21
7214B1n5J7M2l8KJ0j1qJ3J2j7J2Pk5J8K9j9j7K2k2NL8k7rJ3j4RK6j8k3kK3j5J6
$$ 21 -34 -17 25 -13 -11 -1 -12 -20 -7 5 -12 0 7 -18 0 29 10 -7 15 -7 -2 36 9 0 13 -1 8 34 16 -7 -9 14 -1 15
7248A5pl4J7J1qjOj8pK7Ql4J5Pj5J7K1m8K5L4n9M2J1l1MK9l7J2PpJ8KnpNJ6l2
$$ 15 8 -26 -9 2 -6 -7 -1 -19 -26 1 9 -25 -10 -3 -18 -1 20 -28 -3 31 -28 14 25 -6 -2 27 -10 2 9 2 20 22 17 10 15 31 -1
7285aJK7l6QK6m6OL9n4K0K9n0J2J9j6NOj2J0%J1j6j1K9j8j1M0k1j0N0n1J2L2l7
$$ -1 0 27 -9 -1 25 -21 -15 24 -30 -10 19 -31 -19 0 -16 -11 -5 -17 -7 -7 4 -12 -23 6 -12 -23 17 -4 -14 36 -15 -3 29 -8
7319hJ1L3n3J6K2k3J2mNj1MJ5j4l5L9k2rM1k4k7M8l6j0L9m2ML8k3RPj9J5%J3n
$$ -8 3 36 -17 -1 21 -2 10 6 11 0 4 19 5 -30 9 -13 -22 19 -5 -32 16 -20 -30 9 -33 -29 9 -14 -5 2 -17 -2 -2 11 6
7354Fj1J9Nl5M3j5l5N2rl6M5k2k9O1l9qJ1Pj3J4qj5oJ9Lk3J7ok9L6Rl2L5j2k2
$$ 6 -5 14 19 -16 27 12 -23 29 20 -16 29 7 -22 39 0 -8 3 10 -3 11 3 -12 -18 1 4 -19 -2 -8 -37 -1 8 -24 11 -1 -23
7389b3K6Ol8M2Km0K6MlMJ8k9JJ8J1k2J4Pk6K0oj1qJ7l7L2Jk7K1qj6qL4k5lK0j3
$$ -23 3 9 -29 13 15 -25 1 5 2 6 24 -5 -4 14 25 3 17 24 -2 18 12 1 -7 10 -27 5 6 -21 0 -8 -24 -32 2 -23 -26 -6 -19
7426a9qL1j4kLJ4k2QK4j8j3K1rjL5j9k1L8l0%L9j4l4K9k2jK2j1qmROj9J9j4k1
$$ -19 -27 4 -10 -12 -9 5 -17 -9 15 -3 -16 5 -4 -5 30 11 -10 28 -2 -2 37 23 -11 18 -4 -5 17 6 -2 -6 3 9 -10 9 -5 -26
7462b6N0k8l4M0k9j2N7j7k2J1qj1L4j0ONmpQk%lJ9Pl6K8Rl3L8mn5N8j3l1K6pj2
$$ -26 24 -4 -38 2 -27 -39 18 1 -21 -10 -18 -29 5 -5 1 6 2 -5 3 1 1 -2 17 24 -12 16 25 -8 30 26 -29 29 16 -15 11 4 -8
7499hK1qj8PNJ0k7J6mj4J8K0m9K9J1m4M6rl5L6Ql2K2kj3K6Pjk6K1Pj8J7J4m4K0
$$ -8 13 5 -13 -6 -1 9 -18 -2 -6 -20 -2 18 -31 -2 9 -35 11 2 -33 3 11 -21 1 -1 -14 12 19 18 -8 13 20 2 19 33 -11 9
7535IK1m9K2J4m5L2J5m2J6J6l0K0Ll2J3kNjlJ7j5J1Mj8jM4l6J1Ok3J0M3k9JPj8
$$ 9 30 -19 3 17 -28 4 19 -23 -7 9 -21 -1 2 -30 -17 -19 -14 -15 -18 -1 -16 -5 -1 -19 -20 24 -12 -1 5 -18 -8 35 6 7 14 -4
7571dKL0mk1J1oNqJ2l2KK8j9JRj8lJ3j4KK0k5j0K0%mJ0j0k1K9J5k5J5Kk5J3K1
$$ -4 -2 28 24 3 14 8 13 5 17 -15 -13 15 -4 -3 6 -12 -15 -2 -16 -14 6 -19 -29 -9 -9 -13 -3 -13 -34 -5 10 -15 0 2 -23 -10 11
7608A1Lk8J8onK6Ok5J0%nJ3jl8K5Pk4K3Jk2Mj%Jj2Qj6K6mk3J4J4k5K6J6m3K2J6
$$ 11 14 -14 4 -2 -7 19 25 0 10 10 5 18 17 -21 4 11 -13 10 11 -11 -7 -8 -8 -7 -19 -11 -27 -1 -5 -28 -14 0 -25 1 17 -26 -4 12
7646A2l1J9J3l3K9NqnOj8J0J5Lk8J2J9k8J9K0m0J3J8l5J3J3m4K6Oj4QNqj1JJ9
$$ 12 -19 0 13 -20 9 14 6 1 7 -11 -1 14 17 -11 1 20 -8 11 31 -9 4 22 -13 0 13 -31 -5 1 -13 -5 0 -8 -19 -18 1
7681AmjNj3rL0k4RK8k8J2J7j6j2K7k8RJ4KoQrKnQok0K3k6JL4k7qJ8j0j1L2k7J
$$ 1 -3 -4 1 -12 -21 9 -15 -6 22 -6 6 23 7 -5 22 -6 3 17 19 13 21 12 14 9 17 11 -9 14 -12 -11 23 -4 -12 6 -4 -15 17 -10 -9
7720iJ8k4%J2lpjK3jjLj6j4L8j0rL2j8rJ8jl3L4lk6K5Rl0J6kj9MNjrJ8j5rJ1o
$$ -9 9 -15 -15 -3 -6 -13 -14 9 8 7 10 -6 -20 18 8 -1 31 13 4 22 21 -12 22 19 -7 18 27 -3 13 11 -8 -4 1 0 -9 9 -6 -15 -4 -10
7760a0jJ6Kk1J2jk6K8J2k5J6J0j7LJ5j4qK2mjLKlQNj8KJ2k2J1Pk4MK4k8J0J2l6
$$ -10 -11 5 7 -14 -2 -3 -29 -1 11 -14 2 12 -5 -2 13 -1 -9 13 9 8 11 13 10 18 23 5 7 19 -3 8 15 -9 -5 19 -9 1 13 -23
7798b3PJ1kmK0k0j%Rj6lK9j5LK1j9rJ9rKK5j7j1K3j9NJ5j4LJopJ1Mj7j5K9j2j1
$$ -23 -16 -5 -7 -11 9 -11 -12 -12 -3 -19 -22 7 -8 -5 16 -3 -12 7 -2 0 25 8 -3 20 1 6 21 7 10 11 5 -2 9 13 -4 -19 10 -2 -13
7837a3K2j7mJ6j2k0K9j5qJ8j4rL0k2MJ3Kj1oJ9%k2L0Pj8L3j7k1L0j0k2L4j1k3
$$ -13 9 -8 -12 4 -8 -28 1 -14 -22 -4 -18 -27 3 -19 -15 -2 0 -11 -17 2 2 -20 10 17 -1 32 15 -6 24 14 -8 26 15 -8
7871hL2j0k1K3nk0RPrnRlk7K9kk2J3Lk8L2Ok1J9Rk6J0Nj4J3Lj8J1K2j7JJ2jj9
$$ -8 24 14 -7 16 11 -9 0 7 -2 -7 2 -1 -28 1 -1 -23 -10 -7 -35 -3 3 -18 1 10 -16 -6 -1 -15 -2 1 -17 -6 16 -1 0 12 11 -8
7909hJ3J1j8J1J1k9QJ9k6J2J6l1kK2k8pK1lpJ8oj9J2kj1PJ1k1K3J6k5J2K0j7j2
$$ -8 5 16 -2 9 20 -9 -1 18 -8 4 20 -11 -13 9 -19 -26 -5 -8 -15 3 -3 -22 -10 -12 -23 -16 -5 -26 -3 13 -12 0 20 3 -9
7944iL2k1KK4j5jJ3lk3J3Nk2J7lmj4K0qrK0j9j2J9jk8L4k0j8K1OqJ2nk7K6jRo
$$ -9 23 2 4 28 13 12 25 22 -1 12 17 -5 12 9 5 -9 11 3 -6 14 -5 -17 2 1 -27 7 -13 -31 -10 -4 -12 0 -5 -32 -6 -7 2 -4
7982dJ6j7JJ3Nk1J8kj5K5pj9L3oj8J7mj7QjrJJpRmOj2RKk3J6J0l1K6Ml2K9J0l1
$$ -4 12 -5 -4 9 14 -7 11 9 -6 19 12 -7 26 20 2 19 15 -2 6 5 -4 -3 -2 -9 0 -4 2 -10 -1 1 -22 -6 4 -27 -1 3 -29 0 10 -21
8022b1J6J1j7K1jkj1J4oKNmj2L0mj5J0Kk5J4K3l7J1Nj6J4Rk1JJ0j1oJ0Mk4J5N
$$ -21 -5 6 -11 10 9 7 -4 10 4 6 11 7 -5 25 21 6 16 18 -7 7 30 -7 4 9 -7 7 16 -5 -4 6 -5 -11 -1 3 -21 -6 -1
8059anmJ5j7RJ8j7LJ9k1QK3l0J3NplJ5lnQrkmJ0j7Rjj7MK3k0j2K6rj5J0j4JJ6
$$ -1 -6 -10 5 -12 -3 15 -2 1 20 -1 7 30 0 13 18 11 8 23 20 15 23 14 12 8 18 1 10 9 -8 -4 19 -1 -13 13 4 -11 -1 -15 -14 2
8099Bj2j0J2Mj1J5jmNJ9k4lK5pk0K4%j6K4qj9J8Qk2J7pj7J7J3k0jJ0k3lJ4lkK
$$ 2 -10 -20 -8 -4 -15 0 -1 -5 0 19 -5 -8 17 10 -10 14 14 -2 22 14 -5 13 21 -1 16 9 -8 9 22 2 1 11 -12 -15 -1 -4 -6 -4
8137d%k0K1Lj9KJ2k1K0J3l4K7J6j5lK%OOkj1K0qmPJ1k6LJ7l1K1kj6PJ6k5%J7k3
$$ -4 -4 -24 -3 0 -19 -17 -5 -26 -6 7 -27 0 16 1 -2 0 0 6 12 10 -1 19 11 7 14 25 -1 2 19 -12 9 7 -9 -2 14 -11 -11 6 -17
8176a7J3J2k1RJ3j8k1K3Qj2j2J5j0j1M3
$$ -17 -4 8 -13 -4 9 -9 -30 -7 1 -11 -23 -8 -18 -29 14
8191A4
$$ Imaginary data points
##PAGE= N=2
##DATA TABLE= (X++(I..I)), XYDATA
0@%%%%%%%%%%%%%Nj3J6j6J6j6J6k4L2l2L6m4M8n2O0o8P5q3Q9r7J09j17J27j39
$$ 0 0 0 0 0 0 0 0 0 0 0 0 0 0 5 -8 8 -8 8 -8 8 -16 16 -16 20 -24 24 -28 32 -36 39 -44 45 -52 57 -60 67 -72
37g2J50j62J74j86J99k15K31k46K63k82L02l25L52l81M13m51M97n52O17o96P98
$$ -72 78 -84 90 -96 103 -112 119 -127 136 -146 156 -169 183 -198 215 -236 261 -291 326 -370 428
58D28r28J094j314J609k015K596l458M808p091J1476k2155Q0440J23386k82843
$$ 428 -500 594 -720 889 -1126 1470 -1988 2820 -4271 7205 -14950 65490 188876 -93967
72i3967K18628p0406j16102P2092K1737j43851J66064j17431L570J86327k13453
$$ -93967 124661 54255 -61847 10245 31982 -111869 54195 -63236 -59666 126661 -86792
83h6792J18258L5932j60923J43731J858j20395J57948j26263j0035R1695j02564
$$ -86792 31466 67398 -93525 50206 52064 -68331 89617 -36646 -46681 45014 -57550
94e7550K683J65805j95327J09177N6200j67398J30287k9173m8840N3214j4444
$$ -57550 -54867 110938 -84389 24788 80988 -86410 43877 14704 -34136 19078 4634
105D634m0699J08370j33958P7217J094r2396R9231J2566q5646R5592k3487p1263
$$ 4634 -36065 72305 -61653 15564 16658 -75738 23493 36059 -49587 46005 22518 -48745
117d8745J28494j20973M9651K237m9179K5240L4751p8147O4572K1296m9005P8769
$$ -48745 79749 -41224 8427 10664 -38515 -13275 21476 -56671 7901 29197 -19808 58961
129E8961m8096k509o08l4734J7228m005m1530P5481j8435K719K7462m967n7114
$$ 58961 10865 8356 7748 -26986 -9758 -13763 -55293 20188 1753 4472 31934 26967 -30147
142c0147N2062j9772j6127K8776l7658K9797l3674L7098k8749K5149j3910K1928
$$ -30147 21915 2143 -13984 14792 -22866 6931 -26743 10355 -18394 6755 -7155 14773
154A4773N934r238j759j5105M861k8337K7895q242N375J0011N277j0782M060k1929
$$ 14773 20707 11469 9710 -5395 -534 -28871 -976 -9218 -3843 6168 11445 663 4723 -17206
168a7206L6355k6790J808L4158l6288l545L7463m1511j5269N2937n9469M7925
$$ -17206 19149 -7641 -5833 28325 -7963 -11508 25955 -15556 -30825 22112 -37357 10568
180A0568Q085k7789K9598j2838k2831M9134m6086m607L9014o3398M1571J1648
$$ 10568 18653 -9136 20462 7624 -15207 33927 -12159 -16766 22248 -41150 421 12069
192A2069m4207M9024k349m1905Q4107o0722j2676N8733p9263J6815M8355o9716
$$ 12069 -32138 16886 14537 -27368 56739 -3983 -16659 42074 -37189 -20374 27981 -41735
204d1735M0045K8889o4347O8481k3637k3642N8579n8091L615M8586q3907N1055
$$ -41735 -1690 27199 -37148 31333 7696 -15946 42633 -15458 -11843 36743 -47164 3891
216C891J9085p9066P8404j0629m9026Q9469m8447l2302P9865q6602K6038M8190
$$ 3891 22976 -56090 22314 11685 -37341 52128 3681 -28621 51244 -35358 -9320 38870
228C8870q2159M7918J5472o5939P5104k2794l6945P3005o5884J7512M9833p7423
$$ 38870 -43289 4629 20101 -45838 29266 6472 -30473 42532 -23352 -5840 43993 -33430
240c3430M4288J8109q6464Q0944j4990n6621Q9094m7965k1575P3243o1596J2383
$$ -33430 10858 28967 -57497 23447 8457 -48164 40930 -7035 -28610 44633 -16963 -4580
252d580M7151p5950M4325K527n5737O4352k7137k5093O3532n2758J0690N2302
$$ -4580 42571 -33379 10946 13473 -42264 22088 -5049 -30142 33390 -19368 -8678 43624
264D3624o9060M0192J3197p1718O2172j0344m7991O8470l7307k1791O2540m3363
$$ 43624 -25436 14756 27953 -43765 18407 8063 -39928 28542 -8765 -30556 31984 -11379
276a1379R995L3504n3466L0248L870l5279M2446k7217j8715M4535l6016J0899
$$ -11379 -1384 32120 -21346 8902 12772 -22507 19939 -7278 -25993 18542 -17474 -6575
288f575L6273m9721K6338J4403m1394L6719n338l3532L4312j6818j3429L2449
$$ -6575 29698 -20023 6315 20718 -20676 16043 10705 -22827 11485 -5333 -18762 13687
300A3687k1512L856J4610j8736J4981K009j1454J5504j6558p041J6720j8501P986
$$ 13687 -7825 -3969 10641 -8095 6886 8895 -2559 12945 -3613 -10654 6066 -12435 -4449
313d449J2236j9542J1811R949j2186J0688L29j4016N275J46m994Q91K197j189
$$ -4449 7787 -11755 56 10005 -2181 8507 8836 -5180 95 241 -4753 -3862 -1665 -2854
327b854j124Q094k464l915Q678k921l118M811q252j71L640m266N364p816P98J0920
$$ -2854 -3978 4116 1652 -2263 6415 3494 376 5187 -3065 -3236 404 -3862 1502 -6314 -5516 5404
343E404r347J0117M654k1194J6391K577k0794K3156j2765j6685K8385j4974m169
$$ 5404 -3943 6174 10828 -10366 6025 8602 -12192 10964 -1801 -18486 9899 -5075 -9244
356i244K3194k3127Q893J6738k3933J8747o293j9417K4782j9779m937K8356l1136
$$ -9244 13950 -9177 -284 16454 -7479 11268 4975 -14442 10340 -9439 -14376 13980 -17156
369a7156J6403K2106l9185L0480M499l7522L7504j4855k8300M4023k7378l771
$$ -17156 -753 21353 -17832 12648 17147 -20375 17129 2274 -26026 17997 -9381 -13152
381a3152L2087l6512J6394K0927l4185L1484r194l0506M3078k9028n651L5409
$$ -13152 18935 -17577 -1183 19744 -14441 17043 7849 -22657 20421 -8607 -14258 21151
393B1151m2199J3796L3224m8515L3844M368m5000M7668j2841k4130M1571k8611
$$ 21151 -21048 -7252 25972 -22543 11301 15669 -29331 18337 5496 -18634 22937 -5674
405e674r690L7959m2408J8914J2854l5222L7234p409k4143M3200k8722j1720M2646
$$ -5674 -15364 22595 -19813 -899 11955 -23267 13967 6558 -17585 25615 -3107 -14827 27819
418B7819m9130J5182K7535m5245K7465Q331m1036M5928q941k1363L9704l3460
$$ 27819 -21311 -6129 21406 -23839 3626 11957 -29079 16849 7908 -13455 26249 -7211
430g211k393K9399l5558J2965J0646l5808L9912o511j6757L5087k8784q142L9689
$$ -7211 -9604 19795 -15763 -2798 7848 -27960 11952 5441 -11316 23771 -5013 -13155 26534
443B6534l9802R131K1981m3446K6456P943k4574K3817j530j9205L2665k3480N36
$$ 26534 -13268 -4137 17844 -25602 854 8797 -15777 8040 6510 -12695 19970 -3510 -2974
456b974J5354k8132J5756O000j9628K1474k066j8252K6795k1526j485K1403j8803
$$ -2974 12380 -15752 4 6004 -13624 7850 5784 -12468 14327 -7199 -8684 12719 -6084
469f084M353J9047k9725J4958L921j8258J3494l602k036O371P54n270J0318j7867
$$ -6084 -1731 17316 -12409 2549 6470 -11788 1706 -1896 -3932 2439 3193 -2077 8241 -9626
483i626J6208m163q301J3154o683m770N829m751q332J2478k898P562K701l086
$$ -9626 6582 2419 -5882 7272 589 -4181 1648 -3103 -11435 1043 -1855 5707 8408 5322
497E322o086L354n804K31q16L70m710J0784M736q765P317n844k896L354N875r063
$$ 5322 -764 2590 -3214 -2983 -3799 -3429 -8139 2645 7381 -1384 5933 89 -2807 547 6422 -2641
513b641M284r018Q129n562J654Q874n845k910J3578r011q830K0163k6266J3975
$$ -2641 1643 -7375 754 -4808 -3154 5720 -125 -3035 10543 1532 -7298 12865 -13401 574
527E74J386p166P644M496j7225J6160m998j3099K7499k0221M177Q655j5546R509
$$ 574 1960 -5206 2438 6934 -10291 5869 871 -12228 15271 -4950 -773 7882 -7664 1845
541A845L680j7329K2585j6092m354K3639j8982o234L0150l2246J2013K1687l3553
$$ 1845 5525 -11804 10781 -5311 -9665 13974 -5008 -11242 18908 -13338 -1325 20362 -13191
554a3191K3651j0999j0184J0753j781j2468L1547k4588P934J9525l4573K1266
$$ -13191 10460 -539 -10723 30 -1751 -14219 17328 -7260 674 20199 -14374 6892
566F892k789j7901J9062l177j8309L4905k8985M020K3086k9662J0394K2807l3570
$$ 6892 4103 -13798 5264 2087 -16222 18683 -10302 -6282 16804 -12858 -2464 20343 -13227
579a3227J8637O032l0753K8189j6764M40J7422j5994N178K0959l7107K4556J028
$$ -13227 5410 11442 -19311 8878 -7886 -7446 9976 -6018 -840 20119 -16988 7568 8596
592H596k9458L0993p363j5428K7272j7134q115K8142l5291K0912N591k0274J6084
$$ 8596 -20862 10131 2768 -12660 14612 -2522 -10637 17505 -17786 3126 8717 -11557 4527
605D527O920k4751K2937q341j2340K2922k3687J4981K132j6122J4416N270k5966
$$ 4527 11447 -13304 9633 1292 -11048 11874 -11813 3168 5300 -10822 3594 8864 -17102
618a7102L0471q411j5883K3377j3610q305J6376j4207L656J1817k0205K1885q386
$$ -17102 13369 4958 -10925 12452 -1158 -9463 6913 -7294 -3638 8179 -12026 9859 1473
631A473n352J0929m122j2118J7827j4041K653R083j8620J7779o477m266J3455
$$ 1473 -3879 7050 2928 -9190 8637 -5404 -2751 6332 -12288 5491 -986 -5252 8203
644H203j924j5833K0564j3166m282J0226o617r50M375l32K269p83n206R805j2127
$$ 8203 6279 -9554 11010 -2156 -6438 3788 -2829 -3779 596 264 2533 1750 -3456 6349 -5778
659e778N861L058k886k521O372o826J487J175l004N292l454K020N01J716o365
$$ -5778 83 3141 255 -2266 4106 -2720 -1233 -58 -3062 2230 -1224 796 1297 3013 -3352
674c352O009k066k560l63P149p554K4O594o679p7N079j062k437N156l947M387
$$ -3352 2657 591 -1969 -2332 4817 -2737 -2713 3881 -2798 -2875 2204 1142 -1295 3861 -86 4301
690D301q324L557J335o400M744N225r853P451K930r637J2467r454k057Q198q067
$$ 4301 -4023 -466 869 -5531 -787 4438 -5415 2036 4966 -4671 7796 -1658 -3715 4483 -3584
705c584k59J1918j6549O588Q150j1893J0679k096p002P962o013N91R284j7625
$$ -3584 -3843 8075 -8474 -1886 6264 -5629 5050 2954 -4048 3914 -2099 -1508 7776 -9849
719i849J0353M474j5097J6092J85j6816J7833o129q325J8066j5009J049R943j5252
$$ -9849 504 4978 -10119 5973 6158 -10658 7175 1046 -7279 10787 -4222 -3173 6770 -8482
733h482R190O251j6671J5364m154r824J7342j1229p23J2629j8628R578P833k1050
$$ -8482 708 6959 -9712 5652 1498 -8326 9016 -2213 -2936 9693 -8935 643 8476 -12574
747a2574J9310l422j6691K1899o967j0134K0145j4889j137J4545j7814J0130J503
$$ -12574 6736 3314 -13377 8522 1555 -8579 11566 -3323 -4460 10085 -7729 2401 3904
760C904j4849J6930n490q281J8045j4333q96J6327j8348P753P772k0245J6192
$$ 3904 -10945 5985 495 -7786 10259 -4074 -4970 11357 -6991 762 8534 -11711 4481
773D481l62j4968J8800q573p760J7584j1801m98J1617j4448P595K649j2007J3101
$$ 4481 4119 -10849 7951 -622 -8382 9202 -2599 -3097 8520 -5928 1667 4316 -7691 5410
787E410o305o189J5545j3162P61J3340j5990P062P299j5346J0436J559j2439J2991
$$ 5410 -895 -7084 8461 -4701 -3940 9400 -6590 472 7771 -7575 2861 4420 -8019 4972
801D972n680n432J2081q941J596O279q648N650J749p863Q074m915l846J0299q735
$$ 4972 -708 -6140 5941 -3000 -1404 4875 -3773 1877 3626 -4237 3837 -1078 -4924 5375 -3360
816c360R87P661r954M551N630r144M926J429o707N516p35k978L485k599P01J623
$$ -3360 -2373 5288 -4666 -115 5515 -3629 1297 2726 -3981 1535 800 -2178 1307 -1292 -591 1032
832A032k260K590r88j812L645k672k62K888l450J19K346k258k9K570k305k79K112
$$ 1032 -1228 1362 374 -1438 2207 -465 -727 2161 -1289 -1170 1176 -1082 -1111 1459 -846 -1125 987
849I87M00k158K569m52m242M098q40k899L055p67k530N335k013K1J580l905K716
$$ 987 1387 -771 1798 1346 -2896 1202 362 -2537 518 -249 -2779 2556 543 564 2144 -1761 955
866I55p10j793L395l788j236O859o835L632M178r010N881K717q870P432j366q233
$$ 955 245 -1548 1847 -1941 -3177 3682 -3153 479 4657 -4353 1528 4245 -4625 2807 1441 -6792
882f792J0243m409j635P523p035J275M772q279P124j326o762J0142o314k081J0443
$$ -6792 3451 -958 -2593 4930 -2105 -830 3942 -4337 2787 1461 -5301 4841 -1473 -3554 6889
897F889j1104J493R379j3927R282L367j1980J0272j194r234J2740o975l214J0657
$$ 6889 -4215 -2722 6657 -7270 2012 5379 -6601 3671 2477 -6757 5983 -992 -4206 6451
911F451j1439N274L499r955Q603q6q977J4778q830l807J2821j3900K577R557j4032
$$ 6451 -4988 286 3785 -6170 2433 2347 -6630 8148 -682 -4489 8332 -5568 -2991 6566 -7466
926g466P210O462j3834J3144k861q007J0827o759k923J0571j1519M615N047j2096
$$ -7466 -256 6206 -7628 5516 2655 -5352 5475 -1284 -4207 6364 -5155 -540 4507 -7589
940g589J1651k247p396J2269o290o081J4607j4444K548R323j3062P154M925j1243
$$ -7589 4062 1815 -5581 6688 398 -5683 8924 -5520 -2972 6351 -6711 443 5368 -5875
954e875Q842r4q776J1708q345P60O090q027L790M429j0981R533j205p990J2158
$$ -5875 2967 2873 -5903 5805 -2540 -1780 4310 -3717 73 4502 -6479 3054 1849 -6141 6017
969F017o736k854Q419p044j254R650j0810N911K254p198M862m21m801N587j958
$$ 6017 -719 -3573 4846 -2198 -3452 6198 -4612 1299 3553 -3645 1217 796 -4005 1582 -376
984c76j165O289p501N289j211m727M453l6n958Q061k779l321P043n129n2K753
$$ -376 -1541 4748 -2753 2536 1325 -3402 1051 1015 -4943 3118 339 -2982 4061 -1068 -1120 1633
1000A633k321M27K429l562K217j923j95P98M26p0J880j884J739j113j996K552
$$ 1633 -688 -261 2168 -1394 823 -1100 -1295 -497 -71 -141 1739 -145 1594 481 -1515 1037
1016A037k754R75K07K453l888L799j085j776L34K357k694o1M113n058K165P65
$$ 1037 -1717 -742 -535 1918 -1970 1829 744 -1032 -698 1659 -1035 -1096 3017 -2041 124 889
1032H89j561k17K423l521L514j739l92J905k369M54K335k496J242J235n236N816
$$ 889 -672 -889 1534 -1987 1527 -212 -604 1301 -1068 -614 1721 -775 467 1702 -3534 2282
1048B282l738m27N203m513j207P688q138K117M904q150L964K274n043M412j076
$$ 2282 -1456 -1883 3320 -1193 -2400 5288 -2850 -733 4171 -3979 -15 2259 -2784 1628 552
1063E52l954P310p601M605K787p015N040J206q110P650j986o073J0601p160P98
$$ 552 -3402 3908 -3693 912 3699 -3316 1724 2930 -5180 2470 484 -5589 5012 -2148 -1350
1078a350P090q688J973N537j0384P321J016o436O334j868l468O714o263J255N571
$$ -1350 5740 -2948 -975 4562 -5822 1499 2515 -3921 2413 545 -2923 3791 -2472 -1217 4354
1093D354j0388R771p24q076Q066j595p991J1995n958l204Q899q827L726M153q340
$$ 4354 -6034 3737 3013 -5063 3003 1408 -6583 5412 -546 -3750 5149 -3678 48 4201 -4139
1108d139N303J142q141J1237n635k419O061o456J667N700q485N969J055r555J2322
$$ -4139 1164 2306 -5835 5402 -233 -2652 3409 -3047 -1380 4320 -4165 1804 2859 -6696 5626
1123E626m933m959Q710n247l935R653p169J421L482n925M928m05l640O101m293
$$ 5626 693 -4266 4444 -803 -4738 4915 -2254 -833 2649 -3276 1652 1247 -2393 3708 -585
1138e85l428Q716q144L102L572o114K708K846o196O449j901n468Q460n317l28
$$ -585 -4013 4703 -3441 -339 3233 -2881 -173 2673 -3523 2926 1025 -4443 4017 -1300 -1628
1153a628N127m440j866N202m512L359q08j553L007l392J316L241n146M01M899
$$ -1628 3499 -941 -2807 2395 -2117 1242 434 -1119 1888 -1504 -188 3053 -2093 -1692 3207
1168C207o400L829J315l599J470J183k227K427j487k74J745j591J22Q43q89j018
$$ 3207 -3193 636 1951 -1648 -178 1005 -1222 1205 -282 -556 1189 -402 -280 563 -326 -1344
1184a344K210j267J145j903K621j423o16J004K36j592j99L042l203Q37J420O5
$$ -1344 866 -401 744 -1159 1462 39 -577 427 663 -929 -1128 1914 -1289 -452 968 1033
1200A033l237L668j057k038K708l53j803J559n72n84K254l290K323k77j709K188
$$ 1033 -2204 1464 407 -1631 1077 724 -1079 480 -92 -676 1578 -1712 611 334 -1375 813
1216H13L85k636K499j442l8K020l803L271k00m048N460j006n140O841k485l011
$$ 813 1198 -1438 1061 -381 -419 1601 -2202 1069 869 -3179 2281 1275 -3865 2976 491 -2520
1232b520N247k912j696L875l956K497O70m153N601k979j761N258l895j042N114
$$ -2520 2727 -185 -1881 1994 -1962 535 1205 -2948 2653 -326 -2087 3171 -724 -1766 3348
1247C348o025K424K651o107N882q24n447P494l066l626P535n544q91M749m378
$$ 3348 -2677 -253 2398 -3709 2173 1349 -4098 3396 330 -3296 4239 -1305 -2196 2553 -1825
1262a825J986J788m925N234k530k447P262o805L00N829o773K664M099p595M769
$$ -1825 161 1949 -2976 2258 -272 -2719 4543 -2262 -1962 3867 -2906 -242 3857 -3738 1031
1277A031O03n357O879l198k970O492n251N64M724n923K788J097m170M688j851
$$ 1031 1634 -3723 3156 -42 -3012 3480 -1771 -1207 3517 -2406 382 1479 -2691 1997 146
1292A46k643N948n716N66N813p161L128L412o907M085J330n096M911j747k285
$$ 146 -2497 3451 -2265 -1699 4114 -3047 81 3493 -3414 671 2001 -3095 1816 69 -2216
1307b216M473l495Q02L136m945K939N25l914M629j850j953M264l774OM391n173
$$ -2216 2257 -1238 -436 2700 -2245 694 1219 -2695 1934 84 -1869 2395 -1379 -1373 3018 -2155
1323b155K127K603n257L284J070l688L031p68j718K440j445O62J008k485J731
$$ -2155 -28 2575 -2682 602 1672 -2016 1015 247 -1471 969 -476 186 1194 -1291 440
1338D40M2k314L517j541j416K645j972k77K413k099k20J844k277J401R36j369
$$ 440 482 -1832 1685 144 -1272 1373 -599 -876 1537 -562 -782 1062 -1215 186 1122 -247
1354b47j2M58p63N63M53j02o69k06Q68o91M31K32j26q21J356l89p67L87K38j014
$$ -247 -259 199 -564 -1 452 350 -319 -525 343 -348 83 315 189 -632 724 335 -432 -45 193 -821
1374h21P15J173k197J621K96j688J271L25k139K244l24j519J855j245l88J677
$$ -821 -106 1067 -1130 491 787 -901 370 695 -1444 800 476 -1043 812 -433 -821 856
1390H56j261O83M18j662K146j503p66K250k167N4L444l959J457J909m173K742
$$ 856 -405 278 696 -966 1180 -323 -1089 1161 -1006 -952 2492 -1467 -10 1899 -2274 468
1406D68P58l309L179j50k771L892k987P3K183k628J520J018l240L642j176k753
$$ 468 1226 -2083 1096 946 -1825 2067 -920 -847 1336 -1292 228 1246 -1994 1648 472 -2281
1422b281M791m184N01M131m193N55L288n975L891J213m256M257j456j888L829
$$ -2281 2510 -1674 -1173 2958 -1235 -680 2608 -3367 524 1737 -2519 1738 282 -1606 2223
1437B223k606r87L371m837L694N18l486L933j435k950N377l596j272N485n619
$$ 2223 -383 -1370 2001 -2836 858 1376 -2110 1823 388 -2562 2815 -781 -2053 3432 -2187
1452b187J882K708m881K402K130m786M592j509j980L824l061l2K344l663K744
$$ -2187 -305 2403 -2478 -76 2054 -2732 1860 351 -1629 2195 -866 -898 1446 -2217 527
1467E27J749m935M785k570j888M772k412k055M678m577J363L515n060K469p7k031
$$ 527 2276 -2659 2126 -444 -2332 2440 28 -2027 2651 -1926 -563 2952 -2108 361 284 -1747
1483a747K882J85k803L186l447J274K017k903K215J08k880L188n90l110M528l010
$$ -1747 1135 1320 -1483 1703 -1744 -470 1547 -1356 859 967 -1913 1275 685 -2425 2103 -907
1499i07l51K960j837o62K942l574J133O28j429K178r03m01M20o67j79K433l254
$$ -907 -1258 1702 -135 -797 2145 -1429 -296 332 -1097 1081 178 -223 197 -470 -649 1784 -1470
1516a470K141n57r74J850l05j987J489k62j093K932j902p0J66N76j390J469r02
$$ -1470 671 114 -860 990 685 -1302 187 -75 -1168 1764 -138 -208 -42 534 -856 613 -289
1533b89r1L27P29m95p22P41o04Q08n64R17j682Q34M31J30j128J299j338J59J901
$$ -289 -380 -53 676 181 -541 200 -404 404 -160 757 -925 -91 340 470 -658 641 -697 -538 1363
1552A363j731K18L90r55J28K437l043J731k2j562J167N22j411J144k97o37J441
$$ 1363 -368 -150 240 -715 -587 1850 -1193 538 516 -1046 121 643 -768 376 79 -558 883
1569H83j865J891m29j947K205k50k353M235k600j471L004k238M07K795l402Q74
$$ 883 -982 909 480 -1467 738 488 -1865 2370 -230 -1701 1303 -935 -528 2267 -1135 -261
1585b61J492l431L978j580j672K234j230j89K865l381J352O40l349M434j524k490
$$ -261 1231 -2200 1778 198 -1474 760 -470 -659 2206 -1175 177 817 -2532 1902 378 -2112
1601b112M209k173k297N420m230M0L119l350J196J519k951K698m57k598M238l589
$$ -2112 2097 -76 -2373 3047 -1183 -1143 1976 -1374 -178 1341 -1610 1088 631 -1967 2271 -1318
1617a318M53L047l653J225K053m153L565l8l772M805k573j735N064l925o04L968
$$ -1318 -865 2182 -1471 -246 1807 -2346 1219 1181 -2591 2214 -359 -2094 2970 -955 -1559 2409
1633B409m200J639J664k957K116l07j705L592l480L55K978m498K508J949m055
$$ 2409 -1791 -152 1512 -1445 671 364 -1341 2251 -1229 -874 2104 -2394 114 2063 -1992
1648a992K626R58m009L978j620j506L331k521j39K763l012R31J798l199K111l75
$$ -1992 634 1592 -2417 1561 -59 -1565 1766 -755 -894 1869 -1143 -212 1586 -1613 498 123
1664A23r94K040j557j11K079l361J871J742l765K369Q31l250K591L85k211K074
$$ 123 -871 1169 -388 -499 1580 -1781 90 1832 -1933 436 1267 -1983 608 993 -1218 856
1680H56j090j53R20q33K94O35j846J707j65r70J484j264J77N47m81J83J040k178
$$ 856 -234 -387 533 -300 -6 629 -1217 490 325 -645 839 -425 -248 299 -182 1 1041 -1137
1698a137J255M57j656J318O72j514L12J248j335J72P16n94q18R21K33L0j50L15
$$ -1137 118 575 -1081 237 909 -605 -293 955 -380 -208 508 -86 -904 17 250 280 130 445
1716D45o54n11O50N61o72J5O42j185J168k9q28N32l64o98K079j004j041K136j743
$$ 445 -209 -720 -70 491 -181 -166 476 -709 459 430 -398 134 -230 -928 1151 147 -894 1242 -501
1735e01n63K272j529l32J615j281N52m54k04J021j117K06J810k905J255K008l284
$$ -501 -1064 1208 -321 -653 962 -319 233 -221 -425 596 -521 -315 1495 -1410 -155 1853 -1431
1752a431J864J36k336K337K21j858K652k336l63K850k513N49J396k595J346Q96
$$ -1431 433 569 -1767 570 791 -1067 1585 -751 -1114 1736 -777 -228 1168 -1427 -81 815
1768H15j760K258j924lK078k881J335K156m149K134J543m028L551J02k633K398
$$ 815 -945 1313 -611 -614 1464 -1417 -82 2074 -2075 59 1602 -2426 1125 1227 -1406 992
1784I92j436p34K801k314P28J037l159K776M81k481K605j911p75L307k684P48
$$ 992 -444 -1178 1623 -691 37 1074 -2085 691 1172 -1309 1296 -615 -1390 1917 -767 -19
1800a9J501l938K611J798l998L215k95k918L333r67j406J860j786R38J314k492
$$ -19 1482 -2456 155 1953 -2045 1170 875 -2043 1290 323 -1083 777 -1009 -71 1243 -1249
1816a249K481p60k162L057j573j561L460k255K7K330l227J495J172k649J947J88
$$ -1249 1232 472 -1690 1367 -206 -1767 1693 -562 -535 1795 -1432 63 1235 -1414 533 721
1832G21k543K942n98j370J548j405M23J029j185J190o25j561K722j432j100K418
$$ 721 -1822 1120 522 -848 700 -705 -282 747 -438 752 127 -1434 1288 -144 -1244 1174
1848A174j611l64K532k111j09J086j468R96L46j082Q02P7o20J101j029JL61l27
$$ 1174 -437 -801 1731 -380 -489 597 -871 125 471 -611 191 268 -352 749 -280 -279 82 -245
1866b45O02k70p38J116m06o01J431j085m38J397m65j159J149n39k53J069k7q02
$$ -245 357 87 -651 465 59 -542 889 -196 -634 763 298 -861 288 -251 -504 565 538 -264
1884b64K63J48m49M64l55QJ54K61m2q4m64M74k38J54L99r44M05R13j319L53O67
$$ -264 -1 147 -302 162 -193 -185 -31 230 188 104 -360 114 -124 30 429 -515 -110 803 -516 -163 504
1905E04j857J818P53j612N12J31j606J830j02q25R24r15O75M93j001L10j27j310
$$ 504 -1353 465 1218 -394 118 249 -1357 473 371 -454 470 -445 230 723 -278 32 -95 -1405
1923a405K462r78m49J641j984r0J983k131P42J717k946J831J93j613J609j88j475
$$ -1405 1057 79 -370 1271 -713 -803 1180 -951 -209 1508 -1438 393 586 -1027 582 394 -1081
1940a081J814j166M68J260k310J222l22j275K657o26j832K652k367K4K679k589
$$ -1081 733 -433 35 1295 -1015 207 -115 -1390 1267 641 -1191 1461 -906 -882 1797 -792
1956g92K61J642k559J829Q59k413J842q15o59J826j229j57J419k538J936J17j924
$$ -792 -531 1111 -1448 381 1240 -1173 669 -146 -805 1021 -208 -365 1054 -1484 452 569 -1355
1973a355K564p62j745K685j748j174L282k686P03J408k055Q12J184k256J692o21
$$ -1355 1209 447 -1298 1387 -361 -1535 1747 -939 -236 1172 -883 -71 1113 -1143 549 -72
1989g2r33K195j602N73N73j782Q81J143k444K740r16j592K344j265q96K083j326
$$ -72 -1005 1190 -412 161 734 -1048 -167 976 -1468 1272 356 -1236 1108 -157 -1053 1030 -296
2006b96n62K160k004J027J86j018M46l4o33J547r68J57Q80j909J122M35j347J077
$$ -296 -858 1302 -702 325 511 -507 -61 -95 -728 819 -149 8 888 -1021 101 536 -811 266
2024B66M14k027K263p50p03J093n52p88J331n11k86P81j014O79m75N22j57n6l12
$$ 266 680 -1347 916 166 -537 556 4 -784 547 36 -250 531 -483 196 -279 243 86 30 -282
2043b82Q18j055O10L80j077O86K62n62pR67j479Q90J23m12q5P32r77M00M01o75
$$ -282 536 -519 91 471 -606 80 342 -220 -227 740 -739 151 274 -138 -223 509 -468 -68 333 -342
2063c42N39q3m9k20K72m94O09n99Q29n80p6O07l13n27R32p05p71K002j302J25
$$ -342 197 114 65 -155 117 -377 232 -367 462 -118 -194 413 100 -427 505 -200 -971 1031 -271 -146
2083a46P62p03o49J616j327L62M32q53Q09k29k55M88m59k57J334j823J287j20
$$ -146 616 -87 -736 880 -447 -85 347 -506 303 74 -181 307 -152 -409 925 -898 389 269
2101B69j022J252j55j485K043p88j107K469k235K37J254r46q8J003j558J091M
$$ 269 -753 499 344 -1141 902 114 -993 1476 -759 -522 732 -214 -302 701 -857 234 238
2118B38n02J250j756M27J139j482P74R18k510J863L45j440J678p00j538K083j139
$$ 238 -264 986 -770 -343 796 -686 88 1006 -1504 359 704 -736 942 242 -1296 787 -352
2135c52k87J887j869M45Q70j285P74L34j250J364j344L44J457j710P03R23k558
$$ -352 -639 1248 -621 -176 694 -591 183 517 -733 631 -713 -369 1088 -622 81 1004 -1554
2152a554J634J186k326J893p90j174J495o9o10J072j430N12J028j392J091p12
$$ -1554 80 1266 -1060 833 43 -1131 364 295 -315 757 -673 -161 867 -525 566 -146
2168a46p73J299l08k37J085j682P04R61j788J043N34j927J560M66j737J340k41
$$ -146 -919 380 72 -165 920 -762 -58 903 -885 158 692 -1235 325 791 -946 394 153
2185A53m34O08k90j47K35o62R02k46r46J404n43l39J169j046k70Q47r79N16N32
$$ 153 -281 327 37 -110 125 -537 365 119 -827 577 34 -305 864 -182 -452 395 -584 -68 464
2204D64r60O44N20j236P30J89p66M44J23l36j32M48J93l27l30O38l68j73R24o31
$$ 464 -496 148 668 -568 162 351 -415 29 152 -184 -316 132 325 -2 -332 306 -62 -235 689 58
2224E8r68R71qk70P43l96n07N25R6l52L76q20J48O73k01N0K33n21q3M94j58j31
$$ 58 -910 61 53 -217 526 130 -377 148 244 -108 268 -552 -404 269 68 118 351 -170 -253 241 83 -48
2246d8j93K88K4m71O26K67j139J034J71j283Q33L79j180P25J76q05J086l09l4
$$ -48 -241 47 71 -400 226 493 -646 388 559 -724 109 488 -692 33 209 -596 490 181 147
2265A47J59p43K50M65o96N86j16n17R98n48P0L92j182O55Q28j572J097K46j593
$$ 147 306 -437 -187 278 -418 168 52 -465 533 -15 55 447 -735 -80 748 -824 273 519 -1074
2284a074J429L20j272R65j29o84P86n76K02J08p11J083j51q16J401q59o62J190
$$ -1074 355 675 -597 368 239 -445 341 -235 -33 75 -636 447 296 -520 881 22 -640 550
2302E50j062M1J252j322O49N65j541J340P1j279R64j19q45J211m52r1K20o89J056
$$ 550 -512 -471 781 -541 108 673 -868 472 543 -736 228 109 -736 475 23 -68 152 -537 519
2321E19l61o26J179q92p98J874j235k41J430j135J99Q16j127L53L20r87J089l86
$$ 519 158 -468 711 -181 -979 895 -340 -581 849 -286 -87 729 -398 -45 275 -712 377 -9
2339il98Q81m50r6M60p56L87R1o22J109p37n16J352q44l62J413j099l16J098p81
$$ -9 -407 474 24 -72 388 -368 19 110 -512 597 -140 -656 696 -148 -510 903 -196 -512 586 -195
2359a95j00N57n83L06N0J1M08n55k1K68n55L08M58p31O42k02m05P70l37m72P85
$$ -195 -295 262 -321 -15 35 46 454 -101 -122 146 -409 -101 357 -374 268 66 -339 431 94 -378 407
2380D07n60l88J057n27k78M84j63l32N43k2j44k67R8J01l86M76K14m71J28M65
$$ 407 -153 -541 516 -11 -289 195 32 -300 243 221 77 -190 -92 9 -377 99 313 -158 -30 435
2400D35p64L47J74n83L24K70m42M68J00p10N25n9m43M86J44n09L54j05j36QJ33
$$ 435 -329 18 192 -391 -67 203 -239 229 329 -381 144 85 -358 128 272 -237 117 12 -124 -116 17
2421A7K12k53p8M68n21j88Q19q64L6P94n08K5O83j014J52L84n74N43R4m58L15
$$ 17 229 -24 -102 366 -155 -343 476 -388 -352 442 -66 -41 642 -372 -220 164 -410 133 227 -231 84
2442H4P7l24M26m68J51O0k70O42l01m80Q08n12l72J170q36k22R44q49l5P76p98
$$ 84 161 -163 263 -205 -54 6 -264 378 77 -403 405 -107 -479 691 -145 -367 577 -272 -307 469 -329
2463c29L56K32m80L71j01k32M27n18J79L95o99P71k39o73Q35j88o32J211q18m20
$$ -329 27 259 -221 150 49 -183 244 -274 -95 300 -399 372 133 -540 295 107 -525 686 -132 -552
2483e52J065p29k9O98o58J5N95o40M74l61j60M17l48K74M26p85M04K74j083R72
$$ -552 513 -216 -245 453 -205 -190 405 -235 239 -122 -282 135 -213 61 487 -298 106 380 -703 269
2503B69j67o65R98k07o57R74n95l71P17n27O1M47k84J16p6k64M26m07K09L23o81
$$ 269 102 -563 435 228 -429 545 -50 -421 296 -231 -170 277 -7 109 33 -231 195 -212 -3 320 -361
2524c61L55M41q51N22P5p46P32K17o12M51j24o16P37k62pR4l1%J54j78J30l12
$$ -361 -6 435 -416 106 181 -565 167 384 -228 223 99 -517 220 -42 -49 45 14 14 168 -10 120 -192
2546a92o3O26o67L65J96n08J80O04q75L45J97n96M09K02l88Q8K89l96L96j41l0
$$ -192 -255 371 -296 69 265 -243 -63 541 -334 11 208 -388 21 223 -165 -77 212 -184 212 71 41
2567D1k14N5L4R3nK27k30k72N55m03M4L74m26k94Q36n66R5M08n72l3N85k75l5
$$ 41 -173 -118 -84 9 4 231 1 -271 284 -119 -75 299 -127 -421 415 -151 -56 352 -220 -253 332 57 22
2590B2J60n06K33m4L33j55q1N8J66l43M55k92n66O50j16j05N11j96o58Q45m75
$$ 22 182 -324 -91 -135 198 43 -38 20 186 -157 298 6 -560 90 -26 -131 380 184 -474 371 -104
2611a04m9L87l36k30N04k05K0K23l45L01l27K85L4l88J54K96p29P50R7o90O71
$$ -104 -153 234 -102 -332 172 -33 -13 210 -135 166 -161 124 158 -230 -76 220 -509 241 338 -352 319
2632C19j25n68N69p0n93P26m15J40J94j18q3J42k57K58j21j99L87n35M07K08m37
$$ 319 194 -374 195 125 -468 258 -157 -17 177 59 -24 118 -139 119 -2 -201 186 -349 58 266 -171
2653a71K16L86r21O88N2p66N51J09m63N05J31n34M54l67K26j39o5J91j24j64N14
$$ -171 45 431 -490 198 250 -516 35 144 -319 186 317 -217 237 -130 96 -43 -108 83 -41 -205 309
2674C09l40j49O40p01K60K54n48J61L69p25N60J82m58M04L3m36J20Q5k04J59q6
$$ 309 -31 -180 460 -241 19 273 -275 -114 255 -470 90 272 -186 218 251 -185 -65 20 -184 -25 -111
2695a11L44k74j4M07l87k69O09m52j55O70m68j02M86m15O0L81m76K78rk33Q0J15
$$ -111 233 -41 -55 352 -35 -304 305 -147 -302 368 -100 -202 284 -131 -71 310 -166 112 103 -130 -50 65
2717F5k86K31O2K2P2k25L17m15r6M02j99l37P55l05l40O54k68m05M29j29k66L69
$$ 65 -221 10 72 94 166 -59 258 -157 -253 149 -50 -387 368 63 -277 377 109 -296 133 4 -262 107
2739A07j70Q3k3M0N5l2j07J33j66k7J78k95L58m8k38M68k19m17N30j38m65O08
$$ 107 -63 20 -3 37 92 60 -47 86 -80 -107 71 -224 134 86 -152 316 97 -320 210 72 -393 215
2761B15n8m96M87l9j99J25N8l2j82J47R4k65m3L69l60J44L82m22J18J03m51L02
$$ 215 157 -339 148 109 -90 35 93 61 -121 26 120 -145 -188 181 -179 -35 347 -75 43 146 -305 -3
2783cK5l65N08Rl26M04n2n11L40m7q0O0Q8J17l09J79K49m54j1M82m90N0N09n20
$$ -3 22 -343 165 174 -152 252 200 -311 29 -18 -98 -38 50 167 -142 37 286 -168 -179 303 -187 -137 372 -148
2807a48j2L40l57K02J58k42J11j1j78J67J1k33K32m6J10o2qR5l36Q8L62l64p5
$$ -148 -160 180 -177 25 183 -59 52 41 -137 30 41 -192 40 -6 104 42 34 129 -207 -119 243 -121 -196
2830a96N13m72jN37l80k21L91k49rK23j16o3m2J34N4o3k0K9k24J94Oj19K48k23
$$ -196 317 -155 -156 381 1 -220 171 -78 -87 136 20 -43 -85 49 103 40 20 49 -175 19 25 -94 154 -69
2854f9n3L57k60j47L88l29j55N40k58k13L63j78j31J51J06j26n1J01K6k29K22
$$ -69 -122 235 -25 -172 216 -113 -268 272 14 -199 164 -14 -145 6 112 -14 -65 36 62 -167 55
2875E5R6l85K70J15k50J98M0m06L51p8j49L42j53k15L14q6k48L24j86k4M4J76
$$ 55 151 -234 36 151 -99 99 139 -267 84 6 -143 199 46 -169 145 59 -189 135 -51 -75 -31 145
2897A45o1k00J36N5k95K02L12n59L23J71m30J85J80l40J90J19k53K25o7j10J05
$$ 145 84 -116 20 75 -220 -18 294 -265 58 229 -201 -16 164 -176 14 133 -120 105 38 -72 33
2918C3j08L4J13j8O7j56l4J17j96J26K76m64K13L24n04J69J90m70J74L44l03J26
$$ 33 -75 -41 72 54 121 -35 -69 48 -148 -22 254 -210 3 327 -177 -8 182 -288 -114 230 -73 53
2940E3K6j19K6nL3l0j31K56m5j51K53k97L4K61j87k0K70m38J30K92l79J33K00
$$ 53 79 -40 -14 -19 14 -16 -147 109 64 -87 166 -131 -97 164 -23 -43 227 -211 -81 211 -168 -35 165
2963A65k14J1K26j95k3k8P6r9J2K59j62j60K84j72j32L96k94j34K53j46j0L03
$$ 165 -49 -38 188 -7 -30 -58 18 -81 -69 190 28 -132 152 -20 -152 244 -50 -184 69 -77 -87 216
2985B16k72l6K08r9J3L8j76j28J53J92J3q9J13k49j6K56j06k57K71m9j33L99j53
$$ 216 -56 -92 116 17 30 68 -108 -236 -83 109 122 33 146 -103 -119 137 31 -226 45 -4 -137 262 109
3008A09k30J00N4j63K63j5k16Q7j6n3O5J20q8NO5p7j19R6l1j65K28J29k01K13
$$ 109 -121 -21 33 -130 133 118 -98 -11 -27 -80 -15 105 17 22 87 10 -109 -13 -44 -209 19 148 -53 160
3032A60J1l43J14J23k55J65J45k18J40J13j68j5R4j29N3L4j2r8M6J39j35Q4J32
$$ 160 171 -172 -58 65 -190 -25 120 -98 42 155 -13 -28 66 -63 -10 24 12 -86 -40 99 -36 48 180
3055A80k32K0K38m11Q0K48k88J60K61l20N9J22j90O6Jn3k1L1J29m1j07K19j91
$$ 180 -52 -32 206 -205 -125 123 -165 -5 256 -64 -5 117 -73 -7 -6 -59 -80 -49 80 39 -68 151 -40
3078d0n1L03k75r3K79k83nM16l08N5K57l34J9J33k01N0P6lO1l8Q9jk56K67j23
$$ -40 -91 212 -63 -156 123 -160 -165 251 -57 -2 255 -79 -60 73 -128 -78 -2 -5 56 18 107 106 -150 117 -6
3103fk06M02k31j37L38j61j59M30l14nJ62k13J8P1m3j8J19qJ32k30J82j61j83
$$ -6 -212 190 -41 -178 160 -1 -160 270 -44 -49 113 -100 -82 -11 -54 -72 47 39 171 -59 123 -38 -221
3126b21L02q9j47L02o4k61M23k32j41K17j03r6J94p8o4O1J3J7k7P0nj74J27J0
$$ -221 81 -8 -155 147 83 -178 245 13 -128 89 -14 -110 84 6 -58 3 16 33 6 76 71 -103 24 34
3150C4k72L19o4j17K38k9k49K83r7k18K04j15NQ4J31j58J9N3j8j07J55q7j92K39
$$ 34 -238 81 17 -100 138 109 -140 143 46 -172 32 -83 -78 6 137 -21 -2 51 33 -74 81 -6 -198 41
3174D1qq4J55O7k90J75l6j04O4J23j69J9J25j17N8J02j31j43J95n5RJ02j05k38
$$ 41 33 -51 104 171 -119 56 20 -84 -20 103 -66 -47 78 -39 19 121 -10 -153 42 -13 -4 98 -7 -245
3198b45K73K7j4N0m6j58K7K40k09k5M4J2q0L71j59k35J75j17n2K22o8j25J67o2
$$ -245 28 55 41 91 45 -113 -86 154 -55 -80 -36 -24 -104 267 108 -127 48 -69 -121 101 33 -92 75 13
3222A3K0J0oj00K7J5N9j10J84n4k20K99k00l2K27o9l03L49r6j35K70j68q2R1N5
$$ 13 33 43 37 -63 -36 -21 38 -72 112 58 -162 137 -63 -95 132 63 -240 109 13 -122 148 -20 -102 -11 44
3247D4J1o9mN5j44J52M1k36J59J18k29K26o7k74L51r9j43K15j75n6K88n8j50K0
$$ 44 55 -14 -18 37 -107 45 86 -150 9 127 -102 124 57 -217 134 35 -108 107 -68 -124 164 106 -44 -24
3271b4m3M1K5O7N9l60K87J18l28K24j8k66K13J94l19K27q5j25J89j32M1M1l2J3
$$ -24 -67 -26 -1 66 125 -235 52 170 -158 66 48 -218 -5 189 -130 97 12 -113 76 -56 -15 26 -6 7
3295GK4o0Q5q8O3K7k28K18J10l03K23J9l64L60N7k39P7L4j04R5O2o4q7qK18j32
$$ 7 31 -29 56 -32 31 58 -170 48 158 -145 78 97 -267 93 150 -89 -12 22 -82 13 75 11 -76 -84 134 2
3321BkQ5k42J03J39j61R8J7j73K09L0k41J92m0j46J39M1o3l8J48m9j62J37J18
$$ 2 0 85 -157 -54 85 -76 22 39 -134 75 105 -136 56 16 -130 9 50 -13 -51 97 48 -114 23 141
3345A41k34R3J26l04J42K18k13K6N9j22R8M9p2q2j4M1R3N3m4j24N6O2j37J79o9
$$ 141 -93 0 126 -178 -36 182 -31 -5 54 -68 30 79 7 -75 -89 -48 45 98 54 -70 -14 48 -89 90 21
3370B1k25K28J03k04J25O1j93N6J41j04q6P6N6j55R5J55k04J14P9k18K9J06j57
$$ 21 -204 24 127 -77 48 109 -84 -28 113 9 -77 -1 55 -100 -5 150 -54 60 139 -79 -50 56 -101
3393a01J37J0j54J83k9n3O4l5j10N4M8J4r4N2J08k36J83J40l03J34J27l58J48
$$ -101 36 46 -108 75 46 -7 57 22 -88 -34 14 28 -66 -14 94 -142 41 181 -122 12 139 -219 -71
3416g1J45j46J31N0j16K8jQk9j08R2m3M5K18j76j3N5k32J85J56l08J36P6k89K74
$$ -71 74 -72 59 109 -7 21 20 28 -1 -109 -17 -60 -15 203 27 14 69 -163 22 178 -130 6 82 -207 67
3441F7P0k15R0K2k9J7kJ7j40p0K78j56K9K57k73k5J84k44M4J77k43J91K6j09J23
$$ 67 137 -78 12 34 5 22 20 37 -103 -173 105 -51 -22 235 -38 -63 121 -123 -79 98 -145 46 72 -37 86
3466H6Oj42N6m2LL8o2J86k19N5K12j97OK13l41rK72k30Q7J43j72O0O0l9Nq4K0
$$ 86 92 -50 6 -36 -33 5 -57 129 -90 -35 177 -20 -14 199 -142 -151 121 -109 -22 121 -51 9 69 30 35 -49 -29
3493b9k8j0J29l3j09J88j64%K24k39M4J39k56L3K28j97J17P0r8pL2Jq5p4J30k2
$$ -29 -57 -67 62 29 -80 108 -56 -56 168 -71 -27 112 -144 -111 117 -80 37 107 9 2 34 35 -50 -124 6 -16
3519a6m1L07k35q0J55j39m0J90k05K8J51j00P0j2n9k6P4J0l0q6J41j54K2K10j74
$$ -16 -57 250 15 -65 90 -49 -89 101 -104 -76 75 -25 45 33 -26 -52 22 32 2 -84 57 -97 -75 135 -39
3544c9NJ94j67q6K07k09RJ40r7oJ07J6j0p2Om5l3K05j23j01J44r3QK85k77o9J61
$$ -39 -34 160 -7 -93 114 -95 -86 54 -43 -49 58 74 64 -8 -2 -47 -80 125 2 -99 45 -48 -40 245 -32 -101 60
3571F0j55P6J19j94mJ09L6L8j02O7j04p1K11r9j15K44j22p3K56k34QJ62j53j6
$$ 60 -95 -19 100 -94 -98 11 47 85 -17 50 -54 -125 86 -13 -128 116 -6 -79 177 -57 -49 113 -40 -56
3595e6R5j02O2O5o9J8n2J06Lj21J33j45r3K72r9j24K54j41r6K39k21j2J34q2K0
$$ -56 39 -63 -1 64 -5 13 -39 67 70 -51 82 -63 -156 116 17 -107 147 6 -90 149 -72 -84 50 -32 -12
3620a2J0m0O5LJ9%k15K09kj06J98j91j32L25o7q0J73k83LK26o8j1m0o5P2N2P0
$$ -12 -2 -42 23 26 45 45 -170 39 37 -69 129 -62 -194 131 64 -16 157 -126 -123 103 35 24 -16 -81 -9 43 113
3647A13l0k37J54L2j40K60j34j68K32p2r8K42j66q1J56j50O4R2n2j8n9K1R9q6
$$ 113 83 -154 0 32 -108 152 18 -150 82 10 -88 154 -12 -93 63 -87 -23 69 17 -1 -60 -39 60 -26
3671b6J27o3k37K46nj18K14j50j81L18p3o6Q6j44mJ04LLo4j0J25j41J19l6j84
$$ -26 101 38 -199 47 42 -76 138 -12 -193 125 52 -14 72 -72 -76 28 31 34 -30 -40 85 -56 63 27 -157
3696a57K21kj72J91p3j47K58j13j13J59o6k3R8q2ql2P4O1j49R7L0j69K16k0k39
$$ -157 64 62 -110 81 8 -139 119 6 -107 52 -14 -37 61 -21 -29 -61 13 74 -75 22 52 -117 99 79 -160
3721a60K28j9j49K01p6j23J83o2l1L9n5K8l8N4J2j10R9P8k08J64k0j94K57n2j63
$$ -160 68 49 -100 101 25 -98 85 23 -8 31 -24 4 -34 20 32 -78 21 99 -109 55 35 -159 98 46 -117
3746a17J73m8j09J81p5o6N5KO0o6J3K2j62J47Q3j92J52M0j99J90j6j97J77o3o7
$$ -117 56 8 -101 80 5 -61 -6 -4 56 -10 3 25 -137 10 93 -99 53 93 -106 84 68 -129 48 -15 -82
3771h2J69o7l7N5n1J7l8L6P5j66J08L3j93J93O1k49J73K6k05K24l9j35O1%J9P0
$$ -82 87 20 -17 38 -13 4 -34 2 77 -89 19 52 -141 52 113 -136 37 63 -142 82 43 -92 -31 -31 -12 58
3797E8l5Qq0k4J75j78R9M4k06J51R3j83J73j9k26K20l8j25J42n3o2Q1RO3q8qQ1
$$ 58 23 31 -49 -73 102 -76 23 67 -139 12 105 -78 95 76 -150 70 32 -93 49 -4 -66 15 24 87 -1 -9 72
3824G2k16J06J54k28J07J46k82J49Q9j96J51n4r5J28n0KP1j16M3K5nJ38j83JJ05
$$ 72 -144 -38 116 -112 -5 141 -141 8 97 -99 52 -2 -97 31 -19 -17 54 -62 -19 6 1 139 -44 -43 62
3849F2k49K05J48k58J33J02k73K00K3k05J07n0L5M3rN1n8j20J86j12k1J94k58
$$ 62 -187 18 166 -92 41 143 -130 70 93 -112 -5 -55 -20 23 14 65 7 -113 73 -39 -60 134 -124
3872a24N5J20j65J50J14k80J68K4j60J73n0j34Q1L1N3Jo4R6j88M5J94k06j8K08
$$ -124 -69 51 -114 36 150 -130 38 62 -98 75 25 -109 -28 3 56 57 -7 89 -99 -54 140 -66 -84 124
3896A24k20P2J73k23Q5M5j13J03m5q1R6n0M8K8o6Q7m8l9J07k26M6K21k22J12J37
$$ 124 -96 -24 149 -74 11 56 -57 46 1 -80 16 -34 14 42 -24 63 15 -24 83 -143 -97 124 -98 14 151
3921A51k63P7J59j92O1K3m3L1j4M0m8n1J54m7r5J71j57j0J34j69K9J44j43J26
$$ 151 -112 -35 124 -68 -7 16 -27 4 -10 30 -18 -69 85 38 -57 114 -43 -53 81 -88 -59 85 -58 68
3945F8O0k05O9L2o0J5jK9j7J4J22j90l3J78j25j7J98k37PJ96j51N9L5p3L3L7o3
$$ 68 128 -77 -8 24 -36 -21 -22 7 -10 4 126 -64 -97 81 -44 -61 137 -100 -93 103 -48 11 46 -27 6 43 -20
3972b0M4j02M4N9n9J37j12j3J34j83oJ84k00O1J79k52N9J39j15N6k8m1J4j3J12
$$ -20 24 -78 -34 25 -34 103 -9 -22 112 -71 -77 107 -93 -32 147 -105 -46 93 -22 34 6 -35 -21 -34 78
3997G8p4j36J73k8m6K16k19q7J72j20M9J44k38Q5J20j14R2l9j01M6J4M5N0j62
$$ 78 4 -132 41 13 -33 183 -36 -123 49 -71 -22 122 -116 -31 89 -25 67 28 -73 -27 -13 32 82 -80
4021h0J73j14r2K63j47p5K20j93q3K46j93N7Q6j46Q9M1o0P8j47J0Q1r6J87o6j37
$$ -80 93 -21 -113 150 3 -72 148 -45 -128 118 -75 -18 68 -78 11 52 -8 70 -77 -67 14 -82 105 39 -98
4046i8J76o9j04K52k22n7K62j80lJ42j71M9R7o9L5o7J9N2r7Q9J5j96K56m1j35
$$ -98 78 9 -95 157 -65 -122 140 -40 -43 99 -72 -23 74 5 40 -27 -8 44 -53 36 51 -145 111 70 -65
4071f5J62j37o8K19j05r6J88j84P9R6j05K7l5oM3n5P9Rj77K02n6j05K09p5j66
$$ -65 97 -40 -108 111 6 -90 98 -86 -7 89 -16 11 -24 -30 13 -42 37 46 -131 71 15 -90 119 44 -122
4096a22K14j28m4J86j18J2J6j8L1Rl1J8r6J04K5j12J28o6j29K21p1j08J77j41
$$ -122 92 -36 -80 106 -12 0 16 -2 29 38 7 25 -71 33 58 -54 74 8 -121 100 29 -79 98 -43
4120d3k4J32n4o2Q3n6L5j4K0K4j29J35l0j03J40j0j49J97p0r9J88j28k5J10r1
$$ -43 -67 65 11 -51 32 -24 11 -3 17 41 -88 47 17 -86 54 44 -105 92 22 -77 111 -17 -42 68 -23
4145b3J2O0m6L0p1N2L7j08J23pj83J92k6j62K27r4j13J91j03l2J05j06K2K9m2
$$ -23 -11 49 3 33 -38 14 51 -57 66 59 -124 68 42 -120 107 13 -100 91 -12 -44 61 -45 -23 6 -36
4170c6P5n5kQ3j52J15L8j89J90k8j62K26n7j64K28j06p0J59j03QM5p7N9l6pJ29
$$ -36 39 -16 -18 65 -87 28 66 -123 67 39 -123 103 46 -118 110 4 -66 93 -10 -2 43 -34 25 -11 -18 111
4196A11j81P9Q6k22J75K1k18J95kj85K65j11j01J64j33L9P7q6L1l5m1J66j48N7
$$ 111 -70 9 95 -127 48 69 -149 46 44 -141 124 13 -88 76 -57 -18 59 -27 4 -31 -72 94 -54 3
4220CJ12k52J72P3k29J67L8k41K54l7j30J66j03m1Q1p1N5J9q1J08j12J4J66k00
$$ 3 115 -137 35 108 -121 46 84 -157 97 60 -70 96 -7 -48 33 -38 17 36 -45 63 -49 -35 131 -69
4244f9O5R5k28J59Q5k59J84J0j61K10n7r1Q8p0K8J5m7Q9q0%J63j88L3J27j84J08
$$ -69 -4 91 -137 22 107 -152 32 42 -119 91 34 -57 31 -39 -11 4 -43 46 -34 -34 129 -59 -26 101 -83 25
4270B5Q3k21J09P1j49J59l9r0R2l1OJo3O1n0K1J31j59K2R8j87R9J20k15J04N1
$$ 25 108 -113 -4 67 -82 77 38 -52 40 9 15 16 -47 14 -36 -15 116 -43 -21 77 -110 -11 109 -106 -2 49
4296D9j39J18J7p3L4k6M1k1j5O3j08kJ42j18N9J05k25P2Q8j30J14j0j07P5L1l4
$$ 49 -90 28 45 -28 6 -20 21 0 -15 48 -60 -62 80 -38 21 126 -99 -27 61 -69 45 35 -72 3 34 0
4322@M2o7J0rLJ29j49mJ13j60Q6J38k16P5Q6j77J01K6j09J01j3%N1q2M7k5p8J51
$$ 0 42 -25 -15 -24 -21 108 -41 -45 68 -92 -6 132 -84 -9 77 -100 1 27 -82 19 6 6 57 -25 22 -3 -81 70
4350G0r8k1J79j98M7J38k03Q9J22k34J44M0j47J16m5m4P1l1O3lj42J51j12n8K23
$$ 70 -28 -49 130 -68 -21 117 -86 3 125 -109 35 75 -72 44 -1 -45 26 -5 58 55 -87 64 -48 -106 117
4375A17j53l0K03j95K7J47k41J18O0j27J28j7j02J21p9J4P3j18J21o7p9J74j36
$$ 117 -36 -66 137 -58 -31 116 -125 -7 53 -74 54 37 -65 56 -23 -9 64 -54 67 0 -79 95 -41
4398d1m9K36j87QK02k23J6J18j74J08L4o2P7o6j3N2j01Q0K1j46J87q2n9J58j44
$$ -41 -90 146 -41 -33 169 -54 -38 80 -94 14 48 -14 63 -3 -16 36 -65 15 36 -110 77 -5 -64 94 -50
4423e0m9K26j64J6J41k20P9O1p3L5K9m9O9o7P1l7j23J60n3n8J74r0j04J62j13
$$ -50 -99 127 -37 -21 120 -100 -21 40 -33 2 31 -18 51 -16 55 18 -105 55 2 -56 118 28 -76 86 -27
4448b7j3J16j12J6O4q0N7Lo6L2NM9k5o3P9o7n6J80j08m9J64j08l9J12p6l0N7k4
$$ -27 -40 76 -36 -20 44 -36 21 24 -42 -10 -5 44 19 -44 35 -32 -88 92 -16 -65 99 -9 -48 64 -12 -42 15 -9
4476iM2k7J3nn0N0J8o5R6n4p0J41j05LR4r8J0J03j02MK2m4J7PM6jq6J18n6j06
$$ -9 33 6 19 14 -36 14 32 -33 63 9 -61 80 -25 -22 72 -26 -16 87 -15 -11 11 -33 -16 -9 37 36 -50 68 12 -94
4506i4J61q1o9J74q2o1J31j40L8O2o9N8j8l7N4m9J7N6j05J18m7p9J43q0j10K21
$$ -94 67 -14 -83 91 9 -52 79 -61 -23 39 -30 28 10 -27 27 -22 -5 51 -54 64 17 -62 81 1 -109 112
4532A12j36m0J74j42mJ05j07J5L6n8R3p5K1Q2j57R5N4j72J59k9j24J78q5r0K01
$$ 112 -24 -64 110 -32 -36 69 -38 -23 13 -45 48 -27 -6 76 -81 14 68 -104 55 26 -98 80 -5 -95 106
4557A06j30m2J92j86O6L9r1P5k3k2Q1j13O8O5j89J61Kj68J76j2j63K06j04o5J49
$$ 106 -24 -66 126 -60 6 45 -46 29 6 -16 65 -48 20 85 -104 57 59 -109 67 55 -108 98 -6 -71 78
4582G8j13K5N4q0K5L8q8J15p4OP1j47J14K3j36J32Qj65J92n0j00J50q4m8J21o9
$$ 78 -35 -10 44 -36 -11 27 -61 54 -20 -14 57 -90 24 47 -89 43 51 -114 78 28 -72 78 -6 -54 67 -2
4608bJ5J4o6Q0n8L2N8j17M1P1j43J01J6j28J23j6q0J21o1m7O7k5JJ2qnk5J1O7
$$ -2 13 27 -39 41 -17 15 73 -44 -3 68 -75 26 42 -86 37 21 -59 62 1 -46 21 -4 -3 9 1 -4 -29 -18 49
4637D9j11P8K3j17J10J4r6O8Rq5J07j7l1J4k8J1OK0Jn6M3L3j06J01j8j08J21M
$$ 49 -62 16 39 -78 32 46 -50 18 27 -58 49 32 1 15 -13 -2 4 24 25 -31 12 45 -61 40 22 -86 35 39
4665C9r0J00n1o4R6l2PJk9L5l4J1N8j10O9N0j21J10Lj40J32mr4J35p8m8R3n0Q
$$ 39 -51 49 -2 -66 30 -2 5 6 -23 12 -22 -11 47 -63 6 56 -65 45 48 -92 40 36 -58 77 -1 -49 44 -6 2
4694BL4n7M5l3OR1j36L1Q4j54J07O7j62R3J9j50J81m6r2R9n4mP4o7J8jo6J40q5
$$ 2 36 -21 24 -9 -3 88 -48 -17 67 -87 20 87 -75 18 37 -113 68 22 -70 29 -25 -29 45 -22 -4 -5 -71 69 -16
4723a6QP9j59O7J23j83R1N7j75J64Jj17J04n1l9R7o7M1Ko1R6o9m2J28j23RJ26
$$ -16 -8 71 -88 -21 102 -81 10 67 -108 56 57 -60 44 -7 -46 51 -16 25 27 -34 62 -7 -49 79 -44 -35 91
4750I1j63N7Q8j66R7M4j50J37k3o8Q6m9oN1o8O6k3n7J37j01k4J17j26J4J42j56
$$ 91 -72 -15 73 -93 4 48 -102 35 12 -56 30 -19 -25 26 -42 24 1 -56 81 -20 -44 73 -53 -39 103 -53
4776e3N3P0j27Q1J4p5N0mk9O3p5M1ol0Q5o5j0O4q8KJ07j23M6O8r6L8K7p7L3K5
$$ -53 0 70 -57 24 38 -37 13 9 -20 43 -32 9 3 -27 58 -7 -17 47 -41 -39 68 -55 -9 59 -37 1 28 -49 -16 9
4806Ij3J5j3M0l9k2M8n3PR0q7J6O4q1OO4p2L2J5l0J9j5Jl0K0M8l6j8Q1j07K7O0
$$ 9 -4 11 -2 38 -1 -23 25 -28 -21 69 -18 -2 62 -19 -13 51 -21 11 26 -4 15 0 1 -29 -9 39 3 -15 66 -41 -14 46
4838D6r8K3O4p8N7L9q8K3mmK2j5L4l4k8Q8o3j6Q9q6QR0j12L6M9j03P6L0n1N9k8
$$ 46 -52 -29 35 -43 14 53 -35 -12 -16 -20 2 -13 21 -13 -41 47 -16 -32 57 -29 -21 69 -43 -7 42 -61 15 45 -6 53 25
4869B5m1J9m6N8J0o8R9o5l9J14j01k1J26j35M7Q6j26N6K5r3Q3K0n4P4r1K1K4o6
$$ 25 -16 3 -43 15 25 -43 56 -9 -48 66 -35 -56 70 -65 -18 68 -58 -2 23 -70 13 33 -21 53 -38 -17 7 -59
4897e9Q6k0n2J24p8n2J32j18oJ16j24N3Q4j24N6jp2P3k0JN9j31R0jq7J35o6o1
$$ -59 27 7 -45 79 1 -51 81 -37 -43 73 -51 2 86 -38 18 17 -55 18 -2 -1 58 -73 17 16 -71 64 -2 -63
4925f3J35q9l8J34j50K6R6r0N8L8j07N3jl0O4n4L2J3o1P5j5r3J36o2o4J45j00
$$ -63 72 -17 -55 79 -71 -45 51 -39 19 57 -50 3 2 -28 36 -18 14 27 -34 41 26 -67 69 7 -57 88 -12
4952a2k2R1p6KP5o8K2jm1L6k4OL5n8O8k5m1O6m2n2R5m2k3R8r0RL8l0oL2j2NrK1
$$ -12 -34 57 -19 -17 58 -10 12 11 -30 6 -18 -12 23 -35 33 8 -33 33 -9 -61 34 -8 -31 67 -23 -14 24 -6 -12 20 8 13 4 25
4986B5j6n4Q2k0l7P7l4o0Q1n3j7M2k8K0J2mk5NjQk7N4m0l9J00n9l0P9n1l6R7o2
$$ 25 9 -45 37 17 -20 57 23 -37 44 -9 -26 16 -12 8 20 16 -9 -4 -5 3 -24 30 -10 -49 51 -8 -38 41 -10 -46 51 -11
5018a1qL2k5J6Lj1L0m7M1Qq4R3j9n6R3n7n0J17p8JP4j05J8Q5q0K9j3l8N2j9M3
$$ -11 -19 13 -12 4 7 -4 26 -21 20 28 -56 37 18 -38 55 -2 -52 65 -13 -12 62 -43 -25 60 -20 9 -4 -42 10 -9 34
5049C4qq4P1K3j03J13m4q9J38o0k7J04j05%Q5q0M2J6n6M3rl1R2q3L7J0j00J12
$$ 34 26 -58 13 36 -67 46 2 -87 51 -9 -36 68 -37 -37 48 -32 10 26 -30 13 4 -27 65 -18 19 29 -71 41
5077D1%q8J10n1q5J57p0l8Q0j02J6Q0o9M8m7k7P9n4K8L5j11N5O1j16J18l4q5J37
$$ 41 41 -47 63 12 -73 84 14 -24 56 -46 -30 50 -19 29 -18 -45 34 -20 8 43 -68 -13 48 -68 50 16 -69 68
5105F8n3n9R3n6k5R0o8JK5k7M4m6QN6q7O2L0j07N6K8q6J05k1q2J02n0k1L9m3M
$$ 68 15 -44 49 -7 -32 58 -10 -9 16 -11 33 -13 -5 51 -36 26 56 -51 5 33 -53 52 31 -51 51 1 -20 19 -24 -20
5135b0L9l9L1k5J6L8q1L5L5o6N6L2j19Q7No0P0kn1K3J6j4J4j8jk3L4L4n5K7%m3
$$ -20 19 -20 11 -14 2 40 -41 -6 29 -37 19 51 -68 19 24 -36 34 32 -19 4 20 6 20 2 1 -22 12 46 -9 18 18 -25
5167b5M9J5p3M5Jn1M9mj8K0Kk4%J0J4n4M8J4o9R0j2o2O2k3n1R0l5j8N1n0K2K1
$$ -25 24 39 -34 11 12 -39 10 6 -12 8 10 -14 -14 -4 10 -44 4 18 -51 39 27 -35 27 4 -47 43 8 -10 41 -9 13 34
5199C4l6L2n2K8L8p2M1K4r9J06Kr2R5k3q2R7l5m9P7n9L0K0m4N3l6k4O1p4J8P7
$$ 34 -2 30 -22 6 44 -28 13 37 -62 44 46 -46 49 26 -56 41 6 -43 34 -25 5 25 -19 34 -2 -26 35 -39 -21 56
5229E6j04N9N3j22J00Kj10J13l1o2J02m9jL8o0L3J1m6Q3p9j7J11j38P3O6j35N8
$$ 56 -48 11 64 -58 42 44 -66 47 16 -46 56 7 6 44 -16 17 28 -18 65 -14 -31 80 -58 15 81 -54 4
5256DO6j31R6j2r6R9m2j7P2n0LL3o8P0m1j9R7r3RR5j11M8O2j45Q8M5r9P4j5o4
$$ 4 70 -61 35 23 -73 26 -16 -33 39 -11 -8 25 -43 27 -14 -33 64 -29 -20 75 -36 12 74 -71 17 62 -37 37 22 -42
5286d2Q0k2KL8o8K8k0k7Q6n1l9J00r2L9P7j36M3L1q7O7K5o6M6J4k6J3j0Ook1N6
$$ -42 38 16 18 56 -12 16 -4 -31 55 4 -35 65 -27 12 89 -47 -4 27 -60 7 32 -34 12 26 0 13 3 9 3 -18 38
5317C8n7j2Q1n5MO6q8L1N9q9J7J2j3K8K1j3j9qK0k9MM1n6J0L6m8QN6p0K5L3o0
$$ 38 -19 -31 50 -5 -1 65 -23 8 67 -22 -5 7 -6 22 43 30 11 3 23 -6 -2 39 -17 -7 29 -19 -11 45 -25 0 33 -27
5349b7K9Mj6plK9PjM1q6j0N7m2K8N6j01L6P3o9L1jn5M9NLjl9L2j6k2P3n5l1R7
$$ -27 2 6 -10 -17 -20 9 16 15 56 -30 -40 17 -25 3 59 -42 -6 67 -2 29 28 -27 22 27 30 29 -10 22 6 -16 57 2 -29 68
5383F8j07J9O6j02M5O6r6N6K2o4M7l6j7M6k4M7nq0R3k7n1J08j07mJ07q6J5P8j34
$$ 68 -39 -20 46 -56 -11 55 -41 15 37 -27 20 -16 -33 13 -11 36 31 -49 44 17 -34 74 -33 -37 70 -16 -1 77 -57
5412e7O5M8p5O4k0o4P3k9J1J6p9P8Np5Q9n6p8J56r3k7J21j15K6P3j07L7M8p9Q0
$$ -57 8 56 -19 45 25 -39 34 5 16 32 -47 31 36 -39 50 -6 -84 72 -21 -48 73 -42 -16 57 -50 -13 35 -44 36
5441C6l8k6M4m2N6Qq3Q1j5n4J03p5n8J29m8j6Q4j18K7M3o3L3Ll2N6k7j0K9p0O2
$$ 36 -2 -28 16 -26 30 38 -45 36 21 -33 70 -5 -63 66 18 2 86 -32 -5 38 -25 8 11 -21 35 8 -2 27 -43 19
5471A9Jn9P3k9p1J25p7k7Q3o1PO9m9k5M3l1K7j8K4pl0O0j0n6N4j3m6P5m2j1M3
$$ 19 20 -39 34 5 -66 59 -18 -45 38 -23 -16 53 4 -21 22 -9 18 0 24 17 -13 47 37 -19 35 22 -24 51 9 -2 41
5502D1l2l7N3j9lJ1j5%j8L4j0nJ9m4j2P6l3l0M5m1j2P1k1l3RJJ1NK0k1l1L7J9
$$ 41 9 -28 25 6 3 14 -1 -1 -19 15 5 0 19 -25 -37 39 6 -24 21 -20 -32 39 18 -15 -6 -5 6 11 31 10 -21 16 35
5535C5n5Q0o7k6Q7n7KN7o2KM3o8M3j0Lnj5K3Mm4O6l5o5J17o0l4Q3m6m7J14o5j3
$$ 35 -20 60 -7 -33 54 -3 -1 56 -6 -4 39 -29 14 4 7 2 -13 10 14 -30 36 1 -64 53 -7 -41 42 -4 -51 63 -2 -15
5567a5M6m9K4jk6N1k7oN6p7N3K8j01R3j9q8J27n0n7J26q9k7Q9q0J7L5p2M7rj3
$$ -15 31 -18 6 5 -21 30 3 -3 53 -24 29 57 -44 49 30 -58 69 19 -38 88 -1 -28 61 -19 -2 33 -39 8 -1 -14
5597a4O3o7J5M8j05P8K7j41J24j4p4J26m1o6R2o4qP7p8L7K0l9M6m0qN7q5M7M7
$$ -14 49 -18 -3 45 -60 18 45 -96 28 14 -60 66 25 -41 51 -13 -21 56 -22 15 35 -4 42 2 -6 51 -34 13 60
5626F0j20R5J6j03J00j5p1R1l6m5O9n6QK9m3M0pj2M5n5J1L4q4M6L7r9Q6J2o8Q8
$$ 60 -60 35 51 -52 48 33 -38 53 17 -28 41 -15 -7 22 -21 19 12 0 45 -10 1 35 -49 -3 34 -65 21 33 -35 53
5656E3mo7N2l3j3M1k2Kj6J8L2m0jL3o9L0L4p4P1Qm9L5qm0L6Ql7R%MnK7J2n3L4
$$ 53 49 -18 34 1 -12 29 7 9 -7 11 43 3 2 35 -34 -4 30 -44 27 35 -14 21 13 -27 9 17 -20 -11 -11 -7 -12 15 27 -26 8
5691HJ3m6L2J1o4O1J0k6L0j0j0kQnj3J0J5m5M1K8p2P1pq3O7om8O8m0m1O3Mkj4
$$ 8 21 -25 7 18 -46 15 25 -1 29 19 9 7 15 10 -3 7 22 -23 18 46 -26 45 38 -45 22 16 -32 36 -4 -45 18 22 20 6
5725Fm1K9j3K1N7j05J7O5p1O5K4j05L9K7p2J02k3p0P6l1K1K1m1J6jm4P2m9j2J02
$$ 6 -35 -6 -19 2 59 -46 -29 36 -35 30 54 -51 -12 15 -57 45 22 -48 28 -3 18 39 -2 14 13 -31 41 -8 -20 82
5755H2j15M1O4j18N8N2j34R2%p5Q6l1l9P3n6K2K4o5O1l2l4Q6o6LJ12j15K9N8j20
$$ 82 -33 8 72 -46 12 64 -70 22 22 -53 33 2 -37 36 -20 2 26 -39 22 -10 -44 42 -24 -21 91 -24 5 63 -57
5784e7M5O6j12Q8J7q0Q5k9l2K5m1M3K1o4O8n2l2J21r3j3R1j09L1P1r9L1L0o6O1
$$ -57 -12 54 -58 30 47 -33 52 23 -9 16 -25 18 39 -25 43 -9 -41 80 -13 -26 65 -44 -13 58 -41 -10 20 -46 15
5813A5J1n0N0l7kJ8m0N8j8k0O9o2j7Q7p3j5P3o0JP1o9K6Ql2L5j0kj9j3L6pj3M9
$$ 15 26 -24 26 -11 -13 5 -35 23 5 -15 54 -8 -25 62 -11 -26 47 -13 -12 59 -10 16 24 -8 27 17 15 -4 -17 19 12 -1 48
$$ [...]
8191B0
##END NTUPLES=NMR FID
##END=
