##TITLE=1H_DE-80H_X3
 200.13MHz, d2o
 8 sc
 
 19ns.26.2.2025
##JCAMPDX= 6.0         $$ Bruker NMR JCAMP-DX V2.0
##DATA TYPE= NMR FID
##DATA CLASS= NTUPLES
##ORIGIN= UXNMR, Bruker Analytische Messtechnik GmbH
##OWNER= pz
$$ XWIN-NMR		Version 3.5
$$ Thu May 28 15:15:24 2026 Russian Standard Time (UT+4h)  Yarkov@DPX200
##.OBSERVE FREQUENCY= 200.1313
##.OBSERVE NUCLEUS= ^1H
##.DELAY= (6, 6)
##.ACQUISITION MODE= SIMULTANEOUS
##.ACQUISITION SCHEME= undefined
##.AVERAGES= 8
##.DIGITISER RES= 18
##SPECTROMETER/DATA SYSTEM= spect
##.PULSE SEQUENCE= zg30
##.SOLVENT NAME= CDCl3
##.SHIFT REFERENCE= (INTERNAL, CDCl3, 0, 14.3821)
##AUDIT TRAIL= $$ (NUMBER, WHEN, WHO, WHERE, WHAT)
$$ ##TITLE= Audit trail, XWIN-NMR		Version 3.5
$$ ##JCAMPDX= 5.01
$$ ##ORIGIN= Bruker BioSpin GmbH
$$ ##OWNER= Yarkov
$$ C:/Bruker/XWIN-NMR/data/yarkov2/nmr/H-C/1/audita.txt
$$ ##AUDIT TRAIL=  $$ (NUMBER, WHEN, WHO, WHERE, WHAT)
(   1,<2026-05-28 15:13:39.59 +0400>,<Yarkov>,<DPX200>,
      <created by zg, POWCHK disabled, PULCHK disabled
       configuration hash MD5:
       00 E9 B6 7A A2 85 ED C7 34 08 36 98 17 FE 4E 26
       data hash MD5: 16K
       5F 28 06 95 19 A0 57 8D E8 43 50 07 89 B7 77 87>)
$$ ##END=
$$ 
$$ hash MD5
$$ 64 53 73 A3 C2 D9 EB 89 77 2C 11 12 5A DE A0 AE
##$RELAX= 
##$RELAX= 
##$RELAX= 
##$RELAX= 
##$RELAX= 
##$RELAX= 
$$ Bruker specific parameters
$$ --------------------------
##$DU= <C:/Bruker/XWIN-NMR>
##$EXPNO= 1
##$NAME= <H-C>
##$PROCNO= 1
##$TYPE= <nmr>
##$USER= <yarkov2>
##$AMP= (0..31)
100 100 100 100 100 100 100 100 100 100 100 100 100 100 100 100 100 100 
100 100 100 100 100 100 100 100 100 100 100 100 100 100 
##$AQSEQ= 0
##$AQ_mod= 1
##$AUNM= <au_zg>
##$AUTOPOS= <>
##$BF1= 200.13
##$BF2= 200.13
##$BF3= 200.13
##$BF4= 200.13
##$BF5= 200.13
##$BF6= 200.13
##$BF7= 200.13
##$BF8= 200.13
##$BYTORDA= 1
##$CFDGTYP= 0
##$CFRGTYP= 5
##$CHEMSTR= <none>
##$CNST= (0..31)
1 1 145 1 1 1 1 1 1 1 1 1 1 1 1 1 1 1 1 1 1 1 1 1 1 1 1 1 1 1 1 1 
##$CPDPRG= <>
##$CPDPRG1= <>
##$CPDPRG2= <>
##$CPDPRG3= <>
##$CPDPRG4= <mlev>
##$CPDPRG5= <mlev>
##$CPDPRG6= <mlev>
##$CPDPRG7= <mlev>
##$CPDPRG8= <mlev>
##$CPDPRGB= <>
##$CPDPRGT= <>
##$D= (0..31)
0 0.7 0 0 0 0 0 0 0 0 0 0.03 0 0 0 0 0 0 0 0 0 0 0 0 0 0 0 0 0 0 0 0 
##$DATE= 1779966819
##$DBL= (0..7)
120 120 120 120 120 120 120 120 
##$DBP= (0..7)
150 150 150 150 150 150 150 150 
##$DBP07= 0
##$DBPNAM0= <>
##$DBPNAM1= <>
##$DBPNAM2= <>
##$DBPNAM3= <>
##$DBPNAM4= <>
##$DBPNAM5= <>
##$DBPNAM6= <>
##$DBPNAM7= <>
##$DBPOAL= (0..7)
0.5 0.5 0.5 0.5 0.5 0.5 0.5 0.5 
##$DBPOFFS= (0..7)
0 0 0 0 0 0 0 0 
##$DE= 6
##$DECBNUC= <off>
##$DECIM= 32
##$DECNUC= <off>
##$DECSTAT= 4
##$DIGMOD= 1
##$DIGTYP= 9
##$DL= (0..7)
0 120 120 120 120 120 120 120 
##$DP= (0..7)
150 150 150 150 150 150 150 150 
##$DP07= 0
##$DPNAME0= <>
##$DPNAME1= <>
##$DPNAME2= <>
##$DPNAME3= <>
##$DPNAME4= <>
##$DPNAME5= <>
##$DPNAME6= <>
##$DPNAME7= <>
##$DPOAL= (0..7)
0.5 0.5 0.5 0.5 0.5 0.5 0.5 0.5 
##$DPOFFS= (0..7)
0 0 0 0 0 0 0 0 
##$DQDMODE= 0
##$DR= 18
##$DS= 0
$$ [...]
##$SUBNAM2= <"">
##$SUBNAM3= <"">
##$SUBNAM4= <"">
##$SUBNAM5= <"">
##$SUBNAM6= <"">
##$SUBNAM7= <"">
##$SUBNAM8= <"">
##$SUBNAM9= <"">
##$SW= 18.0517328524113
##$SWIBOX= (0..15)
0 0 2 0 0 0 0 0 0 0 0 0 0 0 0 0 
##$SW_h= 3612.71676300578
##$TD= 16384
##$TD0= 1
##$TE= 0
##$TE2= 300
##$TE3= 300
##$TEG= 300
##$TL= (0..7)
0 120 120 120 120 120 120 120 
##$TP= (0..7)
150 150 150 150 150 150 150 150 
##$TP07= 0
##$TPNAME0= <>
##$TPNAME1= <>
##$TPNAME2= <>
##$TPNAME3= <>
##$TPNAME4= <>
##$TPNAME5= <>
##$TPNAME6= <>
##$TPNAME7= <>
##$TPOAL= (0..7)
0.5 0.5 0.5 0.5 0.5 0.5 0.5 0.5 
##$TPOFFS= (0..7)
0 0 0 0 0 0 0 0 
##$TUNHIN= 0
##$TUNHOUT= 0
##$TUNXOUT= 0
##$USERA1= <user>
##$USERA2= <user>
##$USERA3= <user>
##$USERA4= <user>
##$USERA5= <user>
##$V9= 5
##$VALIST= <valist>
##$VCLIST= <CCCCCCCCCCCCCCC>
##$VD= 0
##$VDLIST= <DDDDDDDDDDDDDDD>
##$VPLIST= <PPPPPPPPPPPPPPP>
##$VTLIST= <TTTTTTTTTTTTTTT>
##$WBST= 1024
##$WBSW= 4
##$XGAIN= (0..3)
0 0 0 0 
##$XL= 0
##$YL= 0
##$YMAX_a= 305912
##$YMIN_a= -339237
##$ZGOPTNS= <>
##$ZL1= 120
##$ZL2= 120
##$ZL3= 120
##$ZL4= 120
##$ABSF1= 10
##$ABSF2= 0
##$ABSG= 5
##$ABSL= 3
##$ALPHA= 0
##$AQORDER= 0
##$ASSFAC= 0
##$ASSFACI= 0
##$ASSFACX= 0
##$ASSWID= 0
##$AUNMP= <proc_1d>
##$AZFE= 0.1
##$AZFW= 0.1
##$BCFW= 1
##$BC_mod= 2
##$BYTORDP= 1
##$COROFFS= 0
##$CY= 83.5205535888672
##$DATMOD= 1
##$DC= 2
##$DFILT= <>
##$DTYPP= 0
##$F1P= 10.8118882576601
##$F2P= -7.23987719738617
##$FCOR= 0.5
##$FTSIZE= 0
##$FT_mod= 4
##$GAMMA= 1
##$GB= 0.15
##$INTBC= 1
##$INTSCL= 1
##$ISEN= 128
##$LB= 0.25
##$LEV0= 0
##$LPBIN= 0
##$MAXI= 10000
##$MC2= 0
##$MEAN= 0
##$ME_mod= 0
##$MI= 1.114404
##$NCOEF= 0
##$NC_proc= 0
##$NLEV= 6
##$NOISF1= 3.799351
##$NOISF2= 2.8
##$NSP= 1
##$NTH_PI= 0
##$NZP= 0
##$OFFSET= 14.38212
##$PC= 1
##$PHC0= -6182.096
##$PHC1= 21.22195
##$PH_mod= 1
##$PKNL= yes
##$PPARMOD= 0
##$PSCAL= 0
##$PSIGN= 0
##$REVERSE= no
##$SF= 200.129724274929
##$SI= 16384
##$SIGF1= 3
##$SIGF2= 2
##$SINO= 400
##$SIOLD= 16384
##$SREGLST= <1H.CDCl3>
##$SSB= 0
##$STSI= 0
##$STSR= 0
##$SW_p= 3205.1282051282
##$SYMM= 0
##$S_DEV= 0
##$TDeff= 0
##$TDoff= 0
##$TI= <>
##$TILT= no
##$TM1= 0
##$TM2= 0
##$TOPLEV= 0
##$USERP1= <user>
##$USERP2= <user>
##$USERP3= <user>
##$USERP4= <user>
##$USERP5= <user>
##$WDW= 1
##$XDIM= 8192
##$YMAX_p= 0
##$YMIN_p= 0
$$ End of Bruker specific parameters
$$ ---------------------------------
##NTUPLES= NMR FID
##VAR_NAME=  TIME,          FID/REAL,        FID/IMAG
##SYMBOL=    X,             R,               I
##VAR_TYPE=  INDEPENDENT,   DEPENDENT,       DEPENDENT
##VAR_FORM=  AFFN,          ASDF,            ASDF
##VAR_DIM=   8192,          8192,            8192
##UNITS=     SECONDS,       ARBITRARY UNITS, ARBITRARY UNITS
##FACTOR=    0.0002768,     1,               1
##FIRST=     0,             0,               0
##LAST=      2.2672688,     0,               0
##MIN=       0,             -339237,         0
##MAX=       2.2672688,     305912,          0
$$ Real data points
##PAGE= N=1
##DATA TABLE= (X++(R..R)), XYDATA
$$ [...]
$$ plain form
3626 -2798 -5297 3022 4911 -2962 -5193 3028 5115 -3007 -4886 3150 5086 -3281 -4892 2951 5007
3641 5007 -2992 -5068 3179 5458 -3401 -4993 3186 5043 -3303 -5017 3198 4891 -3444 -5032 3328
3656 3328 4890 -3385 -5002 3473 4999 -3467 -4870 3499 4860 -3550 -4847 3614 4867 -3534 -4711
3671 -4711 3581 4619 -3622 -4616 3646 4493 -3666 -4639 3587 4513 -3557 -4486 3789 4519 -3628 -4441 3705
3688 3705 4502 -3775 -4497 3820 4474 -3854 -4453 3745 4518 -3927 -4491 3814 4448 -3854 -4432 3893 4284
3705 4284 -3919 -4392 4095 4413 -3895 -4345 3897 4291 -3926 -4249 4006 4261 -4064 -4106 4096 4250 -4132
3722 -4132 -4050 3921 3999 -4446 -3871 4273 3916 -3871 -3686 4225 3542 -4044 -3786 4524 2944 -3316 -3231 3759
3740 3759 3667 -4061 -3661 4935 3516 -4605 -4040 4840 3331 -4641 -3755 3540 4459 -4497 -4553 4415 3323
$$ packed form
3626b798k499Q319J889p873k231Q221K087q122j879Q036J936q367j611P843K056
3641E007p999k076Q247K279q859j592Q179J857q346j714Q215J693q335j588Q360
3656C328J562q275j617Q475J526q466j403Q369J361q410j297Q461J253q401j177
3671d711Q292J038q241r94Q262Q47q159r73Q226R26q070r29Q275P30q147q13Q146
3688C705P97q277p22Q317O54q328n99Q198P73q445n64Q305O34q302n78Q325L91
3705D284q203m73Q487L18q308m50Q242L94q217l23Q255K55q325m2Q202J54q382
3722d132Q2P971P8q445N75Q144l57p787J85P911o83p586K58Q310j580o260Q5O990
3740C759r2p728M00Q596j419q121N65Q880j509p972Q86P295R19q956n6Q968j092
$$ plain form
3757 3323 -4321 -4371 4624 3694 -4265 -2981 5147 3631 -4438 -4073 5078 3237 -4737 -3628 4880 3452
3773 3452 -4773 -3199 4488 3612 -4247 -3168 3915 2508 -4822 -3490 5341 2273 -4987 -2979 4877
3788 4877 3309 -4461 -2518 4951 2816 -4914 -3469 4567 2641 -4747 -3118 4871 3947 -3611 -2659
3803 -2659 4290 3509 -4904 -3586 4375 2623 -4824 -2312 4297 3748 -4643 -2568 3617 2455 -5355
3818 -5355 -3240 5153 3043 -5152 -3578 5205 2229 -5106 -2527 4814 2475 -5860 -1624 5001 2198
3833 2198 -4724 -1676 5076 2801 -4481 -2245 5624 2655 -5549 -2373 5420 2453 -4778 -1677 4784
3848 4784 2432 -5490 -2431 5197 2131 -4501 -1829 5267 2214 -4997 -3151 5599 2548 -4999 -2351
3863 -2351 5570 2358 -4924 -1879 4826 2028 -4835 -2615 5042 1742 -5281 -2081 5267 2077 -4881
$$ packed form
3757C323p644n0Q995r30p959J284Q128j516q069L65R151j841p974J109Q508j428
3773C452q225J574P687q76p859J079P083j407p330J332Q831l068p260K008P856
3788D877j568p770J943P469k135p730J445Q036j926p388J629P989r24p558R52
3803b659O949p81q413J318P961j752p447K512O609n49q391K075O185j162p810
3818e355K115Q393k110q195J574Q783k976p335K579P341k339q335M236O625k803
3833B198o922L048O752k275p282K236P869k969q204L176P793k967p231L101O461
3848D784k352p922L059P628l066o632K672P096l053p211J846Q750l051p547K648
3863b351P921l212p282L045O705k798o863K220P657l300p023L200P348l190o958
$$ plain form
3878 -4881 -1846 4953 2059 -5296 -1760 4974 1944 -5209 -1771 5264 2027 -4952 -1836 5120 1961
3893 1961 -5098 -1725 5058 1790 -5126 -1815 4956 1671 -4911 -1657 5039 1664 -5264 -1601 4905
3908 4905 1495 -5397 -1502 5642 1832 -5033 -1852 5124 1327 -5308 -1509 5213 1597 -5340 -1549
3923 -1549 5251 1471 -5125 -1568 5248 1330 -5287 -1304 5193 1265 -5246 -1217 5343 1296 -5227
3938 -5227 -1130 5295 1182 -5091 -1056 5229 1055 -5197 -1168 5050 1062 -5251 -1016 5264 791
3953 791 -5256 -1013 5320 1084 -5409 -900 5250 867 -5258 -820 5729 805 -5189 -664 5304
3968 5304 557 -5171 -810 5528 893 -5579 -828 5368 776 -5412 -654 5337 694 -5272 -709
3983 -709 5191 634 -5023 -601 5302 646 -5021 -529 4716 1033 -5176 -443 5262 553 -5121
$$ packed form
3878d881L035O799k894p355L536O734l030p153L438P035l237o979L116O956l159
3893A961p059L373O783l268o916L311O771l285o582L254O696l375o928L663O506
3908D905l410o892L895P144l810o865L181O976l797o635L799O722l616o937L791
3923a549O800l780o596L557O816l918o617L983O497l928o511M029O560m047o523
3938e227M097O425m113o273M035O285m174o252M029O218l988o313M235O280m473
3953G91o047M243O333m236o493M509O150m383o125M438O549m924n994M525N968
3968E304m747n728M361O338m635o472M751O196m592o188M758N991m643n966M563
3983g09N900m557n657M422N903m656n667M492N245l683o209M733N705m709n674
$$ plain form
3998 -5121 -280 5275 331 -5090 -331 5189 331 -5098 -321 5176 345 -5223 -349 5274 252
4013 252 -5208 -296 5184 122 -5268 -112 5308 259 -5300 -182 5321 145 -5063 94 5260
4028 5260 311 -5057 -86 5118 -374 -5280 183 5248 -263 -5008 363 5187 -125 -5121 2
4043 2 5446 -496 -5313 92 5104 -403 -5128 182 5017 -74 -5204 -53 5157 -217 -4867 263
4059 263 4866 -360 -5228 451 4767 -568 -5094 267 5289 -429 -5400 557 5143 -373 -5636
4074 -5636 252 5048 -487 -5170 465 5050 -619 -5095 399 5001 -719 -5251 835 4943 -624
4089 -624 -4605 567 5012 -943 -4768 700 5158 -533 -5118 316 5078 -628 -5204 822 4974
4104 4974 -1088 -4416 1118 4896 -971 -5065 848 5199 -613 -4654 900 4993 -816 -5235 1037
$$ packed form
3998e121M841N555m944n421M759N520m858n429M777N497m831n568M874N623n022
4013B52n460M912N480n062n390N156N420n049n559N118N503n176n208N157N166
4028E260m949n368M971N204n492m906N463N065n511m745N371M824n312m996N123
4043BN444n942m817N405N012n507m725N310M835n091n130N151N210n374m650N130
4059B63M603n226m868N679M316n335m526N361N022n718m971N957M586n516n263
4074e636N888M796n535m683N635M585n669m476N494M602n720m532O086M108n567
4089f24l981N172M445n955l825N468M458n691m585N434M762n706m576O026M152
4104D974o062l328N534L778n867m094N913M351n812m041N554M093n809m419O272
$$ plain form
4119 1037 5274 -1183 -5072 1213 4685 -743 -4557 915 4755 -405 -5201 1524 4472 -1010 -4926
4134 -4926 1014 4898 -1232 -5142 822 5190 -1138 -5032 1266 4990 -1064 -5000 1240 3738 -1308
4149 -1308 -3877 1537 4813 -1665 -4362 1025 4839 -1345 -4774 2074 5096 -1444 -4884 1397 4274
4164 4274 -1317 -4826 1927 4411 -1736 -4525 1483 4780 -1357 -4173 1093 4849 -1673 -4472 1868
4179 1868 4996 -1713 -4765 1477 4440 -1547 -4407 1792 4448 -1898 -4324 1816 4438 -1664 -4363
4194 -4363 1943 4541 -1597 -4051 1976 4312 -1765 -4123 2012 4257 -1911 -4175 1935 4187 -2007
4209 -2007 -4155 1840 4284 -2029 -3932 2032 4342 -2122 -4089 1802 3993 -2056 -4096 2133 4197
4224 4197 -2113 -4034 2160 4045 -2040 -4228 2290 4205 -2033 -4198 2105 4160 -2092 -4186 2191
$$ packed form
4119A037M237o457l889O285L472n428l814N472L840n160m796O725K948n482l916
4134d926N940L884o130l910N964M368o328l894O298L724o054l936O240K498n046
4149a308k569N414L276o478k697N387L814o184l429O848L022o540l440O281K877
4164D274n591l509O753K484o147k789O008L297o137k816N266L756o522k799O340
4179A868L128o709l052O242K963n987k860O199K656o346k426O140K622o102k699
4194d363O306K598o138k454O027K336o077k358O135K245o168k264O110K252o194
4209b007k148N995K444o313j903N964K310o464j967N891K191o049k040O229K064
4224D197o310j921O194J885o085k188O518J915o238k165O303K055o252k094O377
$$ plain form
4239 2191 4067 -2272 -4107 2329 4023 -2161 -4065 2250 4059 -2247 -3970 2471 4027 -2398 -3884
4254 -3884 2326 3857 -2328 -3832 2359 3717 -2424 -3960 2171 3651 -2210 -3705 2365 3649 -2355
4269 -2355 -3589 2539 3755 -2568 -3680 2576 3677 -2513 -3691 2177 3345 -2350 -3592 2279 3745
4284 3745 -2862 -3402 2904 3698 -2347 -3828 2911 3277 -2815 -3806 2294 3747 -2048 -3285 2279 3048
4300 3048 -2918 -3286 2913 3703 -1896 -3725 1873 2830 -2652 -3313 2523 3641 -2160 -2756 2110 3283
4316 3283 -1640 -3648 2211 3358 -2987 -3861 2697 3446 -2712 -2936 2737 3372 -2749 -3204 2810 3234
4332 3234 -2800 -3253 2777 3221 -2775 -3291 2909 3211 -2852 -3147 2819 3256 -2847 -3175 2910 3308 -2859
4349 -2859 -3218 2950 3093 -2915 -3076 2910 2990 -3004 -3042 2908 3032 -2883 -2995 2851 2895 -2987 -2973 2963
$$ packed form
4239B191J876o339j835O436J694o184j904O315J809o306j723O441J556o425j486
4254c884O210J531o185j504O191J358o141j536O131J480n861j495O070J284o004
4269b355j234O128J216o323j112O256J101o190j178N868J168n695j242N871J466
4284C745o607n40O306P94o045j481O739L66o092r91O100J453n795j237N564P69
4300C048n966l68O199P90n599j829N598R57n482o61N836J118n801n96M866J173
4316C283m923k008N859J147o345q74O558P49o158k24N673O35o121m55O014M24
4332C234o034m53O030M44n996n16O200L02o063k95N966M37o103l28O085L98o167
4349b859l59O168J43o008j61N986Q0n994l8N950J24n915j12N846M4n882J4N936
$$ plain form
4367 2963 2951 -2976 -2778 2822 2861 -2947 -2902 2965 2755 -3025 -2770 3068 2870 -2973 -2635 2982 2671 -2992
4385 -2992 -2803 3081 2764 -2956 -2707 3058 2693 -3027 -2681 3026 2640 -3001 -2732 2943 2624 -3035 -2557
4402 -2557 3032 2506 -3139 -2602 3056 2626 -3100 -2454 3125 2597 -3049 -2524 3131 2390 -2910 -2451 2931
4419 2931 2316 -3171 -2413 3369 2261 -3167 -2157 2949 2231 -3369 -2179 2857 2512 -2847 -2089 3463
4435 3463 2189 -3278 -2345 3776 1721 -2453 -1595 2763 2438 -3458 -2575 3206 1744 -3001 -2023 3175
4451 3175 2269 -3012 -2221 3141 2039 -3041 -2115 2868 2281 -3016 -2135 3120 2219 -3128 -1949 3063
4467 3063 2097 -3051 -1977 2927 1960 -3026 -2093 3080 2016 -2963 -1995 3024 1948 -2880 -2005 2930
4483 2930 1863 -2998 -1973 3007 1946 -3046 -1872 3034 1887 -2948 -1881 3105 1827 -3002 -1756
$$ packed form
4367B963j2n927J98N600L9n808M5N867k10n780K55N838j98n843L38N617l11n663
4385b992J89N884l17n720K49N765l65n720L46N707l86n641K69N675l19n659M78
4402b557N589n26n645N37N658m30n726O46N579n28n646N25N655p41n300M59N382
4419B931o15n487P58N782j108n428J010N106p18n600J190N036l45n359P58N552
4435C463j274n467R33O121k055m174Q58M358l25n896Q83N781j462m745R78N198
4451C175r06n281P91N362j102n080R26M983n87n297Q81N255r01n347J179N012
4467C063r66n148J074M904r67m986R33N173j064m979R68N019j076m828Q75M935
4483B930j067m861J025M980j061m992J174M906j147m835J067M986j278m829J246
$$ plain form
4498 -1756 3100 1818 -2987 -1762 3091 1850 -3037 -1848 3069 1906 -3017 -1817 3039 1733 -3201
4513 -3201 -1988 2984 1722 -2920 -1739 2971 1676 -3046 -1696 2980 1794 -2899 -1625 2933 1669
4528 1669 -3019 -1579 2940 1581 -3058 -1662 3025 1711 -2913 -1597 2971 1610 -2884 -1646 2971
4543 2971 1610 -3037 -1563 2935 1631 -2986 -1580 2992 1564 -2932 -1446 3071 1562 -2904 -1456
4558 -1456 3057 1480 -2936 -1433 2915 1505 -2837 -1445 2951 1450 -3041 -1515 3032 1394 -2912
4573 -2912 -1379 3006 1368 -2991 -1287 2944 1316 -2939 -1354 2883 1329 -2772 -1255 2705 1360
4588 1360 -2807 -1362 2741 1341 -2740 -1290 2838 1237 -2792 -1314 2800 1217 -2911 -1335 2850
4603 2850 1276 -2813 -1343 2934 1365 -2877 -1234 2706 1226 -2778 -1214 2819 1140 -2792 -1152
$$ packed form
4498a756M856j282m805J225M853j241m887J189M917j163m923J200M856j306m934
4513c201J213M972j262m642J181M710j295m722J350M676j186m693J274M558j264
4528A669m688J440M519j359m639J396M687j314m624J316M568j361m494J238M617
4543B971j361m647J474M498j304m617J406M572j428m496J486M517j509m466J448
4558a456M513j577m416J503M348j410m342J392M396j501m491J526M547j638m306
4573b912J533M385j638m359J704M231j628m255J585M237j554m101J517L960j345
4588A360m167J445M103j400m081J450M128j601m029J478M114j583m128J576M185
4603B850j574m089J470M277j569m242J643L940j480m004J564M033j679l932J640
$$ plain form
4618 -1152 2820 1238 -2858 -1220 2759 1136 -2829 -1116 2734 1157 -2718 -1041 2751 1105 -2655
4633 -2655 -1058 2598 1175 -2674 -1142 2705 1081 -2710 -1100 2685 1017 -2660 -1104 2666 991
4648 991 -2639 -1207 2455 1215 -2746 -1058 2692 1180 -2685 -1454 2895 1156 -2681 -1258 3379
4663 3379 900 -2590 -612 2789 1655 -2189 -734 2463 1311 -2714 -519 3046 912 -2401 -851
4678 -851 2462 1171 -2815 -964 2588 964 -2635 -933 2582 1027 -2585 -1005 2466 896 -2594
4693 -2594 -1020 2644 1000 -2660 -1023 2628 999 -2449 -962 2508 926 -2534 -926 2684 974
4708 974 -2616 -1061 2541 1051 -2625 -915 2568 1055 -2564 -956 2602 941 -2538 -885 2513
4723 2513 1033 -2601 -1045 2561 816 -2638 -853 2595 756 -2562 -794 2472 865 -2438 -928
$$ packed form
4618a152L972j582m096J638L979j623l965J713L850j577l875J677L792j646l760
4633b655J597L656j423l849J532L847j624l791J610L785j668l677J556L770j675
4648I91l630J432L662j240l961J688L750j512l865J231M349j739l837J423M637
4663C379k479l490J978L401j134l844J455L197j152m025K195L565k134l313J550
4678h51L313j291l986J851L552j624l599J702L515j555l612J580L471j570l490
4693b594J574L664j644l660J637L651j629l448J487L470j582l460J608L610j710
4708I74l590J555L602j490l676J710L483j513l619J608L558j661l479J653L398
4723B513j480l634J556L606j745l454J785L448j839l318J768L266j607l303J510
$$ plain form
4738 -928 2425 884 -2515 -924 2449 872 -2350 -893 2296 760 -2416 -896 2364 868 -2463
4753 -2463 -745 2443 856 -2457 -728 2261 874 -2381 -882 2470 861 -2490 -858 2496 711
4768 711 -2477 -767 2517 838 -2410 -826 2320 719 -2445 -840 2473 881 -2459 -851 2352
4783 2352 819 -2319 -905 2412 884 -2310 -834 2299 867 -2448 -800 2360 862 -2379 -916
4798 -916 2356 751 -2281 -829 2362 879 -2352 -827 2470 864 -2396 -813 2275 866 -2481
4813 -2481 -892 2304 688 -2465 -719 2325 686 -2479 -821 2329 869 -2428 -763 2482 863
4828 863 -2382 -896 2512 793 -2423 -750 2367 829 -2349 -774 2382 745 -2359 -872 2299
4843 2299 763 -2314 -762 2340 887 -2421 -844 2261 841 -2324 -771 2291 821 -2370 -825
$$ packed form
4738i28L353j541l399J591L373j577l222J457L189j536l176J520L260j496l331
4753b463J718L188j587l313J729K989j387l255J499L352j609l351J632L354j785
4768G11l188J710L284j679l248J584L146j601l164J605L313j592l340J608L203
4783B352j533l138J414L317j528l194J476L133j432l315J648L160j498l241J463
4798i16L272j605l032J452L191j483l231J525L297j606l260J583L088j409l347
4813b481J589L196j616l153J746L044j639l165J658L150j460l297J665L245j619
4828H63l245J486L408j719l216J673L117j538l178J575L156j637l104J487L171
4843B299j536l077J552L102j453l308J577L105j420l165J553L062j470l191J545
$$ plain form
4858 -825 2367 712 -2506 -636 2249 1126 -2562 -495 2471 1053 -1843 -529 2656 1178 -2114
4873 -2114 -630 2511 1184 -2531 -579 2397 806 -2323 -495 2537 697 -2332 -773 2358 882
4888 882 -2538 -1155 2354 1091 -2470 -417 2748 144 -2680 -1140 2451 1069 -2893 -925 3090
4903 3090 1072 -2367 -873 2437 1362 -2613 -1043 2262 371 -2353 -348 2505 486 -2328 -759
4918 -759 2739 535 -2489 -663 2525 684 -2684 -746 2266 510 -2269 -675 2571 705 -2483
4933 -2483 -677 2565 682 -2498 -612 2479 664 -2473 -722 2720 864 -2588 -622 2420 727
4948 727 -2507 -1023 2156 564 -2389 -724 2353 622 -2526 -734 2444 697 -2236 -501 2512
4963 2512 666 -2397 -574 2563 645 -2705 -750 2427 568 -2534 -824 2504 423 -2540 -615
$$ packed form
4858h25L192j655l218J870K885j123l688K067K966j418k896J314L185j478l292
4873b114J484L141j327l715J952K976j591l129J828L032j840l029J559L131j476
4888H82l420J383L509j263l561K053L165k604k824J540L591j382l962J968M015
4903C090k018l439J494L310j075l975J570L305j891k724K005K853k019k814J569
4918g59L498k204l024J826L188j841l368J938L012j756k779J594L246j866l188
4933b483J806L242j883l180J886L091j815l137J751L442j856l452J966L042j693
4948G27l234J484L179j592k953J665L077j731l148J792L178j747k933J735L013
4963B512j846l063J823L137j918l350J955L177j859l102J710L328k081k963J925
$$ plain form
4978 -615 2922 959 -2601 -700 2557 681 -2616 -698 2345 585 -2379 -598 2789 515 -2275
4993 -2275 -605 2554 922 -2540 -795 2382 709 -2535 -653 2415 480 -2588 -944 2651 597
5008 597 -2626 -780 2500 294 -2698 -753 2518 985 -2413 -851 2360 570 -2101 -526 2616
5023 2616 490 -2841 -498 2489 364 -2719 -552 2756 692 -2725 -875 2526 417 -2254 -416
5038 -416 2811 489 -2618 -223 2652 -35 -2759 -678 2888 868 -2531 -320 2552 430 -2623
5053 -2623 -234 2826 355 -2748 -517 3129 330 -2543 -499 3258 558 -2769 -247 3169 -26
5068 -26 -2960 -671 2212 656 -3099 -295 2630 435 -3017 -727 3086 621 -2818 -297 2449
5083 2449 432 -2870 -281 2787 776 -2891 -351 2757 471 -2872 -1371 3164 773 -2822 -335
$$ packed form
4978f15L537j963l560J901L257j876l297J918L043j760k964J781L387k274k790
4993b275J670L159j632l462J745L177j673l244J882L068j935l068J644L595k054
5008E97l223J846L280k206k992J945L271j533l398J562L211j790k671J575L142
5023B616k126l331K343K987k125l083K167L308k064l417J850L401k109k671J838
5038d16L227k322l107K395K875k687k724K081L566k020l399K211K872k122l053
5053b623K389L060k471l103K231L646k799k873K044L757k700l327K522L416l195
5068b6k934K289K883j556l755K804K925k195l452K290L813k465l439K521K746
5083B449k017l302K589L068k011l667K540L108k286l343J501M535k391l595K487
$$ plain form
5098 -335 2319 159 -3000 -142 2325 341 -3064 -547 2821 918 -2326 -210 2842 598 -2379
5113 -2379 -282 2646 258 -3086 -392 3001 282 -2874 -228 2869 189 -2958 -186 2873 265
5128 265 -2926 -244 2898 174 -3025 -254 2951 181 -2942 -82 2865 110 -3108 -93 3062
5143 3062 159 -3001 -101 3026 87 -3056 -86 3049 -54 -3063 -114 2907 19 -2959 -72
5158 -72 2998 181 -2905 -19 2985 17 -3008 -137 3031 -292 -2674 -23 2911 439 -3300
5173 -3300 -202 2942 -280 -3001 -36 2776 138 -2727 254 3048 -663 -2769 -627 4017 196
5188 196 -3241 989 2568 135 -3080 -93 2674 208 -3704 -575 2814 -398 -3714 -45 2920
5203 2920 -417 -2679 198 2852 -631 -3025 163 2609 -69 -3602 380 2919 219 -3368 121
$$ packed form
5098c35K654k160l159K858K467j984l405K517L368j903l244K116L052k244k977
5113b379K097K928k388l344K694L393k719l156K646L097k680l147K772L059k608
5128B65l191K682L142k724l199K771L205k770l123K860K947k755l218L015L155
5143C062k903l160K900L127k939l143K970L135l103l009K949L021k888k978K887
5158g2L070k817l086K886L004k968l025K871L168l323k382K651K934k472l739
5173c300L098L144l222k721K965K812k638k865K981K794l711k106K142M644l821
5188A96l437M230J579k433l215K987K767k466l912L129L389l212l316L669K965
5203B920l337k262K877K654l483k394L188K446k678l533L982K539k700l587L489
$$ plain form
5218 121 3607 -324 -3041 136 3007 -248 -3464 81 3107 -363 -3222 196 3239 -259 -3066
5233 -3066 402 3342 -324 -2835 354 3791 -968 -3115 156 3366 -350 -3387 396 3189 -515
5248 -515 -3209 490 3186 -385 -3245 516 3280 -520 -3227 489 3078 -572 -3150 390 3280
5263 3280 -514 -3196 490 3167 -555 -3205 686 3186 -623 -3128 632 3093 -615 -3166 552
5278 552 3171 -665 -3112 717 3060 -713 -3095 684 3080 -590 -3226 705 3272 -770 -3178
5293 -3178 812 3226 -777 -3213 879 3169 -833 -3206 940 3263 -988 -3156 844 3345 -997
5308 -997 -3181 881 3155 -907 -3170 1144 3207 -1018 -3131 922 3169 -873 -3185 951 3222
5323 3222 -997 -3160 1048 3057 -1150 -3129 958 3083 -1105 -3094 924 3039 -1002 -3048 1075
$$ packed form
5218A21L486l931k717L177K871l255l216L545L026l470k859L418L043l498k807
5233c066L468K940l666k511L189L437m759k147L271L210l716l037L783K793l704
5248e15k694L699K696l571k860L761K764l800k707L716K589l650k578L540K890
5263C280l794k682L686K677l722k650L891K500l809k505L760K461l708k551L718
5278E52K619l836k447L829K343l773k382L779K396l670k636L931K567m042k408
5293c178L990K414m003k436M092K290m002k373M146K323m251k168M000K501m342
5308i97k184M062K274m062k263M314K063m225k113M053K247m042k312M136K271
5323C222m219k163M208K009m207j979M087K125m188j989M018K115m041k046M123
$$ plain form
5338 1075 3036 -1015 -3085 1119 3145 -1202 -3110 1192 3086 -1255 -2953 1230 3187 -1293 -3212
5353 -3212 1273 3053 -1253 -3213 1287 3085 -1307 -3388 1169 3399 -1247 -3163 1329 2203 -1733
5368 -1733 -2855 830 2299 -1513 -3745 1860 2711 -767 -3479 1222 2439 -1666 -3311 1001 2529
5383 2529 -1134 -3477 2352 1860 -1748 -2814 1677 3922 -1787 -2752 1631 2745 -1481 -3603 1846
5398 1846 3517 -1894 -3039 1089 3690 -1241 -3137 1511 2817 -1939 -2393 2241 2764 -1644 -2713
5413 -2713 1688 3202 -1867 -2925 1649 2936 -1694 -2845 1743 2871 -1887 -2949 1610 2985 -1766
5428 -1766 -2930 1703 2975 -1687 -2801 1684 2910 -1828 -2735 1778 2852 -1973 -2818 1904 2727 -1648
5444 -1648 -2477 1720 2594 -2223 -2862 1428 3058 -1871 -2713 1987 3511 -1681 -2308 2549 3159 -1960
$$ packed form
5338A075J961m051k070M204K026m347j908M302J894m341j698M183J957m480j919
5353c212M485J780m306j960M500J798m392k081M557K230m646j916M492Q74l936
5368a733j122L685J469l812k232N605Q51l478k712M701J217m105j645M312J528
5383B529l663k343N829m92l608j066M491K245n709r65M383J114m226k122N449
5398A846J671n411j145M128K601m931j896M648J306m756m54M634N23m408j069
5413b713M401J514n069j058M574J287m630j151M588J128m758j062M559J375m751
5428a766j164M633J272m662j114M485J226m738r07M513J074m825q45M722Q23m375
5444a648q29M197Q74m817o39M290J630m929q42M700J524n192o27M857O10n119
$$ plain form
5460 -1960 -2876 1900 2712 -2303 -2920 2526 2479 -1609 -2910 1972 2575 -2730 -2318 2172 2539 -1852 -2550
5477 -2550 2303 2433 -1699 -2793 2343 2406 -1673 -2586 2362 2540 -2277 -2399 2338 2187 -2149 -2341 2011
5494 2011 2756 -2272 -2403 2282 2634 -2349 -2626 2138 2696 -2002 -2307 2461 2393 -2418 -2329 2332 2414 -2412
5512 -2412 -2501 2478 2548 -2266 -2356 2189 2563 -2402 -2157 2458 2812 -2219 -2203 3073 2099 -2605 -2066 2253
5530 2253 2204 -2589 -2188 2531 2375 -2274 -2212 2571 2138 -2089 -2320 2573 2230 -2421 -2231 2454 1940 -2443
5548 -2443 -1998 2379 2122 -2338 -2187 2791 2028 -2416 -2030 2647 2026 -2919 -1715 2798 1764 -2219
5564 -2219 -1933 3063 2124 -2929 -1913 2677 1907 -2673 -2282 2480 2123 -2729 -2010 2610 2292 -2788 -1766
5581 -1766 2664 1910 -2614 -1760 2758 1968 -2903 -1785 2744 1926 -2989 -2138 2579 1990 -2582 -1661 2430
$$ packed form
5460a960r16M776Q12n015o17N446m7m088j301M882O03n305M12M490L67m391o98
5477b550M853J30m132j094N136O3m079r13M948J78m817j22M737j51m336j92M352
5494B011P45n028j31M685L52m983k77M764N58m698l05M768o8m811Q9M661Q2m826
5512b412q9M979P0m814r0M545L74m965K45M615L54n031J6N276r74m704N39M319
5530B253m9m793M01M719j56m649O2M783m33m227k31M893l43m651J90M685n14m383
5548b443M45M377k57m460J51M978p63m444L86M677o21m945J204M513j034l983
5564b219K86M996r39n053J016M590p70m580L91M762l57m852P19M620l18n080J022
5581a766M430p54m524Q54M518p90m871J118M529q18m915Q51M717n89m572R21M091
$$ plain form
5598 2430 2091 -2905 -1384 2530 2070 -2492 -1782 2726 2261 -2703 -1966 2447 1595 -3775 -1409 2938
5614 2938 1899 -3034 -1716 3148 1952 -2473 -1814 3618 1890 -2354 -1297 2616 1615 -2990 -1388
5629 -1388 3231 1755 -2897 -1260 3184 929 -2915 -653 2680 1415 -2812 -1262 3148 1997 -3555
5644 -3555 -1584 3198 1604 -3119 -1384 2816 1745 -3219 -1809 2701 1751 -2923 -536 3683 522
5659 522 -3810 -1639 2631 1217 -3009 -783 3120 871 -2974 -1676 2900 751 -2634 -290 3571
5674 3571 897 -3251 -654 2129 567 -2514 -864 3066 1386 -3154 -907 3387 650 -2520 -556
5689 -556 3359 758 -3078 -781 3013 364 -3451 -1238 2793 1223 -2664 -1242 2268 261 -2782
5704 -2782 -14 2873 580 -2928 -1422 3441 463 -2653 -726 2848 505 -2993 -372 3316 517
$$ packed form
5598B430l39m996J521L914m60m562P10M508m65m964P37M413q52n370K366M347
5614B938j039m933J318M864j196m425O59N432j728m244J057L913j001m605J602
5629a388M619j476m652J637M444k255l844K262L333j265m227J550M410j151n552
5644c555J971M782j594m723J735M200j071m964J410M510r50m674K387M219l161
5659E22m332K171M270j414m226K226L903k249l845J298M576k149l385K344L861
5674C571k674m148K597K783j562l081J650L930j680m540K247M294k737l170J964
5689e56L915k601l836K297L794k649l815K213M031j570l887J422L510k007l043
5704b782K768K887k293l508J506M863k978l116J927L574k343l498K621L688k799
$$ plain form
5719 517 -2866 -361 3514 547 -3388 -286 3196 530 -2728 -403 3310 441 -2769 -827 2994
5734 2994 -88 -3232 -240 2433 1025 -2376 493 3267 1162 -2883 -648 3462 -121 -2070 -1070
5749 -1070 2930 954 -3275 -429 2411 122 -3916 -257 2963 352 -3625 -574 3771 -89 -2363
5764 -2363 774 2863 603 -2319 81 3037 847 -3548 -190 3336 1051 -3508 -419 2469 754
5779 754 -2913 -92 3105 896 -2852 867 3134 -30 -3201 245 2625 950 -3191 -716 2796
5794 2796 214 -2662 -356 3100 931 -2991 -570 2743 672 -2722 980 3541 199 -2934 -219
5809 -219 2954 54 -2937 -142 2368 -1131 -2825 -369 2286 -546 -2222 90 2593 -477 -2112
5824 -2112 -315 2963 125 -3073 -253 2296 305 -2654 1155 2164 -794 -2758 1424 3391 -443
$$ packed form
5719E17l383K505L875k967l935L102L482k666l258K325L713k869l210J942L821
5734B994l082l144K992K673j408l401K869K774k105m045K235M110l583j949J000
5749a070M000j976m229K846K840k289m038L659L220k611l977L051M345l860k274
5764b363L137K089k260k922K400K956k190m395L358L526k285m559L089K888j715
5779G54l667K821L197k209l748L719K267l164l171L446K380j675m141K475L512
5794B796k582k876K306L456k169l922K421L313k071l394L702K561l342l133K715
5809b19L173k900k991K795K510l499j694K456K655k832j676K312K503l070j635
5824b112J797L278k838l198K820K549j991k959L809J009k958j964M182J967l834
$$ plain form
5839 -443 -2881 327 3167 -358 -2738 263 2944 -654 -2544 258 2886 -578 -3533 128 2674
5854 2674 -344 -2485 927 3023 -544 -3005 254 2792 -197 -3180 465 2816 -189 -2890 433
5869 433 3032 -460 -2698 535 2591 -458 -2539 744 2445 -793 -2432 539 2646 -671 -2824
5884 -2824 378 2705 -807 -2686 456 2427 -1242 -2463 418 2276 -886 -2299 1305 2149 -607
5899 -607 -2633 726 1938 -776 -2287 558 2505 -894 -2625 339 2337 -651 -2941 894 2512
5914 2512 -404 -2689 627 2397 -1052 -2638 862 2209 -660 -2480 573 3245 -1093 -2510 685
5929 685 2634 -1062 -2721 809 2658 -969 -2499 914 2360 -707 -2620 1229 2261 -917 -2494
5944 -2494 842 2569 -1100 -2512 1064 2624 -1119 -2344 868 2398 -523 -2364 937 2243 -804
$$ packed form
5839d43k438L208K840l525k380L001K681l598j890K802K628l464k955L661K546
5854B674l018k141L412K096l567k461L259K538k989k983L645K351l005k701L323
5869D33K599l492k238L233K056l049k081L283J701l238j639K971K107l317k153
5884b824L202K327l512j879L142J971l669j221K881J858l162j413L604Q44k756
5899f07k026L359J212k714j511K845J947l399j731K964J998k988k290L835J618
5914B512k916k285L316J770l449j586L500J347k869j820L053K672m338j417L195
5929F85J949l696j659L530J849l627j530L413J446l067j913L849J032l178j577
5944b494L336J727l669j412L576J560l743j225L212J530k921j841L301J306l047
$$ plain form
5959 -804 -2403 1030 2291 -1124 -2500 1378 2418 -1142 -2286 966 2314 -1386 -2454 1132 2439
5974 2439 -1250 -2273 1179 2354 -880 -2275 1280 2121 -1019 -2159 1046 2230 -1262 -2065 1404
5989 1404 2290 -985 -1783 910 2302 -1103 -2125 1472 2350 -1380 -2092 1236 1923 -1173 -2215 1212
6005 1212 2104 -1164 -2110 1328 2107 -1204 -2096 1398 2041 -1276 -2013 1209 1960 -1198 -1981 1237 2030
6022 2030 -1306 -2136 1379 1920 -1360 -2082 1326 2124 -1295 -1858 1343 1994 -1240 -2028 1441 1973 -1511
6039 -1511 -2047 1331 2203 -1333 -1942 1445 1989 -1522 -1968 1660 1768 -1303 -1887 1384 1811 -1432 -1806
6056 -1806 1558 1643 -1533 -1981 1618 1570 -1262 -1886 1761 1314 -970 -1976 1342 1926 -2238 -1419 1794
6073 1794 1221 -1884 -1380 1427 1617 -1675 -1538 1336 1812 -1394 -1667 1412 1919 -1455 -1637 1478 1582
$$ packed form
5959h04j599L433J261l415j376L878J040l560j144L252J348l700j068L586J307
5974B439l689j023L452J175l234j395L555Q41l140j140L205J184l492q03L469
5989A404Q86l275p98K693J392l405j022L597Q78l730p12L328O87l096j042L427
6005A212Q92l268r46L438P79l311q92L494O43l317p37L222P51l158p83L218P93
6022B030l336q30L515N41l280p22L408P98l419n63L201O51l234p88L469N32l484
6039a511n36L378Q72l536o09L387N44l511m46L628J08l071n84L271M27l243l74
6056a806L364Q5l176m48L599m8k832o24L647m47k284j006L318N84m164Q19L213
6073A794n73l105N04K807J90l292J37K874M76l206k73L079N07l374j82L115J04
$$ plain form
6090 1582 -1628 -1667 1420 1689 -1510 -1524 1512 1596 -1583 -1454 1598 1546 -1547 -1627 1540 1620 -1664 -1504 1555
6109 1555 1564 -1548 -1532 1491 1604 -1401 -1500 1368 1462 -1464 -1570 1516 1503 -1400 -1389 1568 1534 -1349 -1541
6128 -1541 1407 1506 -1425 -1307 1510 1493 -1498 -1609 1547 1481 -1643 -1601 1544 1633 -1890 -1414 1439 1444 -1622
6147 -1622 -1091 1480 1650 -1344 -1502 1573 1370 -1553 -1336 1401 1411 -1474 -1487 1570 1106 -1549 -1197 1732
6165 1732 1207 -1460 -1134 1575 1203 -1460 -1330 1777 1435 -1728 -741 1736 862 -1779 -1683 1606 995
6182 995 -1967 -774 1571 1158 -1927 -1488 1702 960 -2024 -1521 1508 1488 -1541 -1255 1376 1246 -1595
6199 -1595 -1089 1546 1413 -1286 -1310 1652 1579 -1332 -961 1806 884 -1792 -873 1308 827 -2019 -1191 1730
6217 1730 916 -1647 -663 1681 845 -1487 -918 1803 933 -1567 -997 2287 1066 -1506 -1355 1521 1146
$$ packed form
6090A582l210l9L087K69l199j4L036Q4l179J29L052n2l093q0L167Q0l284J60L059
6109A555Rl112J6L023J13l005r9K868R4k926j06L086j3k903J1K957l4k883j92
6128a541K948R9k931J18K817j7k991j11L156o6l124M2L145Q9l523M76K853Nl066
6147a622N31K571J70k994j58L075k03k923K17K737J0k885j3L057m64k655L52K929
6165A732n25k667L26K709l72k663J30L107l42l163R87K477q74k641R6L289o11
6182I95k962J193K345m13l085M39L190p42k984N03L029k0l029K86K631j30k841
6199a595N06K635j33k699k4K962p3k911L71K767r22k676R19K181m81k846Q28K921
6217A730q14k563R84K344q36k332N69K721q70k500N70L284j221k572J51K876l75
$$ plain form
6234 1146 -1461 -1196 1953 925 -1497 -789 1287 907 -1611 -880 1600 1034 -1489 -720 1463 630 -1880
6251 -1880 -1062 1372 917 -1292 -825 1514 1149 -1671 -1161 1340 972 -939 -1349 2217 957 -1651 -285
6268 -285 2071 1199 -1278 -1125 1538 457 -1708 -1791 1533 159 -1616 -906 855 211 -2024 -1645 1704
6285 1704 846 -1072 -916 1943 1099 -1588 -722 2001 1878 -2398 -411 1674 -85 -2594 -541 2261
6301 2261 864 -1562 -612 1454 875 -1169 -287 1724 554 -1999 -1141 1827 770 -1282 -304 1076
6317 1076 1196 -1437 -1229 1605 1799 -1349 -1196 1869 817 -1940 -857 1496 1247 -2006 -489 1672
6333 1672 834 -1784 -733 1534 704 -1257 -662 1724 615 -1529 -747 1649 515 -1542 -703 1692
6349 1692 534 -1600 -525 1718 651 -1599 -572 1541 542 -1702 -510 1680 502 -1607 -560
$$ packed form
6234A146k607K65L149j028k422P08K076l80k518P31K480n66k523P69K183q33k510
6251a880Q18K434m55k209M67K339l65k820N10K501l68j911m10L566j260k608J366
6268b85K356q72k477J53K663j081k165q3L324j374j775P10J761o44k235L79L349
6285A704q58j918J56K859q44k687Q66K723j23m276J987K085j759k509K053K802
6301B261j397k426R50K066n79k044Q82K011j170k553Q58K968j057k052R78J380
6317A076J20k633K08K834J94l148J53L065j052k757J083K353k49l253J517K161
6333A672q38k618J051K267q30j961N95K386j109k144P82K396j134k057Q39K395
6349A692j158k134J075K243j067k250J027K113r99k244J192K190j178k109J047
$$ plain form
6364 -560 1673 623 -1627 -491 1518 573 -1572 -461 1720 452 -1732 -615 1586 548 -1685
6379 -1685 -516 1655 489 -1528 -412 1712 457 -1634 -458 1565 302 -1627 -481 1596 421
6394 421 -1562 -482 1636 374 -1618 -422 1525 324 -1586 -407 1639 253 -1650 -358 1659
6409 1659 397 -1579 -346 1645 431 -1567 -305 1679 294 -1698 -284 1579 285 -1560 -329
6424 -329 1575 313 -1587 -229 1541 204 -1545 -252 1639 247 -1519 -326 1542 347 -1816
6439 -1816 -407 1382 -15 -1409 -300 1484 -287 -1623 70 1371 282 -1653 -292 1636 314
6454 314 -1366 -154 1675 32 -1012 -155 1464 -153 -1213 55 1644 142 -1668 -218 1634
6469 1634 115 -1536 42 1567 158 -1649 -227 1483 217 -1549 -204 1561 149 -1465 -281
$$ packed form
6364e60K233j050k250J136K009r45k145J111K181j268k184J117K201j038k233
6379a685J169K171j166k017J116K124j255k091J176K023j263j929J146K077j175
6394D21j983J080K118j262j992J196J947j201j910J179K046j386j903J292K017
6409A659j262j976J233J991j214j998J262J984j385j992J414J863j294j845J231
6424c29J904j262j900J358J770j337j749J293J891j392j766J193J868j195k163
6439a816J409J789j397j394J109J784j771j336J693J301j089j935J361J928j322
6454C14j680J212J829j643j044Q57J619j617j060J268J589j502j810J450J852
6469A634j519j651J578J525j409j807J422J710j266j766J345J765j412j614J184
$$ plain form
6484 -281 1611 207 -1396 -196 1824 373 -1404 -101 1463 -408 -1859 -74 1445 269 -1603
6499 -1603 -177 1206 688 -1529 -62 1354 765 -1785 -691 1264 52 -1405 129 1024 187 -1685
6515 -1685 177 1834 1222 -1512 648 1839 31 -1156 -345 1958 67 -2155 123 1582 -381
6530 -381 -1512 3 1614 -121 -1613 -562 2033 283 -1721 88 947 -35 -1394 574 1705 -235
6546 -235 -1484 37 1392 186 -1407 334 1824 -49 -1547 34 1457 -220 -1286 150 1128
6561 1128 -226 -1569 -614 1487 -260 -1900 -509 789 -110 -1829 650 1320 371 -1896 19 1390
6577 1390 122 -1742 379 1494 99 -1238 -113 1883 255 -888 426 1625 173 -1648 674
6592 674 1425 -79 -1152 399 2028 -343 -1342 122 1568 -245 -1492 288 1625 -276 -1464 106
$$ packed form
6484b81J892j404j603J200K020j451j777J303J564j871j451J785J519j176j872
6499a603J426J383n18k217J467J416n89k550J094J955j212j457J534Q95q37j872
6515a685J862J657o12k734K160J191j808j187Q11K303j891k222K278J459j963
6530c81j131J515J611j735j492J051K595j750k004J809Q59r82j359J968J131j940
6546b35j249J521J355j206j593J741J490j873j498J581J423j677j066J436R78
6561A128j354j343R55K101j747j640J391J298q99j719K479O70r49k267J915J371
6577A390j268j864K121J115j395j337J125J996j628j143J314J199j452j821K322
6592F74P51j504j073J551J629k371r99J464J446j813j247J780J337j901j188J570
$$ plain form
6608 106 1604 -216 -1338 212 1562 -246 -1430 181 1400 -316 -1399 287 1478 -286 -1362
6623 -1362 282 1426 -354 -1343 209 1409 -441 -1426 267 1458 -315 -1448 326 1385 -427
6638 -427 -1459 363 1416 -321 -1394 298 1404 -322 -1347 316 1415 -341 -1459 340 1503
6653 1503 -388 -1434 351 1508 -390 -1552 412 1436 -325 -1455 305 1503 -425 -1446 414
6668 414 1411 -279 -1458 390 1419 -340 -1395 442 1302 -427 -1495 460 1454 -381 -1522 387
6684 387 1415 -401 -1493 435 1508 -475 -1278 386 1370 -559 -1418 436 1479 -418 -1490 487
6700 487 1384 -395 -1421 405 1536 -413 -1306 295 1507 -406 -1452 510 1419 -330 -1436 436
6716 436 1457 -477 -1494 443 1360 -550 -1404 540 1480 -550 -1336 574 1432 -564 -1346 566 1332
$$ packed form
6608A06J498j820j122J550J350j808j184J611J219j716j083J686J191j764j076
6623a362J644J144j780r89J552J200j850r85J693J191j773j133J774J059j812
6638d27j032J822J053j737j073J692J106j726j025J663J099j756j118J799J163
6653A503j891j046J785J157j898j162J964J024j761j130J760J198j928j021J860
6668D14R97j690j179J848J029j759j055J837Q60j729j068J955R94j835j141J909
6684C87J028j816j092J928J073j983q03J664R84j929q59J854J043j897j072J977
6700D87Q97j779j026J826J131j949q93J601J212j913j046J962R09j749j106J872
6716D36J021j934j017J937R17j910q54J944R40k030p86J910Q58j996p82J912P66
$$ plain form
6733 1332 -628 -1371 621 1421 -611 -1449 609 1388 -589 -1312 564 1396 -697 -1414 625 1362 -571
6750 -571 -1411 638 1441 -679 -1445 590 1306 -540 -1301 596 1477 -646 -1310 627 1409 -644 -1329
6767 -1329 641 1471 -643 -1323 643 1360 -760 -1411 713 1335 -627 -1328 686 1300 -566 -1303 617
6784 617 1442 -758 -1180 717 552 -1022 -1112 703 829 -1394 -1832 869 1004 -515 -1254 967 1405 -1063
6802 -1063 -1298 565 1117 -449 -1556 683 528 -1145 -1247 1005 1116 -1262 -1877 609 1090 -1129 -1223
6819 -1223 523 1032 -480 -1159 318 1319 -757 -1385 -21 1238 -391 -1303 683 672 -1243 -1305 1074
6836 1074 1120 -1000 -1460 1685 1404 -943 -844 1725 1370 -1117 -1895 1396 1231 -1044 -660 1351 1048 -1220
6854 -1220 -1006 867 939 -776 -1368 586 909 -1195 -1622 964 1394 -1092 -1228 858 1607 -745 -1053
$$ packed form
6733A332j960p43J992Q00k032q38K058P79j977p23J876Q32k093p17K039P37j933
6750e71q40K049Q03k120p66K035P16j846p61J897Q81k123o64J937P82k053o85
6767a329J970Q30k114o80J966P17k120o51K124O22j962p01K014O14j866p37J920
6784F17Q25k200m22J897j65j574r0J815J26k223m38K701J35j519p39K221M38k468
6802a063k35J863N52j566j107K239j55j673j02K252J11k378o15K486M81k219r4
6819a223J746N09j512o79J477J001k076o28J364J259j629r12J986j1j915o2K379
6836A074M6k120m60L145k81k347R9K569l55k487p78L291j65k275L84K011l03k268
6854a220K14J873P2j715n92J954L23k104m27K586M30k486j36K086P49k352l08
$$ plain form
6871 -1053 1259 1082 -795 -1421 1226 873 -1337 -1553 806 731 -616 -1039 1342 1230 -1251 -603 813
6888 813 1253 -614 -1164 777 1404 -1568 -667 1464 1075 -1431 -1052 871 906 -779 -1113 753 1045 -986
6906 -986 -890 1505 1326 -1262 -1264 1296 467 -1450 -1294 1237 1400 -1350 -986 1435 1261 -1380 -1091 917
6924 917 1157 -956 -977 1001 866 -1212 -1108 1043 1319 -1364 -556 1495 838 -1176 -1205 971 701 -1328
6942 -1328 -1200 818 675 -1213 -842 795 910 -1617 -1084 1172 1152 -1242 -1193 1439 802 -1103 -630 1589
6960 1589 1017 -1129 -887 1335 1046 -1340 -898 1065 1063 -1315 -584 1379 1288 -964 -1039 1336 1061 -1493
6978 -1493 -1388 671 943 -1914 -1455 1460 784 -2264 -923 1452 937 -891 -737 1414 1216 -1779 -824
6995 -824 1150 1276 -2676 -867 2209 426 -1782 -880 847 -46 -1660 -1308 1200 2155 -1090 -1029 1179
$$ packed form
6871a053K312j77j877o26K647l53k210k16K359p5j347m23K381j12k481O48J416
6888H13M40j867n50J941O27k972R01K131l89k506L79J923L5j685l34J866K92k031
6906i86R6K395j79k588kK560q29j917J56K531J63k750L64K421j74k641K89K008
6924I17K40k113k1J978j35k078J04K151K76k683Q08K051o57k014k9K176k70k029
6942a328J28K018j43j888L71J637J15k527N33K256k0k394M9K632o37j905M73K219
6960A589n72k146K42K222k89k386M42J963kk378P31J963r1k252p5K375k75k554
6978a493J05K059K72k857M59K915o76l048J341K375n15j828J54K151j98k995R55
6995h24J974J26l952J809L076j783k208R02J727q93j614L52K508R55l245O1K208
$$ plain form
7012 1179 710 -1347 -135 1221 543 -764 -506 1473 678 -1111 -700 1280 1259 -1215 -431 1562 598
7029 598 -1647 -923 825 759 -1084 -939 1306 1077 -1344 -679 1000 987 -1612 -766 1266 978 -1531 -578
7047 -578 1446 574 -1234 -880 1303 695 -1289 -782 1312 791 -1463 -828 1473 894 -1373 -634 1552
7064 1552 769 -1407 -634 1434 696 -1594 -644 1589 668 -1430 -710 1557 400 -1052 -375 1499 147
7081 147 -1658 -530 1161 634 -1432 -284 1307 838 -1329 -527 1565 505 -1208 -829 1230 711
7097 711 -1257 -511 1589 742 -1441 -287 1715 614 -1242 -122 1581 180 -1740 -73 1632 730
7113 730 -1063 -623 1605 120 -1998 212 2027 98 -1091 -360 1062 -19 -1959 -552 1589 342
7129 342 -1890 -185 1619 121 -1659 -392 1483 815 -1263 -218 1867 379 -1129 -937 1707 844
$$ packed form
7012A179m69k057J212J356o78j307K58J979p95j789M11J980k1k474P84J993r64
7029E98k245P24J748o6j843J45K245k29k421O65J679j3k599Q46K032k88k509R53
7047e78K024q72j808L54K183o08j984N07K094n21k254O35K301n79k267P39K186
7064A552p83k176P73K068p38k290R50K233r21k098P20K267j157j452O77J874j352
7081A47j805J128J691n27k066J148J591m69k167Q02K092j060j713L79K059n19
7097G11j968P46K100q47k183J154K002j101j856J120J703j401j920J667J705r02
7113G30j793M40K228j485k118K210J815j929j189P31J422j081j940J407K141j247
7129C42k232J705J804j498j780J267J875o68k078J045K085j488j508J92K644q63
$$ plain form
7145 844 -2129 -714 1341 556 -1910 -605 1530 -81 -1011 -434 1334 275 -1605 -752 1242 146
7161 146 -1487 -313 1331 128 -1539 -63 1645 243 -1609 -258 1537 176 -1563 -208 1467
7176 1467 260 -1470 -182 1592 254 -1560 -265 1521 257 -1554 -174 1598 153 -1543 -241
7191 -241 1446 154 -1613 -100 1547 286 -1601 -169 1590 166 -1642 -124 1565 143 -1601
7206 -1601 -29 1562 151 -1612 -162 1596 124 -1483 -178 1631 83 -1691 47 1593 37
7221 37 -1634 -62 1589 13 -1703 42 1564 -26 -1644 -6 1642 -37 -1609 -46 1666
7236 1666 -60 -1569 0 1659 32 -1588 28 1735 -25 -1657 69 1686 53 -1641 89
7251 89 1663 -27 -1537 88 1572 -201 -1679 137 1752 -120 -1628 183 1602 -169 -1567
$$ packed form
7145H44k973J415K055p85k466J305K135j611r30N77J768j059j880Q53J994j096
7161A46j633J174J644j203j667J476J708j402j852J351J795j361j739J355J675
7176A467j207j730J288J774j338j814J295J786j264j811J380J772j445j696J302
7191b41J687j292j767J513J647j261j887J432J759j424j808J518J689j422j744
7206a601J572J591j411j763J450J758j472j607J305J809j548j774J738J546j556
7221C7j671J572J651j576j716J745J522j590j618J638J648j679j572J563J712
7236A666j726j509J569J659j627j620J616J707j760j632J726J617j633j694J730
7251H9J574j690j510J625J484j773j478J816J615j872j508J811J419j771j398
$$ plain form
7266 -1567 236 1537 -32 -1591 135 1622 -235 -1511 239 1641 -198 -1566 279 1626 -93
7281 -93 -1726 193 1311 -488 -2046 20 1297 -400 -1831 752 1050 -986 -1864 -83 1418 524
7297 524 -900 643 1368 -439 -2039 200 1749 -851 -1721 494 1436 -262 -1648 54 1655 -259
7313 -259 -1616 322 1497 -266 -1439 396 1410 -384 -1528 366 1550 -343 -1559 347 1529
7328 1529 -487 -1517 400 1564 -352 -1506 318 1599 -514 -1558 497 1600 -458 -1638 353
7343 353 1499 -467 -1457 497 1680 -489 -1549 457 1611 -481 -1543 473 1584 -447 -1519
7358 -1519 455 1508 -573 -1512 360 1549 -484 -1850 588 754 -909 -942 38 2233 -572 -1853
7374 -1853 597 1781 217 -2455 179 1376 -285 -1744 509 1118 -849 -1619 846 1688 -425 -1429
$$ packed form
7266a567J803J301j569j559J726J487j857j276J750J402j839j368J845J347j719
7281i3j633J919J118j799j558K066J277j697j431K583K98k036q78J781J501q94
7297E24j424J543P25j807j600K239J549k600q70K215R42j698j386J702J601j914
7313b59j357J938J175j763j173J835J014j794j144J894J184j893j216J906J182
7328A529k016j030J917J164j916j154J824J281k113j044K055J103k058j180J991
7343C53J146j966r90J954J183k169j060K006J154k092j062K016J111k031j072
7358a519J974J053k081r39J872J189k033j366K438J66j663l3R80K195k805j281
7374a853K450J184j564k672K634J197j661j459K253O09j967p70K465Q42k113j004
$$ plain form
7390 -1429 140 1922 -933 -1127 567 1194 -432 -1914 929 1437 -419 -1000 1018 1964 101 -1377
7406 -1377 1182 770 -1160 -886 633 1936 -937 -1487 879 2226 -1381 -1803 517 1099 -848 -1742
7422 -1742 1004 1457 -901 -1524 549 1195 -1108 -1034 1285 1610 -1524 -2243 693 2170 -951 -1360 367
7439 367 1940 -1502 -1873 1370 1087 -672 -665 339 1105 -1876 -1899 717 1503 -1052 -1059 -1063 1576 -703 -1225
7458 -1225 1164 2670 -402 -1134 1259 -227 -664 -1851 773 180 -480 -2417 1119 861 -1232 -1491
7474 -1491 652 1701 -1844 -2011 626 848 -1209 -2270 871 607 -1028 -1351 1060 1467 -1073 -970
7490 -970 544 958 -1083 -894 427 1434 -785 -1643 846 813 -543 -1406 1462 773 -1135 -1219 812
7507 812 467 -876 -425 1233 1159 -2410 -1223 707 1347 -1549 -711 1002 1034 -1643 -1243 1608 1574 -1209
$$ packed form
7390a429J569J782k855j94J694O27j626j482K843N08j856n81K018R46j863j478
7406a377K559m12j930K74J519J303k873n50K366J347l607m22K320N82j947q94
7422a742K746M53k358o23K073O46k303P4K319L25l134p19K936J477l121m09J727
7439C67J573l442l71L243k83j759PJ004P66k981k3K616P86k555pmK639k279n22
7458a225K389J506l072p32K393j486m37j187K624n93o60j937L536k58k093k59
7474a491K143J049l545j67K637K22k057j061L141k64j635l23K411M07k540J03
7490i70J514M14k041J89J321J007k219q58K489l3j356q63K868o89j908q4K031
7507H12l45j343M51J658p4l569J187J930O40k896Q38J713L2k677M00K851l4k783
$$ plain form
7525 -1209 -1512 1005 1281 -1189 -1456 187 665 -927 -986 1333 749 -1573 -1489 536 2326 -1835 -2451
7542 -2451 617 1210 -1361 -1436 1173 893 -757 -1005 -235 658 -1066 -1103 990 1194 -1478 -1405 1130 1296
7560 1296 -1500 -1278 842 1265 -2832 -954 648 1062 -2826 -1476 555 397 -419 -1507 2004 683
7576 683 -1478 -517 1749 1310 -1217 -1419 1028 1153 -1845 -55 1531 292 -1630 -1148 1559 747 -1024
7593 -1024 -846 1530 1407 -1314 -1253 1237 1029 -1242 -1077 1515 815 -1295 -897 1118 842 -1499 -1056
7610 -1056 1330 795 -1357 -852 1296 877 -1341 -879 1212 927 -1333 -790 1335 875 -1389 -866 1389
7627 1389 744 -1426 -759 1350 650 -1329 -771 1380 859 -1398 -818 1510 761 -1482 -711 1378 743
7644 743 -1426 -594 1439 660 -1481 -716 1524 661 -1350 -683 1386 629 -1482 -686 1470 635 -1449
$$ packed form
7525a209l03K517K76k470k67J643M78j592n9K319n84k322Q4K025J790m161o16
7542b451L068N93k571p5K609k80j650k48P70Q93j724l7K093K04k672P3K535J66
7560A296k796K22K120M23m097J878J602M14l888J350K031j58q16j088L511j321
7576F83k161R61K266m39k527k02K447J25k998J790J586j239j922M82K707q12j771
7593a024J78K376j23k721O1K490k08k271J65K592p00k110L98K015k76k341M43
7610a056K386n35k152N05K148m19k218M62K091k85k260N43K125m60k264N23K255
7627A389o45k170O67K109p00j979N58K151n21k257N80K328p49k243P71K089o35
7644G43k169Q32K033p79k141P65K240q63k011O67K069p57k111P96K156q35k084
$$ plain form
7661 -1449 -700 1378 702 -1483 -721 1489 643 -1403 -688 1445 689 -1426 -728 1557 690 -1459 -712
7678 -712 1455 457 -1489 -622 1549 602 -1669 -817 1403 831 -1201 -627 2161 234 -1148 -168 1761
7695 1761 645 -2333 -448 1310 25 -1724 -1357 1776 645 -2578 -157 1863 1458 -2081 -455
7710 -455 1722 641 -1763 -524 1689 361 -1661 -431 1676 567 -1772 -216 1840 220 -1305
7725 -1305 -583 1379 378 -1606 -411 1744 348 -1382 -273 1593 347 -1581 -239 1465 479
7740 479 -1397 -294 1625 319 -1446 -293 1501 333 -1550 -186 1649 180 -1454 -308 1444
7755 1444 215 -1484 -173 1524 120 -1427 -211 1613 134 -1513 -267 1457 177 -1675 -68
7770 -68 1554 221 -1441 -142 1555 130 -1483 -120 1669 -44 -1400 -75 1813 261 -1541
$$ packed form
7661a449P49K078o76k185P62K210q46k046P15K133p56k115O98K285q67k149P47
7678g12K167r98j946Q67K171r47k271Q52K220n72k032N74K788j927j382R80J929
7695A761j116k978J885J758j285j749L67L133j131l223K421K020m05l539J626
7710d55K177j081k404J239K213j328k022J230K107j109k339J556K056j620j525
7725a305P22J962j001j984J195K155j396j730J109J866j246j928J342J704r86
7740D79j876J103J919j306j765J153J794j168j883J364J835j469j634J146J752
7755A444j229j699J311J697j404j547J216J824j479j647J246J724j280j852J607
7770f8J622j333j662J299J697j425j613J363J789j713j356J325J888j552j802
$$ plain form
7785 -1541 21 1367 493 -1572 199 1959 225 -1677 -219 920 -214 -1759 -1 1812 618
7800 618 -1537 146 1349 77 -1500 23 1482 -38 -1461 33 1510 -36 -1579 66 1428
7815 1428 1 -1550 75 1356 -83 -1495 48 1502 -81 -1424 75 1576 -78 -1437 138
7830 138 1421 -53 -1483 44 1574 -84 -1468 108 1537 -204 -1514 157 1424 -122 -1470
7845 -1470 168 1415 -203 -1563 211 1474 -305 -1465 192 1550 -209 -1307 210 1337 -244
7860 -244 -1419 179 1373 -327 -1455 50 1509 -307 -1428 258 1387 -151 -1523 235 1366
7875 1366 -327 -1406 331 1374 -362 -1457 318 1342 -384 -1259 198 1455 -63 -1394 485
7890 485 1436 -355 -1403 317 1424 -323 -1315 424 1295 -335 -1250 520 1313 -499 -1380 526 1504
$$ packed form
7785a541J562J346q74k065J771J760j734j902J458J139j134j545J758J813j194
7800F18k155J683J203j272j577J523J459j520j423J494J477j546j543J645J362
7815A428j427j551J625J281j439j412J543J454j583j343J499J501j654j359J575
7830A38J283j474j430J527J530j658j384J576J429j741j310J671J267j546j348
7845a470J638J247j618j360J774J263j779j160J657J358j759j098J517J127j581
7860b44j175J598J194j700j128J505J459j816j121J686J129j538j372J758J131
7875A366j693j079J737J043j736j095J775J024j726q75J457J257j518j331J879
7890D85R51j791j048J720J107j747r92J739Q71j630r15J770P93j812q81J906R78
$$ plain form
7907 1504 -462 -1267 393 1313 -526 -1405 561 1466 -364 -1322 519 1192 -320 -1220 488 1266 -504
7924 -504 -1340 593 1269 -592 -1334 490 1273 -483 -1322 490 1348 -517 -1248 519 1311 -433 -1208
7941 -1208 633 1309 -633 -1225 575 1224 -592 -1273 627 1165 -672 -1133 599 1163 -781 -1111 629
7958 629 1151 -643 -1065 722 1195 -577 -1128 682 1139 -634 -1096 702 1211 -628 -1169 690 1154
7975 1154 -767 -1215 659 1179 -633 -1098 725 1354 -695 -1172 682 1202 -587 -1164 747 1165 -784
7992 -784 -1256 763 1120 -649 -1105 638 1109 -867 -1100 745 1065 -700 -1083 828 1078 -760 -1007
8009 -1007 701 1019 -904 -1059 828 1102 -760 -1054 810 1077 -815 -1045 722 1027 -849 -1072 915
8026 915 972 -878 -1053 813 977 -858 -870 726 948 -925 -893 801 965 -755 -1065 803 1000 -801
$$ packed form
7907A504j966q05J660R20j839q79J966R05j830r58J841O73j512r00J708P78j770
7924e04q36J933O76j861p42J824P83j756q39J812Q58j865p31J767P92j744p75
7941a208J841O76j942n92J800O49j816o81J900N38j837m61J732N64j944l30J740
7958F29N22j794m22J787M73j772n51J810M57j773m62J798N09j839n41J859M64
7975A154j921m48J874N20j812m65J823O29k049m77J854N20j789n77J911M18j949
7992g84m72K019L57j769m56J743M71j976k33J845L20j765l83J911K50j838k47
8009a007J708L18j923j55J887K74j862k94J864K67j892k30J767L05j876k23J987
8026I15N7j850j75J866J64j835j2J596K22j873L2J694J64j720l10J868J97j801
$$ plain form
8044 -801 -1048 864 914 -823 -1108 876 943 -895 -900 884 976 -871 -806 868 921 -916 -822 922 799 -937
8064 -937 -879 929 870 -953 -848 959 793 -966 -811 915 810 -895 -945 1020 799 -885 -796 991
8082 991 903 -999 -672 917 857 -892 -778 933 790 -896 -808 920 721 -916 -857 938 790 -1032
8100 -1032 -685 927 761 -917 -684 1007 686 -1008 -694 1002 675 -981 -715 1091 722 -758 -615
8117 -615 1006 699 -931 -709 1031 734 -1019 -575 1041 658 -1078 -555 1002 659 -1045 -638 1176
8134 1176 718 -989 -690 971 653 -1007 -571 1037 641 -1030 -695 894 537 -984 -551 1045 563
8151 563 -968 -673 1112 651 -1017 -604 1021 547 -999 -650 1043 590 -1013 -393 1075 427 -997
8168 -997 -508 996 482 -1061 -420 1050 469 -992 -522 1108 445 -1012 -388 1072 396 -1192 -455
$$ packed form
8044h01k47J912N0j737k85J984O7j838nJ784R2j847O5J674N3j837R4J744j23j736
8064i37N8J808n9j823J05J807j66j759J55J726j05j705n0J965k21j684Q9J787
8082I91q8j902L27J589o0j749J14J711j43j686Q8J728j99j637N9J795j48j822
8100a032L47J612j66j678K33J691l21j694L14J696l27j656K66J806l69j480J43
8117f15J621l07j630K22J740k97j753M44J616l83j736N23J557l43j704M07J814
8134A176m58j707K99J661l18j660M36J608l96j671L35J589l57j521M33J596m82
8151E63j531K95J785m61j668M13J625m74j546L49J693m53j603O20J468o48j424
8168i97M89J504n14j543O41J470n81j461M70J630o63j457O24J460o76j588P37
$$ plain form
8185 -455 1095 442 -1033 -351 1002 478
$$ packed form
8185d55J550o53j475O82J353n24
8191D78
$$ Imaginary data points
##PAGE= N=2
##DATA TABLE= (X++(I..I)), XYDATA
$$ plain form
0 0 0 0 0 0 0 0 0 0 0 0 8 -8 8 -8 11 -16 16 -19 24 -32 34 -42 51 -59 67 -82 96 -108 124 -145 165 -187 211
33 211 -237 269 -304 341 -382 426 -474 528 -586 651 -721 793 -878 969 -1068 1175 -1295
50 -1295 1429 -1572 1732 -1912 2116 -2346 2605 -2908 3261 -3679 4184 -4812 5616 -6674 8146
65 8146 -10343 13953 -20910 39105 -185622 -339237 303854 302739 -281017 -314965 298221 301556
77 301556 -286339 -304463 296524 296282 -288230 -296971 292804 287654 -289608 -288072 292199 280165
89 280165 -290365 -280174 291145 273032 -291253 -271792 293440 267846 -291395 -263192 294065
100 294065 262036 -293204 -257871 295560 256997 -295365 -254320 295974 250457 -298401 -249741
111 -249741 296273 245150 -298789 -244446 297726 239996 -299213 -237721 299577 236551 -298033
$$ packed form
0@%%%%%%%%%%Qj6J6j6J9k7L2l5M3n6O6p6R3j10J26j49J78k04K32k69L10l52L98
33B11m48N06n73O45p23Q08r00J002j114J237j372J514j671J847k037K243k470
50a295K724l001L304l644M028m462M951n513O169o940P863q996J0428j2290J4820
65H146j8489K4296l4863O0015k24727j53615O43091j115n83756l3948O13186L335
77C01556n87895j8124O00987k42n84512q741N89775n150n77262J536N80271j2034
89B80165n70530J0191N71319j8113n64285J9461N65232k5594n59241K8203N57257
100B94065l2029n55240L5333N53431l8563n52362M1045N50294m5517n48858M8660
111b49741N46014n1123n43939N4343N42172n7730n39209O1492N37298o3026n34584
$$ plain form
122 -298033 -229776 299400 228195 -298994 -223914 299290 221711 -298176 -218529 294902 212273
133 212273 -298981 -214671 296325 208817 -296904 -207963 295599 203841 -293243 -199279 294757
144 294757 197913 -292103 -192034 292156 191903 -292010 -188870 291952 185536 -292962
154 -292962 -185545 292517 181431 -295011 -181751 294098 178842 -296046 -176944 297266
164 297266 175541 -297094 -172372 299633 172554 -298060 -168321 300186 166785 -300169
174 -300169 -165262 299544 161394 -301068 -161234 299031 157185 -300719 -156273 299039
184 299039 153353 -298177 -150188 298602 149127 -296045 -144600 297094 143687 -294816
194 -294816 -140104 294659 137971 -294655 -136524 292685 132627 -294412 -132446 292318
$$ packed form
122b98033O8257N29176p1205n27189P5080N23204p7579n19887P9647N13431q2629
133B12273n11254Q4310N10996q7508n05721Q8941N03562r1758m97084R3964M94036
144B94757r6844m90016J00069M84190j00253m83913J03140M80822j06416m78498
154b92962J07417M78062j11086m76442J13260M75849j15256m74888J19102M74210
164B97266j21725m72635J24722M72005j27079m70614J29739M68507j33401m66954
174c00169J34907M64806j38150m62462J39834M60265j41846m57904J44446M55312
184B99039j45686m51530J47989M48790j49475m45172J51445M41694j53407m38503
194b94816J54712M34763j56688m32626J58131M29209j60058m27039J61966M24764
$$ plain form
204 292318 128772 -293770 -127431 293799 125722 -293414 -122455 295613 122341 -294257
214 -294257 -118554 296594 117951 -296249 -115445 296808 112866 -298283 -112371 296979
224 296979 108235 -298953 -107914 296519 103480 -295767 -100712 297801 101273 -296231
234 -296231 -97213 297120 96971 -294490 -93055 294405 91290 -293450 -89402 291201
244 291201 85880 -291959 -85472 288784 81474 -289373 -80491 287836 78198 -286760
254 -286760 -75239 287466 74921 -285372 -70910 286912 70449 -285718 -67385 285393
264 285393 64545 -286895 -64331 285641 60417 -287591 -60310 286244 56874 -287135
274 -287135 -55346 287319 53855 -286039 -50416 287469 50247 -284983 -46790 285764
$$ packed form
204B92318j63546m22542J66339M21230j68077m19136J70959M18068j73272m16598
214b94257J75703M15148j78643m14200J80804M12253j83942m11149J85912M09350
224B96979j88744m07188J91039M04433j93039l99247J95055L98513j96528l97504
234b96231J99018L94333k00149l91461K01435L87460k03115l84740K04048L80603
244B91201k05321l77839K06487L74256k07310l70847K08882L68327k09638l64958
254b86760K11521L62705k12545l60293K14462L57822k16463l56167K18333L52778
264B85393k20848l51440K22564L49972k25224l48008K27281L46554k29370l44009
274b87135K31789L42665k33464l39894K35623L37885k37222l35230K38193L32554
$$ plain form
284 285764 45636 -284283 -43963 282641 41076 -282594 -40590 279063 36829 -278834
294 -278834 -36698 276631 34534 -275152 -32714 273943 31767 -271349 -28245 271685
304 271685 27867 -269220 -25890 268775 24081 -267897 -23555 265733 20502 -267406
314 -267406 -20421 263919 17649 -266413 -15851 265675 15533 -265100 -12599 265627
324 265627 12903 -263687 -9983 265408 8950 -262623 -7181 263964 5156 -264871
334 -264871 -4945 262764 1905 -263434 -1681 260958 -642 -260200 2252 259239
344 259239 -2627 -256502 5760 256646 -5452 -253469 8239 252959 -9125 -251266
354 -251266 10128 249093 -12727 -249234 12546 246518 -15454 -246720 16028 245374
$$ packed form
284B85764k40128l29919K40320L26604k41565l23670K42004L19653k42234l15663
294b78834K42136L13329k42097l09686K42438L06657k42176l03116K43104K99930
304B71685k43818k97087K43330K94665k44694k91978K44342K89288k45231k87908
314b67406K46985K84340k46270k84062K50562K81526k50142k80633K52501K78226
324B65627k52724k76590K53704K75391k56458k71573K55442K71145k58808k70027
334b64871K59926K67709k60859k65339K61753K62639k61600k59558K62452K56987
344B59239k61866k53875K62262K50886k62098k48017K61708K44720k62084k42141
354b51266K61394K38965k61820k36507K61780K33972k61972k31266K62748K29346
$$ plain form
364 245374 -17618 -244380 19831 244963 -19843 -242862 23201 244159 -23214 -242801
374 -242801 25838 242764 -27564 -243171 28299 241268 -31308 -242066 31708 239285
384 239285 -33513 -239770 35050 237944 -36532 -236535 38667 236058 -38659 -234471
394 -234471 41441 234270 -40992 -232638 41990 230823 -44749 -229728 43536 226815
404 226815 -46510 -226160 46068 224808 -47520 -224032 49296 223359 -49395 -220578
414 -220578 51905 221391 -51854 -219102 53926 219052 -55342 -218582 55995 216875
424 216875 -59005 -217754 58915 215753 -61788 -216154 62545 215268 -63881 -213970
434 -213970 66271 214463 -66301 -212107 69207 212441 -69424 -210543 70876 209245
$$ packed form
364B45374k62992k26762K64211K25132k64806k23019K66063K20958k67373k19587
374b42801K68639K16926k70328k15607K71470K12969k72576k10758K73774K07577
384B39285k72798k06257K74820K02894k74476k00003K75202J97391k74717j95812
394b34471K75912J92829k75262j91646K74628J88833k75572j84979K73264J83279
404B26815k73325j79650K72228J78740k72328j76512K73328J74063k72754j71183
414b20578K72483J69486k73245j67248K73028J65126k74394j63240K74577J60880
424B16875k75880j58749K76669J56838k77541j54366K78699J52723k79149j50089
434b13970K80241J48192k80764j45806K81314J43234k81865j41119K81419J38369
$$ plain form
444 209245 -72720 -208608 72423 205629 -74981 -205582 74375 202790 -76164 -201443
454 -201443 76792 200140 -76835 -197358 78799 197259 -78272 -194124 80109 193402
464 193402 -80387 -191997 81029 189973 -83029 -190015 82702 187388 -85242 -187516
474 -187516 85327 185993 -86724 -184946 88486 185043 -88593 -182050 91438 183282 -91126
485 -91126 -181395 92828 180773 -94135 -180397 94213 178218 -96531 -178271 95905 175866
496 175866 -97576 -175169 97939 173827 -97734 -171580 99207 171260 -97988 -168411 99591
507 99591 167936 -98898 -165792 99158 163969 -100129 -163570 99057 160803 -100710 -160833
518 -160833 100031 158689 -100894 -157611 101805 157246 -101503 -155012 103508 155286 -102994
$$ packed form
444B09245k81965j35888K81031J33206k80610j30601K79957J28415k78954j25279
454b01443K78235J23348k76975j20523K76157J18460k75531j15852K74233J13293
464A93402k73789j11610K73026J08944k73002j06986K72717J04686k72630j02274
474a87516K72843J00666k72717r8222K73432R6557k73636r3457K73488R1844k74408
485i1126r0269K74223Q7945k74908q6262K74610Q4005k74749q1740K74176P9961
496A75866k73442p7593K73108P5888k71561p3846K70787P2053k69248p0423K68002
507I9591O8345k66834o6894K64950O4811k64098o3441K62627O1746k61513o0123
518a60833K60864N8658k59583n6717K59416N5441k58749n3509K58520N1778k58280
$$ plain form
529 -102994 -153366 104893 153092 -105658 -152447 105871 150679 -107957 -151119 107601 148914
540 148914 -109667 -148802 109910 147531 -110479 -145938 111925 145976 -111184 -143305 113058
551 113058 143156 -112238 -141205 112889 139726 -113515 -139178 112534 136572 -113918 -136443
562 -136443 112741 134083 -113686 -133059 113746 132086 -113149 -129895 114528 130015 -113483
573 -113483 -127469 114786 127253 -114791 -126086 115047 124467 -116444 -124744 115896 122629
584 122629 -117873 -122837 117790 121481 -118726 -120464 120194 120370 -119570 -118157 121515 118519
596 118519 -120906 -116663 121960 115704 -122468 -115125 121864 112931 -123303 -112914 122212
607 122212 110634 -123024 -110037 122635 108842 -122097 -106770 122846 106667 -121374 -104195
$$ packed form
529a02994n0372K58259M8199k58750m6789K58318M4808k58636m3162K58720M1313
540A48914k58581l9135K58712L7621k58010l5459K57863L4051k57160l2121K56363
551A13058L0098k55394k8967K54094K6837k53241k5663K51712K4038k50490k2525
562a36443K49184K1342k47769j9373K46805J8340k45235j6746K44423J5487k43498
573a13483j3986K42255J2467k42044j1295K41133R420k40911q300K40640O733
584A22629k40502m964K40627L691k40207j738K40658J76k39940J413K39672k996
596A18519k39425M243K38623o256k38172P343K36989q933k36234J0389K35126
607A22212j1578k33658J2987K32672j3793k30939J5327K29616j6179k28041J7179
$$ plain form
618 -104195 122449 103986 -121573 -102310 121502 100844 -122173 -100567 121317 98225 -122555
629 -122555 -98157 121963 96341 -122639 -95453 123454 94879 -123307 -92806 124837 92844
640 92844 -124350 -90889 125706 90153 -126066 -89470 125905 87387 -127391 -87518 126306
651 126306 85257 -127535 -84971 126971 83759 -126961 -82203 127353 82039 -125818 -79726
662 -79726 126604 79906 -125398 -78047 125122 76955 -124925 -76778 123418 74507 -124166
673 -124166 -74743 122752 72715 -122965 -72230 122818 71499 -121864 -69679 122941 70002
684 70002 -121733 -68101 122570 67998 -122388 -66958 122374 65514 -123382 -65770 122330
695 122330 63803 -123758 -63922 123201 62444 -123425 -61485 124012 61484 -123004 -59424
$$ packed form
618a04195K26644j8463k25559J9263K23812k0658k23017K1606K21884k3092k20780
629a22555K4398K20120k5622k18980K7186K18907k8575k18186L0501K17643l1993
640I2844k17194L3461K16595l5553k16219L6596K15375l8518k14778L9873K13824
651A26306m1049k12792M2564K11942m3212k10720M4758K09556m5314k07857M6092
662g9726K06330m6698k05304M7351K03169m8167k01880M8147K00196m8911j98673
673a24166M9423J97495n0037j95680N0735J95048n1319j93363N2185J92620n2939
684G0002j91735N3632J90671n4572j90386N5430J89332n6860j88896N7612J88100
695A22330n8527j87561N9836J87123o0757j85869O1940J85497o2528j84488O3580
$$ plain form
706 -59424 123917 59661 -122646 -58004 122932 57409 -122760 -56910 121476 55079 -122039
717 -122039 -55449 120377 53436 -120586 -53246 119772 52364 -118881 -50915 119384 50949
728 50949 -117548 -49070 118328 48979 -117215 -47826 117111 46796 -117818 -46763 116669
739 116669 44873 -117826 -45005 117045 43529 -117479 -42605 117878 42342 -117248 -40480
750 -40480 118456 40735 -117491 -38950 118140 38442 -118017 -37802 117378 36471 -118102
761 -118102 -36730 116650 34921 -117093 -34876 116151 33958 -115526 -32833 115599 32963
772 32963 -114033 -31300 114445 31533 -113091 -30348 112678 29601 -112516 -29552 111155
783 111155 27920 -111887 -28412 110496 26908 -110869 -26457 110587 26081 -109797 -24572
$$ packed form
706e9424J83341o4256j82307O4642J80936o5523j80169O5850J78386o6397j77118
717a22039O6590J75826o6941j74022O7340J73018o7408j71245O7966J70299o8435
728E0949j68497O8478J67398o9349j66194O9389J64937p0315j64614P1055J63432
739A16669p1796j62699P2821J62050p3516j61008P4874J60483p5536j59590P6768
750d0480J58936p7721j58226P8541J57090p9698j56459Q0215J55180q0907j54573
761a18102Q1372J53380q1729j52014Q2217J51027q2193j49484Q2693J48432q2636
772C2963j46996Q2733J45745q2912j44624Q2743J43026q3077j42117Q2964J40707
783A11155q3235j39807Q3475J38908q3588j37777Q4412J37044q4506j35878Q5225
$$ plain form
794 -24572 110690 24836 -109620 -23102 110392 22994 -109979 -22104 109795 20919 -110414
805 -110414 -21001 109356 19174 -109970 -19366 109195 18084 -109011 -17297 108952 17306
816 17306 -107682 -15839 108100 16099 -106723 -14935 106534 14423 -105862 -14338 104569
827 104569 12886 -104810 -13384 103142 12255 -103245 -12002 102332 11406 -101355 -10347
838 -10347 101733 10604 -100244 -8975 100753 8995 -100025 -8146 99699 7149 -99940
849 -99940 -7210 98661 5451 -99511 -5693 98576 4328 -98649 -3899 98630 3605
860 3605 -97719 -2262 98198 2534 -96814 -1270 96918 1316 -96378 -943 95286 -7
872 -7 -95549 -553 93922 -797 -93860 329 92812 -771 -91934 1413 91812 -888 -90262
$$ packed form
794b4572J35262q5854j34456Q6518J33494q7398j32973Q7875J31899q8876j31333
805a10414Q9413J30357r0182j29144R0604J28561r1111j27095R1714J26249r1646
816A7306j24988R1843J23939r2001j22822R1788J21469r2111j20285R1524J18907
827A04569r1683j17696R1426J16526r0887j15500R1243J14334r0926j12761R1008
838a0347J12080r1129j10848R1269J09728r1758j09020R1879J07845r2550j07089
849i9940R2730J05871r3210j04962R3818J04269r4248j02977R4750J02529r5025
860C605j01324R5457J00460r5664r9348R5544R8188r5602r7694R5435R6229r5293
872gr5542R4996R4475r4719r3063R4189R2483r3583r1163R3347R0399r2700q9374
$$ plain form
885 -90262 2104 90537 -1631 -89203 2434 88930 -2805 -88600 2669 87565 -3942 -88086
897 -88086 3423 86898 -4692 -87009 4943 86671 -5196 -85843 6263 86567 -5942 -85246
909 -85246 7311 85712 -7129 -85177 7767 84544 -8571 -84941 8186 83521 -9583 -83752
921 -83752 9151 82864 -9798 -82408 10150 82229 -9791 -80811 10681 81015 -10089 -79648
933 -79648 10815 79403 -10911 -78853 10755 77728 -11535 -78020 11031 76676 -11943 -76752
945 -76752 11791 76074 -11962 -75324 12943 75658 -12470 -74394 13666 74932 -13398 -74064
957 -74064 14133 73856 -14784 -73972 14683 72960 -15866 -73239 15313 72482 -15712 -71693
969 -71693 17021 71751 -17116 -70540 17715 71384 -16821 -69171 18242 69737 -17667 -68848
$$ packed form
885i0262R2366Q8433r2168q7572R1637Q6496r1735q5795R1269Q4896r1507q4144
897h8086R1509Q3475r1590q2317R1952Q1728r1867q0647R2106Q0304r2509p9304
909h5246R2557P8401r2841p8048R2944P6777r3115p6370R3127P5335r3104p4169
921h3752R2903P3713r2662p2610R2558P2079r2020p1020R1492P0334r1104o9559
933g9648R0463O8588r0314o7942Q9608O6973q9263o6485Q9051O5645q8619o4809
945g6752Q8543O4283q8036o3362Q8267O2715q8128o1924Q8060O1266q8330o0666
957g4064Q8197N9723q8640n9188Q8655N8277q8826n7373Q8552N7169q8194n5981
969g1693Q8714N4730q8867n3424Q8255N3669q8205n2350Q7413N1495q7404n1181
$$ plain form
981 -68848 17027 68387 -18612 -67989 17363 67012 -18296 -67184 18013 66131 -17921 -65690
993 -65690 19078 65491 -17926 -64343 18994 64598 -18624 -63582 19566 63129 -19363 -63303
1005 -63303 19699 61993 -20794 -62537 20027 61365 -21170 -61397 21127 60971 -21356 -60474
1017 -60474 22340 60891 -21958 -59403 22902 59257 -22633 -58714 23086 58193 -23121 -58002
1029 -58002 22295 57024 -23508 -57110 23051 56312 -22863 -55522 23262 55921 -22258 -54249
1041 -54249 22834 54110 -23317 -53275 23149 52831 -22895 -53303 22871 50895 -23868 -51934
1053 -51934 23092 49267 -23139 -50959 23024 50634 -23705 -49374 23443 49993 -23201 -49194
1065 -49194 24136 48326 -24076 -48166 24342 48118 -24057 -48188 24158 47428 -25183 -47890
$$ packed form
981f8848Q5875N1360q6999m9377Q5352M9649q5308m8888Q5197M8118q4052m7769
993f5690Q4768M6413q3417m6417Q3337M5604q3222m4958Q3148M3563q2492m3940
1005f3303Q3002M2294q2787m1743Q2564M1338q2535m0227Q2524L9844q2327l9118
1017f0474Q2814L8551q2849l7445Q2305L6355q1890l6081Q1800L5107q1314l4881
1029e8002Q0297L4729q0532l3602Q0161L3261p9175l2659P8784L2659p8179l1991
1041e4249P7083L1276p7427k9958P6424K9682p5726l0408P6174K8024p4763k8066
1053e1934P5026K6175p2406k7820P3983K7610p4339k5669P2817K6550p3194k5993
1065d9194P3330K4190p2402k4090P2508K3776p2175k4131P2346K3270p2611k2707
$$ plain form
1077 -47890 24746 46544 -24731 -46703 25263 45875 -24736 -45369 25254 45890 -24687 -44751
1089 -44751 25213 44507 -24114 -43964 23753 42992 -24403 -42804 23312 41556 -24481 -42487
1101 -42487 23785 41980 -24118 -41502 23248 42204 -23662 -40235 24298 40787 -23837 -39303
1113 -39303 23950 39660 -25064 -39809 24598 38231 -24755 -39564 25201 38786 -25144 -38104
1125 -38104 24796 38099 -25242 -37430 25136 37166 -24761 -36942 25357 36586 -24401 -37143
1137 -37143 24663 34929 -26011 -36069 24371 35150 -24879 -35001 24571 34944 -24383 -34303
1149 -34303 24405 33885 -23882 -33092 24380 33795 -23674 -32995 23658 32834 -24255 -31979 23732
1162 23732 31909 -24072 -32377 23277 30457 -24798 -31000 23899 30254 -24325 -30015 24952 30424
$$ packed form
1077d7890P2636K1798p1275k1972P1966K0612p0611k0633P0623K0636p0577k0064
1089d4751O9964J9294o8621j9850O7717J9239o7395j8401O6116J8244o6037j8006
1101d2487O6272J8195o6098j7384O4750J8956o5866j6573O4533J6489o4624j5466
1113c9303O3253J5710o4724j4745O4407J3633o2986j4809O4765J3585o3930j2960
1125c8104O2900J3303o3341j2188O2566J2030o1927j2181O2299J1229o0987j2742
1137c7143O1806J0266o0940j0058O0440J0779o0029j0122N9572J0373n9327r920
1149c4303N8708R480n7767r210N7472R415n7469r321N6653R176n7089p724N5711
1162B3732Q177n5981q305N5654P180n5255o202N4899O355n4579n690N4967N472
$$ plain form
1175 30424 -24155 -29293 25095 29362 -24655 -29037 24505 28599 -24790 -28833 23959 27780 -25021
1188 -25021 -28176 24484 27165 -24661 -27346 23970 27320 -24195 -26286 24303 26804 -23086 -25669
1201 -25669 23433 25987 -22770 -26310 23110 25165 -23131 -25397 22294 24493 -22852 -25061 22696
1214 22696 23889 -21948 -23936 22412 23857 -22557 -23097 22508 23329 -21890 -22998 22459 22517 -22310
1228 -22310 -22779 22051 22291 -22640 -22180 22012 21566 -22263 -21669 22160 21454 -21880 -21003 22158 21226
1243 21226 -21514 -20513 21677 20610 -21096 -20420 20993 19918 -20997 -20283 20325 19516 -20660 -19786
1257 -19786 19926 19260 -19896 -19125 19820 19313 -19396 -18417 19770 18847 -19110 -18357 19261 18256
1271 18256 -19210 -18315 18879 17749 -19365 -17996 18805 17382 -19217 -17664 18943 17221 -18733
$$ packed form
1175C0424n4579n138N4388M267n4017m382N3542M094n3389m043N2792L821n2801
1188b5021l155N2660K681n1826k685N1316L350n1515k091N0589K501m9890k583
1201b5669M9102K554m8757l540M9420K055m8296k266M7691K199m7345k209M7757
1214B2696J193m5837j988M6348J445m6414n40M5605Q21m5219j108M5457N8m4827
1228b2310m69M4830K40m4931M60M4192m46m3829N94M3829p06m3334Q77M3161r32
1243B1226m2740J001M2190j067m1706O76M1413j075m0915P14M0608q09m0176Q74
1257a9786L9712o66l9156P71L8945n07l8709R79L8187r23l7957P53L7618j005
1271A8256l7466Q95L7194j130l7114J369L6801j423l6599J553L6607j722l5954
$$ plain form
1284 -18733 -16903 18954 17204 -18381 -16427 18931 16789 -18484 -16345 18350 16099 -18438 -16313
1297 -16313 17765 15722 -18081 -16147 17497 15733 -17501 -15753 17343 15693 -16853 -15260 16997
1310 16997 15502 -16490 -14960 16716 15119 -16433 -15035 15923 14730 -16363 -15068 15708 14390
1323 14390 -16095 -14758 15725 14239 -15812 -14144 15889 14249 -15385 -13658 15916 13945 -15410
1336 -15410 -13461 15558 13404 -15546 -13541 15100 13010 -15512 -13486 14897 12911 -15140 -13045
1349 -13045 14849 12959 -14481 -12662 14641 12851 -14214 -12419 14313 12524 -13973 -12540 13694
1362 13694 12155 -13763 -12559 13232 11969 -13381 -12399 12894 12041 -12749 -11913 12907 12142 -12494
1376 -12494 -11549 12841 11879 -12463 -11462 12637 11458 -12434 -11562 12038 11134 -12478 -11390 11903
$$ packed form
1284a8733J830L5857j750l5585J954L5358k142l5273K139L4695k251l4537K125
1297a6313L4078k043l3803J934L3644j764l3234J748L3096j650l2546J593L2257
1310A6997j495l1992J530L1676j597l1552J398L0958j193l1093J295L0776j318
1323A4390l0485J337L0483j486l0051J668L0033j640k9634J727K9574j971k9355
1336a5410J949K9019k154k8950K005K8641k090k8522K026K8383j986k8051K095
1349a3045K7894j890k7440J819K7303j790k7065J795K6732j789k6497J433K6234
1362A3694j539k5918J204K5791j263k5350R82K5293q53k4790Q36K4820p65k4636
1376a2494R45K4390r62k4342J001K4099j179k3892Q72K3600r04k3612J088K3293
$$ plain form
1390 11903 10898 -12356 -11066 12061 10969 -11759 -10784 11815 11026 -11418 -11017 11643 10589 -11539
1404 -11539 -10569 10771 10742 -11083 -10971 10431 10321 -10886 -10592 10180 10640 -10181 -10322 9811 11176
1419 11176 -9907 -10213 9880 10952 -9290 -10349 9875 10656 -9080 -9938 9356 10227 -9216 -10835
1433 -10835 9064 10380 -9044 -10723 8083 9078 -9324 -9922 9252 9371 -8853 -10137 8139 10148
1447 10148 -8364 -10461 8889 8910 -7862 -9427 7916 9790 -9218 -10213 7478 9727 -8641 -10328
1461 -10328 7452 10487 -7208 -9783 7009 10508 -7179 -9952 7204 10026 -6685 -10234 6686
1474 6686 10395 -6968 -10514 6269 10196 -6330 -10376 5940 10442 -6209 -10445 5671 10132
1487 10132 -6373 -10422 6988 10941 -5418 -10852 6124 9414 -6281 -10062 4892 9601 -6470
$$ packed form
1390A1903j005k3254J290K3127j092k2728R75K2599p89k2444M01K2660j054k2128
1404a1539R70K1340k9k1825J12K1402j10k1207K94K0772M60k0821j41K0133J365
1419A1176k1083l06K0093J072k0242j059K0224P81j9736q58J9294Q71j9443j619
1433a0835J9899J316j9424j679J8806R95j8402n98J9174J19j8224j284J8276K009
1447A0148j8512k097J9350K1j6772j565J7343J874j9008r95J7691K249j8368j687
1461a0328J7780L035j7695k575J6792L499j7687k773J7156K822j6711l549J6920
1474F686L709j7363l546J6783L927j6526m046J6316M502j6651m236J6116M461
1487A0132j6505m049J7410L953j6359n434J6976L290j5695l781J4954M709j6071
$$ plain form
1500 -6470 -10530 5516 10610 -6140 -11066 6261 10220 -5450 -10384 6351 11088 -5474 -10440
1513 -10440 4934 10204 -5344 -10922 5379 11093 -5818 -10261 4692 10969 -4750 -11238 5201
1526 5201 9737 -4252 -10992 4414 11536 -4497 -10277 5130 10366 -4041 -11248 4994 11246
1539 11246 -4337 -10177 4772 10743 -4212 -11437 4257 10627 -4549 -11775 4259 11127 -4425
1552 -4425 -10945 3993 12074 -5292 -10771 3836 10813 -3870 -11978 2601 10248 -5491 -11635
1565 -11635 3216 10474 -3748 -12893 3181 11086 -3923 -11580 3335 12023 -3363 -12831 3551
1578 3551 11663 -2651 -11663 2602 10985 -4046 -12125 2259 11511 -2821 -10786 3358 11927
1591 11927 -3824 -12285 2858 11402 -4214 -12277 2856 11664 -2707 -12277 2487 12100 -2993
$$ packed form
1500f470m060J6046N094j6750m926J7327L959j5670m934J6735M737j6562m966
1513a0440J5374N270j5548n578J6301N714j6911m443J4953O277j5719o488J6439
1526E201M536j3989o740J5406P122j6033n780J5407N236j4407p207J6242O252
1539A1246j5583n840J4949N971j4955p225J5694O370j5176p226J6034O868j5552
1552d425o520J4938Q081j7366n479J4607O977j4683q108J4579P647j5739o144
1565a1635J4851P258j4222r145J6074P905j5009p657J4915Q688j5386r468J6382
1578C551Q112j4314r012J4265Q383j5031q079J4384R252j4332p965J4144Q569
1591A1927j5751q461J5143Q544j5616q063J5133Q808j4371r570J4764R613j5093
$$ plain form
1604 -2993 -12175 3024 11901 -3161 -12799 3614 12111 -3583 -12629 3035 11811 -3228 -12686
1617 -12686 3063 12397 -2504 -13054 2944 13244 -2577 -12266 3435 13311 -2553 -12884
1629 -12884 2235 12594 -2165 -13256 2580 13344 -3118 -13217 1387 13404 -2283 -12968
1641 -12968 2591 13256 -2377 -13749 2738 13176 -2422 -13202 2682 13033 -2944 -14034
1653 -14034 2722 13541 -2714 -14203 2449 13517 -2990 -13305 2477 14303 -3147 -13252
1665 -13252 2958 13804 -2765 -13988 3286 13724 -3230 -13903 2648 14160 -2847 -14177
1677 -14177 2675 14107 -2918 -14291 2606 14197 -2761 -14361 2698 14410 -2635 -14318
1689 -14318 2832 14624 -2615 -14375 2976 14485 -2851 -14572 2836 14556 -3079 -14777
$$ packed form
1604b993r182J5199Q877j5062r638J6413Q497j5694r046J5664Q776j5039r458
1617a2686J5749R334j4901j0550J5998J0300j5821r689J5701R876j5864j0331
1629a2884J5119J0359j4759j1091J5836J0764j6462j0099J4604J2017j5687j0685
1641a2968J5559J0665j5633j1372J6487J0438j5598j0780J5884J0351j5977j1090
1653a4034J6756J0819j6255j1489J6652J1068j6507j0315J5782J1826j7450j0105
1665a3252J6210J0846j6569j1223J7274J0438j6954j0673J6551J1512j7007j1330
1677a4177J6852J1432j7025j1373J6897J1591j6958j1600J7059J1712j7045j1683
1689a4318J7150J1792j7239j1760J7351J1509j7336j1721J7408J1720j7635j1698
$$ plain form
1701 -14777 2936 14578 -3296 -14809 3259 14574 -3116 -14709 3427 14678 -3495 -14213
1713 -14213 3118 15241 -3483 -14037 3932 14554 -3426 -14922 3713 14837 -3567 -15041
1725 -15041 3099 14875 -3740 -15188 3477 15078 -3424 -15052 3709 15256 -3278 -14995
1737 -14995 3741 15218 -3693 -15366 3567 15159 -3801 -15420 3539 15165 -3766 -15447
1749 -15447 3819 15329 -3865 -15350 4058 15699 -4022 -15288 4258 15627 -4084 -15366
1761 -15366 4203 15478 -4335 -15592 4238 15388 -4751 -15674 4424 15417 -4634 -15504
1773 -15504 4989 16147 -4097 -15585 4811 15804 -4876 -15210 4239 15185 -4336 -16002
1785 -16002 4534 15787 -5050 -15564 5069 15448 -4586 -16042 4559 15797 -4795 -15217
$$ packed form
1701a4777J7713J1642j7874j1513J8068J1315j7690j1593J8136J1251j8173j0718
1713a4213J7331J2123j8724j0554J7969J0622j7980j1496J8635J1124j8404j1474
1725a5041J8140J1776j8615j1448J8665J1601j8502j1628J8761J1547j8534j1717
1737a4995J8736J1477j8911j1673J8933J1592j8960j1619J8959J1626j8931j1681
1749a5447J9266J1510j9194j1485J9408J1641j9721j1266J9546J1369j9711j1282
1761a5366J9569J1275j9813j1257J9830J1150k0139j0923K0098J0993k0051j0870
1773a5504K0493J1158k0244j1488K0396J0993k0680j0334J9449J0946j9521j1666
1785a6002K0536J1253k0837j0514K0633J0379k0034j1456K0601J1238k0592j0422
$$ plain form
1797 -15217 5141 16110 -5225 -15627 5504 16038 -4664 -15803 4643 15564 -4887 -15482
1809 -15482 5305 15452 -5876 -16005 5042 15712 -5321 -15875 5263 16027 -5579 -15627
1821 -15627 5930 16065 -5708 -15674 6064 15916 -5858 -15718 6405 15794 -6032 -16023 6074
1834 6074 15874 -6483 -16138 5825 15851 -6259 -16226 6285 16062 -6146 -16075 6397 16352
1847 16352 -6136 -15885 6362 16078 -6404 -16020 6296 15979 -6789 -16070 6404 16013 -6937
1860 -6937 -15776 6996 15575 -7052 -15442 6671 16258 -6811 -15955 7460 15952 -7322 -15891
1873 -15891 7490 15836 -7510 -15958 7595 15648 -7781 -15984 7595 15826 -7869 -15859 7783
1886 7783 15827 -7777 -15753 7805 15963 -7801 -15610 7970 15827 -7969 -15762 7843 16024
$$ packed form
1797a5217K0358J0969k1335j0402K1131J0534k0702j1139K0446J0921k0451j0595
1809a5482K0787J0147k1328j0129K1047J0670k1033j0554K1138J0764k1606j0048
1821a5627K1557J0135k1773r966K1738R852k1774r860K2123R389k1826r991K2097
1834F074R800k2357r655K1963J0026k2110r967K2511R777k2208r929K2472R955
1847A6352k2488r749K2247R716k2482r616K2316R683k2768r281K2474R609k2950
1860f937q839K2772Q579k2627q390K2113R587k3069r144K3415Q492k3274q569
1873a5891K3381Q346k3346q448K3553Q053k3429q203K3579Q231k3695p990K3642
1886G783Q044k3604p976K3558Q158k3764p809K3580P857k3796p793K3605Q181
$$ plain form
1899 16024 -8145 -15583 8101 15173 -8246 -15663 8013 14915 -7897 -14964 8924 15145 -8065
1912 -8065 -14864 9306 15860 -8210 -15680 8753 15609 -9264 -15147 8542 15334 -9338 -15494
1925 -15494 9826 14859 -9261 -15272 8848 15270 -9422 -15211 9587 15231 -9222 -15096 9606
1938 9606 15265 -9694 -15165 9491 15336 -9788 -15093 9519 14900 -9792 -15246 9496 14973
1951 14973 -9808 -15035 9785 15046 -9740 -14871 9964 14938 -9810 -14819 10222 14942 -10237
1964 -10237 -14743 10243 14688 -10333 -14852 10487 14411 -10864 -14625 10751 14408 -10780 -14227
1977 -14227 10970 14343 -10881 -14316 10870 14288 -11028 -14166 11115 13947 -11421 -14209 11000
1990 11000 14406 -11816 -13974 11287 14182 -10821 -13689 11527 13978 -11231 -14061 11556 13880
$$ packed form
1899A6024k4169p438K3684P072k3419p417K3676O902k2812p067K3888O221k3210
1912h065o799K4170O554k4070p470K4433O856k4873n883K3689O792k4672o156
1925a5494K5320N033k4120o011K4120O422k4692n789K4798N644k4453n874K4702
1938I606N659k4959n471K4656N845k5124n305K4612N381k4692n454K4742N477
1951A4973k4781n227K4820N261k4786n131K4835M974k4748n009K5041M720k5179
1964a0237m506K4986M445k5021m519K5339L924k5275l761K5376L657k5188l447
1977a4227K5197L373k5224l435K5186L418k5316l138K5281K832k5368k788K5209
1990A1000L406k6222k158K5261K895k5003k868K5216K451k5209k830K5617K324
$$ plain form
2003 13880 -11787 -13031 12003 14146 -11798 -14014 11801 13519 -11831 -13808 11678 13581 -12195
2016 -12195 -13645 11972 13629 -12155 -13403 12383 13540 -12168 -13246 12422 13277 -12426 -13124 12553
2030 12553 13075 -12754 -13194 12741 12850 -12938 -12857 12841 12711 -12854 -12850 12946 12747 -12871 -12679 13098
2046 13098 12913 -12926 -12535 13207 12820 -13065 -12664 13203 12536 -13157 -12595 13019 12437 -13272 -12405
2061 -12405 13155 12324 -13337 -12287 13581 12347 -13486 -12134 13563 12165 -13486 -11821 13813
2074 13813 11849 -13793 -11721 13837 11422 -14015 -11513 13936 11215 -14202 -11324 14247 11204
2087 11204 -14261 -11094 14385 11114 -14302 -10928 14604 11145 -14413 -10848 14377 10755 -14462
2100 -14462 -10804 14373 10635 -14607 -10743 14416 10626 -14606 -10732 14547 10683 -14401 -10457
$$ packed form
2003A3880k5667j244K5034K143k5944k216K5815J718k5350j977K5486J903k5776
2016a2195j450K5617J657k5784j248K5786J157k5708j078K5668Q55k5703o98K5677
2030A2553N22k5829m40K5935J09k5788Q1K5698j30k5565MK5796j99k5618J92K5777
2046A3098j85k5839L91K5742l87k5885M01K5867o67k5693N62K5614n82k5709Q67
2061a2405K5560q31k5661J050K5868j234k5833J352K5697j398k5651J665K5634
2074A3813j964k5642K072K5558k415k5437K502K5449k721k5417K878K5571l043
2087A1204k5465L167K5479l271k5416L374K5532l459k5558L565K5225l622k5217
2100a4462L658K5177l738k5242L864K5159l790k5232L874K5279l864k5084L944
$$ plain form
2113 -10457 14685 10486 -14491 -10241 14667 10247 -14697 -10333 14854 10141 -14855 -10128 14748
2126 14748 9938 -15091 -9885 15008 9692 -15065 -9627 15307 9591 -15111 -9304 15242 9518
2139 9518 -15274 -9211 15285 9161 -15376 -9202 15251 8949 -15437 -9123 15415 9034 -15515
2152 -15515 -9032 15509 8903 -15502 -8901 15421 9044 -15415 -8885 15494 8809 -15477 -8714
2165 -8714 15423 8662 -15606 -8753 15593 8461 -15640 -8506 15666 8204 -15688 -8325 15719
2178 15719 8111 -15801 -7865 15852 7881 -15810 -7734 15959 7683 -15955 -7569 16057 7437
2191 7437 -16139 -7368 16124 7262 -16126 -7185 16151 7122 -16184 -7069 16338 7033 -16084
2204 -16084 -6964 16260 7081 -16177 -6875 16171 6777 -16383 -6909 16115 6724 -16331 -6843
$$ packed form
2113a0457K5142m199k4977M250K4908m420k4944M364K5187m713k4996M727K4876
2126A4748m810k5029N206K4893n316k4757N438K4934n716k4702N807K4546n724
2139I518k4792O063K4496o124k4537O174K4453o302k4386O314K4538o381k4549
2152a5515O483K4541o606k4405O601K4322o377k4459O530K4379o685k4286O763
2165h714K4137o761k4268O853K4346p132k4101P134K4172p462k3892P363K4044
2178A5719p608k3912P936K3717p971k3691Q076K3693q276k3638Q386K3626q620
2191G437k3576Q771K3492q862k3388Q941K3336r029k3306R115K3407r305k3117
2204a6084R120K3224r179k3258R302K3046r394k3160R474K3024r391k3055R488
$$ plain form
2217 -6843 16209 6570 -16226 -6506 16275 6530 -16280 -6344 16241 6447 -16282 -6125 16399
2230 16399 5952 -16380 -6076 16330 5750 -16605 -5644 16455 5443 -16569 -5439 16689
2242 16689 5285 -16640 -5060 16589 5056 -16560 -4855 16742 5043 -16583 -4885 16587
2254 16587 4731 -16617 -4873 16431 4632 -16676 -4799 16543 4612 -16511 -4651 16538
2266 16538 4546 -16491 -4575 16518 4378 -16512 -4410 16512 4263 -16526 -4290 16473
2278 16473 4137 -16646 -4073 16443 3770 -16523 -3794 16521 3588 -16501 -3529 16530
2290 16530 3450 -16486 -3218 16588 3190 -16525 -2910 16487 2882 -16551 -2780 16417
2302 16417 2634 -16651 -2776 16508 2612 -16562 -2613 16610 2505 -16425 -2361 16580
$$ packed form
2217f843K3052r639k2796R720K2781r745k2810R936K2585r794k2729J0157K2524
2230A6399j0447k2332J0304K2406j0580k2355J0961K2099j1012k2012J1130K2128
2242A6689j1404k1925J1580K1649j1533k1616J1705K1597j1699k1626J1698K1472
2254A6587j1856k1348J1744K1304j1799k1308J1877K1342j1931k1123J1860K1189
2266A6538j1992k1037J1916K1093j2140k0890J2102K0922j2249k0789J2236K0763
2278A6473j2336k0783J2573K0516j2673k0293J2729K0315j2933k0089J2972K0059
2290A6530j3080j9936J3268J9806j3398j9715J3615J9397j3605j9433J3771J9197
2302A6417j3783j9285J3875J9284j3896j9174J3949J9223j4105j8930J4064J8941
$$ plain form
2314 16580 2595 -16372 -2317 16523 2498 -16387 -2380 16466 2213 -16395 -2341 16273
2326 16273 2100 -16491 -2131 16422 2070 -16360 -1903 16447 1859 -16288 -1652 16497
2338 16497 1606 -16361 -1358 16263 1272 -16456 -1183 16190 1010 -16465 -1024 16269
2350 16269 849 -16269 -885 16123 752 -16325 -511 16222 647 -16059 -477 16183
2362 16183 512 -16169 -518 15961 338 -16250 -493 16416 424 -15651 -496 15478
2374 15478 -481 -16599 -707 16071 -33 -15837 56 16091 695 -15763 456 15693
2386 15693 113 -16444 -371 16297 -159 -16027 80 15721 -517 -15193 902 15416
2398 15416 -678 -15265 1951 15721 -598 -15979 783 15848 -513 -15102 972 15435
$$ packed form
2314A6580j3985j8967J4055J8840j4025j8885J4007J8846j4253j8608J4054J8614
2326A6273j4173j8591J4360J8553j4352j8430J4457J8350j4588j8147J4636J8149
2338A6497j4891j7967J5003J7621j4991j7728J5273J7373j5180j7475J5441J7293
2350A6269j5420j7118J5384J7008j5371j7077J5814J6733j5575j6706J5582J6660
2362A6183j5671j6681J5651J6479j5623j6588J5757J6909j5992j6075J5155J5974
2374A5478j5959j6118J5892J6778j6104j5804J5893J6035j5396j6458J6219J5237
2386A5693j5580j6557J6073J6668j6456j5868J6107J5641j6238j4676J6095J4514
2398A5416j6094j4587J7216J3770j6319j5381J6762J5065j6361j4589J6074J4463
$$ plain form
2410 15435 -1644 -14943 2147 14102 -1428 -16474 1462 15647 -2002 -15286 1421 15722
2422 15722 -1759 -15557 1445 15639 -1324 -15501 1826 15531 -1862 -15254 1351 15326
2434 15326 -2218 -15650 1889 14788 -1742 -15242 2510 14870 -2618 -15308 2240 14899
2446 14899 -2275 -14591 2386 15214 -2264 -14496 2397 14609 -2886 -14645 3215 14246
2458 14246 -2907 -14398 3267 14839 -3529 -14643 3279 14748 -3190 -14834 3212 14585
2470 14585 -3234 -14426 3386 14400 -3468 -14338 3503 14409 -3413 -14355 3483 14310
2482 14310 -3648 -14348 3572 14160 -3658 -14140 3800 14225 -3784 -14043 4003 14091
2494 14091 -4127 -13809 4014 13909 -4138 -13817 4269 13704 -4365 -13752 4400 13655 -4498
$$ packed form
2410A5435j7079j3299J7090J1955j5530j5046J7936J4185j7649j3284J6707J4301
2422A5722j7481j3798J7002J4194j6963j4177J7327J3705j7393j3392J6605J3975
2434A5326j7544j3432J7539J2899j6530j3500J7752J2360j7488j2690J7548J2659
2446A4899j7174j2316J6977J2828j7478j2232J6893J2212j7495j1759J7860J1031
2458A4246j7153j1491J7665J1572j8368j1114J7922J1469j7938j1644J8046J1373
2470A4585j7819j1192J7812J1014j7868j0870J7841J0906j7822j0942J7838J0827
2482A4310j7958j0700J7920J0588j7818j0482J7940J0425j8009j0259J8046J0088
2494A4091j8218r682J7823R895j8047r679J8086R435j8069r387J8152R255j8153
$$ plain form
2507 -4498 -13524 4524 13496 -4652 -13358 4592 13483 -4790 -13303 4997 13486 -5217 -13260
2520 -13260 5411 13179 -5168 -13710 5471 13741 -5264 -12886 4881 12249 -5971 -13026 4968
2533 4968 12677 -5330 -13384 5412 12587 -4942 -12813 5395 12950 -4868 -12817 5412 12570
2546 12570 -5300 -12759 5416 12829 -5413 -12658 5574 12422 -5888 -12690 5655 12762 -5783
2559 -5783 -12367 6050 12249 -6118 -12317 6238 12190 -6147 -12143 5978 11996 -6176 -11956
2572 -11956 6287 12005 -6443 -12024 6272 12077 -6289 -11912 6481 11999 -6511 -11648 6668
2585 6668 11806 -6562 -11786 6610 11627 -6565 -11699 6558 11599 -6697 -11597 6806 11336
2598 11336 -6869 -11387 6990 11314 -7064 -11123 7118 11124 -7137 -10893 7274 10950 -7346
$$ packed form
2507d498r026J8048Q972j8148q706J7950Q891j8273q513J8300Q489j8703q043
2520a3260J8671P768j8347q542J9181Q270j9005p622J7767P368j8220p055J7994
2533D968P709j8007q054J8796P175j7529p871J8208P555j7818p949J8229P158
2546A2570j7870p459J8175P413j8242p245J8232O848j8310o802J8345P107j8545
2559e783o584J8417O199j8367o199J8555N952j8337n996J8121O018j8172n780
2572a1956J8243N718j8448n581J8296N805j8366n623J8393N518j8510n137J8316
2585F668N138j8368n224J8396N017j8192n134J8257N041j8296m900J8403M530
2598A1336j8205m518J8377M324j8378m059J8241M006j8261l756J8167L676j8296
$$ plain form
2611 -7346 -10820 7354 10764 -7521 -10695 7538 10528 -7495 -10683 7603 10465 -7642 -10443
2624 -10443 7664 10385 -7567 -10339 7706 10420 -7647 -10181 7701 10237 -7729 -10137 7651
2637 7651 10075 -7793 -10228 7767 10035 -7743 -10015 7929 10141 -7879 -9875 7803 9860
2650 9860 -7896 -9541 8203 9714 -8079 -9439 7860 9353 -8505 -9485 8794 8486 -7911 -9475
2664 -9475 8134 8677 -8417 -9258 8492 8807 -8104 -8733 8331 9458 -7829 -8770 8422 8493 -8599
2679 -8599 -8691 8658 8714 -8298 -8056 8368 8983 -8338 -8630 8730 8616 -9143 -7942 8805 8553
2694 8553 -8651 -8648 8659 7266 -8515 -8680 8836 9085 -7262 -8629 8014 8393 -9328 -8193 9014
2709 9014 8345 -8823 -8342 9482 7158 -8233 -6419 8322 7661 -9230 -7735 9207 6938 -8895
$$ packed form
2611g346l474J8174L410j8285l174J8233K990j8023l188J8286K862j8107k801
2624a0443J8107K721j7952k772J8045K714j8067k534J7882K536j7966k408J7788
2637G651K424j7868k435J7995K268j7778k272J7944K212j8020j996J7678K057
2650I860j7756j645J7744J511j7793j360J7299J493j7858r80J8279l08j6397j564
2664i475J7609N43j7094q41J7750L15j6911o29J7064J127j7287r41J7192P1j7092
2679h599r2J7349N6j7012K42J6424O15j7321k92J7360j14j7759J201J6747k52
2694H553j7204LJ7307j393j5781j65J7516K49j6347j367J6643L79j7721J135J7207
2709I014o69j7168M81J7824k324j5391J814J4741o61j6891J495J6942k269j5833
$$ plain form
2723 -8895 -7002 8365 7642 -9343 -6773 8981 7108 -9707 -7237 9393 6571 -10118 -7072 9754
2737 9754 6974 -9154 -8410 9347 7117 -8440 -7512 8545 6754 -8442 -6308 9015 7187 -9773
2751 -9773 -7303 8667 6236 -9778 -6227 9040 6150 -9016 -6042 9308 5714 -9030 -5664
2764 -5664 9229 6074 -10015 -5517 9253 6360 -9881 -5605 9681 5978 -9522 -5516 9800
2777 9800 6035 -9594 -5442 9287 5662 -9365 -5069 10072 5674 -9829 -5371 9366 5316
2790 5316 -10619 -5389 8755 4162 -9988 -5639 8174 4509 -10779 -4913 9104 5064 -9454
2803 -9454 -5046 9568 4880 -9842 -5318 9926 5070 -9607 -5125 9974 4679 -9403 -4415
2816 -4415 10509 3302 -10061 -3881 9873 4488 -9445 -3328 9071 4151 -10687 -4763 10008
$$ packed form
2723h895J893J5367p23j6985K570J5754j873j6815K470J6630k822j6689L046J6826
2737I754k780j6128P44J7757k230j5557R28J6057j791j5196K134J5323j828j6960
2751i773K470J5970k431j6014L551J5267k890j5166K974J5350l594j4744L366
2764e664J4893l155j6089M498J4770k893j6241M276J5286l703j5500M006J5316
2777I800l765j5629M152J4729l625j5027M296J5141m398j5503M458J4737m050
2790E316j5935N230J4144m593j4150M349J3813l665j5288N866J4017m040j4518
2803i454M408J4614m688j4722M524J5244m856j4677M482J5099n295j4082M988
2816d415J4924p207j3363O180J3754n385j3933O117J2399m920j4838N924J4771
$$ plain form
2829 10008 3380 -9809 -3477 9317 3468 -9738 -3389 9622 3744 -10360 -3850 10277 3444
2842 3444 -10160 -2910 10488 2738 -10328 -2844 10721 3088 -9414 -3129 9819 3150 -10037
2855 -10037 -2917 10413 2840 -10207 -2882 9794 2376 -9983 -2812 9844 2432 -9921 -2482
2868 -2482 10204 2704 -10129 -2646 9623 2371 -10045 -2370 9815 2309 -10003 -1563 9923
2881 9923 2205 -10156 -1859 9787 1584 -9863 -2011 9997 1656 -9918 -1641 9854 1948
2894 1948 -9868 -1651 9933 1477 -9729 -1708 9799 1709 -9960 -1636 9842 1567 -9847
2907 -9847 -1522 10131 1522 -9889 -1306 10160 1181 -9794 -1291 9764 1479 -9665 -1410
2920 -1410 9891 1153 -9892 -1149 9515 519 -9615 -909 9497 667 -9871 -558 9456
$$ packed form
2829A0008o628j3189O332J2794n849j3206O349J3011n878j4104O510J4127o833
2842C444j3604P250J3398p750j3066P484J3565p633j2502O285J2948o669j3187
2855a0037P120J3330p573j3047P325J2676p418j2359P171J2656p412j2353P439
2868b482J2686p500j2833P483J2269p252j2416P675J2185p506j2312Q440J1486
2881I923p718j2361Q297J1646q203j1447P852J2008q341j1574Q277J1495p906
2894A948j1816Q217J1584q456j1206Q021J1507q090j1669Q324J1478q275j1414
2907i847Q325J1653q609j1411Q583J1466q979j0975Q503J1055q285j1144Q255
2920a410J1301q738j1045Q743J0664q996j0134Q706J0406q830j0538R313J0014
$$ plain form
2933 9456 322 -9601 -610 9425 214 -9693 -527 9447 240 -9504 -185 9457 372 -9429 197
2948 197 9776 -44 -9529 -30 9726 221 -9549 -130 9591 165 -9396 -123 9864 -83 -9567
2963 -9567 -2 9596 -101 -9648 62 9648 -490 -9308 531 9423 -438 -9497 654 9510
2977 9510 -627 -9389 780 9344 -932 -9361 892 9246 -1057 -9088 931 9253 -1100
2990 -1100 -9173 1105 9042 -1270 -9194 1397 9121 -1217 -9039 1354 9022 -1377 -9034
3003 -9034 1345 8934 -1444 -9000 1408 9093 -1560 -9128 1436 8968 -1637 -8897 1574
3016 1574 9081 -1672 -8872 1578 8726 -1987 -8978 1880 9007 -2325 -8684 1993 8886
3029 8886 -2222 -8504 1892 8573 -1692 -8740 2239 8238 -2960 -8926 2013 8310 -2066
$$ packed form
2933I456r134r923Q991J0035r211r907R166R974r207r744R319R642r085r801R626
2948A97R579r820r485R499R756r505r770R419R721r426r561R273R987r947r484
2963i567R565R598r697r547R710R586j0138q818R839Q892r861r059J0151Q856
2977I510j0137q762J0169Q564j0276q429J0253Q354j0303q031J0019Q322j0353
2990a100q073J0278P937j0312p924J0591P724j0338p822J0393P668j0399p657
3003i034J0379P589j0378p556J0408P685j0653p568J0564P532j0605p260J0471
3016A574P507j0753p200J0450P148j0713o991J0858P127j1332o359J0677O893
3029H886j1108o282J0396O681j0265p048J0979N999j1198n966J0939O297j0376
$$ plain form
3042 -2066 -8862 2464 7877 -2938 -8652 1925 7515 -2794 -7429 1934 6888 -2859 -7016 4287
3056 4287 7267 -3137 -9047 2563 8655 -3267 -8247 2307 8249 -2762 -8365 3087 7907
3069 7907 -2990 -8555 2814 7309 -2803 -8444 2821 7882 -2636 -7679 3087 7734 -3598
3082 -3598 -7616 2722 6977 -3889 -7691 2649 6721 -3723 -6972 2924 7364 -4052 -6875 2692
3096 2692 7085 -3658 -7461 4487 6989 -4313 -6976 3727 7527 -3710 -7299 2998 6992
3109 6992 -3371 -7268 3780 7245 -4143 -7258 4069 7921 -4003 -7048 3865 7283 -3667
3122 -3667 -7318 3825 7128 -3888 -7266 4026 7147 -3954 -7176 4185 7055 -4189 -7023
3135 -7023 4335 7009 -4357 -6835 4268 6797 -4417 -6707 4456 6651 -4459 -6780 4464
$$ packed form
3042b066o796J1326N413j0815n714J0577N590j0309m635R363M954r747m157J1303
3056D287K980j0404n910J1610O092j1922m980J0554N942j1011n603J1452M820
3069G907j0897n565J1369M495j0112n641J1265N061j0518n043J0766M647j1332
3082c598m018J0338M255j0866l802J0340M072j0444l249R896M440j1416k823R567
3096B692M393j0743l803J1948K502j1302k663J0703L800j1237l589J0297L994
3109F992j0363l897J1048L465j1388l115J1327L852j1924l045J0913L418j0950
3122c667l651J1143L303j1016l378J1292L121j1101l222J1361K870j1244k834
3135g023J1358K674j1366k478J1103K529j1214k290J1163K195j1110k321J1244
$$ plain form
3148 4464 6591 -4612 -6503 4660 6525 -4636 -6322 4633 6636 -4661 -6257 5092 6302
3161 6302 -5019 -6560 4619 6432 -4337 -6036 4578 6698 -4633 -7086 5330 6702 -3685
3174 -3685 -5985 5132 6030 -5102 -5689 6009 5966 -4514 -6035 4869 5754 -5297 -6232 5296 5794
3189 5794 -5287 -5611 5016 5705 -5425 -5486 5187 5710 -5226 -5291 5300 5455 -5296 -5273 5355
3204 5355 5395 -5302 -5267 5335 5142 -5424 -5317 5291 5088 -5448 -5143 5275 5153 -5482 -5246 5543
3220 5543 5147 -5537 -5134 5485 5086 -5464 -5092 5518 4972 -5579 -4952 5469 4908 -5548 -4909
3235 -4909 5678 4827 -5707 -4701 5634 4698 -5791 -4606 5671 4601 -5640 -4472 5790 4414
3249 4414 -5752 -4295 5713 4388 -5762 -4154 5931 4233 -5909 -4079 5822 4066 -5910 -4058
$$ packed form
3148D464K127j1203j891J1163J865j1161j686J0955K003j1297j596J1349J210
3161F302j1321j541J1179J813j0769j699J0614K120j1331k453J2416J372j0387
3174c685k300J1117Q98j1132n87J1698m3j0480j521J0904Q85j1051r35J1528M98
3189E794j1081l24J0627O89j1130o1J0673N23j0936o5J0591J55j0751K3J0628
3204E355M0j0697L5J0602j93j0566J07J0608k03j0536L05J0418j22j0635K36J0789
3220E543l96j0684M03J0619l99j0550L72J0610n46j0551O27J0421n61j0456O39
3235d909J0587q51j0534J006J0335r36j0489J185J0277j070j0241J168J0262j376
3249D414j0166J457J0008j325j0150J608J0085j698j0142J830R901j756r976J852
$$ plain form
3263 -4058 5812 4179 -6026 -4203 6005 4269 -6135 -3812 5978 3630 -5688 -4615 5828 3543
3277 3543 -6290 -3835 6016 3774 -6187 -3841 6323 3655 -6250 -3113 6246 4095 -5481 -3472 6009
3292 6009 3755 -6177 -4345 5826 3525 -5806 -3040 6789 3284 -5497 -3354 6471 3259 -6408 -3558
3307 -3558 6336 3159 -7336 -3269 5808 3355 -5848 -2510 6031 3452 -6533 -3506 5637 3465 -7002
3322 -7002 -2735 6756 2472 -5976 -3221 6704 3179 -6297 -3005 6446 2892 -6721 -2186 6898 2849
3337 2849 -6648 -2493 6347 2093 -6387 -2256 6295 2151 -6618 -3064 6230 2738 -6296 -2093 6607
3352 6607 2561 -6898 -2376 7353 1941 -5902 -2046 6124 1721 -7206 -2319 6237 1914 -6276 -1871
3367 -1871 6077 1707 -5984 -1807 6214 919 -6405 -2159 6295 1955 -6929 -1882 6361 1669 -6851
$$ packed form
3263d058R870j633j0205J823J0208j736j0404K323R790k348r318J073J0443k285
3277C543r833K455R851k242r961K346J0164k668r905L137R359k151r576K009R481
3292F009k254r932J832J0171k301r331K766R829l505q781K143R825l212r667K850
3307c558R894l177j0495M067R077k453r203L338Q541k579r985L027R143k172j0467
3322g002M267R491m284q448K755R925l525r476L292R451l554r613M535R084m049
3337B849r497M155Q840m254q480M131Q551m144q769L554R294l492r034M203Q700
3352F607m046r459M522R729n412p843L856Q170m403q927M887Q556m323q190M405
3367a871P948m370p691M177Q021n295p324M246Q454m340q884N047Q243m692q520
$$ plain form
3382 -6851 -1922 6206 2008 -6944 -805 6020 1618 -6946 -1625 6403 1480 -6512 -1534 6481 1370
3397 1370 -6667 -1206 7134 1553 -6674 -1047 5990 1138 -6295 -872 6893 1058 -6651 -625 6551
3412 6551 529 -6318 -1259 6422 852 -6340 -191 6487 428 -6374 -755 6588 879 -6505 -1090
3427 -1090 6436 392 -6256 -710 6989 362 -7387 -768 6158 83 -6825 -961 7013 419 -6194
3442 -6194 86 7216 369 -7371 -1045 5686 1451 -5941 -892 7088 360 -6417 -473 5928 740
3457 740 -6042 -225 5464 138 -6530 -201 6705 -203 -7001 246 7773 -91 -6841 -664 5977
3472 5977 -178 -5818 -71 5648 -1120 -6847 516 6313 -1085 -7099 -36 6638 73 -6456 79
3487 79 6940 -709 -6079 780 5329 -552 -6200 611 7267 -804 -6433 1252 5990 -1022 -5938
$$ packed form
3382f851M929Q128m198q952O139O825m402q564N321Q028m923p992M978Q015n111
3397A370q037N461Q340n581q227N627P037m852p433N423P765n835p709O026P176
3412F551o022o847N059P681n570p192O149O678o059o802N619P343n709p384N415
3427a090P526o044o648N546P699o627p749O619O926o075o908N864P974o594o613
3442f194O280P130o847p740O326O731m235p392N049P980o728o777N944O401n188
3457G40o782N817N689n326o668O329O906o908o798P247P527p864o750O177O641
3472E977o155n640N747N719o768n727P363N797p398o014P063O674o565o529O535
3487G9O861p649n370O859M549n881n648O811O656q071n629P685M738p012m916
$$ plain form
3502 -5938 127 6452 -1183 -6099 -13 6152 -1212 -6636 296 5752 -1580 -5655 2112 6061 -1647
3517 -1647 -5659 1058 5735 -1911 -5646 1074 5602 -1563 -6052 1935 5928 -1502 -6345 1446 5698
3532 5698 -993 -5833 1430 5758 -1517 -5964 1687 6120 -1955 -6127 1617 6067 -1437 -6300 1404
3547 1404 5823 -2120 -5735 1025 5738 -1643 -6381 1923 6141 -1763 -6003 2154 5861 -2089 -5807
3562 -5807 2017 5878 -2045 -5663 1939 5712 -2150 -5624 2191 5621 -2266 -5810 2574 5354 -2272
3577 -2272 -5310 2453 5590 -2374 -5563 2379 5284 -2331 -5417 2313 5510 -2487 -5615 2037 5782
3592 5782 -2553 -5532 2227 5425 -2788 -6086 2572 5414 -2724 -5633 2762 5559 -2707 -5391 2759
3607 2759 5603 -2710 -5423 2734 5516 -2696 -5559 2910 5288 -2800 -5330 2732 5343 -2868 -5252
$$ packed form
3502e938O065O325p635m916O086O165p364n424O932N456p332m075P767L949p708
3517a647m012O717M677p646l735O720M528p165m489P987L993p430m843P791M252
3532E698o691m840P263M328p275m447P651M433q075m172P744M450p504m863P704
3547A404M419p943l615O760M713p381m738Q304M218p904m240Q157L707p950l718
3562e807P824L861p923l618P602L773p862l474P815L430p887l544Q384K780p626
3577b272l038P763L137p964l189P942K905p615l086P730L197p997l128P652L745
3592E782q335k979P759L198q213l298Q658K842q138k909Q395K797q266k684Q150
3607B759K844q313k713Q157K782q212k863Q469K378q088k530Q062K611q211k384
$$ plain form
3622 -5252 2965 5115 -2970 -5174 2923 5182 -2899 -4750 3280 5141 -2983 -5011 3202 5248 -3191
3637 -3191 -5146 2835 5657 -2985 -5060 3298 4511 -3531 -5152 3235 5016 -3276 -5071 3200 5098
3652 5098 -3218 -4884 3175 5123 -3237 -5066 3441 4857 -3538 -4944 3410 4866 -3490 -4937 3410
3667 3410 4900 -3433 -4750 3608 4839 -3523 -4714 3599 4634 -3654 -4535 3560 4544 -3768 -4490 3576
3683 3576 4556 -3698 -4460 3795 4520 -3765 -4510 3811 4399 -3825 -4412 3769 4495 -3855 -4391 3790 4473
3700 4473 -3802 -4492 4015 4418 -3894 -4420 3963 4452 -3930 -4423 3962 4304 -4047 -4246 4074 4437 -3947
3717 -3947 -4314 3979 4163 -4135 -4123 4116 4206 -4076 -4008 4511 4496 -3824 -4118 4801 3218 -4358 -3419 4420
3735 4420 4010 -4603 -3051 4373 3045 -4268 -3809 3955 2787 -3602 -3294 4170 3520 -4666 -4128 4470
$$ packed form
3622e252Q217K150q085k204Q097K259q081j851Q030J861q124k028Q213K046q439
3637c191j955P981K822q642k075Q358J213q042j621Q387J781q292j795Q271J898
3652E098q316j666Q059J948q360j829Q507J416q395j406Q354J456q356j447Q347
3667C410J490q333j317Q358J231q362j191Q313J035q288q81Q095R84q312p22Q066
3683C576R80q254p62Q255P25q285p45Q321N88q224n87Q181P26q350n36Q181O83
3700D473q275o90Q507M03q312n26Q383M89q382m93Q385L42q351j99Q320L63q384
3717c947l67Q293J84q298J2Q239R0q282O8Q519j5q320k94Q919j583p576R39P839
3735D420m10q613J552P424j328p313M59P764j168o389L08P464o50q186N38Q598
$$ plain form
3751 4470 3813 -4443 -3890 4471 3746 -4948 -4134 4179 3477 -4615 -4570 4426 3451 -4552 -4082 4449 3656
3768 3656 -5127 -3321 4495 3768 -4456 -2937 4996 3305 -4416 -3858 4735 2989 -3976 -3037 4355 3980
3784 3980 -5203 -2513 4234 3240 -4738 -2325 4773 3663 -4190 -2931 5254 3292 -5297 -3131 5793
3799 5793 2558 -4305 -3490 5007 3471 -4807 -3025 5408 2702 -4301 -2552 5003 3248 -6164 -2464
3814 -2464 4620 3598 -3196 -2156 4785 3195 -4318 -3640 4852 2649 -5377 -3401 5879 1746 -5043
3829 -5043 -3181 5413 2040 -5699 -1913 4767 548 -4854 -3700 4853 1551 -5414 -1457 4924 2744
3844 2744 -5119 -2491 5083 3081 -4872 -2695 4384 2563 -5457 -2905 5112 2083 -5227 -2180 4655
$$ packed form
3751D470o57q256N53Q361p25q694Q14Q313p02q092M5Q996r75q003M70Q531p93
3768C656q783J806P816p27q224J519P933j691p721N58Q593j746o965R39P392l75
3784C980r183K690O747r94p978K413P098j110p853J259Q185j962q589K166Q924
3799E793l235o863Q15Q497j536q278J782Q433k706p003J749P555j755r412L700
3814b464P084j022o794J040O941j590p513O78Q492k203q026J976R280m133o789
3829e043J862Q594l373p739L786O680m219n402J154Q553l302o965L957O381k180
3844B744p863K628P574k002p953K177P079j821q020K552Q017l029p310L047O835
$$ [...]
##END NTUPLES=NMR FID
##END=
