##TITLE=1H_DE-80H_X3
 200.13MHz, d2o
 8 sc
 
 19ns.26.2.2025
##JCAMPDX= 6.0         $$ Bruker NMR JCAMP-DX V2.0
##DATA TYPE= NMR FID
##DATA CLASS= NTUPLES
##ORIGIN= UXNMR, Bruker Analytische Messtechnik GmbH
##OWNER= pz
$$ XWIN-NMR		Version 3.5
$$ Mon May 25 17:12:25 2026 Russian Standard Time (UT+4h)  Yarkov@DPX200
##.OBSERVE FREQUENCY= 200.1313
##.OBSERVE NUCLEUS= ^1H
##.DELAY= (6, 6)
##.ACQUISITION MODE= SIMULTANEOUS
##.ACQUISITION SCHEME= undefined
##.AVERAGES= 8
##.DIGITISER RES= 18
##SPECTROMETER/DATA SYSTEM= spect
##.PULSE SEQUENCE= zg30
##.SOLVENT NAME= CDCl3
##.SHIFT REFERENCE= (INTERNAL, CDCl3, 0, 14.3821)
##AUDIT TRAIL= $$ (NUMBER, WHEN, WHO, WHERE, WHAT)
$$ ##TITLE= Audit trail, XWIN-NMR		Version 3.5
$$ ##JCAMPDX= 5.01
$$ ##ORIGIN= Bruker BioSpin GmbH
$$ ##OWNER= Yarkov
$$ C:/Bruker/XWIN-NMR/data/yarkov2/nmr/H-C/1/audita.txt
$$ ##AUDIT TRAIL=  $$ (NUMBER, WHEN, WHO, WHERE, WHAT)
(   1,<2026-05-25 17:10:48.73 +0400>,<Yarkov>,<DPX200>,
      <created by zg, POWCHK disabled, PULCHK disabled
       configuration hash MD5:
       00 E9 B6 7A A2 85 ED C7 34 08 36 98 17 FE 4E 26
       data hash MD5: 16K
       2E 13 B0 18 E7 45 06 46 BF EA 9F E1 AF 5C 32 06>)
$$ ##END=
$$ 
$$ hash MD5
$$ C7 8A D2 DF 1D 4A 9E 37 4D 89 7A 2F 2D 17 95 34
##$RELAX= 
##$RELAX= 
##$RELAX= 
##$RELAX= 
##$RELAX= 
##$RELAX= 
$$ Bruker specific parameters
$$ --------------------------
##$DU= <C:/Bruker/XWIN-NMR>
##$EXPNO= 1
##$NAME= <H-C>
##$PROCNO= 1
##$TYPE= <nmr>
##$USER= <yarkov2>
##$AMP= (0..31)
100 100 100 100 100 100 100 100 100 100 100 100 100 100 100 100 100 100 
100 100 100 100 100 100 100 100 100 100 100 100 100 100 
##$AQSEQ= 0
##$AQ_mod= 1
##$AUNM= <au_zg>
##$AUTOPOS= <>
##$BF1= 200.13
##$BF2= 200.13
##$BF3= 200.13
##$BF4= 200.13
##$BF5= 200.13
##$BF6= 200.13
##$BF7= 200.13
##$BF8= 200.13
##$BYTORDA= 1
##$CFDGTYP= 0
##$CFRGTYP= 5
##$CHEMSTR= <none>
##$CNST= (0..31)
1 1 145 1 1 1 1 1 1 1 1 1 1 1 1 1 1 1 1 1 1 1 1 1 1 1 1 1 1 1 1 1 
##$CPDPRG= <>
##$CPDPRG1= <>
##$CPDPRG2= <>
##$CPDPRG3= <>
##$CPDPRG4= <mlev>
##$CPDPRG5= <mlev>
##$CPDPRG6= <mlev>
##$CPDPRG7= <mlev>
##$CPDPRG8= <mlev>
##$CPDPRGB= <>
##$CPDPRGT= <>
##$D= (0..31)
0 0.7 0 0 0 0 0 0 0 0 0 0.03 0 0 0 0 0 0 0 0 0 0 0 0 0 0 0 0 0 0 0 0 
##$DATE= 1779714648
##$DBL= (0..7)
120 120 120 120 120 120 120 120 
##$DBP= (0..7)
150 150 150 150 150 150 150 150 
##$DBP07= 0
##$DBPNAM0= <>
##$DBPNAM1= <>
##$DBPNAM2= <>
##$DBPNAM3= <>
##$DBPNAM4= <>
##$DBPNAM5= <>
##$DBPNAM6= <>
##$DBPNAM7= <>
##$DBPOAL= (0..7)
0.5 0.5 0.5 0.5 0.5 0.5 0.5 0.5 
##$DBPOFFS= (0..7)
0 0 0 0 0 0 0 0 
##$DE= 6
##$DECBNUC= <off>
##$DECIM= 32
##$DECNUC= <off>
##$DECSTAT= 4
##$DIGMOD= 1
##$DIGTYP= 9
##$DL= (0..7)
0 120 120 120 120 120 120 120 
##$DP= (0..7)
150 150 150 150 150 150 150 150 
##$DP07= 0
##$DPNAME0= <>
##$DPNAME1= <>
##$DPNAME2= <>
##$DPNAME3= <>
##$DPNAME4= <>
##$DPNAME5= <>
##$DPNAME6= <>
##$DPNAME7= <>
##$DPOAL= (0..7)
0.5 0.5 0.5 0.5 0.5 0.5 0.5 0.5 
##$DPOFFS= (0..7)
0 0 0 0 0 0 0 0 
##$DQDMODE= 0
##$DR= 18
##$DS= 0
$$ [...]
##$SUBNAM2= <"">
##$SUBNAM3= <"">
##$SUBNAM4= <"">
##$SUBNAM5= <"">
##$SUBNAM6= <"">
##$SUBNAM7= <"">
##$SUBNAM8= <"">
##$SUBNAM9= <"">
##$SW= 18.0517328524113
##$SWIBOX= (0..15)
0 0 2 0 0 0 0 0 0 0 0 0 0 0 0 0 
##$SW_h= 3612.71676300578
##$TD= 16384
##$TD0= 1
##$TE= 0
##$TE2= 300
##$TE3= 300
##$TEG= 300
##$TL= (0..7)
0 120 120 120 120 120 120 120 
##$TP= (0..7)
150 150 150 150 150 150 150 150 
##$TP07= 0
##$TPNAME0= <>
##$TPNAME1= <>
##$TPNAME2= <>
##$TPNAME3= <>
##$TPNAME4= <>
##$TPNAME5= <>
##$TPNAME6= <>
##$TPNAME7= <>
##$TPOAL= (0..7)
0.5 0.5 0.5 0.5 0.5 0.5 0.5 0.5 
##$TPOFFS= (0..7)
0 0 0 0 0 0 0 0 
##$TUNHIN= 0
##$TUNHOUT= 0
##$TUNXOUT= 0
##$USERA1= <user>
##$USERA2= <user>
##$USERA3= <user>
##$USERA4= <user>
##$USERA5= <user>
##$V9= 5
##$VALIST= <valist>
##$VCLIST= <CCCCCCCCCCCCCCC>
##$VD= 0
##$VDLIST= <DDDDDDDDDDDDDDD>
##$VPLIST= <PPPPPPPPPPPPPPP>
##$VTLIST= <TTTTTTTTTTTTTTT>
##$WBST= 1024
##$WBSW= 4
##$XGAIN= (0..3)
0 0 0 0 
##$XL= 0
##$YL= 0
##$YMAX_a= 789423
##$YMIN_a= -749069
##$ZGOPTNS= <>
##$ZL1= 120
##$ZL2= 120
##$ZL3= 120
##$ZL4= 120
##$ABSF1= 10
##$ABSF2= 0
##$ABSG= 5
##$ABSL= 3
##$ALPHA= 0
##$AQORDER= 0
##$ASSFAC= 0
##$ASSFACI= 0
##$ASSFACX= 0
##$ASSWID= 0
##$AUNMP= <proc_1d>
##$AZFE= 0.1
##$AZFW= 0.1
##$BCFW= 1
##$BC_mod= 2
##$BYTORDP= 1
##$COROFFS= 0
##$CY= 83.5205535888672
##$DATMOD= 1
##$DC= 2
##$DFILT= <>
##$DTYPP= 0
##$F1P= 10.8118882576601
##$F2P= -7.23987719738617
##$FCOR= 0.5
##$FTSIZE= 0
##$FT_mod= 4
##$GAMMA= 1
##$GB= 0.15
##$INTBC= 1
##$INTSCL= 1
##$ISEN= 128
##$LB= 0.25
##$LEV0= 0
##$LPBIN= 0
##$MAXI= 10000
##$MC2= 0
##$MEAN= 0
##$ME_mod= 0
##$MI= 1.114404
##$NCOEF= 0
##$NC_proc= 0
##$NLEV= 6
##$NOISF1= 3.799351
##$NOISF2= 2.8
##$NSP= 1
##$NTH_PI= 0
##$NZP= 0
##$OFFSET= 14.38212
##$PC= 1
##$PHC0= -5662.917
##$PHC1= 16.22195
##$PH_mod= 1
##$PKNL= yes
##$PPARMOD= 0
##$PSCAL= 0
##$PSIGN= 0
##$REVERSE= no
##$SF= 200.129724274929
##$SI= 16384
##$SIGF1= 3
##$SIGF2= 2
##$SINO= 400
##$SIOLD= 16384
##$SREGLST= <1H.CDCl3>
##$SSB= 0
##$STSI= 0
##$STSR= 0
##$SW_p= 3205.1282051282
##$SYMM= 0
##$S_DEV= 0
##$TDeff= 0
##$TDoff= 0
##$TI= <>
##$TILT= no
##$TM1= 0
##$TM2= 0
##$TOPLEV= 0
##$USERP1= <user>
##$USERP2= <user>
##$USERP3= <user>
##$USERP4= <user>
##$USERP5= <user>
##$WDW= 1
##$XDIM= 8192
##$YMAX_p= 0
##$YMIN_p= 0
$$ End of Bruker specific parameters
$$ ---------------------------------
##NTUPLES= NMR FID
##VAR_NAME=  TIME,          FID/REAL,        FID/IMAG
##SYMBOL=    X,             R,               I
##VAR_TYPE=  INDEPENDENT,   DEPENDENT,       DEPENDENT
##VAR_FORM=  AFFN,          ASDF,            ASDF
##VAR_DIM=   8192,          8192,            8192
##UNITS=     SECONDS,       ARBITRARY UNITS, ARBITRARY UNITS
##FACTOR=    0.0002768,     1,               1
##FIRST=     0,             0,               0
##LAST=      2.2672688,     0,               0
##MIN=       0,             -749069,         0
##MAX=       2.2672688,     789423,          0
$$ Real data points
##PAGE= N=1
##DATA TABLE= (X++(R..R)), XYDATA
$$ [...]
1518A034J133q65j783j518J36J897J725L06j548j961p11J218J763J172r12j758
1534f72j281K63J565J816K75j331j997l41R15J761J098p86j894j252K43J726J578
1551A686p6j363j607o29J120J913P31m73j742j459K16J500J775J65j423j473p47
1568a886J095J561J012p26j526j102J20J583J532j85j267j599m77J218J452R12
1584A717o00j511j366M37J426J392O0j314j507l01Q85J466Q62o50j500j045L10
1601a239J391J138K20j128j603m24R70J596P11o84j408j095N20J138J164K41j173
1618C35j326n03R49J478L12m13j561p34K26J378R94N2r30j169l69O96J503N31
1636A449m89j472q76M70Q34J127J16r87j232j99O27J353O88o88j179r33N24J014
$$ plain form
1518 1034 2167 1302 -481 -1999 -1863 34 1759 2065 517 -1444 -2155 -937 826 1998 1086 -672
1534 -672 -1953 -1690 -125 1691 1966 635 -1362 -1703 -788 973 2071 1285 -609 -1861 -1618 108 1686
1551 1686 1610 247 -1360 -1989 -869 1044 1775 1302 -440 -1899 -1683 -183 1592 1757 334 -1139 -1886
1568 -1886 -791 770 1782 1056 -470 -1572 -1452 131 1663 1478 211 -1388 -1865 -647 805 1717
1584 1717 1117 -394 -1760 -1323 103 1495 1555 241 -1266 -1567 -682 784 1646 996 -504 -1549 -1239
1601 -1239 152 1290 1510 382 -1221 -1645 -675 921 1632 948 -460 -1555 -1035 103 1267 1508 335
1618 335 -991 -1494 -545 933 1245 832 -729 -1463 -1237 141 1135 1187 257 -912 -1281 -585 918 1449
1636 1449 960 -512 -1388 -918 -84 1043 1159 172 -1060 -1259 -632 721 1409 721 -458 -1391 -867 147
1654A47Q57L07j074j201n10R91J313L73n94j126o20J64J082J011r2p85j124k29
1672a110O86J285L28n55q99p95p7J424R44l18p67j088j49O08J173L82m84j009
1690d21n22P6J032Q60o0p28j032k84P84R95N14o00j098n47K30J102N93j29n59
1709B06j101k3N72J083J94m12r65l68K0R73Q60K5j061p43k63P07J166J47l19j150
1729d52p23M34R32Q79k36q16q46j24N77R70M41o29q93l98L56P85N91J2p62j027
1749i29O4N46P95L94n73p80o45M56Q43P17j41o86p26o3O70O52K16l11r20l95L28
1770d88O77N00Q0o97o80k31P44P15K48m12p91m81K70N97P38j21p71p28O5N53O98
1791D85L55m53o10o09K91O59O57o4o93q28R6O08P25M0m83n85k91J86P87L37J32
$$ plain form
1654 147 1004 1311 237 -964 -1474 -483 830 1203 609 -517 -1137 -973 109 1120 1028 243 -881 -1110
1672 -1110 -424 861 1189 634 -265 -1060 -1137 287 1231 913 146 -942 -1091 -483 690 1072 588 -421
1690 -421 -943 -867 165 1025 965 237 -795 -1079 -295 700 1214 614 -484 -1031 -801 301 894 765 206
1709 206 -895 -918 -346 737 931 519 -446 -814 -794 179 1039 1064 3 -740 -1003 -296 870 1017 698 -452
1729 -452 -1175 -741 191 1070 834 18 -828 -952 -375 595 1036 407 -486 -884 -528 257 848 860 98 -929
1749 -929 -865 -319 476 870 297 -483 -1128 -672 171 888 747 61 -665 -728 -58 594 810 499 -421 -816 -488
1770 -488 189 689 769 72 -608 -839 -95 620 868 456 -335 -816 -546 51 789 668 -103 -831 -766 -213 485
1791 485 840 387 -223 -832 -541 118 775 711 18 -810 -714 -106 619 659 176 -409 -700 -514 273 610 742
1812G42o61n96j38M99O42J35k51o39o99P42L15M80%n69q10L03L80O90Q1k69p79
1833d02l37J22R10M13j41m56p91R2K79P78K28m58p99k2P6O09N57j42n16n49P7
1854d72K99P73J56l93n75m21K44N48M79j63n75n65R3N39N24K07l91n89m39K61
1874d60N77M12j63m39m27j14N10M99J71l62n09m08L37M34M68J6n50n38j5N16P01
1895F56j05k98o54k64L46M37L78l7o25l21j0N20L47Q6k03n22l44L17M33N03k71
1916C69n47l61R5N44L02K13m39n28j56J54M84L44q9l08n55J56J89N88Q2l94l04
1937a61l97L26N20N7q6k41l57q0N76K35l8j71o12n2K58M30K08j70m61j23q6K77
1959a48M58R1l72j41l11PP28J21j66l96k09n9M31M64j98j47k77l15M03K64K14
$$ plain form
1812 742 81 -515 -653 -154 488 623 372 -267 -966 -224 91 571 571 2 -808 -505 -125 565 646 377 -402
1833 -402 -739 -617 293 706 565 109 -682 -590 -311 467 695 237 -562 -584 -508 101 658 516 0 -549 -472
1854 -472 -173 600 756 363 -212 -633 -389 159 638 475 -100 -665 -572 -33 491 698 307 -282 -721 -460
1874 -460 117 529 366 -73 -500 -614 -104 395 566 204 -305 -713 -376 58 526 542 -8 -546 -561 -45 656
1895 656 551 253 -401 -665 -319 118 496 459 -166 -487 -497 23 370 456 253 -269 -613 -296 137 640 369
1916 369 -178 -539 -444 100 402 615 176 -352 -508 -354 130 474 385 77 -478 -322 -133 455 537 143 -161
1937 -161 -558 -232 288 345 259 18 -339 -419 157 392 354 183 -429 -481 -223 207 415 245 -216 -339 -425 -148
1959 -148 310 401 29 -112 -423 -416 312 433 267 -129 -338 -397 34 498 300 153 -124 -439 -36 228 442
1980D42j71k72n52J94L61L00K26k41o01k52K59N08K1Q8n65j07j0M09K95J44l43
2001A33m07p7L02K30L53k49m14k23Q8K33M94j68j85l17j57J45K71M01j62l77m26
2022e12J75K07N58j67o2n05j81K34M04K66j55k06k92j44K70M49Ml04k69j87K77
2043a40L68R0P6n17m8j55K55L73qj2l76k53J41N11J86k69m18j56m7L48M14kk17
2066A44m11m4R4M39Rj19k20j72m1L61J93Q6k26l88j22L46L07L3p9l38j47J04K79
2089H8K84J09n81j08j83K87J17L92j06m30j44m1J32M55n9r5l04j45M43j18M71
2110D64Ln30k96K33K9N70j69l02j91j83K79J93L37k76l03k59K7L99J38k2n0k22
2132a31j05o7M77J65l15J65k21k78K67M05j11j27l04n4KM53K20m91l8k80J4L41
$$ plain form
1980 442 271 -1 -553 -359 2 302 528 287 -314 -566 -307 201 222 310 -255 -362 -372 37 332 476 133
2001 133 -274 -351 -49 181 534 285 -129 -352 -264 -31 463 295 110 -207 -364 -219 52 453 291 -86 -512
2022 -512 -337 -130 428 261 199 -306 -487 -253 151 417 262 56 -236 -380 -110 339 343 39 -230 -417 -140
2043 -140 228 318 394 -123 -171 -326 -71 302 294 282 -94 -347 -206 305 491 222 -196 -352 -399 -51 363 361 144
2066 144 -267 -311 -217 222 231 112 -108 -280 -321 40 233 319 93 -295 -417 -71 236 269 190 -148 -295 -191 88
2089 88 372 481 -100 -208 -391 -104 13 405 299 -131 -275 -316 -184 271 212 117 -187 -332 111 -7 464
2110 464 467 -63 -359 -126 -97 473 304 2 -189 -372 -93 100 437 161 -142 -401 -374 25 163 141 91 -131
2132 -131 -236 -303 174 339 24 189 -32 -310 -43 362 251 124 -180 -234 -232 221 441 -50 -88 -368 -354 -13
2154a3J34K1k02o9j56P3L73L5q8k00k12K2K80K14j08j50l05P8K12K34p3J94k80
2177A4j64j9J45L95l4k51k89k14L54K20J14j95%j74m12N74L67k17n56P7J99j37
2199b03L04L0r0j98O1J28n16R34k58J2k76j49J44L04j46Rl07J44J61j04K18P6
2221B78m84l63P19J68n37%j07k44N32N5j07k80N23j5p8O2k23j27N44J13p35l12
2243f18M56N40n16O93o81O4l0j1L7N57m23l21l65M38M26k07q0K12n03L30j95K13
2265A6N1K15q7l60j99O10j01Lk0r9m15K49J56K39j85l4k88mK26P6M08m33Qk83
2289b51J77K32K16l74M7k62K04O5L1J0k49Jo8J61K08J51l80j68N8J73N4K03O5
2312C04j41l99M0K3L08J63j09k64k8j50K96l1Q0j30j87K46L5M7j7J6m7j07k41
$$ plain form
2154 -13 121 142 -60 -129 -285 -212 161 196 108 -92 -304 -282 -2 212 104 -46 -351 -273 -61 173 100 294 14
2177 14 -150 -169 -24 371 337 86 -203 -417 -63 157 271 76 76 -98 -510 64 431 214 -342 -265 -66 -203
2199 -203 101 131 41 -157 -96 32 -484 450 192 204 -72 -221 -77 227 81 90 -217 -73 88 -16 202 278
2221 278 -206 -569 150 318 -219 -219 -326 -570 -38 17 -90 -370 153 138 60 122 -101 -228 316 429 -306 -618
2243 -618 -162 378 -138 555 -126 -62 -92 -103 -66 491 68 -253 -618 -180 246 39 -41 171 -332 -2 -197 16
2265 16 67 282 195 -165 -364 246 145 148 128 29 -386 -137 19 258 73 39 -249 -253 -27 49 457 24 32 -251
2289 -251 -74 158 374 0 47 -215 -11 54 85 95 -154 -153 -221 -60 148 299 -81 -249 -191 -18 36 239 304
2312 304 163 -236 -196 -173 135 298 189 -75 -103 -253 43 12 92 -38 -225 21 56 103 86 102 55 -52 -293
2335b93L19L07k35j41n6o7L7L84q5k49j23K01m9O5L02j64k11j44n5J68J20J32
2357A63q0j29j47J38J88j2j5q0j92Q2o4J23K18o6k24LJ27m6K60r7J2k76k31K11
2381a34J59mJ15k12L6j00J61J19r0lk08J75J34j64L06k91q3Q5o0N0P5J07j70n0
2405d7j16J31K43k01j85J87n8Q0R7j68J69k38P5k10J28K39L0j89j2p5q6L33m7
2428H0L7k33j08J78j11K13J33On34J68j13P45l96J4L71n53O2l17k8L72K48l80
2450a46J78j42O7J84J0k61M2m2R4J31Q4j47j72L8J19k1o7J27j18l3q1N1K11K4
2474A30j0p8j63JK85m2j28j29M4m5J45j2L4m5j32m5J59J16K07p2j78l55J92R6
2498b5K67j35o8k74K93r9kK51j22p7r4n3O1L02j72m7J8j78N8M1Q0J35j76p7K81
$$ plain form
2335 -293 26 333 98 -43 -99 -166 -129 255 170 -79 -202 -1 -50 15 317 153 -58 -202 -257 -89 31 163
2357 163 83 -46 -193 -55 133 121 106 26 -166 -84 -148 -25 193 127 -97 -94 33 -13 247 150 162 -114 -345 -134
2381 -134 25 21 136 -76 -40 -140 21 140 50 47 -161 14 148 -16 290 -1 -84 1 -59 -9 66 173 3 -47
2405 -47 -163 -32 211 10 -175 12 -46 34 131 -37 132 -106 -31 -241 -113 126 156 -33 -45 -120 -206 127 80
2428 80 117 -116 -224 -46 -157 56 189 195 -339 -171 -284 461 65 79 450 -103 -41 -358 -386 -14 234 -146
2450 -146 32 -110 -43 141 151 -110 -68 -110 -16 115 199 52 -120 -82 37 16 -51 76 -42 -75 -156 -105 106 130
2474 130 120 42 -121 -120 165 123 -5 -134 -90 -135 10 -2 32 -13 -145 -190 -31 85 292 220 42 -313 -121 -25
2498 -25 242 107 39 -235 58 -41 -43 208 86 9 -85 -138 -77 225 53 6 24 -154 -96 -55 25 160 -16 -93 188
2523A88k64J95L0j27n2p1O4Q7K47j85k45P9j17R0J49J06j48j84J10o0L1l2K37
2546A28J4j95pP2O5K3j67p0QL06kj10N1P0j35r6J12m5l3k5P3j23m8J57J10m0q1
2573A2m4o2L1J72Or6q9J18j18O7K2mN4o5j04J47J04r2n9j19q8R2J23o9J94j51
2599a8nM6k11K54j4Qj37o1J92l2L3j31Rm9P4pK9K06q8q3j19RN7K01j07Qj56K9
2627f3rJ91J9j97J35j65J31N0K0j16R2o0j96J06N5N1o3l3O1k5P2P5k41J18j36
2652a28J15Q5j03m1K2LN7r7K42r2Q3k46J61p9j02qM01k14J5j4M3K9j94M3L0Pp4
2679e6J57j4kj31MK03J15j73k9J06j47j30O4j08K35n0J35k62L7rJ60k8Q9j36k20
2704a90l2K13J17j68j24K53k01O9L5J04K1j60K12j6l20K85M6j90q3M1J04oK38
$$ plain form
2523 188 -76 119 149 22 -30 -101 -37 50 297 112 -133 -54 -171 -81 68 174 26 -158 -48 -108 -77 -109 128
2546 128 142 -53 -60 12 77 100 -67 -137 -129 177 175 65 116 186 51 -45 67 22 -11 -36 37 -86 -134 23 133 93 12
2573 12 -32 -94 -63 109 115 19 -70 48 -70 -3 19 15 69 4 -100 47 151 59 0 -119 -207 -115 8 -61 133 -18
2599 -18 -23 23 -188 66 52 60 -77 -138 54 22 55 -76 -67 -116 -42 -49 -20 186 98 15 -104 -95 -38 163 56 64 -92 -63
2627 -63 -72 119 138 -59 76 -89 42 92 112 -4 88 28 -168 -62 -7 44 -19 -52 9 -16 56 131 -110 8 -128
2652 -128 -13 72 -31 -72 -50 -47 10 -87 155 63 146 -100 61 -18 -120 -128 273 59 74 60 103 132 -62 -19 11 18 -56
2679 -56 101 87 85 -46 -42 161 276 103 74 180 33 -97 -33 -141 94 44 179 -83 -46 -55 105 77 166 30 -190
2704 -190 -222 -9 108 -60 -184 69 -132 -63 -28 76 97 -63 149 133 -187 98 144 -46 -129 -88 16 10 248
2727B48j20j54M6l0j01K57r3j32O4K3M3j97J71K4j90J16J07j91K46k07N6j6q8
2750a18K39k38L22o6l39J60m5M0R9R6k72J13j00R0J06l1J09k44l8J46J02J9nj07
2774C8j38%m4J43rq2J06j09J47m2O7L4j70j9LK42j53Mj61J59K0k96K49L9O5q9
2800DJ97l1j52P7K7j10k2K9OL9m1J33k75J05L8j89L55k74R6J19k53P6J11L4L2
2825A31j67J1n1J71j89O2J07k08K7J40j1r3K20O8k66J50k04K28k5j26R3j29k6
2848h7L0K77k45N8o7p3O5J12J49k46j2jj11J60J44q0q9p3lJ15P5%kj73J13k45
2874b09J48J23q2J40j72q5J44J45j74J54n9l1m6O7r7J29j74mj2L5N5J01N0q7j24
2899f5J04j26J05P4j47J60k67N6K35M6l52M0J88L5n9JJ94l12M1M2K8j01J13j5
$$ plain form
2727 248 128 -26 20 -10 -111 146 53 -79 -15 8 51 -146 25 49 -141 -25 82 -109 137 -70 -14 -30 -118
2750 -118 121 -117 205 139 -200 -40 -85 -45 54 150 -122 -9 -109 -19 87 56 165 -79 -117 29 131 150 145 38
2774 38 -100 -100 -144 -1 -10 -92 14 -95 52 10 77 111 -59 -78 -75 167 14 18 -143 16 36 -260 -11 28 93 4
2800 4 201 170 18 95 122 12 -10 19 25 64 23 156 -119 -14 24 -165 190 -84 12 131 -122 -46 65 99 131
2825 131 -36 -25 -76 95 -94 -32 75 -133 -106 34 23 -70 150 218 -48 102 -102 126 101 -25 68 -61 -87
2848 -87 -57 220 -25 33 -34 -107 -42 70 219 -27 -39 -40 -151 9 153 73 -16 -89 -92 23 98 98 96 -77 36 -209
2874 -209 -61 62 -20 120 -52 -137 7 152 -22 132 73 42 -4 63 -34 95 -79 -83 -95 -60 -5 96 146 59 -65
2899 -65 39 -87 18 92 -55 105 -162 -106 129 175 -177 -137 51 86 27 28 222 -90 -49 -7 21 -80 33 18
2923A8L6j49Q2j66K34R9k60J07J00j31K0J56M9k33L6j7J29q3M7l1n3K8pJ2Q3n0
2949E6qP1k00J57o0j08K25j15L2M5N0j0ql5k45O9K35k06P5j2Kk9j11J19qJ14p8
2976A7n8J42k83K95p0p4p2K52k58K00Lj19L1r0LJ41p2m7P7j69P6M9J59j41j10
3001a18Q3l2m0N3P9j01MJ63j39k7K45j57l3j06J12O2q4J07L6j10j15J35k8o3L6
3026c8n8O2K7r8o4O5K23p1j47K2L6J65p1o1o5J30p4j43J89J55j67M5o5M2j19M2
3052c8K2p4K43l90K00j06J61O4j80k3Q5l8O8K5Mn4j00K35l01P6K00o7o6J16N4
3077A16j04r2P8k9nN9Q8k90K43j2M9j13J53j10M1p7O1p1m3m4J58p9l1L4Nl6P6
3104B5m4J2O4J05p8p4J45k32mK22l8p6P8j56l0k8Q3R8N3p3r9q8K45j33K8O5j26
$$ plain form
2923 18 54 -95 -13 -179 55 154 -106 1 101 -30 -10 146 195 -38 -2 -19 110 27 74 43 -10 18 11 23 106 56
2949 56 48 119 -81 76 16 -92 133 18 50 95 145 135 127 92 -153 -84 151 -55 20 8 10 -19 -130 -11 -19 95 17
2976 17 -41 101 -182 113 43 -31 -103 149 -109 91 94 -25 6 -84 -81 60 -12 -59 18 -151 -75 -26 133 -8 -118
3001 -118 -35 -67 -107 -54 25 -76 -72 91 -48 -75 170 13 -20 -126 -14 48 -36 71 107 -3 -118 17 -11 -74 -38
3026 -38 -96 -34 -7 -105 -169 -104 119 48 -99 -77 -41 124 53 -8 -73 57 -17 -160 29 184 17 62 -3 39 -80 -38
3052 -38 -16 -90 153 -237 -37 -143 18 82 -98 -121 -36 -74 -6 19 23 -31 -131 104 -197 -121 79 12 -54 62 116
3077 116 12 -80 -2 -31 -36 23 111 -179 64 52 101 -12 141 31 72 -5 56 -15 -58 -102 56 -23 -54 -20 -15 -51 25
3104 25 -19 -7 57 162 84 10 155 -77 -81 141 103 27 105 -51 -81 -109 -26 72 125 52 -47 -135 110 -23 5 70 -56
3131e6J75j47l6P9k8N2j32J53j66J87L6Rj76J34l9r0l7J83p2N8J1l50R7J22J00
3156F7j23J18N9lJ7J0j25l7R0J4k38J86j91K79k00m5J78r4Q3K6j97J21j47R0R7
3181C5l3L8m8pJ98k13j07K43o3j00J13j03K9Q0k4l3Q5r8nn5L5Q1j11M9JJ10p2
3208B5J11j73j1Q7J72j06J26l26J8J38K3k28J89j0l0O1k42J88p3J09q4K2j20L48
3232B14j22q0j12J71J52k18M9qJ18k88J6J78j17j21N6J50p8J03q6N4r9P3j13J55
3256D7J53k9J40l27P7o6lj42K53j19j54K46k5l3k0j2P9N6j32r2J71j36K35k12
3280d5P3l3j46J85q5j0O4m1J18q6q6J25m4m9P0J48j01j27J14J6m9n2Q4M4k79K70
3306G8j69J05p4J30J3k06J11L9L3j48J01k4P4l7j8p3K1R8P7j41j08K87j47K5o2
$$ plain form
3131 -56 119 -28 -64 15 -13 39 -93 60 -106 81 117 126 -50 84 45 -45 -82 101 29 87 98 -252 -155 -33 67
3156 67 -56 62 121 118 135 145 20 -17 73 87 -151 35 -156 123 -77 -122 56 -38 45 71 -126 -5 -152 -62 35
3181 35 2 40 -8 -15 183 -30 -137 106 43 -57 56 -47 -18 62 38 5 90 -8 -13 -68 -33 48 -63 -14 -13 97 25
3208 25 136 -37 -48 39 211 105 231 -95 -77 61 84 -144 45 35 5 66 -176 12 -61 48 -36 -14 -134 214
3232 214 92 12 -100 71 223 5 54 46 164 -124 -108 70 -47 -168 -112 38 -40 63 -23 31 -68 5 -108 47
3256 47 200 171 311 -16 61 -5 -8 -150 103 -16 -170 76 51 18 -2 -14 65 121 -11 -103 68 -68 167 -45
3280 -45 28 -5 -151 34 -51 -61 3 -38 80 -6 -92 33 -11 -60 10 158 57 -70 44 60 11 -41 43 87 -192 78
3306 78 -91 14 -60 70 83 -123 -12 27 60 -88 13 -11 63 26 8 -65 -44 54 131 -10 -118 169 22 47 -15
3331a5lR3j1J2j56K39j50j18m7J74P9j34O9q6J02j95Q4j14R9K05j30m1l0K9m7
3356i2M1J08PJ23q7k9j14lK2OJ08n5P3q8q5J21K1j25k2J23q1N7n2R2j4L7Pj42
3384d3kkJ04l0j35M4K1J97j84J95o2j96J97q7j07r8J83MK28p5j49P0l0o2J49j3
3410A17j12k5K1K04j19Lo9K9l3Jj41J34k1J08m0Oj35L6J53j34J33L1j09q1J14
3435G1n0l3J2l0j1M6r6K96j40J69l05P0o5J76k17K31j42P4q9RJ08q0j24M32k58
3460E4q6l0R0q2R6j18J49J53k26J43j96Rn7m6J12P1k3j3j30J82m8L9L9qjj09M7
3487A1o8n4M4J26r9R6m6J6q4k1R8qn2mRR3P5o6O5j89l7l0K37j27R1L4o1k34J37
3516d8ML5n1j2l8MnN1J86k63K40j41Kmj0K7J53l6j00q6J64j27J93k58L29l63J04
$$ plain form
3331 -15 -18 75 64 76 -80 159 9 -109 -156 18 97 -37 32 -54 48 -147 -63 -177 -78 127 -3 -44 -74 -45 -92
3356 -92 -51 57 64 187 100 71 -43 -46 -24 -18 90 35 108 20 -65 56 77 -48 -70 53 -28 29 -23 69 55 92 99 -43
3384 -43 -45 -47 57 27 -108 -64 -43 154 -30 165 103 -93 104 17 -90 -188 -5 -1 227 152 3 73 43 -19 130 117
3410 117 5 -20 1 205 86 89 20 49 16 17 -124 10 -11 97 57 63 -72 -36 117 -17 116 147 38 -43 71
3435 71 21 -12 0 -30 -41 5 -91 205 65 234 -71 -1 -66 110 -107 124 -18 56 -33 -24 84 4 -120 312 54
3460 54 -32 -62 28 -54 42 -76 73 226 0 143 -53 -44 -101 -147 -35 36 13 0 -130 52 4 43 82 74 73 -36 11
3487 11 -57 -111 -67 59 -40 56 10 26 -58 -79 19 11 -41 -45 -36 57 132 66 131 -58 -95 -125 112 -15 76 110 49 -185 -48
3516 -48 -44 -9 -60 -72 -110 -106 -111 -60 126 -137 103 -38 -36 -40 -50 -23 130 94 -6 -92 72 -55 138 -120 209 -154 -50
3543e0J5J00O7j38L4L9M8j28K8k2N1p8j7L6m0N8j50J69o4J52j82j5K91k23OQL3
3570B8j22J12J8o1K03j67j59J67J8j45J97j68K75k12n7J99j85N4p6J07l5n5R6
3593C2j25K21K0k09J61j16K1n7J0J77K3l40J31j4J00O8j69k09K70J90j64J2N4
3616H7k8o2j03K3J18j8K9n1O5q2L2r0K34J7k50j0J48j55Q6J36k2j22J39j64m3
3641h6J01M2J99k29R9J42l21J13K69j56q4j35O4m8J18m06O57n00r9N29k52K23
3663B40l26j14N82j057Q20l77O96o65o6M50P4o97L61K1K56J27k38J61Q0n16K05
3684A7j09j28Q3M97l46J38l27Q3K33O7k87J45j40K17j60q3O8N1p8M0J03O0J2p0
3708H6J25l06K15Jj77l7J51k7l1O6j42K10k88K62o0j50l1J61j41P8J6O4j08Q5
$$ plain form
3543 -50 -35 65 132 -6 28 67 115 -13 15 -7 44 -34 -51 -15 -55 3 -147 22 -42 110 -72 -87 204 -19 -13 -5 28
3570 28 -94 18 36 -25 178 11 -148 19 37 -108 89 -79 196 -16 -73 126 -59 -5 -81 26 -9 -64 32
3593 32 -93 128 148 -61 100 -16 5 -52 -42 135 158 -182 -51 -65 35 103 -66 -275 -5 185 21 33 87
3616 87 59 -3 -106 -83 35 17 46 -5 60 -22 10 -80 154 171 -79 -89 59 -96 -10 126 104 -18 121 -43 -86
3641 -86 15 57 256 27 126 268 -53 60 329 173 89 -46 18 -30 88 -318 339 -161 -260 269 17 240
3663 240 -86 -200 382 -675 145 -232 464 -201 -267 183 257 -440 -79 -58 198 325 87 248 328 -188 17
3684 17 -92 -220 -137 360 14 152 -175 -92 141 208 -79 66 -74 143 -17 -100 -32 19 -59 -19 84 144 156 86
3708 86 211 -95 120 121 -56 -93 58 31 0 66 -76 134 -154 108 48 -102 -133 28 -113 -35 -19 45 -63 22
3732B2m1m4O5q4J70j37J14n4k2k6m3O7M6j06j3J19j3k53J92j8J5j4J12j11J22
3757F5j24N0J21j5j73J04j31J16J9N4lj52M1m7J2j4J20j0j01Q4K8j96L00j11J3
3782E0l4o5o6L54k69K8K1j08O3o6J08N4j90J36R4j76J6K20j26k7J22j55J2J15
3806A11m9N6q2n2K7J40j54j5Kj8J01n8M4J05k82K00l8n5J57j01j06J21J9j5j33
3831g5l8L1K2J44j40k0M3J6K02k53J23q5k7r8O6J62j03J5nPL9q2J53M4P6k75%
3858e8J92n1%r2l1Q0p3J32n6L6K5j13k18K08J50k87J76k82K00J93P5k22j64J76
3882dK16k76M6k8J72q3k00J06q8P8J1l8J5L6M1j3m5R1j22R7k1ON7q4n7O7mN7L7
3911G0k08j1J28J35j48m2K40k50J32Kj25R1j19P6k3J06ll3KJ12k29N9M5p8L9R5
$$ plain form
3732 22 -19 -63 2 -82 88 -49 65 11 -11 -37 -80 -13 33 -73 -86 33 20 -233 -41 -59 -44 -58 54 -57 65
3757 65 -59 -9 112 97 -76 28 -103 13 32 86 83 -69 -28 -75 -63 -77 43 33 -68 16 44 -152 148 37 50
3782 50 16 -49 -115 239 -30 -2 19 -89 -26 -92 16 70 -120 16 110 -66 -50 170 44 17 139 -16 -4 111
3806 111 62 118 36 -16 11 151 -3 -18 -16 -34 67 9 53 158 -124 76 38 -17 140 39 -67 54 73 58 -75
3831 -75 -113 -82 -60 84 -56 -76 -33 -17 185 -68 55 -30 -57 -155 -89 73 -30 -15 -20 -13 26 -56 97 141 217 -58 -58
3858 -58 134 83 83 -9 -40 40 -33 99 43 79 104 -9 -227 -19 131 -156 20 -262 -62 131 206 -16 -180 -4
3882 -4 212 -64 -18 -46 126 43 -157 -51 -139 -61 -50 -88 -73 -37 4 -9 -54 37 -85 12 -9 -3 54 -30 -87 -20 -24 33 70
3911 70 -138 -149 -21 114 -34 -76 164 -86 46 48 -77 14 -105 -29 -52 54 51 18 20 132 -97 -38 7 -71 -32 63
3937F3J6%j09o9J21m3jO7j16K0L6K2j15J50L6j03m3J06Qk4P4o6j50M1K18p6q4
3964b1J06k50L18k06l0N8j1p7J00J9j6n0J88k0j58J77r9N3q7j7k1K11j71k0pJ60
3990A29j23j12J36Rk2j05J16L8m6J63j59j02J26k0l5K5J13j17L7j54J82klp5M7
4015D6k1N6j04j72K22J03L7p0j4j35J09M2q1n5o5J72n2k0M6j6j67J98J1o1J0j02
4041h3NK27pl1p1M7m7n7r2k0K03k5m3qk37J79J47k31J57k9Pn9J10J11m5q7l0L4
4069B5J20j33o4R8m9J8j72J55j12R5Rj23J60j04J02j13O5Q6N6k36J07Q6N4p9J28
4094A79k27PJ14q5J49n1J4k4p3k2O6k38L61j33J70k26m6K21k5R3j89J35j37j30
4118i7J86O2j30J10p6k0j23R4j02M9J24n2Rj94L7J51K0l5q0J6O5J4j03J36k69
$$ plain form
3937 63 79 79 -30 -99 22 -21 -22 45 -71 -51 -15 7 -108 42 78 -25 -68 38 46 22 96 30 -120 -79 139 63 -21
3964 -21 85 -165 153 -53 -83 -25 -36 -113 -13 6 -10 -60 128 108 -50 127 28 81 -6 -23 -44 167 -4 -24 -31 129
3990 129 6 -106 30 39 17 -88 28 66 20 183 24 -78 48 28 -7 18 131 14 51 -103 79 77 74 -1 46
4015 46 25 81 -23 -195 27 130 167 97 83 -52 57 99 18 -37 -102 70 18 -2 44 28 -139 59 70 9 19 -83
4041 -83 -78 149 142 111 40 87 40 -17 -109 -129 74 49 6 -2 -239 -60 87 -144 13 -16 -9 -68 42 153 108 21 -9 25
4069 25 145 12 -52 46 -3 15 -157 -2 -114 -19 -10 -133 27 -77 25 -88 -23 63 119 -117 -10 76 130 51 179
4094 179 -48 -41 73 -12 137 86 100 76 3 -19 47 -191 170 37 207 -19 -65 156 131 224 35 170 33 -97
4118 -97 89 151 21 131 55 35 -88 6 -96 -47 77 25 34 -160 -123 28 48 13 -67 -51 14 28 -75 61 -208
4143b08K61l25K60j38J38P0L0k50K46R7r1o2%q7J3j3m9r0J33j00J1K02J1N2k04
4168i3P8J26k09K10j17n6K15k90K91k04J81m3N5p8k3J10j07p4p2K42j21j9R5k44
4192a47O4J57r3J59n2J9l25J51J82k25J12K0N5j70J26KP1r6m3J36r4p0J91j16
4216A4p4J86k01J35n4m9K7J4J48j05Jj39J81Ll9j21L0o2J31o7q1J96j10J5K7P9
4242H5j22K4K02j81j23K15j52J05n0L8q1q7J45j46N7J13k4K9Q0j60jK19k02P3
4266E6Oq9l2QJ37j30K48l04O5P2N4Jk15J32l9J00r0M8j50m6J22o8J28j57J8J24
4292am4J99k71J49O2J1q1K3O8j73J44j36N1nR9j91M2M0k1n7N2J38p5j62J45P1
4318G7o5j08J41j04j02J82O9J9j52J53j44K27l02J80Q1r0o3m7J36o7j00O5J8Q2
$$ plain form
4143 -208 53 -272 -12 -150 -12 58 88 -162 84 181 90 28 28 -59 -46 -59 -108 -198 -65 -165 -154 48 59 111 -93
4168 -93 -15 111 -98 112 -5 -61 154 -136 155 -49 132 89 144 66 43 153 46 -28 -100 142 21 2 97 -147
4192 -147 -83 74 -19 140 88 107 -218 -67 115 -110 2 22 77 -93 33 35 106 10 -33 103 9 -61 130 14
4216 14 -60 126 -75 60 6 -43 -16 -2 146 41 42 -97 84 87 48 -73 -43 -105 26 -41 -122 74 -36 -21 6 85
4242 85 -37 -13 189 8 -115 100 -52 53 3 41 -40 -127 18 -128 -71 42 18 47 127 -33 -34 185 -17 56
4266 56 62 -27 -59 -51 86 -44 204 -100 -35 37 91 92 -123 9 -30 70 -20 28 -122 -168 -46 -114 14 -143 -125 -1
4292 -1 -45 154 -117 32 94 105 24 47 115 -58 86 -50 1 -4 95 -96 -54 -14 -35 -92 -40 98 23 -139 6 77
4318 77 12 -96 45 -59 -161 21 90 109 -43 110 -34 193 -109 71 152 62 -1 -48 88 21 -79 -14 4 86
4342H6j30j12K76r4Rj4j2R2j84j0m2J1J75o7p8J6P1K0Ko5J37m2p0N8m5j42K01
4369D7K9o3J29j16j14R3j64lJ07LJ55j90J69j36J60K5k2j73P7k2l2K1J1n3q4K83
4395A37q9n9j14J47q5J71p0q6J05j18R5j85P8q4J02J15j02q1OP4j00M2o4K04j52
4420a13M7O5K6l5l7P1n1q5J48J5m4j3j21J36J05J1Rj92P5k20K81O2q4p5N7j54
4446a16J97J41k22J0N8r5J1j05K8J02r6K8o3J10P4j30L3j64J63Q0l2R8j34jJ91
4471A66j49j7KJ50k25j00K04j17O5M7k3n4M0J12P0k51K10J4j11N3k68J81L6q8
4495e3K6qK6N1n7n3J19P1l6J32l12P7l3N5q8J21j06l1J02n7J60m0j21N3nQ9r0
4522hO6pj04O9j9p8K52p5j46q5K04j08J1r8L0J82r0qR6j82n3J69L4R2k26Q4L1
$$ plain form
4342 86 -44 -156 120 26 35 21 9 101 -83 -93 -135 -124 51 -16 -94 -78 -7 13 15 -50 87 45 -25 33 -12 -154 47
4369 47 76 13 142 26 -88 5 -159 -162 -55 -52 103 -87 82 -54 106 131 109 -64 13 -9 -41 -20 -9 -62 -146 137
4395 137 48 -11 -125 22 -63 108 38 -48 57 -61 34 -151 -73 -157 -55 60 -42 -123 -117 -43 -143 -101 -165 39 -113
4420 -113 -66 -1 25 -10 -47 24 -27 -112 36 51 7 -6 -127 9 114 125 134 -58 17 -203 78 140 56 -19 38 -116
4446 -116 81 222 0 10 68 -27 -16 -121 -93 9 -87 -59 -122 -12 62 -68 -35 -199 -36 44 12 110 -24 -25 166
4471 166 17 0 2 152 -73 -173 31 -86 -21 26 3 -51 -11 101 171 -80 130 144 33 86 -182 -1 35 -53
4495 -53 -27 -35 -9 42 -15 -68 51 122 86 218 -94 -17 -50 5 -83 38 -68 -99 3 -54 106 66 -55 -2 -7 82 -8
4522 -8 58 51 -53 16 -3 -81 171 96 -50 -135 69 -39 -28 -126 -96 86 -4 -12 84 -98 -151 18 52 144 -82 2 33
4549C3J5K0o1N6kP7k06O4N9j74K82j54L4Q0Oj76J45P7k07NN6l3k8LM5L5k4j96
4577a69J1J31p3R1N4m0n3R4oO8k52K86k72J99q0n4J61j60O1j70L2N1J95j31J56
4602A30l1j8j05M7p7K6R2j01J06P5j55R2q4J07j6q8N0n2M8j21mR9J92k19J23j53
4628c7L5O8o0lM3o8l3M3q3L7N0K01j60P5j18Q4o3q5K26k63K96k14P3n1N5Q1k58
4655a29J16Q2j9n3J01q3J45j08j11J56n7p7PJ31j41K01j98LJ13j75J65K9j84J96
4679A10n7n3O0j24L6P7o7J75j00K3J42p3l38J88RO3Q2k83J68j1o3Q1K3j87N6j38
4705b01K72J0j28nq0J70r3J3j39K30l1L6j96K21kn4O7n0j35M8J36k1M3o8k01K67
4731A09m8%N2r5o5j92J23J33J33n1p9q8J7Q2Q5j69p1l2K57j76J33m9%k5l8L9J2
$$ plain form
4549 33 48 68 7 63 61 138 -68 -4 55 -119 163 9 43 123 129 -47 98 175 -32 -27 29 -4 -32 -29 16 51 27 -169
4577 -169 -158 -27 -100 -9 45 5 -48 46 40 108 -144 142 -130 69 -11 -65 96 -64 -3 -173 -141 -90 105 -26 130
4602 130 99 81 -24 23 -54 -28 64 -37 69 144 -11 81 -3 104 88 0 50 -2 46 -75 -79 20 212 -7 116 -37
4628 -37 -2 66 6 3 46 -22 -55 -12 -95 -58 -8 193 33 108 -10 74 11 -74 152 -111 185 -29 44 -7 48 129 -129
4655 -129 -13 69 50 -3 98 15 160 52 -59 97 40 -37 -30 101 -40 161 -37 -34 79 -96 69 98 -86 110
4679 110 53 0 60 -64 -28 49 -18 157 57 80 222 149 -189 -1 8 71 153 -130 38 27 -36 45 68 -119 -63 -201
4705 -201 71 81 -47 -52 -132 38 -55 -42 -181 49 18 54 -142 79 77 23 90 40 -95 -47 89 68 111 43 -158 109
4731 109 61 61 113 18 -47 -239 -116 17 150 99 20 -68 -51 31 116 -53 -124 -156 101 -75 58 9 9 -16 -54 -15 -3
4758cQ1J03r3o2r5R3m9R5j2m9j71O1MJ19j9N4j50P8k4kJ76m5q7M1r2JP5q0L7N6
4788D1J37k72J51j1j99J34J64k68J77Rj80J15J3r8J68j42J81n8q2J23m8k16K10
4811D9PP2k91J84J32j81Q2j05J14j88P9p0J41L1n5R7j60P3L0m5q0l0P3J19o7J35
4837A46k07n0J46p5K4q8J13JJ3P2j21P9m6j80J81j0J87pq9k0o2q5Q1J5M4j77o4
4864a79J68J9J20j12n1j8%LJ3L0m1R1j4p6m2N2k2O3P9k29K46K2r7M2q1M5J03k34
4892a00J23K8nJ04r0L6p0L3k44O1n7K26q7J8k0q0pJ75k11K26p9m3L7J78o1K8l5
4919H4m3k76J13J18P8k63R7j37K06j4j39kK04pj28Q8O3J1J1ok5O3j06LJ12J0o0
4946E5p2j43R8L1n9J84k84J62Q3q9L04l68L3J24M9o3J54j18j05l2K23r5j75J66
$$ plain form
4758 -3 78 181 88 26 -69 24 -25 70 58 9 -162 -101 -97 22 3 57 -93 -15 -39 -41 135 90 3 44 -48 -47 28 -52 -15 41
4788 41 178 -94 57 46 -153 -19 145 -123 54 63 -117 -2 11 -87 81 -61 120 62 -20 103 55 -161 49
4811 49 56 128 -163 21 153 -28 54 -51 63 -125 -46 -116 25 56 1 98 -62 11 41 -4 -84 -114 -41 78 11 146
4837 146 -61 -111 35 -40 -16 -104 9 10 23 95 -26 53 7 -173 8 -2 185 178 89 69 7 -78 3 18 62 -115 -179
4864 -179 -11 8 128 16 -35 -53 -53 -50 -37 -7 -48 43 29 -47 -89 -37 -59 4 83 -146 100 122 25 67 -14 31 134 -100
4892 -100 23 51 46 150 60 96 26 59 -185 -124 -181 45 -42 -24 -44 -124 -131 44 -167 59 -20 -63 -26 152 91 119 84
4919 84 41 -235 -122 -4 74 -189 -92 -229 -23 -37 -176 -178 26 19 -109 -21 42 53 64 58 33 96 -10 -7 105 115 55
4946 55 -17 -160 -62 -31 -90 94 -190 -28 55 -34 270 -98 -65 59 108 45 199 81 -24 -56 167 72 -103 63
4970F3k09J68N2nq7k6m0J02J84j54k0m2o2J9k5J95M5k03k6j05L58p2j12m4J38
4995I2l0M0j47p7J24J26k4o2M6l0l00J17J40p6K27o8m8l2N2p4J60k22J26j70J
5020a09J60p9K22j79J8k5Q9q2l4RQ9m0J13j43K45k03O0n1qJ5q9O9q5P9k06R7J07
5047C9J67k94L16k86O1l9L0jO7j43K6J00n0J60jk50J77rr3JJ1M6j17K3lpK36j55
5075A2%L8j29N0p4J39Mm9R7o7R2q2l2j30K44j09M0M2j51J94j59O7n5N1p8K00l9
5102A16j30k0Q1K27l20M0R1p3J3rO2m6L5j22q5O7MP7J25j10L1p3j07JJ0J8O6J71
5130A40j54m6R6j89J22R8J5k02MJ75q7K5n4J21j34J08j46R3p5N6J14qq8r2J70
5155F2j61K46j15o6M1r9J2J00joR3j95P0m8O2j16J14q7J15oJ04k12J5Jm2J31j23
$$ plain form
4970 63 -146 22 74 69 -18 -44 -84 18 202 48 28 -14 -76 -57 -82 113 158 -45 -71 -176 182 110 -2 -46 92
4995 92 62 102 -45 -122 2 128 104 42 88 58 -242 -125 15 -61 166 98 50 18 70 -4 156 -66 60 -110 -109
5020 -109 51 -28 194 15 33 8 97 15 -19 -10 79 39 152 9 254 51 111 60 52 67 -22 47 -38 41 -165 -68 39
5047 39 206 -88 228 -58 3 -36 -6 -7 60 -83 -57 43 -7 153 152 -98 79 70 -23 -22 -11 35 -82 -59 -62 -69 167 12
5075 12 12 50 -79 -29 -103 36 40 -9 88 21 113 31 -1 -131 113 4 44 86 -65 129 -30 37 -18 33 -45 155 116
5102 116 -14 -34 47 274 -46 -6 85 12 25 16 78 32 67 -55 -140 -73 -69 8 133 23 54 -19 -126 -125 -115 -97 -31 140
5130 140 -14 -60 36 -153 -31 67 82 -120 -116 59 -28 -3 -57 64 -70 38 -108 -15 -90 -34 80 72 -16 -108 62
5155 62 -99 147 32 -34 7 -92 -80 20 19 13 106 -89 -19 -67 -5 -121 -7 -94 21 15 119 -93 -78 -77 -119 12 -111
5182a11J16k70L33p8j1KJ92j13J4m5J12k70O2Q6j22j1R0n4J43o2n7K43q1k32J16
5207hjL0J12p4k24J88o5n6j06J38K06k63K88j86p7M2J81q7N9K2j04q7J83k00O1
5232b8j86K9K35j14K2N7M6p1n6l8J55O1P7k51Q6rq5J67j19p2O4j68K09K1Lj47
5258a12J14m2K1K20j55n2j7Q4Q1p3l6j04m4M9L1n8J22o9n8K3J37m6J1K1J31k97
5284a18M1K26j96k5r7N7m8L4K93j66j82J76Q5o9J4n6P5J89j35j69J07j93M1K59
5308A43j89J37j41J09o3r6K45p9j59P7L0j44L6N0n5j11M03j87k9j77L40n3j83
5331i6J20J52j37J00j97n3K12q8J08l2k81K07j35K23j86J19l9j84L50l14J15J47
5353A11p5n5m0J80j14L1p9q3J53r1N4K2Q9J0k08J77K7n8KNJ1o9O6j34O2j84J10
$$ plain form
5182 -111 5 -265 68 -10 -21 -19 173 60 74 29 141 -129 -67 19 -103 -114 -24 -78 65 3 -54 189 108 -124 -8
5207 -8 -9 21 133 59 -165 23 -42 -98 -204 -66 140 -123 165 -21 -98 -56 125 38 97 119 15 -72 111 -89 -28
5232 -28 -214 -185 50 -64 -42 15 61 -10 -66 -104 51 112 189 -62 24 15 -70 97 -22 -94 -30 -198 11 32 35 -112
5258 -112 2 -40 -19 201 46 -6 -23 61 142 69 33 -71 -115 -66 -35 -93 29 -40 -98 -75 62 16 27 48 179 -118
5284 -118 -77 149 -47 -72 -169 -112 -160 -126 167 1 -181 -5 80 11 25 -31 44 233 98 -71 36 -157 -116 143
5308 143 -46 91 -50 59 -4 -100 145 66 -93 -16 14 -130 -94 -44 -99 -210 193 6 -23 -200 140 87 -96
5331 -96 24 176 39 139 -58 -111 101 13 121 89 -192 15 -120 103 -83 36 -3 -187 163 -151 -36 111
5353 111 36 -19 -59 121 7 38 -41 -124 29 -62 -8 14 103 113 -95 82 109 51 53 58 69 0 66 -68 -6 -190 -80
5380h0J47j01J23j73J75p5J27l25K09K5J00n2j04q0P2J4J4q4J01j50n9J49o6K12
5404A19k90P1K07r4l4j32J29O1j7n7r0l8J10J22j71O4k36K51k10K23n9K9k3M3
5428b2J12J2k62K85j87K02l14J90R9j87P5qJ05j23J99n2q8J8m8oN5Ol2K8k85K65
5454C7l4J48j55k1Q2o8Q5j70J54p0k9o7R2J72k35N5J5R8r0J41k22J85J04k11Q6
5479H2j01J76j97J55j29ON6j48J03OJ34j99N9L6n1J01m0k61K77J07O4j64J59k55
5503b4o8K58l51J9K01k23K47Qk6n1l6J06o4K9J7l5r6O4rj5P9J31j28P8j30R1r0
5530a8Q3R7k69qN1L7O4k6n5k32N49k96N8M5k05K18j27Pj05L91j80j01K1mK0N1
5556F6J00k02j0O3K4j09J12K1j70Q3k13M09o4j07p3K9O0k3RL9L0J2j08J67j49
$$ plain form
5380 -80 67 -34 89 -84 91 16 143 -182 27 52 152 100 -4 -84 -12 2 16 -68 33 -117 -176 -27 -93 119
5404 119 -171 -100 107 13 -21 -153 -24 37 20 -37 -127 -165 -55 67 -104 -40 -276 -25 -235 -12 -71 -42 -65 -22
5428 -22 90 102 -160 125 -62 140 -174 16 115 -72 3 -5 100 -23 176 124 36 54 6 0 55 61 29 57 -228 37
5454 37 3 151 -4 -25 57 -11 74 -96 58 -12 -41 -108 -16 156 -79 -24 -9 89 -1 140 -82 103 207 -4 82
5479 82 -19 157 -40 115 -14 -8 48 -100 3 9 143 -56 3 39 -12 89 49 -212 65 172 236 72 231 -24
5503 -24 -92 166 -185 -166 35 -188 59 67 41 -10 -46 60 -4 25 42 7 -89 -25 -34 -49 30 161 33 111 -19 72 -18
5530 -18 65 162 -107 -115 -64 -27 37 11 -44 -276 273 -23 35 80 -125 93 -34 -27 -132 259 79 -22 -1 -5 15 66
5556 66 166 -36 -46 17 41 -68 44 65 -105 -22 -235 174 110 3 -70 -41 19 -4 5 44 74 86 -22 145 -4
5581dP8Q9j66n3M5K48k04M6q5m4J36q3K3J3o5oJ33L2n0k03J94p1Kp8j8JO9l8k6
5610h5Q3R8j93J48J18j13J68j64q0j09J57Mj28J53j65J31M5M9l18J52j15K01R4
5633A31n9j14K4n1r1K16j87QK75%j43O5j43j49J88J05j76O4N2k7P7j92O8L2J46
5658A19o5j28L5j18J34l5j19J54LM9o2j45K72j08O0j88jJ43n7J02N1p4q1J30K1
5683I2q5J72m03J01K65k96OJ87p0n3J06j13N8J22q9j11Q0J75J3k59R5L6q9n0Q6
5708b4Lj41N2J13R6k1j03J27j41m5R9nJ51k72Ol0N1K02k08N3p7J38L1P3j97M0
5734b9J03j42m0K07j73j52J98r7J09m2n7Q8L3n9J19j12m1J07M3j09M7P7N1k42
5758a13K49ol1l3k9Q3k14J29j7O9r9j05Q2j02N8J26L2o0j13O3j22L53j39rj9R
$$ plain form
5581 -4 74 163 -3 -56 -11 237 33 79 -6 -50 86 3 26 39 -26 -32 101 133 83 -120 74 3 5 -73 -91 -90 -21 -59 -85
5610 -85 -2 96 -97 51 169 56 224 60 -20 -129 28 32 -96 57 -108 23 68 117 -201 -49 -164 37 131
5633 131 72 -42 -18 -69 -160 56 -131 -123 152 152 9 74 -69 -218 -30 75 -101 -37 15 -12 65 -127 -59 -27 119
5658 119 54 -74 -39 -157 -23 -58 -177 -23 -20 29 -33 -178 94 -14 46 -142 -143 0 -57 45 96 22 -59 71 92
5683 92 7 179 -224 -123 142 -154 -148 39 -31 -84 22 -91 -33 89 0 -111 -31 144 157 -102 -7 29 -60 -110 -24
5708 -24 -21 -162 -110 3 99 78 -25 102 -39 -84 15 10 161 -111 -105 -135 -84 118 -90 -37 -114 24 55 128 -69 -29
5734 -29 74 -68 -108 99 -74 -226 -28 -125 -16 -58 -115 -27 6 -53 66 -46 -87 20 63 -46 1 78 129 -113
5758 -113 136 130 99 66 37 120 -94 35 18 87 -12 -117 -35 -137 -79 47 79 19 -94 -31 -153 200 61 52 33 42
5784D2r1j8m4J57l0j23J6P8P0j88J43l13L47p1r3J14M9m1O4O1j35j5lJ0j19K87
5810A54q4M2O6k25N0K1r3NR2l9O8j58n7J01QN5p2l5j21M3K54kj21K4L8r9J12N3
5838H0K9p8j32J5J46o6j7l1l1P6j3K0J44k92K1K65j28j33K76p5k54K09N4l9l0
5863A6R0k70J40J7Q0j08L0K9PJ7r5J30J44j93N2j18N9o5rJ64j25L7J11l01J65
5888DJ88j35j4j88K35o6q3L8%N5j09mP8L9M3MK2p7j61K14o9JK5j15O1P6q1o6n3
5917a38K42j91R8j4n5J9J55kj03j37K13K7n8Jj33K08j28J15r4nm1Pj6J63k11J53
5943G5j36K6K00k98J02J20j70P3M5m0j7K6p2M2k2k0Q8k10K44K5Oj80L26k77O3
5968A9j10R1K2J73k27j96K21n4j0J58o3k28L50k53j0jK0nJ05n3Q3j16r8K70j52
$$ plain form
5784 42 -49 -67 -111 46 16 -107 -91 -13 57 -131 12 -301 46 -25 -118 -4 45 4 68 129 -6 -21 -24 -14 -133 154
5810 154 70 112 178 -47 3 24 -69 -64 28 -11 57 -101 -158 -57 -49 6 -66 -101 -222 -179 75 73 -48 -24 14 -85 27 80
5838 80 109 31 -101 -86 60 -6 -23 -54 -85 -9 -22 -2 142 -150 -129 136 8 -125 151 76 -178 31 85 46 16
5863 16 106 -164 -24 -7 73 -35 -5 24 31 48 -47 83 227 34 86 -32 27 -38 -47 117 -8 29 140 -161 4
5888 4 192 57 43 -145 90 24 -59 -21 -21 34 -75 -79 -1 38 81 85 107 30 -131 83 14 15 40 -75 -14 62 -19 -85 -138
5917 -138 104 -87 11 -3 -58 -39 116 114 11 -126 87 114 56 57 -76 132 4 119 25 20 -21 -14 -30 133 -78 75
5943 75 -61 -35 165 -133 -31 89 -81 -8 37 -3 -20 6 -66 -24 -46 -66 22 -188 56 81 87 -93 233 -44 19
5968 19 -91 0 22 195 -32 -228 -7 -61 -71 87 24 -204 146 -107 -117 -118 -98 -103 2 -51 32 -84 -182 88 -64
5993f4j9J67o2J33jl60J80j4R8M8j15J5j00NO1k2J30j9p0q2J51q3O2J1n4J5o2
6020e1J34j58J06p1J63l0j74j2Q4j32J90j01J32m1J32n1k67K20m4n7K8J63k4k52
6044a13n8M2J01j07oJ73J00J23k30j8n7K05k21p5J69K1r2J83j96N2L1j91K63q6
6068A3K0N0r1K1J79j83n7j7k00K60j25J8p0J12j16J00R2J21q4o8J9Q7lp8Q8j30
6094d2K61k09N9j19j4J20j54o3J12J67l42J67J89L4j72j04J92k53K65n5k4l9M8
6117B4Rk67J63J24n0Pj21K42p8q2R2Q9r8l8rn9R5m0P1p4O7q6k8N5o4J87J34l01
6145c6J72M4k51M6J29k00J85j40J51m2j98K57j23r6J29oj02j27K19J23k33K02
6167A03j44N2j26K46j56K0j0M8j25J14P6j71P6J69l26J34J01N3j7k88J11K13k31
$$ plain form
5993 -64 -83 84 22 155 154 -206 -26 -40 58 106 -9 6 -94 -89 -28 -50 80 61 -9 -91 60 -23 39 50 -4 11 -51
6020 -51 83 -75 31 -40 123 93 -81 -93 -9 -141 49 -52 80 39 171 120 -147 73 29 -28 0 163 139 -113
6044 -113 -171 -129 -28 -135 -141 32 132 255 25 7 -50 155 -66 -141 28 49 -43 140 -56 -4 27 -164 99 13
6068 13 33 83 -8 13 192 9 -48 -65 -265 -5 -130 -112 -182 -70 -186 -86 6 127 43 -25 -6 81 78 0 88 -42
6094 -42 219 10 69 -50 -64 56 -98 -161 -49 118 -224 -57 132 166 -6 -110 82 -171 94 39 15 -24 24
6117 24 33 -234 -71 53 3 10 -111 131 53 -29 63 152 54 16 7 -52 43 3 74 0 67 -19 -47 8 -56 131 265 -36
6145 -36 136 180 -71 -25 104 -96 89 -51 100 58 -140 117 -6 -102 27 21 -81 -208 11 134 -99 103
6167 103 -41 11 -115 131 -25 -5 -15 33 -92 22 98 -73 3 172 -154 -20 81 134 117 -171 -60 153 -78
6190g8J24O1k28R5J16M4j82R2J1k7J29j97L8J23j17J9j35J13Q1j63J73j70j7J89
6214I4R9j99p3Q8k7m5K56k78K9P6m9m8k5Q4j19J84r6K2O4m1k0J46j47oO3j23J23
6241C2l8J57l04J72j17J2K15l81N1K87j16L6P1j85K10k9l5q0J61j71P4Q8j39N4
6265B5K2nP1p7k3J35j41j46K90k57M9K2OM1mN4j70J25J33j81k0N6M0r2J00j62
6291a09J29Rk7p6Q1r1Q1lK4n9k6Q2nK07l49O5N1J48j11k0j00L29j49j13Q9M0m4
6318E3l2j0MrQ8Ko2J42k81J82K0O3r3OJ4r9l9r0J59j1p8J30r3o3k1J61r3R7J07
6347A54r5l3l7L3lKo2NO3j3n5N7Nn8p9J16J29m8j30k6K13o4Q0j11J1M2Q8k40P2
6376A6r6J53j00M7n6O6n4K5j09N9J5J01K2L9j3j51Rk0K81k3k28p6J91j15n6O1
$$ plain form
6190 -78 46 107 -121 -26 90 134 -48 44 55 28 157 -40 -2 121 4 23 -112 1 82 -81 92 -78 -95 94
6214 94 193 -6 -79 9 -18 -63 193 -85 -56 20 -29 -77 -102 -18 -137 47 -49 -27 37 -4 -24 122 -25 -31 32 -91 32
6241 32 -6 151 -153 19 -98 -86 129 -252 -201 86 -30 6 77 -108 102 73 38 -42 119 -52 22 110 -29 25
6265 25 47 42 113 36 13 148 7 -139 151 -106 -57 -35 -29 12 8 62 -108 17 150 -31 -51 5 45 -47 53 -109
6291 -109 20 29 2 -74 7 -84 -3 -6 18 -41 -67 15 10 217 -132 -67 -16 132 21 1 -99 230 81 -32 57 97 53
6318 53 21 11 15 6 94 96 34 176 -105 77 97 160 67 73 87 -12 -51 -141 18 7 -71 59 -34 -97 -118 43 -50 47 154
6347 154 59 26 -11 22 19 21 -41 -36 27 14 -41 16 21 -37 -116 0 129 81 -49 -75 138 74 154 43 54 96 184 -56 16
6376 16 -80 73 -27 20 -36 30 -24 1 -108 -49 -34 67 89 128 115 -36 -27 -47 234 211 -17 -93 98 -17 -73 -12
6402a2J44k1j79J78o5j52J98k14J72K0j50j6J14O0k1j20J05N3m5j84J5Q5n9K7
6426f7n9Q3Q9j9P1j30Pj7J7J16r9J10k4j89J84k2J60j99L6MJ40j06p5j9N1%O1
6453A04p9O2j29k09L39o4k27J80M5j8j40J20M8k8l9m0P5pR2k8j30J31N8k95P5
6478a04J42L0pj53K65l36L5J31k8K20l40J45J31k28J76p1j11J13Rq4L3N4J4l5
6502Aj11j27K72j47J04n3Q1%l2J10q6p7J18m1j4J36j59KK0P5j67l1M1J02j85J30
6528c8K09l7j9k77K71j18J40k56l0K14j11j11K45k93K69N9Q3l87K59o5q2J8n6
6551a13J17o2rJ75k49p9K27j48k89N42l81M04J17j7J1n02N57J64J10o14K12n05
6573c32K73L96n39M5K75l54Q16m8k84m00N44p38Q00J1j93l13kj38K7L49K27L0
$$ plain form
6402 -12 132 111 -68 110 45 -107 91 -123 49 69 -81 -97 17 77 56 -64 41 94 49 -135 -120 -35 -94 -67
6426 -67 -126 -43 46 27 98 -32 -25 -42 -25 91 -8 102 78 -111 73 51 211 12 48 52 192 86 11 -8 43 43 104
6453 104 25 87 -42 -251 88 24 -203 -23 22 4 -136 -16 32 4 -35 -75 0 -7 85 57 -73 58 116 -179 -104
6478 -104 38 68 61 -92 173 -163 -128 3 -25 195 -145 0 131 -97 79 8 -103 10 19 -65 -32 22 36 1
6502 1 -110 -237 35 -112 -8 -61 20 20 -12 98 12 -65 53 12 -2 134 -25 -23 -3 72 -95 -126 -85 17 -168 -38
6528 -38 171 134 115 -162 109 -9 131 -125 -155 59 -52 -163 82 -211 58 117 200 -187 72 7 -75 -57 -113
6551 -113 4 -58 -67 108 -141 -220 7 -141 -430 112 -269 135 252 235 246 -256 301 465 575 -39 173 -332
6573 -332 -59 337 -202 -157 118 -236 580 532 248 -152 392 -346 454 465 272 -41 -43 -181 -154 195 422 452
6595D52q01O84n27l5O33m54N87p29M5m18J012k22n3k11j83k6k6P97k70Q4o5j12
6617A62n47M79m02N1K40L83n57J13O43m35K9K8O1o0p47M39j39K08M56k49O7l52
6639a29l2p9K59k77L0J42l24J1N54l78M78m80j5N20j19j74k32K83J3l1j37L60
6661B43m68J06J92ol30K47J05M6j89L4o8K37m00M73k63j39N7L04m24K29N2K4R3
6684A55j3n3k6l0O6J41j84M3j86K68j09np3Oj06Q3k2r6J32k4P0J0Q6l27O0N9J50
6711G5n0j02J2j15J92m8qJ4j3m2K3kQ5JN8Q2l8j30kn1l6N2j63J09J76j07PN5K7
6740F1P9k41J34J3k0R7p5l9m1o0K08j52J00k06J85j37j7R3RM5O3J41j72k79L40
6765A29j80P1M0j87J09QK66j33J0pk15J60j17L8M3lJ1j19O5R7j99n8K72j32M9
$$ plain form
6595 452 -349 335 -192 -227 406 -48 539 -190 -145 -563 449 227 174 -37 -220 -246 -272 525 255 339 274 162
6617 162 -385 94 -308 -257 -17 366 -191 -78 565 130 159 187 248 188 -559 -120 -259 -51 405 156 223 -129
6639 -129 -161 -240 19 -258 -228 -86 -410 -399 155 -223 255 -225 -240 280 161 -13 -245 38 51 20 -117 243
6661 243 -225 -119 73 67 -263 -16 89 135 -54 -20 -88 149 -251 222 -41 -180 -123 181 -243 -14 38 62 155
6684 155 142 89 63 33 99 240 56 99 -87 181 72 67 -6 0 -106 -23 -45 -141 -9 -33 37 47 133 -194 -134 -75 75
6711 75 25 -77 -65 -180 12 -36 -44 -30 -43 -85 -62 -64 21 22 80 162 124 -6 -8 -59 -95 -43 -206 -97 79 -28 -21 34 61
6740 61 140 -101 33 46 26 123 48 9 -32 -92 116 -36 64 -142 43 -94 -111 -18 -9 36 99 240 68 -211 129
6765 129 -51 20 60 -127 -18 -10 256 123 133 126 -89 71 -46 -8 35 32 43 -76 -11 86 -113 -171 101 -31 18
6790A8j21N7K0J64l23J07J69qj12k6N2K03j73q3J44l5j9L2o4l4j8j16K0J59oK4
6816C1j47J87p2n4m7Q0o1J81n6kpl6R3j41O5p0M6O0r7q2N9J62n8lk4p1QJ10j32
6845g8k5J06L4l7r2M7pJ99k08%N1L49l69j7K8R8j37N8l7J06j20j2J42k14K13j90
6871a12Q5K0J43k48O2j12j9J19J78r1M1q2n1J67p4J12k91N7M6K02j35P5k07J50
6895C5j66j19J70J04k7Om4K5J13j71M1q6J96n4J2L1o9m7J88j73Jj27J45Q7r6K15
6921A90m22J87M8q7K3m4J43j11jJ96j85J88j6o9pM7JrJ8lj36J08J34p3j3j31o5
6948h9J92j83j05J84o3J43k69J73J7l7Q5k1K31m01O9J05r7K65k85K16j46m9j5
6971h0J46p8M3j49J16M6O1j04j14LK16q8j4p5P3J44k39O5j2P3m2P4l7O7k56J99
$$ plain form
6790 18 -103 -46 -26 138 -185 -78 91 83 -29 -55 -3 200 27 -56 88 53 34 66 2 -32 -50 -166 -146 13 7 31
6816 31 -116 71 -1 -55 -102 -22 -83 98 42 40 33 -3 90 -51 14 -56 -10 50 -47 -129 -70 92 34 31 7 -64 -56 54 -78
6845 -78 -103 3 37 0 -92 -45 -52 147 -61 -61 -10 339 -30 -47 -19 79 -58 0 -37 69 -51 -63 79 -135 78 -112
6871 -112 -27 -7 136 -112 -50 -162 -181 -62 116 25 66 -16 -67 100 26 138 -153 -96 -50 152 17 92 -115 35
6895 35 -131 -250 -80 24 -3 3 -41 -16 97 -74 -33 -119 77 23 35 66 -3 -50 138 -35 -34 -161 -16 71 -25 190
6921 190 -232 -45 3 -84 -61 -105 38 -73 -74 122 -63 125 109 40 33 80 81 72 90 87 -49 59 193 120 107 -24 -89
6948 -89 103 -80 -185 -1 -64 79 -190 -17 0 -37 48 27 258 -143 -74 31 -66 199 -86 130 -16 -65 -80
6971 -80 66 -12 31 -118 -2 44 105 1 -113 -110 106 18 4 -71 2 146 -93 -28 -40 33 -9 65 28 95 -161 38
6997C8l2R1k43K52rj31%J8j0J7O7j0Lj07K36r5j70J37j19N6J7j6R2O0j82k3Q8
7024B5n0L5q1J09L0k4J8j65J47r4J14o3j1J8K8k04K60k39K43j01j06J49r8J61
7048A01q2n1Lk2r6K62j8k40K95l01rJ32j34K87lk88J34L0k3m1Q8R3j10Rk00K07
7074B3R4o9J1j18Q5p1j64J20m7J94r1p9J92m5q8N9lj07K43j42j44J75j75K42M8
7099A43k06N6j8j6R9m3J23k35Q0P5m0o8k2m1R0p9K72q0j12Nm8K0PQ3j7P7j51J36
7127I0L0lj38P2j15J44j01j13K12q2l3J19Njj22J39k08J32k9N8m1M7k06K88j70
7152b6Q4J13j63P9j23J61j16j0N8p1j6J78j52K2J50k02J40j79l7J77j90O4l7J36
7176D0K5L1r5n7J23M3J08l13n2L22k84J93k09J83J4m2j21R3P0P5j68o3J9P1Q4
$$ plain form
6997 38 6 97 -146 106 97 -34 -34 -16 -26 -9 58 48 51 -56 180 85 -85 52 -67 -11 6 -10 82 142 -40 -63 25
7024 25 -25 10 -71 38 68 44 62 -103 44 -50 64 1 -10 8 36 -168 92 -147 96 -5 -111 38 -60 101
7048 101 19 -32 -29 -51 -147 115 97 -143 152 -149 -158 -26 -160 127 124 -164 -30 0 -23 -64 24 117 7 16 -184 23
7074 23 117 48 59 -59 26 -45 -209 -89 -136 58 -33 -112 80 35 -53 6 3 -104 139 -3 -147 28 -147 95 143
7099 143 -63 -7 -25 -41 58 15 138 -97 -17 58 18 -50 -72 -113 -23 -102 170 90 -22 -17 -65 -45 -38 45 28 105 -46 90
7127 90 120 117 -21 51 -64 80 -21 -134 78 -4 -37 82 87 86 -36 103 -105 27 -2 56 15 62 -144 144 -26
7152 -26 58 171 8 87 -36 125 9 -1 57 -14 -30 148 -4 18 168 -34 106 -73 -110 67 -123 -59 -96 40
7176 40 65 96 1 -56 67 110 218 -95 -147 175 -109 84 -125 58 72 30 -91 2 72 147 -21 -84 -65 6 90
7201I0k9mL4o3j21K15r6j7Q7j75Q1N6M3j57o9L9K20j83J20j57n1J95j04R5J38
7226A87m0k42J13m2Q0L4j06J2O3J0k0Lp6J36N6j3j94r1N7k6Q4m7MN3o5N4l8N4
7254@k03L07J6k05K2J04L9j14o1L8R7M5n2l7o1P2j56K23r0L8M3J9j5r8K8o2J24
7281F1j29j8J1J87j48J09l2M5j34o0J05j3M0j20J67j00n7P2NJ47k76K36j22l5
7305e9Q0j10O7L7r1j02J68MP9J31k08J10K2j78K5J51j20R3J8p1j6L6Qj24q3J26
7331gK8j70J99q9P0r6L3J11n5N3j38J9R4j30l5r7J58O1j33J73J05p2k2j47N4j27
7357a60K14J0j5j19n1P5j71J32J86j56K3p4J35L9l9n0J82k2k50J45l6J4j45J96
7381F3p7m6J58J07j14o3j0J04j45N8K1j8j18N5n1K9l6M3P6k02J76Q1p6nK8O8j18
$$ plain form
7201 90 61 57 91 28 -93 122 26 9 96 -79 2 58 101 -56 -125 -86 134 -49 71 -86 -137 58 -46 49 187
7226 187 147 -95 18 -24 56 90 -16 -4 59 69 49 52 -24 112 168 155 -39 -130 -73 -99 -15 -62 -58 -5 -70 -16 -54 0
7254 0 -203 104 120 -85 -63 41 80 -34 -95 -57 40 85 33 -4 -65 7 -149 74 -16 22 65 84 69 -29 -1 -63 61
7281 61 -68 -86 -75 112 -36 73 41 86 -48 -108 -3 -16 24 -96 71 -29 -86 -14 -9 138 -138 98 -24 -59
7305 -59 21 -89 -22 15 -76 -178 -10 -6 73 204 -4 106 128 -50 -25 126 6 99 117 46 30 66 74 -50 -133 -7
7331 -7 21 -149 50 -39 31 -65 -32 79 24 77 -61 -42 52 -78 -113 -210 -52 9 -124 49 154 82 60 -87 -33 -160
7357 -160 54 64 49 -70 -121 -46 -217 -85 101 -55 -32 -106 29 68 29 -21 161 139 -111 34 -2 12 -133 63
7381 63 -14 -60 98 205 91 28 18 122 -23 35 56 38 -80 -25 -76 -47 -83 -40 36 -166 10 91 15 10 38 106 -12
7408a2M3n3j40J98Q2j33K9m2k6PP0o8J26j26Q6J1j64J49q0ML0K48l45J44J10r6
7434E2pj05J16P8j01J0k2r7jO1o5j3L3J40j60J62p1k9Knq6J79o3o2J21m8r2K9
7462d4QN5j5l4j70L47j96J23j73Q7r2K0J45j29M0j7J67j63L2M9l7q3O9p3l0L43
7488B29j12o0o5J13j86l7P3K0j44J67p7J3P9j02r6R6j4j3O8J09RJ8k35J90j43
7513a00N3Q3m1j17L04p1o9j65J62J14j41p1J52j79O5j8j6M1k7J8j25J65n9P6l2
7538BQ1j53R2J0n7r5O0N2J8k2Q4m0Lk25L42k42J68o7R4K1l1k22K32q9j1J8o0Q7
7566E0L5Q7r6N7n4j14j18P5Q1Q0q1J8j3Jr1J45k1M3P2k49J81Q4j33P5j03j29K7
7593i1N9q7L3J73K0j64o0J45j49K09k12K36k77K49o0N7J46k97J02J24q2k38J66
$$ plain form
7408 -12 31 -22 -162 36 118 -15 14 -28 -54 -47 23 -45 81 -45 41 52 -112 37 -43 -39 -9 239 -106 38 148 52
7434 52 45 -60 56 134 33 43 21 -76 -77 -16 -81 -94 -61 79 -81 81 10 -19 -17 -22 -108 71 8 -54 67 19 -73 -44
7462 -44 -36 19 4 -30 -200 147 -49 74 -99 -12 -104 -84 61 -68 -28 -45 122 -41 -9 40 3 -80 -11 -84 -114 229
7488 229 117 57 -8 105 -81 -118 -45 -25 -169 -2 -79 -66 13 -89 -185 -89 -103 -116 -48 61 70 88 -147 43 -100
7513 -100 -47 36 -5 -122 182 111 42 -123 39 153 12 -59 93 -86 -21 -39 -55 -14 -41 -23 -148 17 -42 34 2
7538 2 83 -70 22 32 -25 -120 -60 -8 10 -12 72 32 35 -190 152 -90 78 11 105 126 95 -127 105 16 5 23 -37 50
7566 50 85 172 76 133 79 -35 -153 -78 3 83 2 20 7 8 -83 62 41 84 156 -93 88 172 39 114 11 -118 -91
7593 -91 -32 -119 -86 87 107 -57 -117 28 -121 88 -124 112 -165 84 24 81 227 -70 32 156 74 -164 2
7616Bp7O8j14K21r5qq5q9K06O2j48J72m9j3j29J99k00p2K65k59N5J16kp0J99j00
7642E5r2Q8j89K9p5K25j66J29P9q5J43j44J53j94J68R1j74j1k48J50j26J43%K2
7666b9J19k0q7Np5N0o0K18r0O0r9l1K6J62j83l6j05N3K51L0Q3l11K08k89L26j96
7692b0L5k12J02LJ21j39J23N6k57J47J00j50J17M1J12k02m0Q7n5P4k69K48K3k17
7716a72J87M3Q4k99K19J09k65J55q6O4j49k6J87o2K4J16o6o8j33K05L4j38J28
7739I1j17R7j5r5k70K54J29j19j16L0J04R9l3j4j77J95p3j3Q7rj95M2k5RL79l71
7765a26K20n5Or2pL8M9o9rJ59N9k72J34qj05J39j7j60N4K37r9M3k32J38kj41O5
7792e3m3O0k8O0L8m3R0k00P2J5Q6%J03q0j63Q8J22j67J22j83J19q6n7J85J12k41
$$ plain form
7616 2 -75 -7 -121 100 5 -3 -88 -177 29 91 -57 115 66 53 -76 123 -77 -149 116 -143 -88 28 26 -44 155 55
7642 55 -37 51 -138 -109 -184 41 -125 4 83 -2 141 -3 150 -44 124 215 41 30 -218 -68 -194 -51 -51 -29
7666 -29 90 70 -17 -12 -87 -37 -97 121 31 91 -8 -39 -13 149 -34 -70 -175 -122 129 159 242 -69 139 -150 176 -20
7692 -20 15 -197 -95 -92 29 -110 13 69 -188 -41 59 -91 26 67 179 -23 -63 24 -31 43 -226 22 45 -172
7716 -172 15 58 142 -157 62 171 -94 61 -25 39 -110 -136 51 -11 13 129 63 -5 -138 67 101 -37 91
7739 91 -26 71 56 -39 -309 -55 74 -45 -161 -131 -27 72 39 25 -152 43 -30 -43 44 35 -160 -118 -143 -134 245 -126
7765 -126 94 39 45 -47 -54 -16 33 -36 -45 114 173 -99 35 27 -78 61 44 -116 -62 175 76 119 -113 25 23 -118 -53
7792 -53 -96 -36 -64 -4 34 -9 81 -119 -47 -32 54 54 157 77 -86 2 124 -43 79 -104 15 -71 -128 57 169 -72
7818g2J60r3pP8J9mP3k06Q0q2O8J4l0qj0j09J93R1j48R0j90J62l4Nk0j41p1K38
7846D6j42J7M4j7q1P1k5K0J43n4P8m3j58L7J88j01p0m0J31j73K%J25lP8k1J3j87
7874a22J01oK13k05j9J76Q8k84l2K68j81p9R8Q5k00J53j41J03J9kP0o6j3j31J55
7899D8J13j62J7oj03J79j25Kp9N2J35q6j00j3K69j41m1J6P6K0J2j61K42j85j7
7924c8J00j83J92p5Np7J73K4k08K26l4j64J02j02j13L54k75MR2k6pp8R1M8L3P0
7950A34l3j36n0J01orK5q6P7l8k9j29K04j13j0K01n3o4j23N5J69j93O1r7K01j52
7976i3J13J14k7j00L5L6j57j32J95J6L7j04J53k11J62j64J48N0q1%K00k55N1P
8000gn9R0OM2o3j26P4J21R2k05L6K1P4K9j16j17J17O6j41J56j44L9J47k60P6j48
$$ plain form
7818 -72 88 -5 -12 66 85 81 154 -52 28 -54 14 28 -2 -10 -20 -129 64 155 7 97 -93 69 35 40 20 -121 -192 46
7846 46 -96 -79 -35 -52 -133 -62 -87 -67 76 22 100 57 -101 -64 124 23 -47 -87 44 -129 -127 -127 -2 -5 73 52 65 -122
7874 -122 -21 -27 186 -19 -38 138 226 -58 -90 178 -3 -82 16 101 -99 54 -87 16 35 33 103 37 24 -107 48
7899 48 161 -1 16 10 -93 86 -39 -37 -116 -64 71 -15 -115 -128 141 0 -41 -25 51 71 83 -78 164 -21 -38
7924 -38 62 -121 71 -4 1 -76 97 121 -87 139 105 -59 43 -59 -172 182 -93 -89 3 -23 -30 -108 -17 31 64 134
7950 134 101 -35 -85 16 10 1 26 -60 17 -21 -50 -179 25 -88 -98 103 50 -14 -137 -82 87 -106 -45 -142 59 -93
7976 -93 20 134 107 7 42 78 -79 -211 -16 0 37 -67 86 -125 37 -127 21 71 -10 -10 190 -65 -14 -7
8000 -7 -66 24 30 72 9 -117 -43 78 170 -35 1 22 96 125 9 -108 9 75 -66 90 -54 -15 132 -128 -52 -200
8026b00K11N7L7lR9k31O6m4R4J6p4j80R2J07j16J13m0J7j74j7J27J18j72J83o5
8051B1p5j06K8M5m9J69n6M4Po8J0j9J7J84k28O4M7k1J6l7J8p2K78j72j1o0P6p5
8079b5n6J4J73r4k2j27K9P5J12j4n8k10J78J60o4O2o0j54J43K5r1P7j31Q9M7j19
8105d1J22j37J10j52J02l9R0l3j46J33k8Q3l3n7n6j32J42J87j48R2rp8j22rJ49
8130a0nm2K03k07M4N3l0K5K6r9K6N3m8oJ37j18O8J5o1P1j16K19k31J28k22R5J32
8157A00p7P9p3N6j73Q7oq7K65n0j43J34j50P5Q2j28KJ01j74J79k29J60n0J65k11
8182f6K24j21p1J32k37K15OJ14l26
$$ plain form
8026 -200 11 68 105 102 201 -30 36 -8 86 102 28 -152 -60 47 -69 44 4 21 -153 -170 -43 75 -97 86 21
8051 21 -54 -160 -132 -87 -136 33 -23 21 28 -40 -30 -49 -32 152 -76 -12 35 14 30 -7 11 -61 217 45 34 -26 50 -25
8079 -25 -81 -67 106 12 -10 -137 -108 -33 79 65 7 -203 -25 135 71 133 73 -81 62 87 -4 73 -58 31 78 -41
8105 -41 81 -56 54 -98 4 -35 55 22 -124 9 -19 64 31 -26 -82 -214 -72 115 -33 59 50 -28 -150 -159 -10
8130 -10 -15 -57 146 -61 -17 36 6 31 57 -42 -16 37 -11 -17 120 2 70 85 24 95 -21 198 -33 95 -127 -32 100
8157 100 23 102 29 85 -88 -1 -7 -94 171 121 -22 112 -38 37 119 -9 -7 94 -80 99 -130 30 -20 145 -66
8182 -66 158 37 -34 98 -139 76 82 196 -130
8191a30
$$ Imaginary data points
##PAGE= N=2
##DATA TABLE= (X++(I..I)), XYDATA
0@%%%%%%qQqJ6j6K4l9M7n6P2q8J04j28J52j84K25k65L12l68M27m94N74o62P66
30D11q78R99j138J292j458J644j849K070k316K584k877L201l552L936m358M815
46B526n315N863o459P117p844Q638r519J0504j1599J2835j4238J5840j7699J9882
60A0532k2483K5655k9623L4747m1662N1544o6925R4376j58177N76692L14747r83246
72a93823j42073p5485M6427N22720M89191n66705o65055k3787K58351L01667N74689
83E26117J15519o18017n07415J66042L38120L10495K35108k09328o77936l29611
93f50906L37972M70630J99860M997l07349n17043q6650N42287M52485j3432k14636
104B18215l52596l93441J41080O22386K69765k49749k84904k88856j99243L61203
$$ plain form
0 0 0 0 0 0 0 0 -8 0 -8 8 -8 16 -23 24 -32 40 -48 56 -72 80 -104 121 -144 168 -200 227 -267 307 -355 411
30 411 -467 532 -606 686 -772 872 -977 1093 -1223 1361 -1516 1685 -1867 2069 -2289 2526
46 2526 -2789 3074 -3385 3732 -4112 4526 -4993 5511 -6088 6747 -7491 8349 -9350 10532
60 10532 -11951 13704 -15919 18828 -22834 28710 -38215 56161 -102016 474676 789423 -193823
72 -193823 -335896 -411381 -364954 157766 646957 80252 -584803 -608590 -350239 -48572 526117
83 526117 641636 23619 -483796 -317754 20366 330861 565969 356641 -321295 -650906
93 -650906 -312934 157696 357556 362553 55204 -461839 -548489 -6202 446283 432851 218215
104 218215 -134381 -527822 -386742 235644 505409 255660 -29244 -318100 -517343 -156140
114a56140O07944K4123m20059k83158j68458J2121M70604M41305k00789m67232
124a39739j97700Q030K19536M64433J99558l75855m43385q1372J52221K82986
134H8713L15684m1927m74332l55097J04146L07957K66015J47173j71004m44320
144b56992j96326K88381L72396J46587m6893k77922l85499k2016M02220L01073
154C25009k5032j76614k98175k58409J78590M66493J71112j81723k34463k36940
164b70152r0217L13941M08964q968l08486k49536j31743Q1431L68590K70448j69759
175B14513l43902j67536K5037K18396L46144J08475k96508l31893m8516J54313
185a21477K36506K14793o3377l69721k64041R8236K58731K08466Q5762j66837
$$ plain form
114 -156140 451804 475927 55868 -227290 -395748 -383627 86977 528282 327493 -139739
124 -139739 -337439 -329409 -109873 354560 554118 178263 -265122 -346494 -194273 88713
134 88713 404397 362470 -111862 -466959 -362813 -54856 211159 358332 187328 -256992
144 -256992 -453318 -164937 207459 354046 307153 29231 -356268 -378284 23936 325009
154 325009 299977 123363 -174812 -433221 -254631 211862 382974 201251 -33212 -270152
164 -270152 -360369 -46428 362536 353568 45082 -204454 -336197 -254766 113824 384272 214513
175 214513 -129389 -296925 -271888 -53492 292652 401127 104619 -227274 -275790 -121477
185 -121477 115029 329822 266445 -103276 -367317 -269081 -10350 198116 283878 117041
195A17041l41080j14743K42744K81163J07890n7175k54528k95301K5470L18797
205C0278K11296k8256j53870k46576j63864J84159L59971J22412j42540k06185
215c3175j88603k6508K61292K83495k9579k48069k12534r1970J05221K97221J86761
226C03552j46757k71105j25173M4041J88746K54877N4515k52071k66010k7255
236b42640J44593J98003J55724p0001k87775j82157J00923K15652J67909M8584
246B48815j65871k77218p0076J97793K10186P4259o3069k16216k12634N4928K66465
257D7362J63861k6906j35462k01199j03792J59216K67266P5581j30363j84297
267f8733j46883R601K24607K14476l4418j97414j60462n1540J07150K37676J27310
$$ plain form
195 117041 -224039 -338782 -96038 185125 293015 235840 -18688 -313989 -288519 30278
205 30278 241574 213318 59448 -187128 -350992 -166833 193138 315550 173010 -33175
215 -33175 -221778 -248286 13006 296501 266922 18853 -193681 -285651 -180430 116791 303552
226 303552 156795 -114310 -239483 -195442 -6696 248181 302696 50625 -215385 -242640
236 -242640 -98047 99956 255680 185679 -102096 -284253 -183330 32322 200231 248815
246 248815 82944 -194274 -264350 -66557 143629 217888 154819 -61397 -274031 -219103 47362
257 47362 211223 184317 48855 -152344 -256136 -96920 170346 245927 115564 -68733
267 -68733 -215616 -206015 18592 233068 198650 1236 -159226 -210766 -103616 134060 261370
278B61370j40080k26156r5987M8253J58726J90933J9204k10023j99768l102J32439
289f4191J70374J14221q0681k34570j26276R3147J72601J28087J8585j54855k17472
300a81030l3647J70923J69288N1953o8377j78781j51279O5363K14736J27855l3319
311A53685j29931j62110o2698J43233K06526M5788j15248j52205j10183K6135
321a57008J89192J61921m4055j65708j24566k7444J00436J90079Q6356j23694
331H5509j80856o9902N1817J38383J46153n353j76395j51716P399J13971J39628
342I8638Q0249q2548j90633q8579Q7159J44079R8550P16j34545j67808j2343J46071
354b0994J35856L2852p0414j49899j08826O8191J73949R4094l6930j12717j29309
$$ plain form
278 261370 121290 -104866 -200853 -152600 6126 197059 216263 6240 -193528 -196630 -64191
289 -64191 106183 220404 139723 -94847 -221123 -127976 44625 172712 191297 36442 -181030
300 -181030 -214677 -43754 125534 177487 109110 -69671 -220950 -155587 59149 187004 153685
311 153685 23754 -138356 -201054 -57821 148705 194493 79245 -72960 -183143 -157008
321 -157008 32184 194105 150050 -15658 -140224 -167668 -67232 122847 209203 85509
331 85509 -95347 -165249 -113432 24951 171104 165751 -10644 -162360 -154961 -40990 98638
342 98638 178887 96339 -94294 -182873 -95714 48365 146915 147631 13086 -154722 -167065 -20994
354 -20994 114862 147714 77300 -72599 -181425 -113234 60715 154809 117879 5162 -124147
365a24147l4463J29848J62590K2797j02949j24697q1180L5331J56870J18636m9672
376A08964j38881r7261r081R6508J53032N4743j09077j42602m7905N2317J18977
387C9734J09255k3080j51404j16057J7402J00125J12744N3814p9027j53269n8843
398a48606Q3011J20754P3180j4523j19544j29846L923J24121J06275J8800o6634
409E0911j23991p4495P2024J42720O6385m0161r9221j04173j7012J12686J24858
420A10531O786r0371j00710n4329M6636J34162Q8598m8156j14576p7321q60Q3820
432a5790J16064K5054j02263j16756l2494N2359J03752Q6832k5026j20641q1558
443a10467K8952R0726R0334L1160p8729j28308m3349O9645R4599N2216k2949j02953
$$ plain form
365 -124147 -158610 -28762 133828 156625 53676 -71021 -152201 -116870 40000 158636 108964
376 108964 -29917 -127178 -136259 -39751 113281 168024 58947 -83655 -131560 -79243 39734
387 39734 148989 125909 -25495 -141552 -124150 -24025 88719 142533 63506 -89763 -148606
398 -148606 -65595 55159 128339 113816 -5728 -135574 -131651 -7530 98745 117545 50911
409 50911 -73080 -147575 -75551 67169 133554 93393 -5828 -110001 -127013 -14327 110531
420 110531 117317 26946 -73764 -128093 -81457 52705 141303 93147 -21429 -98750 -99610 -15790
432 -15790 100274 125328 23065 -93691 -126185 -73826 29926 116758 91732 -28909 -110467
443 -110467 -81515 9211 99545 130705 51976 -76332 -119681 -50036 44563 96779 73830 -29123
455b9123r6012K0416J09380Q5700J1208o0824j02812n2779O6055J12092M2801
466A06102m3207q6927q0757p19J00163R9639J275p5062q0363l5943M8250J08678
478F1129N9948n1187r8111o1707N444P4566R2354J1679q7237q9793j6454N2171
490d7198Q7145O3356l1829j03105o2913K8215P6095P0789J6419p1850j00245k2584
502i7705O5420P9684M0036k5717q8722p2870K5561R0262O3810M85n7577q4373
514f1706l3721O2817R0778K9562m0691p4210o1072R550Q4153P3239q864o6531
526C304o5494k2770M8882R0343M2387m6992p8027m2762J4095O7172P1617J14p6969
539D900p2266q761M6205O9486M2391l6984q6380m5443K9705O4903N6345O783o2776
$$ plain form
455 -29123 -125135 -104719 4661 90361 101569 40745 -62067 -114846 -48791 63301 106102
466 106102 62895 -24032 -104789 -105508 -5345 94294 95569 20507 -59856 -95799 -47549 61129
478 61129 121077 69890 -28221 -89928 -84484 -9918 82436 94115 6878 -82915 -99369 -47198
490 -47198 39947 103303 71474 -31631 -94544 -66329 9766 80555 96974 25124 -75121 -97705
502 -97705 -32285 47399 87435 61718 -27004 -99874 -74313 15949 79759 80244 22667 -61706
514 -61706 -95427 -32610 58168 87730 47039 -27171 -88243 -78693 5460 78699 69835 3304
526 3304 -62190 -84960 -36078 54265 96652 49660 -28367 -71129 -57034 10138 81755 81869 4900
539 4900 -67366 -76127 -29922 39564 81955 44971 -41409 -86852 -57147 7756 64101 70884 8108
552H108p7170p261O0421O6076K9383k7254p5035n3978K6557P3169M5965q133n5165
565E683o9987j9863N6841P3380K1606l4636n9486m3892J8915P4122N5931j4579
577F4035n9397n6969j7611M1336O9874K5712m4299o4745l0480K0529O2267O0503
589G0755k176o2263n4205k156M1143N6798K7590l9669p4506l5449K6017N3424
601E303M4653J313n5004n9489Q33N3274N4444K1347k7832o3809l9928K6509N9826
614B1440L5895r575m7953n5060q941N0929N8789J3667l3065n1810l4065J9304
626d0445O0879M1215j5918n0922m3474p369M0245N8439J7443l9635n2849k2957
638e5348J9092N0320M3342j0649n5652m2493K907L7842M8669K0932l4106n6867
$$ plain form
552 8108 -69062 -76323 -15902 50174 79557 52303 -22732 -76710 -50153 23016 68981 60848 5683
565 5683 -64304 -84167 -27326 46054 67660 33024 -26462 -70354 -51439 22683 78614 64035
577 64035 4638 -52331 -69942 -28606 41268 66980 22681 -42064 -72544 -52015 10252 70755
589 70755 68579 6316 -47889 -50045 -8902 47896 75486 35817 -38689 -74138 -48121 5303
601 5303 49956 51269 -3735 -63224 -62391 -9117 45327 66674 38842 -24967 -64895 -38386 21440
614 21440 57335 47760 -193 -55253 -64194 -13265 45524 59191 26126 -25684 -59749 -40445
626 -40445 20434 61649 45731 -5191 -48665 -56034 -15789 42650 60093 20458 -32391 -55348
638 -55348 -36256 14064 57406 46757 -8895 -51388 -48481 -10639 38030 58962 24856 -32011
650c2011k1190K7096M5244L3805o220n0554m7787K836M2903M0575J2442k8206
662A8933n1887k5647K8076N1095K8331r570m1411m2263j504M3919M5206N248l1973
675A6553m3065k4443J9913M9825L0446j7169m1812l3082o93L6894M6081R806l5787
688A3467m1784j5478J8320M1989L1872j3939m6053l1279M857L2237L8958J2246
700D5413l2344m4217j3026K3884L8940K5385q664m2876l4914O942L6586L1712
712C2821O973k6953m1742j8147K5573M1068K1045j2584l5055l1373J714L7912
724A252L5313J411k7719l5031j7437K0884M1187K1588j6878l5209k5657K515L2692
737a089L6540L893l1996l3217r864J6462L5954K3867j5027l8278k3916O898K8861
$$ plain form
650 -32011 -53201 -26105 19139 52944 46724 -3830 -51617 -48781 -5878 34697 47139 18933
662 18933 -32954 -58601 -30525 20570 48901 39331 -2080 -44343 -45847 -1928 43278 48526 16553
675 16553 -26512 -50955 -31042 18783 49229 32060 -9752 -42834 -43527 -6633 39448 49254 13467
688 13467 -28317 -43795 -25475 16514 48386 34447 -11606 -42885 -38028 -5791 33167 45413
700 45413 13069 -31148 -44174 -20290 18650 44035 35371 -7505 -42419 -35477 1109 32821
712 32821 39794 12841 -28901 -47048 -21475 19593 40638 28054 -7001 -38374 -36660 1252
724 1252 36565 37976 10257 -24774 -42211 -21327 19860 41448 24570 -10639 -36296 -33781 -1089
737 -1089 35451 39344 7348 -25869 -35733 -19271 16683 40550 25523 -12755 -36671 -29773 -912
750i12L1693O745k9011l6411q562K1884L2388J9533j1416l6177k7062Q254L1667
763B613K7156L008k4371l4602j1684K3657L4605J4498j2940l0759k5632N193L2992
776C734K7915j226k5086k9051j1429J9601L5284J5577j6592k9885j9735M421K8492
789B020K9596n18k7796k7239o899J7164L0388J7226j5367l1769j8112P981K5371
802B046K5513K628k5860k8946m825J9836K6779J4032j2217l0479k0420R448K7053
815D588K0990M91k1709k7741o992K1598K7886R935j2854k6079j9536O847K8065
828E489K1395l282k1591k3340o979J8308K8682J0596j5475k4848j5134N583K4432
841C836K2402k795k3483k1725l737J6243K5230J2144j4364k5761j3101Q262K1638
$$ plain form
750 -912 30781 37526 8515 -27896 -36458 -14574 17814 37347 25931 -10246 -37308 -29054 2613
763 2613 29769 32777 8406 -26196 -37880 -14223 20382 34880 21940 -8819 -34451 -29258 3734
776 3734 31649 30423 5337 -23714 -35143 -15542 19742 35319 18727 -11158 -30893 -26472 2020
789 2020 31616 31098 3302 -23937 -30836 -13672 16716 33942 18575 -13194 -31306 -23325 2046
802 2046 27559 30187 4327 -24619 -29444 -9608 17171 31203 18986 -11493 -31913 -22465 4588
815 4588 25578 26069 4360 -23381 -30373 -8775 19111 29046 16192 -9887 -29423 -22576 5489
828 5489 26884 23602 2011 -21329 -28308 -10000 18682 29278 13803 -11045 -26179 -20596 3836
841 3836 26238 23443 -40 -21765 -25502 -9259 15971 28115 13751 -12010 -25111 -16849 4789
854D789J9380l92k2701k3007k265J7514K1739R791j1637k5055j4594R669K2937
867F168J6266j437j9440k2121l597J9128K2097O483j2172k1718j4422Q131K3260
880F626J5891m463j8415j8311l679J6518K2684O677j3840k0188j0812O405K0782
893E875J5688l855j9722j6982j379J4210J9858Q104j2908k0693r175Q544J8057
906E622J5393k230j9149j7831p2J4973J7461N568j0898k0517j0032R608J8078
919E974J2292k692j6430j6818o89J6704J6959L433j0913j8003j0435Q262J9168
932F812J1813n049j5278j4466j210J4653J8203L659j3119j6108p686O734J7216
945F174J2586n093j7014j2734O17J2853J5855M799j1922j7166o727P463J5492
$$ plain form
854 4789 24169 23777 1076 -21931 -24196 -6682 15057 24848 13211 -11844 -26438 -16769 6168
867 6168 22434 20997 1557 -20564 -24161 -5033 17064 23547 11375 -10343 -24765 -16634 6626
880 6626 22517 18054 -361 -18672 -22351 -5833 16851 23528 9688 -10500 -21312 -14907 5875
893 5875 21563 17708 -2014 -18996 -20375 -6165 13693 21797 8889 -11804 -20979 -12435 5622
906 5622 21015 18785 -364 -18195 -18267 -3294 14167 19735 8837 -11680 -21712 -12104 5974
919 5974 18266 15574 -856 -17674 -18363 -1659 15300 18733 7820 -10183 -20618 -12356 6812
932 6812 18625 13576 -1702 -16168 -17378 -2725 15478 19137 6018 -10090 -17776 -11042 6174
945 6174 18760 13667 -3347 -16081 -15464 -2611 13244 18043 6121 -11045 -17772 -10309 5183
958E183J1437l608j5967j3415J932J3039J4590M071r780j6618p175Q944J3821
971F454R550m353j3966j4351J159J3678J3948J938r274j4042p503P972J6306Q787
985A6303m731j3261j1548q72J3022J3697J790j0983j2917o017O806J4965R593
998A5847n229j3505r678J322J0709J2364L273j0645j4090m612O916J2926P935
1011A3533l404j3943j0352K690J1304J0903K382r173j2893n157Q525J2326O742
1024A3483l922j1927j0355J179J2108J0450R22q585j1952n510P998J2586O535
1037A3010m801j1310q920J139J1121J0622P49r494j0394m362O219J2387O810m916
1051G860j1457p533J901R986R985J087q990j1211l117O303J0504O390m223j1452
$$ plain form
958 5183 16620 13012 -2955 -16370 -14438 -1399 13191 17262 7482 -9136 -16311 -7367 6454
971 6454 16004 11651 -2315 -16666 -15507 -1829 12119 14057 4783 -9259 -16762 -8790 7516 16303
985 16303 11572 -1689 -13237 -14109 -1087 12610 14400 3417 -9500 -15517 -8711 6254 15847
998 15847 10618 -2887 -12565 -11243 -534 11830 15103 4458 -9632 -14244 -7328 5598 13533
1011 13533 10129 -3814 -14166 -11476 -172 10731 13113 3940 -8953 -14110 -5585 6741 13483
1024 13483 9561 -2366 -12721 -11542 566 11016 11938 3353 -8599 -14109 -6111 6475 13010
1037 13010 8209 -3101 -12021 -10882 239 10861 11610 2116 -8278 -12640 -6421 5966 12776 7860
1051 7860 -3597 -11130 -9229 757 10742 11829 2839 -8372 -11489 -5186 5318 11708 7485 -3967
1065c967p618K184R833Q593J510q227j0752l000P289J0219N034l791j0243q227
1079a1163K506R994Q384P3p519r461m298P128J0365M680m600r565o881J755R589
1094I87Q518l22p702q656k589N786J0093M580m961r498o050J983Q494P941M29
1109I033q235q567j600O053R123M532m070r619n922K697Q200O635J42p322r050
1124g970j818O552Q180L847l782q525n822K664Q595O596o16o613p807k194N868
1139b845Q654K910m375p929n179K045Q177O594n42p172o896j368N178Q111L376
1154H739m381p965m401K095P314O225m47p031o808r75N245P198L451l913p869
1169c523m674K993O751N527l29o265o937j119N562O929K618l754o909m695K627
$$ plain form
1065 -3967 -11585 -9401 432 9025 10535 2308 -8444 -11444 -4155 6064 11098 7307 -2936 -11163
1079 -11163 -8657 1337 9721 9794 2275 -7186 -11484 -4356 6009 10689 6089 -3476 -10357 -8602 987
1094 987 9505 9183 1481 -7175 -9764 -3978 6115 10695 5734 -3764 -9814 -7831 663 8604 9033
1109 9033 798 -7769 -9369 -3316 5807 10339 6269 -3350 -9272 -6575 1625 8260 8402 1080 -7970
1124 -7970 -9788 -3236 4944 8791 5009 -3516 -9338 -6674 1921 8517 7901 1288 -6519 -8713 -2845
1139 -2845 5809 8719 4344 -3585 -8764 -6719 1458 8052 7510 338 -6558 -7926 -2748 5363 8739
1154 8739 4358 -3607 -8008 -5913 1401 7626 7179 148 -6660 -7635 -2390 4808 8259 4346 -3523
1169 -3523 -8197 -5204 1547 7074 6745 480 -6457 -7576 -2014 4915 7533 3779 -3130 -7825 -5198
1184e198P013N088p35n858o353j259N450O828K175l782o632l771K046O847N135
1199F994j163n885n717p52M710O489K196l958o422l316K247O085N040p76o127
1214c55n401m63M861N840K493l869o457k996K265N883M065l61n411n788j92M571
1230a315N617J753l233n771l723K625N930L901r11m867n051n85M481N888J282
1245F021l604n446k861J895N755L854j442m665m489m83M336N387J556l647n237
1260c070k514K250N050L768r33n328m064l9L925M781J509l202n404k335K396M933
1276A723L269p59m599m287J32M225M579P83k880m975k485K287M640L137j099m355
1292f64l931j53M218M422R88l044m389k152J829M776L094j467m309l435M8L476
$$ plain form
1184 -5198 1815 6903 6168 310 -6043 -7302 -1852 4976 7151 3369 -3263 -7034 -4988 1859 6994
1199 6994 5831 -54 -5771 -6523 -1813 4676 6872 2914 -3508 -6824 -4577 1508 6548 5772 -355
1214 -355 -5756 -6219 -1358 4482 6975 3106 -3351 -6347 -4082 1801 5866 5505 94 -5694 -5886 -1315
1230 -1315 4302 6055 2822 -2949 -6672 -4047 1883 5784 4873 6 -5045 -5630 -1149 4739 6021
1245 6021 2417 -3029 -5890 -3995 1760 5614 4172 -493 -4982 -5465 -1129 4258 5814 2167 -3070
1260 -3070 -5584 -3334 1716 5484 4551 -777 -4841 -4880 -955 3826 5335 2133 -3271 -5606 -3210 1723
1276 1723 4992 4233 -366 -4653 -4521 -296 4283 5066 2186 -2789 -5274 -2987 1653 4790 3691 -664
1292 -664 -4595 -4748 -530 3892 4880 1836 -2553 -4705 -2876 1900 4994 3527 -782 -4217 -4169 -693
1308f93M233R29l026m476j599J962M305L059j155m189l485M81L173M090Q35l033
1324A411m280j546K189L852K549j013m023l299L98L524L358P94k435l972j645
1339d138K013L988K357j214l836k881O9L492L412O39k653l666j596J997L826K238
1355D047j302l645k680O9L142L458O30k750l496j366J929L470K538j164l615k650
1371c385K98K911L058P24k574l359j444J869L332J972q82l307k756M47L011K877
1387B792N35k324l274j213J932L230J660r03l059k515J54K968K946J77k208l165
1403b267j063J639L353J736j427k780k230L95K575K857K62k301k877r54J473K970
1419A361J603r94l031k175N54K737K290N43k049k794p34J693K623J678j064k944
$$ plain form
1308 -693 3540 4469 1443 -3033 -4632 -2670 1635 4694 3539 -650 -4135 -3654 -481 3609 4444 1411
1324 1411 -2869 -4415 -2226 1626 4175 3162 -861 -4160 -3762 -238 3120 3914 1479 -2493 -4138
1339 -4138 -2125 1863 4220 3006 -830 -3711 -3642 -150 3262 3901 1248 -2418 -4014 -2017 1809 4047
1355 4047 2745 -900 -3580 -3511 -369 3089 3719 969 -2527 -3893 -1964 1506 4044 2880 -735 -3385
1371 -3385 -3087 -176 2882 3606 1032 -2327 -3771 -1902 1430 3402 2520 -787 -3543 -3096 -85 2792
1387 2792 3327 1003 -2271 -3484 -1552 1678 3338 2435 -624 -3139 -2985 -17 2929 3106 898 -2267
1403 -2267 -3330 -1691 1662 3398 1971 -809 -3039 -2644 -69 2788 3050 749 -2128 -3082 -1609 1361
1419 1361 2964 1970 -1061 -3236 -2682 55 2345 2888 839 -1955 -2689 -996 1627 3305 2241 -703
1435g03k042M52K296K383K04k142k506q82J646K697J451r87k646j822M18K413
1451B30K162J44j846k486r24J641K379J322j141k274j916N27K299K251J62k111
1467D19k192o01J249K424J281j037k242j992O55K018K181P8j788k314o60J482
1483a039K212J363r14k412j504M60K236J549L17j619k628n37J579K243R63q84
1499A385k291j479L94K141J773l8j653j894n08J377K166J073j176k081j129L94
1515a546J843J734rj869j871n46J435J996J215j147k068j160N58J641J630J44
1531A980j726j827l34J229J814R03r07j908j271N06J903J434M3j513j863k23J166
1548e94J885N50r05j558j398N75J768J512k04j285j709l91R72K016O05r72j470
$$ plain form
1435 -703 -2745 -2293 3 2386 2590 448 -2058 -2940 -1294 1403 2854 1867 -779 -2601 -2183 230
1451 230 2392 2536 690 -1796 -2720 -1079 1300 2622 1481 -793 -2709 -2182 117 2368 2530 419
1467 419 -1773 -2374 -1125 1299 2580 1543 -699 -2691 -2036 -18 2163 2241 453 -1861 -2521 -1039
1483 -1039 1173 2536 1622 -790 -2294 -1834 402 1951 2268 649 -1979 -2516 -937 1306 2269 1385
1499 1385 -906 -2385 -1991 150 1923 1885 232 -1662 -2170 -793 1373 2446 1270 -811 -1940 -1546
1515 -1546 297 2031 2022 153 -1718 -2264 -829 1167 2382 1235 -833 -1993 -1435 206 1836 1980
1531 1980 254 -1573 -1907 -678 1136 2039 1132 -776 -2047 -1541 362 1796 1839 326 -1537 -1760 -594
1548 -594 1291 1841 936 -622 -2020 -1445 323 1835 1631 346 -1363 -1754 -782 1234 1839 867 -603
1565f03j212L76J689J454k73j280j512k95J070J655P70r80j607j032N90J492J303
1582A605n8j546j560j44J315J369P55p69j546j192P26J340J090P2j341j407k48
1599a539J151J298Q35q54j616q67M02J589J018j19j181j320k56J128J333N85q47
1616G40j313r25M24J442J040j91j065j306l18J099J379M92p90j380j078O64J360
1633B74J007j26j079j232qR16J256O00j098j248p68N74J236R05j50j100j207q1
1651a329J018J269L71m91j384o33M39J306O22j66r35j264k71J122J229L37n82
1668F58j239o98M44J210P88p7j297p88q5Q36J085M26o60j329m27M18J024R88k45
1687A032j139q04l72Q67J187M50o56j226m95L74J071P82k77q04j044j05Q52J003
$$ plain form
1565 -603 -1815 -1439 250 1704 1431 151 -1361 -1656 -586 1069 1839 859 -748 -1780 -1190 302 1605
1582 1605 1547 1 -1559 -1703 -388 981 1736 967 -579 -1771 -1045 295 1385 1457 116 -1291 -1539
1599 -1539 -388 910 1745 891 -725 -1592 -1190 399 1417 1298 117 -1203 -1459 -331 1002 1587 740
1616 740 -573 -1498 -1074 368 1408 1217 152 -1154 -1472 -373 1006 1498 708 -672 -1750 -1086 274
1633 274 1281 1155 76 -1156 -1164 -248 1008 1608 510 -738 -1506 -932 304 1209 1059 -41 -1248 -1329
1651 -1329 -311 958 1329 838 -546 -1179 -740 566 1188 1022 87 -1177 -1448 -326 903 1240 658
1668 658 -581 -1279 -835 375 1163 1086 -211 -999 -1084 -248 837 1263 603 -726 -1153 -735 289 1277 1032
1687 1032 -107 -911 -1283 -416 771 1221 565 -661 -1156 -782 289 1071 794 -10 -1054 -1159 -307 696
1705F96K69o15q64o76N99R41O71k29q89q92n3Q46Q87L04m30j067o36M21J030M98
1725H11j04q21q67R9Q20P96M30p83q72n08M35P98N87j13q41o72j47R21P47O6l92
1746C90r08m68M56Q34M97j38o55p86j05P71Q38J83n86r54k21K59Q96N13j13p65
1766f2o32K2N63P85K36o00p91l38K95Q65M88k01o41o36o6O21P28K29o72n21m94
1787h22L54R89L81l59p54o72M4O39R24K45o62o62k24J71N83M79Q2p89o54J8N44
1808a45P99om85l50m92J92Q67L94j57p15n59O0N07O82R2l27p33m43M52P41L02
1829F76j67o15o35J20M44O63J66l51n97m28M73L85O27l17n48n77J50N93N04J6
1849E82n03o30k48N23N40M31k14o30l80p1P50L45J88m56o70k31L93N02K64k33
$$ plain form
1705 696 965 350 -514 -1190 -591 350 1021 792 -97 -989 -1042 -196 691 995 565 -502 -1138 -717 313 811
1725 811 707 -114 -981 -882 -62 734 1164 381 -491 -999 -564 234 821 708 -133 -805 -952 -31 716 782 390
1746 390 -518 -986 -530 304 801 663 8 -778 -883 -112 726 909 323 -631 -852 -593 303 816 703 -62
1766 -62 -694 -672 -109 676 912 312 -479 -817 -522 343 831 630 -11 -647 -713 -92 636 865 193 -328 -822
1787 -822 -468 521 902 543 -211 -883 -839 -200 724 969 307 -355 -579 -408 175 654 736 -53 -707 -689 -145
1808 -145 654 648 163 -187 -679 -487 380 774 617 -98 -657 -597 -90 592 684 357 -376 -819 -367 374 676
1829 676 509 -106 -741 -621 -177 486 652 301 -296 -724 -251 134 761 444 -104 -681 -531 62 566 582
1849 582 79 -551 -799 -276 264 695 481 -149 -529 -600 150 495 683 227 -443 -674 -281 221 485 252
1869B52m65k22k20O84M42K82n56m28j83JO27M48m08m53l76J14L29M47J24j83o72
1890d16k7J48N26M47j54n86o54L14M34N07L4m02n88k41M85L52L39j94m66l17j7
1911d76M39N84q5k87n11k20K37M78L26j28m39m96J01N53L08J59m42m08j77J96
1931b88O37K49k16m91m94K43L04M08J25l08m96n9M13K91K10j67n20j15k10M89
1951EM49K40n07n49j15K48M95K34j14m17m57M3L64L80N3l68l39p1Q5O40O8j7n20
1974a70k91K20K68L14Kk51l42m65M71N39R4k25k75k86K27R2L60K21m27m58j2K37
1996a57L95J69m5n37l45N4M70M34O6l97m42j76M64N0L98j50l59j67n5N46J14j41
2018A89q0l70j63K07L95J83k23l85j79J01L04L27R8l08k69j69J89M89R9j08m17
$$ plain form
1869 252 -213 -435 -655 29 471 753 197 -231 -414 -413 214 662 254 -199 -575 -461 -132 315 439 256 -416
1890 -416 -443 -295 231 678 524 -62 -716 -402 32 539 573 171 -417 -658 -173 179 518 324 -142 -459 -476
1911 -476 -37 547 462 175 -336 -556 -319 159 485 357 -82 -578 -477 76 384 543 101 -307 -484 -288
1931 -288 349 598 382 -109 -603 -360 -56 352 477 169 -327 -386 27 318 528 361 -159 -274 -484 5
1951 5 454 694 187 -362 -477 -229 266 500 386 -31 -488 -445 -81 299 352 -16 -355 -426 -341 299 367 350 -170
1974 -170 -461 -241 27 341 343 92 -250 -715 -244 295 389 164 -111 -397 -170 -78 282 503 76 -382 -394 -157
1996 -157 238 407 362 -175 -520 -466 4 438 504 107 -335 -511 -47 3 401 251 -108 -275 -330 216 330 189
2018 189 109 -261 -424 -217 178 361 138 -247 -426 -325 -21 306 404 96 -173 -342 -153 336 435 327 -90
2039i0j55K3K15M21j10j83l65n0R0L34L50j66l86m14J68K08M49n6j26l51o0N0
2061b04L70K28j09m30j89K5K90L21P0l12l94p3K61K70K83k63k79j99l4M86K69
2082C87r5k13l62k13K02O12L6q7l68k82K68R6L43O1l55q2l08L49Q8L35k29l25
2104a42o3M3J80K58R8k24k71j18O2L96L9j26q4l03J11L27K5K3l11j81m6K46J67
2127A06P3k2l81j04J83K94P0N9l64j97JK75J86J05k26j24k13N5J23N48j97l08
2149e8o7j42J31K64O9Qk30j29m5J70M42l20K6k26j0J33J71pp4l15j25J78J96K63
2173C03o0m07r4R0O2L40%k40r7j3j98L22K31K5k15m0j27K27j50J27j67K9k75K6
2197c01J32L10j70l72K09l89M88Q2K28J10l37m06J67m3L40K36l82O8l89M72J75
$$ plain form
2039 -90 -245 -222 -7 414 304 121 -244 -294 -204 130 480 314 -72 -486 -318 -110 339 283 157 -194 -254 -204
2061 -204 166 394 285 -145 -334 -309 -19 302 372 60 -334 -407 -146 124 407 144 -135 -334 -368 118 387
2082 387 292 79 -283 -496 -294 318 354 267 -101 -383 -115 -19 324 385 30 -52 -360 -11 77 412 183 -142
2104 -142 -205 -162 18 276 374 150 -121 -239 -177 219 258 132 48 -255 -144 183 208 231 -80 -261 -307 -61 106
2127 106 179 157 -224 -328 -145 149 219 278 -86 -283 -282 -7 179 284 58 -66 -279 -224 -101 447 250 -58
2149 -58 -125 -267 -136 128 197 205 -25 -154 -199 -29 413 93 119 -107 -117 16 187 180 106 -209 -334 -156 40 303
2173 303 243 -164 -258 -168 -106 234 234 -6 -103 -116 -314 8 239 264 49 9 -118 109 -41 86 -81 -52 -327 -301
2197 -301 -169 141 -29 -401 -192 -581 -93 -11 217 327 -10 -416 -249 -292 48 284 -98 -30 -419 53 228
2218B28O3o2l68j13j80O99j80O42p03m05J85M71l1K30l15m2p73N11L47R9M86n51
2240B38o67P20k89P47n26j07l02K21M92p90P22l90K8m16K69O7m7M14l64j07j05
2261a92j8L98J6J12k43l28n1O6L83j24J74k10j40p7L98N0j20Jm18J35J30K4J17
2284H3l0k96R1R2J46J13L4j02l32P1O4J43j27J95m06N5j22K56L27j35k43o2K00
2307A5q7J44J6rj67k4L2J02M5o2jj63J34j7J05j7R2l53m1J78J75j51K19k29j52
2332b16L8J05L30k3j31j69j46K09J19J05m9J5k50k13K35m3O9Q0k35P6K3K84J11
2355C24k72k56Q6N8j1J55j77K82l48j40L37RL3l8J10m21K27l2J17J55j71k73K27
2378a9j82K56J12k04R1p9k80K94J31J25j20j57o2LK7L14j66k40R0Nj27K65Q8j09
$$ plain form
2218 228 291 229 -139 -252 -432 267 87 729 26 -379 -194 277 246 476 161 119 -654 -143 204 303 789 238
2240 238 -429 291 2 749 223 116 -186 35 527 -263 459 69 97 -319 -50 17 -30 384 20 -87 -192
2261 -192 -210 188 204 316 73 -255 -306 -240 143 19 193 -17 -157 -234 164 214 94 95 -323 -188 -58 -34 83
2284 83 53 -243 -152 -60 86 199 233 131 -201 -130 -66 77 -50 145 -261 -206 -328 -72 255 120 -123 -185 15
2307 15 -72 72 88 79 -88 -112 -80 22 67 5 4 -159 -25 -42 63 46 138 -215 -256 -78 97 -54 165 -64 -216
2332 -216 -178 -73 257 234 103 -66 -212 -3 116 221 172 187 -63 -276 -41 -84 -15 65 -170 -94 -71 213 324
2355 324 52 -204 -118 -60 -71 84 -93 189 -159 -299 38 47 80 42 152 -269 -42 -74 43 198 27 -246 -19
2378 -19 -201 55 167 -37 54 -25 -305 -11 120 245 125 -32 -94 -91 -64 250 84 -156 -66 -61 -188 77 165 56
2402E6k94J80m9J78J29p8k02l7L9J86J02j39m0j78j80K58K10j59J63j56j53J21
2424d3pJ62j42k1n1j90J76L6L29j45R2l08k84J47N59kl19K6Lj68L24J92j47m28
2448b09j78L86j3J29j07O8J6j73Q5j52K08l1l8j94L4Q8K48o6k44K51l04K26K7
2471E7j10J19n4j76%P9J31R0j10k50J43k5k8J9J74O1k02k5J55J13j7j34o7j41
2495a98L51o0m8M8j31K6j69K62P7P6j56k13J35J09l7k9J77j7k93j42J45J14J01
2518A28j3j16j61Q6K41k7j16M3m7l8N8J85j14j15j8q6l7O6P5J51k37k05J53J12
2542c2M1J69l50J0KJ60J05nJ76m36l0L3J52J72j81J87l96J78J6j73K13J38j25
2565B4n4k22J56K92j03r3r3j31PL39N0j87P6j73O8J2J95j11N7j74r8K3J72J38
$$ plain form
2402 56 -238 -58 -107 71 200 122 -80 -117 -78 108 210 71 31 -147 -327 -69 141 -18 145 -11 -164 -43
2424 -43 -50 112 -30 -51 -102 -292 -116 -80 249 104 196 -112 -396 -249 310 308 -11 15 18 -150 174 366 219 -209
2448 -209 -387 -1 -14 115 8 76 92 -81 4 -148 60 29 -9 -203 -169 -81 167 101 -143 108 -196 30 57
2471 57 -53 66 12 -164 -164 -85 46 136 26 -224 -81 -106 -134 -115 59 120 -82 -107 48 161 144 10 -57 -198
2495 -198 153 93 45 93 -38 -12 -181 81 158 234 78 -135 0 109 72 43 220 203 -90 -232 -87 27 128
2518 128 115 -1 -162 -76 165 138 22 65 18 -20 38 223 109 -6 -24 -110 -147 -81 -6 145 -92 -297 -144 -32
2542 -32 9 178 -172 -162 -160 0 105 100 276 -160 -190 -157 -5 167 -14 173 -223 -45 -29 -202 11 149 24
2565 24 -30 -252 -96 196 93 0 -93 -224 -217 122 172 -15 61 -112 -44 -32 163 52 109 -65 -163 -140 32 170
2589A70k6j41j05m5K05J52j50j44j5J2J8K54N2o6q1J5jj79K09m6K0j79N7R3l1
2614D8L7l0j54L4j93M27k03K58j38j59k2J94J40j76q3k5%n8K80p5l4K4o1k53K42
2639B0R2oK6j37j6n6J53J24m82J97n6PM3J25J12j34j66J79n4Q5j42L10j15l33
2663b24n4L40N2l5o5r8J48M2n4M5j03J06j82K08k08J51O6j14l5j72J79r0l0L62
2687B35j98p3j65J51M6J48m7J20k33rJ62j25K4J73k51o8J72J09j64j68K40j38
2709e9Q0Q7k08J04J73l5k44P0J07k2j03n9P2p0K2n1J90m5P9r1K6J8Nj50J2J44
2735E2p3nJ04n7o2p4J76J4j26M6K02j82k75J98m9K01n5l9mJ7J5r7K45k45m3Q0
2761c6j5J23M3p6j66K64j88k67K58K29k44K0Lr9R0K76J8l18M0o3J4J97j36O0m3
$$ plain form
2589 170 144 3 -102 -147 58 210 60 -84 -99 -87 -69 185 237 171 90 105 104 -75 134 88 108 -71 -14 79 48
2614 48 85 55 -99 -65 -258 169 -34 224 86 -73 -95 99 239 63 -20 -45 -45 -103 177 102 68 92 31 -222 20
2639 20 112 106 132 -5 -21 -77 76 200 -282 -85 -141 -134 -91 34 146 12 -154 25 -29 56 -86 224 109 -224
2663 -224 -278 62 114 79 14 -84 64 106 52 97 -6 100 -82 126 -82 69 135 21 -14 -186 -7 -97 -127 235
2687 235 37 -36 -201 -50 -4 144 97 217 -16 -25 137 12 36 209 -42 -110 62 171 7 -161 79 -59
2709 -59 21 108 -100 4 177 142 -102 -32 75 53 -50 -109 -37 -107 -85 -136 54 9 88 -3 23 41 46 -104 -92 52
2735 52 -21 -26 78 21 -41 -115 61 75 -51 -5 197 15 -260 -62 -111 90 35 -4 -8 9 24 -73 172 -73 -116 -36
2761 -36 -51 72 115 39 -127 137 -51 -318 -60 169 -75 -55 -52 -151 -61 215 233 -85 -45 -108 -94 103 -33 27 -16
2786a6j00J79j01k7K22k33R7p2L9r6MJ04K3j88P5Q2K9q0q4J7L5J88N4j62p6J06
2812A9l7l1NO2J80Nk37Po8Q7K6J26k00j0K25j62Q6k14J4J41n5o1J8J72j82l11
2838c95K75rJ30J11o5r2J82m1O1p4j95O1P9j85J04J20n9J24k44M5O9r9K44j67
2862b0J16n5qK5l9l8r1q0K20k28K90j39%Q7J49k70J05j66J71L3j09N7k2J51j28
2887A1J7J5j03L8J29l3j0j50J25j4k24L81k53K11o5j05J1J27k57J74m9j04N4O1
2911a3J61r1m3J3n3r0L2R5K83k85mJ8P7k06J02j72K81j26j83J68J39q3J73J7j75
2936C5n5L1J09p4j5L4j64rK38l6p9j0j63j9K49R7m8k0q9j09K13O9j7j66l2n4j31
2963b15M05j78n0J56j32p7K43k03n7P0m6J7J02L9j14J52j11k8O9Nj83K34r6j99
$$ plain form
2786 -16 -116 63 -38 -65 157 -76 21 -51 -12 -108 -104 0 23 -165 -90 -8 21 -59 -143 -126 -91 97 151 -11 -87 19
2812 19 -18 -49 -44 18 198 203 -34 -27 -95 -8 18 144 -56 -66 159 -3 83 -131 -117 24 -31 -92 -74 98 -84 -395
2838 -395 -120 -129 1 112 47 -45 137 96 157 83 -112 -51 28 -157 -53 67 8 132 -112 -67 2 -97 147 -20
2862 -20 96 41 33 58 19 -19 -110 -190 30 -198 92 -47 -47 40 189 -81 24 -142 29 62 -47 10 -12 139 11
2887 11 28 43 -60 -22 107 74 64 -86 39 25 -199 182 -71 140 75 -30 -19 108 -149 25 -24 -128 -74 -13
2911 -13 148 57 14 27 -26 -116 -84 11 294 9 5 23 100 -106 -4 -176 105 -21 -204 -36 103 20 193 210 35
2936 35 -20 11 120 46 31 65 -99 -108 130 94 15 5 -158 -177 72 169 121 101 12 -97 116 185 168 2 -30 -84 -215
2963 -215 190 12 -38 118 -14 -91 152 -51 -108 -38 -84 -67 35 74 -40 112 1 -27 42 47 -136 98 2 -197
2987a97J54N3J47k8j4k50j11L54j29kN9J61j12j94J48N5N5m8M9j22O5j76O0o4
3011h7O3o0J51n0L1K7L0j66J23k8k00K71j68K12m6Kj83O9J31Q5k28JP2j33J84
3036A03ojq9K0j58J77N2m2n5r9l8J09N4j7Q8j47l0l2K00j62oK32j22K5k00J32
3062a2k6M9j8j77J96J31k5p4j43J85j47K09j03L2o9J08m3j66J88n9L1j0o0J12
3086A09k30K32k5k24K01j36Q0j28K23n5J3k19J82K6J08j71J35p3q5P7o6rM0o4
3110e9J09J7k84K96o0n2PN3j86J08R9Q8k39J29NJnJ56k16k6j24J68J30k03N3J79
3136A44k83M7J54p7JK0Q0p9L4%k09J88j11J97k22o9K22J38n1j71J08l1K77k53
3160E4q4m8L4MJ22M2j18n1J35j24J7Qn8l6j1K14j46O4j8n4Q7q0M3q7J49j53n6
$$ plain form
2987 -197 -43 10 157 129 115 -135 -246 108 -21 -23 36 197 85 -109 39 94 149 101 150 28 93 -83 -23 -87
3011 -87 -24 -84 67 17 48 75 105 -61 62 34 -166 105 -63 149 103 105 -78 -9 122 207 -21 -20 52 -81 103
3036 103 97 96 7 27 -131 46 98 56 1 -98 -136 -27 27 10 98 -49 -79 -111 89 -73 -79 153 31 56 -144 -12
3062 -12 -38 11 -7 -184 12 143 118 44 -99 86 -61 148 45 77 8 116 73 -93 95 36 67 57 -3 109
3086 109 -121 111 86 -138 63 -73 7 -121 102 47 60 -159 23 49 157 -14 121 48 -37 40 -26 -35 5 -59
3110 -59 50 67 -217 79 19 -33 -26 27 -159 -51 48 136 -103 26 31 32 27 183 -33 -59 -183 -15 115 -88 -35 144
3136 144 -139 -92 62 -15 -14 6 86 7 41 41 -168 20 -91 106 -116 -185 37 175 124 -47 61 30 307 54
3160 54 -30 -78 -44 -40 82 124 6 -45 90 -34 -17 -9 -67 -103 -114 100 -46 18 0 -54 33 -47 -4 -91 58 -95 -151
3187a51J00k22J53MJ10J20r1P1n6m0N0J6j19P8r3J62j02J11j58O7l7j04J86m6
3211IJ6p4l9k5RK30j47O1p6j37J40P6j68m7K31l3P3M7k00M6N7p5K20j81K1K1K
3238E7r3J80j39m1q6K21j33O1n3M8oO7N1j03j30M1R2j09J49j53L4m1J83j07N9
3263D9N3q3p8Rl0j8J89k50m9L68k98R4J4k0j89K10L8j96L15o9j57K34k75M2O8
3288b9J30o1J62k33J47P3j39L7J6O2l64K52j66J88k9Q1j3k28J60J2j23K16j70
3311a9j81J04K8K27j88N7M2J0Kj3k77L12j46J45o6p1Q9j49j86K47ql4J5Q3l1n7
3337f5k5N2N6R2n7j80J72q6K3m7RJ66j00j65K87l3p4o1J05j13O5R5j34J27k54
3362a45K47j71Q7%L2j29J12R2N7k32L0l2l0J04n2J41k4j70J58j62O6L4K2j56P6
$$ plain form
3187 -151 -51 -273 -120 -116 -6 114 23 94 38 -2 48 64 -55 23 -70 92 -10 101 -57 10 -27 -131 55 9
3211 9 25 -49 -88 -113 -104 126 -21 40 -36 -173 -33 43 -125 -172 59 26 99 146 -54 -8 49 -26 194 13 34 55 57
3238 57 -36 144 5 -36 -122 99 -34 27 -26 22 16 83 134 31 -99 -58 34 -75 74 -79 -45 -86 97 -10 49
3263 49 102 19 -59 -50 -80 -98 91 -159 -208 160 -138 -44 -30 -50 -239 -29 9 -187 128 59 -98 136 -139 -97 -29
3288 -29 101 40 202 -31 116 189 50 87 103 165 -199 53 -113 75 46 127 114 -114 46 58 -65 151 -19
3311 -19 -200 -96 -68 159 -29 28 70 80 82 69 -208 104 -42 103 37 -34 55 -94 -280 -33 -41 -75 -60 23 -8 -65
3337 -65 -90 -38 18 110 53 -127 45 -41 -18 -65 -56 110 10 -155 132 99 25 -36 69 -44 21 116 -18 109 -145
3362 -145 102 -69 18 18 50 -79 33 125 182 -50 -20 -52 -82 22 -30 111 87 -83 75 -87 -21 13 35 -121 -45
3387d5j09Q4R0j78J10j56K27q3j7L7r9J8K37k13K64j64K3o1J44l2L1n0o5Pk9O3
3413C4m0J3L7p9Q2j56K77j01L8n0p9p8J29o8l8K88l27P3O8P4j74J31J00j82p0
3438i8K06m0q4J94k02J8R0m1J45m33L21R4j55KJ52l2l7p6n7J24j26L84j12l65
3462a28K56j01p0J80j91J02k8M3j6j5j03k1P2l9K26lj41L8j43Q9Mo3j8L8Q0j6
3488C2J0j45R0N5j22L0m7J27mJ01j89R0L3J8jj9k76J29Kn5J26R3k44O6J86K0q0
3515B6J8n9O8J6j52J84j66m4J75k2j24r2Q7M5P8P2r1Qo5M1R2j7j24L7J38l25K00
3542DP4j7n4j19Q7Nm3J31o2n7N6r5Rj7J97nj20N5o0N7J2j68L39k02M7m0J09j3
3570A10q1r0L4J8l3%j05J96j1j38p8J34j7qR5l6o9J8P6p6J88j54j58L88j2k79
$$ plain form
3387 -45 -154 -70 20 -158 -48 -204 23 -60 -77 -40 -139 -121 116 -97 167 3 26 -35 109 77 108 58 -7 0 -29 34
3413 34 -6 7 44 -35 47 -109 168 67 105 55 -24 -102 27 -41 -79 209 -118 -45 23 97 -77 54 154 -28 -98
3438 -98 108 68 -16 178 -24 -6 84 43 188 -245 76 170 15 17 169 137 100 24 -33 91 -35 349 237 -128
3462 -128 128 27 -43 137 -54 48 20 63 47 32 -71 -92 -20 -59 167 164 23 61 -82 7 11 -52 -70 -32 48 32
3488 32 42 -103 -13 42 -80 -50 -97 30 26 127 -62 28 61 79 78 59 -217 -88 -86 -141 -15 78 -166 -100 86 106 26
3515 26 44 -15 53 69 -83 101 -65 -109 66 44 -80 -172 -85 -40 38 110 19 27 -38 3 95 78 -46 -9 129 -196 4
3542 4 78 61 7 -112 -25 -20 -63 68 6 -51 5 -90 -81 -98 99 94 -26 29 -31 26 38 -130 209 7 54 14 123 110
3570 110 29 -61 -27 -9 -42 -42 -147 49 38 -100 -178 -44 -61 -69 26 -10 -79 -61 15 -61 127 -27 -185 203 191 -88
3596h8PR1P8j77N2K6o4J79k31M22l19P6L4M0Q0l28l8K40J84j65KL5q8Q7PMl6j6
3624I4m5K9l7j05L7J15j97J60J01j21o7R4j24J54j41P5n0J28k45J76j49O1J36
3647G9k22J22P7j87J53n6j44N27n41N17n15M0Q7j07l3J07k3L0q7O5j65l3L56j56
3671a09j23L22m4L02n69k4K07o26O52J22j46O9m21Q41o68N6K91m87K76K80l41
3692a40K01Rj42l9J59j4k3J50j2j50J2o0J82j17J06M0j96J30J29j81K4q7o3J4
3716f8R6p7L6lJ49j64J75Q8l50K00m3j54P1k2ON6k44L37l2Q2j39J02j25m7J35
3741F5j16j9J4J88j24K8o0L7j70J65k0m3j01K26k10L29q0j08O1n9l7l0KJ10n3
3766eJ47j77l0J86j92J50k80K67J43k54J09k24K09j3j80K25L7j60P8Okp8J71J7
$$ plain form
3596 -88 -81 10 88 -89 -37 -11 -75 104 -127 295 -24 52 86 126 206 -122 -160 80 264 99 101 136 48 135 142 146 110 94
3624 94 49 78 41 -64 -27 88 -109 51 152 31 -36 58 -66 88 -53 22 -28 100 -145 31 -118 -57 79
3647 79 -143 -21 56 -131 22 -34 -178 349 -192 325 -190 -150 -63 -170 -203 -96 -119 -89 -176 -111 -276 -309 47 -109
3671 -109 -232 90 46 348 -221 -245 -38 -664 -12 110 -36 33 -388 453 -215 -159 132 -355 -79 201 -140
3692 -140 61 70 -72 -111 48 34 11 161 149 -1 11 -49 133 16 122 162 -34 96 225 44 68 -19 -82 -68
3716 -68 28 -49 -13 -16 133 -31 144 232 -118 82 39 -115 -44 -66 -60 -4 -248 89 57 139 0 102 -23 -70 65
3741 65 -51 -70 -56 132 8 36 -24 13 -157 8 -12 -55 -156 70 -140 189 109 1 62 3 -34 -64 -62 48 -5
3766 -5 142 -35 -65 121 -71 79 -201 66 209 -45 64 -160 49 36 -144 81 118 -42 36 42 40 -38 133 150
3790A50n3O8n7l34J71J88j30o6N9L1l4l5J38r0j3J58j78J28Pj56K46j74j54J56
3814B6K6M2N5J9j33r9J48n9k9J26r4J36j07R8j27j54L47ok61J3nJ88j45N8j29
3839f6J2J4k8J98j17O0j32Q2k9%J14j99K91k68O2J2j22Q4j90K12j9p4J7Q6j61
3864a61K38j82L3O3k21R8L0J35rL5j83J34R4j58j0m7J47k4Qk27M0N7N8J87k37
3889a02J71k13J90j3j4Ok6L7K6l1j15l6O2jR3j01J21j49R9j71J61m7p7L3P7j53
3915a73L15r0j00j9L9J20j05R9j52M1PLk47K13j33J67l0j9J50m7n4P6j07O7l1
3940a0j6j4q2J76j43K70j61k4k9qJ64k67K02j55K16k1j79l3K01r7j46J88M1O8
3964A41j43J38p0k08L18j79p5R1j16KJ74j95J07q2J07R5k91K44j2R5m1l72L34
$$ plain form
3790 150 97 165 108 -226 -55 133 3 -63 -4 27 -7 -42 96 6 -7 151 -27 101 108 -48 198 24 -130 26
3814 26 52 94 149 168 35 -64 84 25 -4 122 28 164 57 155 28 -126 221 215 -46 -33 -38 150 5 63 -66
3839 -66 -54 -40 -68 130 13 73 -59 23 -6 -6 108 -91 200 -68 -6 6 -116 -32 -222 -10 -29 -103 -86 0 -161
3864 -161 77 -105 -72 -9 -230 -132 -102 33 24 59 -124 10 104 -54 -64 -111 36 12 20 -207 -167 -110 -52 135 -102
3889 -102 69 -144 46 33 19 25 -1 36 62 31 -84 -120 -58 -59 34 -67 54 -95 4 -167 -6 -53 -130 -97 -20 -173
3915 -173 142 52 -48 -67 -28 92 -13 86 -66 -25 -18 -15 -262 -49 -182 -15 -45 -64 86 39 -15 61 -46 21 -10
3940 -10 -26 -40 -122 54 -89 181 20 -4 -33 -41 123 -144 58 -97 119 98 -81 -114 87 -10 -156 32 73 141
3964 141 -2 136 66 -142 176 -3 -78 13 -103 -101 73 -122 -15 -97 10 105 -186 58 46 141 100 -272 62
3987F2p2r2L8J2J03j11M5J59j21o2j5J12k9j31K41j59q6J92j80K55j18k02P8N6
4011b5J2M6O4M3j13q3NJ73k38N8P4j5rq0J51j1q2J52l6j29O4k2n3J80k22J80q3
4038Aj07N6p6j7J80K0k4j7o3j36J99M3n1j01j07L8J38j13O4K0k3K09m5q5k3J88
4064A68k05k9l2J9PJ22k1M9k7p8J70j17k0R1m7n9J4J49j68PJ07k38K10L6j93N0
4090c5j48Q3K11k27Q9N4k31J62J2k7M5Jp4k0J98j80J79j85J46o6j61J50M8J09
4114A33j49j60J23P1n6P0P1l4r9N3q3L7n2k7J9OJ12j57O2J6NJ7j23J39n7M5OK9
4142A7L1k2RL4m6j0j52N2l3J46j37J0l3J18K3q6P6K9j66r5L50M5j91R4o5Kj3%
4170a3l7J8j48J99j09J40k13J42j3J6n6l5K31k54K0OJ00N5k04L09j23mj21N0o7
$$ plain form
3987 62 -10 -102 -64 -52 51 -60 -15 144 23 -39 -54 58 29 -102 139 -20 -106 86 -94 161 43 -159 -81 -25
4011 -25 -13 33 97 140 27 -56 -51 122 -116 -58 16 1 -8 -88 63 52 -30 122 86 -43 21 -1 -54 126 -96 84 1
4038 1 -106 -50 -126 -143 37 57 33 16 -47 -183 16 59 8 -93 -200 -162 -24 -137 -73 -53 -76 133 88 3 -20 168
4064 168 -37 -66 -98 -79 -72 50 29 78 51 -27 143 26 6 97 50 -9 5 154 -14 -7 100 -138 72 108 -85 -35
4090 -35 -183 -100 111 -116 -27 27 -204 -42 -30 -57 -12 -11 -85 -105 93 -87 92 -93 53 -13 -174 -24 24 133
4114 133 -16 -176 -53 18 -38 32 103 69 -30 23 -60 -23 -75 -102 -83 -77 35 -122 -60 -44 -39 -22 -145 -6 -63 -18 -12 17
4142 17 48 26 35 69 23 13 -139 -87 -120 26 -111 -101 -134 -16 7 -79 -3 26 -140 -235 115 160 -31 63 -2 0 -13 -13
4170 -13 -50 -32 -180 19 -90 50 -163 -21 -34 -18 -74 -109 122 -132 -112 -106 -6 49 -155 154 31 27 -94 -44 -111
4195a11R7p1J33kJ63P1k75m4m3qM9L4j81J99r7J01k15J65L2Q2P7j13j10N7J03
4220I3j28p0J31N2Q6j49m6R9k11K01j3k31K13N7k12K07o5n3J62j28N8L7j47r9
4244a56J69o7J6J18r9L4k1o0K49j78K1n2N5k32L98k80J47j88J95kj50N4K1Q7r3
4269a4M5j16K3k1P0r3J28J0J85j74j8q3oP2M2j35J52J16k28p7K8J73q1j2Qq0J52
4296F6k04j7J37n1o0K47j31O5n1R2j47K14j54mJ60q8l06J97M9j15QJ36J22l35
4320a70J79J16p1j27J78ql3k9O2k17RM1J77O8k19n7L9j4jk00J39J19r6J6J06L1
4346C8k72K35j38J35p5Q3JQ3m6Q0l0k19J70J9M3M8l00J08J71j69l8Q3m1m9P0J8
4372Hl7j9k0L3O3r4m5L3J16j49K10j72j0J37n3pj2kK8K4q7N7K0m8J15k6n6l7L1
$$ plain form
4195 -111 -14 -85 48 46 209 280 5 -39 -82 -90 -41 -7 -188 11 -86 15 -200 -35 -3 79 156 43 -67 -10 93
4220 93 -35 -105 26 78 164 15 -31 68 -143 58 45 -186 27 84 -128 79 14 -39 123 -5 53 90 -57 -156
4244 -156 13 -54 -38 80 -19 15 -6 -66 183 5 26 -26 29 -203 195 -85 62 -126 69 67 -83 -29 -8 79 -14
4269 -14 31 -85 -62 -83 -13 -106 22 32 217 43 25 -58 -64 8 50 -85 67 183 -45 -122 -94 79 -2 -14 -6 -86 66
4296 66 -138 -155 -18 -69 -129 118 -13 52 1 93 -54 160 6 2 162 74 -232 -35 14 -101 -93 43 165 -170
4320 -170 9 125 54 -73 105 97 64 35 97 -120 -111 -70 107 175 -44 -101 -62 -76 -77 -277 -138 -19 -115 -99 7 38
4346 38 -234 1 -137 -2 -77 6 7 90 44 124 94 -125 45 64 107 155 -145 -37 134 -35 -73 10 -31 -80 -10 8
4372 8 -29 -48 -68 -35 28 -66 -111 -78 38 -111 99 -73 -83 54 1 -6 -18 -20 8 32 -55 2 22 -26 89 63 7 -30 1
4401ALn5m9J78n1q7J63j3k97M98l78Qm1J14q7m5J66Pk5J85j96K4J43k93J60po8
4428d2o2L11j94N9Rk34J81O8j55m1J30o7O1k79K98m1J18j03k2j46J93N7j14M7
4452C2l9j13K7P6j6J98j56J23j34m1m9K8J81nk75J24q4m0J39j59L2L92j22l12
4476a93pL22n2jL9J21j58j45R2l5N0j52J34J10k09J36l6j02r5O5J3J78j97K95
4500A73k15K2L2j50P3N8n8n1J24J23j79j24R8J18N7l4P0j56L3o2R2k0L8P0r7m1
4526fQ0j05Q3q6Rk2p1J37j48J11R8k30Q1R7P9j33L0q4K10p3n2k34J51J13m6j7
4552b8l3K9j00J25L8j4j0o8N6K1o4L8j1J09ol1K5Nj56nJ01pR6j53P1L5j31J95
4580A27l34K15j8m8m7L2p1K30No3k0j61J51J4k4O6o6j03J89j33n2K2K7J18j91
$$ plain form
4401 1 4 -51 -100 78 27 -60 103 90 -207 291 -87 -79 -120 -6 -93 -138 28 35 10 195 -1 23 166 -127 33 26 -42
4428 -42 -104 207 13 72 81 -153 28 96 -59 -100 30 -37 24 -255 43 2 120 17 -5 -151 42 99 -15 32
4452 32 -7 -120 -93 -17 -33 165 9 132 -2 -43 -92 -64 117 112 -163 -39 -123 -163 -24 -183 -151 241 119 -193
4476 -193 -200 122 70 69 108 229 71 -74 18 -17 33 -119 15 125 -84 52 16 -86 -181 -116 -103 75 -122 173
4500 173 -42 -20 12 -138 -65 -7 -65 -116 8 131 -48 -172 -74 44 101 67 137 -19 14 -48 44 24 62 132 35 -6
4526 -6 74 -31 52 -34 -25 -47 -118 19 -129 -18 80 -150 -69 28 107 -26 4 -80 130 57 5 -229 -78 35 -11 -28
4552 -28 -61 -32 -132 -7 31 17 7 -61 -5 16 -48 -10 -21 88 82 51 76 81 -75 -80 21 14 110 -43 28 63 -68 127
4580 127 -207 8 -10 -58 -105 -73 -144 86 91 28 8 -153 -2 12 -12 54 -12 -115 74 -59 -111 -89 -62 56 -135
4605a35K15j75J05K1L9k40J39J04P7o7j63J29M2j35N2K8M9n1J04j05p1M9p2J91
4629A30lm9j96J63p1L7Q6n6j2j5M6J98l26J28o5J10j45J65J4j38K4L2r9o7J15
4654Fp1K37l18R3J24kO7j32Q7k05K41J23j15j54K1r3qJ78o0p1j23L05k29O8O5
4679C4N1L6k83J00r7Q5K11k10R1l2J36q8j87J38k7j66K59o3J3J8j86K62r7J25
4703A23o8Q1k44J13j41N3P9P4l2j12J09j70M8J05l6J19k48O1Q1J6p9j5P2J08j35
4728c8j93K35m0J24j93J10p1p7K25p7K8k3q6J80j46PR1L3j33J97k46J70k1j55
4752i9o7K39l7J41k26J30p8j61J68J12k78K94j53q8n0J28j20J66J53j43K5j5%
4775D1n2j49J88p7N1J08l1j73J20k22J74M9N2o9j12K02k52N6M4q2O3O4j9L7j66
$$ plain form
4605 -135 80 -95 10 31 70 -170 -31 73 150 83 -80 49 91 -44 8 36 85 34 138 33 -38 11 -61 130
4629 130 127 78 -118 45 -26 11 97 41 29 14 60 258 -68 60 -5 105 -40 125 139 1 25 57 -42 -109 6
4654 6 -65 172 -146 -53 71 69 136 4 91 -114 127 250 135 -19 2 -91 -99 79 19 -52 -175 130 -99 -31 34
4679 34 85 121 -162 -62 -159 -74 137 -73 18 -14 122 34 -153 -15 -42 -208 51 -12 1 19 -167 95 -2 123
4703 123 55 136 -108 5 -136 -83 -4 70 38 -74 35 -135 -87 18 -18 101 -147 -86 -5 11 -68 -83 -11 97 -38
4728 -38 -231 4 -36 88 -105 5 -66 -143 82 5 33 10 -76 104 -42 -35 56 89 -44 153 -93 77 56 -99
4752 -99 -166 73 36 177 -49 81 3 -158 10 122 -156 138 -15 -103 -153 -25 -145 21 174 31 56 41 41
4775 41 -11 -160 28 -49 2 110 79 -94 26 -196 -22 27 79 10 -102 100 -152 -96 -52 -134 -71 -7 -26 11 -155
4800a55R5j0k7J04o2J18k37K86j64j5M3Q9k0n6L0o9P1j06J04L1R0m6l7m2L5j32
4826h2N5J69k04NR0q1r7J04j6n4R8m7K7j96J73J75j86J70k1l3N9j37M3o4K3mJ15
4853H4l2ml8j9P5l72M52j92J81r7K8p0k6Q3j09P3R0q1m4Lm2k1O1k1L3J77k77J39
4881C4o6l2K59k61L4J70k54J79l4kJ2Q1j49O9p9j2L2r8J9J04R0k38O7q5Q1P3J72
4908A66k70L9J94p1j77L04k1j16J02j86PJ05q4l6k7R1j20l4J19M8K8ml04K74O3
4933I0J6j05R5J1j22n6R4j16j6O8m2J01K21l18r3J25J1JL7J09j28J05j62L3L5
4958fPr6QL8O9Q3M2k71J9m0L15k31O1M6K8j7k4K2j81K29o6r4jq8O6J95j70J26
4986F9n0j07J24J61j27M4m9k7k7oj0j08K17J14l01k8pO1k6MJ52p4j1L6q2r4O2
$$ plain form
4800 -155 -60 -70 -97 7 -55 63 -174 112 -52 -67 -24 65 45 -11 19 -50 21 -85 19 50 140 94 57 15 50 -82
4826 -82 -27 142 -62 -57 33 -48 -145 -41 -57 -111 -13 -60 -33 -229 -56 119 -67 103 82 49 108 -29 14 -50 -27 -31 84
4853 84 52 48 10 -9 66 -306 146 -46 135 38 66 -4 -30 53 -56 17 107 26 -18 -15 -57 -78 -17 -38 -5 172 -105 34
4881 34 -32 -64 195 -66 -32 138 -116 63 29 27 39 120 -29 40 -39 -51 -19 -117 -98 6 96 -142 -75 -160 -79 -6 166
4908 166 -104 -65 129 58 -119 185 164 48 150 -36 -29 76 -8 -44 -71 20 -100 -134 -15 33 61 57 -247 27 90
4933 90 106 1 96 107 -15 -71 23 -93 -109 -41 -83 18 239 -79 -172 -47 -36 -35 2 111 -17 88 -74 -41 -6
4958 -6 1 -95 -87 -49 20 103 145 -126 -107 -147 168 -63 -2 44 72 55 31 53 -128 101 35 -59 -60 -148 -82 113 -57 69
4986 69 19 -88 36 197 70 114 65 38 11 5 -5 -113 104 218 -83 -111 -118 -57 -83 -79 73 -1 -12 24 -58 -152 -90
5013i0q5L0K10L9k09K5P6N1OQ3j76J27J07o3p3J48j26J7j16R9j29J24m5On2j3
5039b9J26k44j03L67j13J73l40J82Nk03J39J38m4M3j53J29j78K2J95j60q6M0J77
5062H3rrj28N9R6j73K55j41N6J20j84l5Q1p6r4K01q5K5k12J44P2mj1r0K08n1k08
5089a10R9r0K03n1k8j0l0o5N5j09J26l9J0N0l4K88k06k22qO5j17J98Q0n3n9J61
5115A04j09K1j34K34L0r1j18J03R0o2r3M0N4k0j13j9O1j6O0j9j06K8L5P3l7K6
5141B2q1PrN6q1J40M2o6k37J63J97o5k9qk0K5j10P3L2p8n9O5M7j52O7MJ66k16
5169a05J41p2J21l8kQ8j75lj4R6p9q7J2K30k45J47J72j63Kj6m9N8k25L0K77j18
5195a7O7q2J12r4J62j70o4J79j39p6l3J48j11O9k0Q9j8n4P5Q5p1j36J0J84M8j08
$$ plain form
5013 -90 -175 -145 65 104 -105 -80 -4 47 53 136 -40 87 194 131 58 206 80 97 -19 80 -49 75 30 36 -16 -29
5039 -29 97 -147 -250 117 4 177 -163 19 24 -179 -40 98 54 97 -56 73 -105 -83 112 -48 -134 -94 83
5062 83 74 65 -63 -4 92 -81 174 33 89 209 25 -10 71 -5 -99 102 17 42 -170 -26 46 42 31 -59 149 98 -110
5089 -110 -11 -101 102 51 23 13 -17 -82 -27 -136 -10 -49 -39 11 -23 265 59 -163 -171 -106 -223 -25 55 2 -57 104
5115 104 -5 16 -118 116 146 55 -63 40 130 68 -25 15 69 49 -64 -83 -22 -38 22 3 -103 -75 -40 33 -4 22
5141 22 -59 -52 -61 -5 -86 54 96 30 -207 -44 153 88 59 51 31 56 -54 19 51 -27 -86 -21 26 -126 -59 -55 111 -105
5169 -105 36 -36 85 47 45 133 -42 -45 -59 37 -42 -129 -117 113 -132 15 187 24 26 10 -39 19 -206 -176 101 -17
5195 -17 50 -32 80 -14 148 -22 -86 93 -46 -122 -155 -7 -118 -49 -69 20 2 -52 23 108 37 -99 -89 95 143 35
5221C5m4K26k25q4R9j12J54q0J49k60J42K10r5j94M4K8k5J22Q7l79L53j81Q0J6
5245F6k3j06jJ11j94J61k0L2j50L8K74j03o6j7K1oj0J13j12k13K23l7j04R1K0
5270a2M4o8J9kj14R9P7m7R4j00J75j31L0m6J58q5j83j5J33j07j17J25K93j84N4
5295I0n7J4Q5j60J13rj1o8j47J64O6j03J00J05j18o2J19N0j80Q0j76R5j0J10n7
5320C3O0Lk40J46k3J64j97P4k9q1J42j17J06j18N9n5l0J18n6K30k72m0l4K49q3
5345IP1j07M3MJ21k81M7R3j50J58n3K8k3J16j0j66J63j02%R0p9J41r6l2J31k25
5371a09J04l4L2j2P1K2M1o9M5j29q3O1L9M8O5j91J91P5j99K8N2N2j34K4rJ03k25
5398a41M0J54Q2j98L7k4O6nLr8K43j23O2j43J2J16J32k64Qj37M6J63r7j8L1M9
$$ plain form
5221 35 -9 217 -8 -92 7 -105 49 -31 118 -142 0 210 115 -79 -35 -7 -32 90 177 -202 151 -30 50 66
5245 66 43 -63 -64 47 -147 14 -6 26 -124 -86 188 85 19 2 23 17 7 120 8 -205 18 -19 -123 -32 -12
5270 -12 32 -36 -17 -19 -133 -34 43 -4 90 -10 165 34 64 18 176 91 -92 -107 26 -81 -198 -73 220 36 90
5295 90 33 47 132 -28 85 76 65 -3 -150 14 80 -23 77 182 64 2 121 171 -9 71 -105 -10 -20 90 33
5320 33 93 96 -144 2 -21 143 -54 20 -9 -90 52 -65 41 -77 -18 -73 -103 15 -41 189 -83 -123 -157 92 9
5345 9 80 -27 16 20 141 -140 -93 0 -150 8 -45 -17 -40 76 66 -100 63 -39 -39 51 -28 113 17 -15 116 -109
5371 -109 -5 -39 -7 -19 52 74 115 46 91 -38 -121 -60 -21 27 92 -99 92 167 -32 -4 48 100 -34 -10 -19 84 -141
5398 -141 -101 53 135 -63 -26 -50 16 11 14 -84 159 36 98 -45 -33 83 215 -49 -41 -178 -132 31 -66 -84 -53 -4
5424dJ0o7P9k3L7l7Jl9J1mN8o6n8J20n3N0M7Kj24M1P4k4o7k7Q5j4n9M9k3M5M7
5455F7L5p8O4K8j81K15j77R6jq7N8j8k5p0j35K44Jm9L1j6J24j16l2R1k46J26L7
5482a4j31L47k24J0K23k35o0N4p5R9R3k57p9J07J75P2n5q5l0R8l1p4P8L2j3j51
5508a26Q2J19p3j34J07O5o9K64l32J15m7J17J27k30J70k7Mk02P6o3jK1J14M8o8
5533E7j04Q8p4R0j00R4j8j26L0J99k97J56n2J28j04l3N7R8k12J15O9j56J58jj10
5558d8k7L0o8k4J05L5J78o6Nk2k8j0j7j0j11J40j71P7j09J97o8Lo0J8M8N1m4o2
5586e8m9J35j5n0m8O8jL4J37l7j17M7r4j14L5L13j08k67K32q8l4J76P2p7r5M3
5612D0n7J42q8J08n0j08J58n2m3P6k36L06k03L6J24l19K32M3j21j7M4o7j03J18
$$ plain form
5424 -4 6 -61 18 -5 32 -5 -4 -43 -32 -36 22 -44 -102 18 -35 15 62 64 -60 -19 55 31 -36 -63 22 8 -51 -2 -25 20 67
5455 67 102 24 88 116 -65 150 -27 69 68 -19 39 21 -4 -74 -209 35 36 -13 18 2 126 10 -22 69 -177 -51 -14
5482 -14 -145 202 -22 -12 211 -24 -84 -30 -105 -6 87 -170 -249 -142 33 105 50 -35 -65 33 2 -72 6 38 25 -126
5508 -126 -44 75 2 -132 -25 40 -29 235 -97 18 -29 88 215 -15 155 128 132 -70 6 -57 -58 -37 77 125 57
5533 57 -47 41 -33 57 -43 51 33 -93 -63 136 -161 -5 -57 71 -33 -66 -9 89 -123 -8 61 -95 63 62 -48
5558 -48 -75 -45 -113 -137 -32 3 181 115 120 98 70 60 43 33 -78 62 -109 -32 -141 56 -12 -9 -69 -51 -3 48 4 -58
5586 -58 -107 28 13 -37 -85 -17 -18 16 153 116 -1 46 -48 -162 -127 186 78 -189 43 -45 -79 97 169 92 -3 40
5612 40 -17 125 37 145 95 -13 145 93 50 126 -110 196 -7 29 153 -166 66 109 -12 -29 15 -52 -155 -37
5636c7j5p1M6l0P2l3M4N1Oj74J27J17j19J71k54j08K53p4K5q7L2o2Q7KJ96r2J0
$$ plain form
5636 -37 -52 -123 -77 -107 -35 -68 -24 27 33 -141 -14 103 -16 155 -99 -207 46 -28 -3 -90 -58 -120 -33 -31 165 73 83
$$ [...]
8191h3
##END NTUPLES=NMR FID
##END=
