##TITLE=1H_DE-80H_X3
 200.13MHz, d2o
 8 sc
 
 19ns.26.2.2025
##JCAMPDX= 6.0         $$ Bruker NMR JCAMP-DX V2.0
##DATA TYPE= NMR FID
##DATA CLASS= NTUPLES
##ORIGIN= UXNMR, Bruker Analytische Messtechnik GmbH
##OWNER= pz
$$ XWIN-NMR		Version 3.5
$$ Tue May 20 19:07:38 2025 Russian Standard Time (UT+4h)  Yarkov@DPX200
##.OBSERVE FREQUENCY= 200.1313
##.OBSERVE NUCLEUS= ^1H
##.DELAY= (6, 6)
##.ACQUISITION MODE= SIMULTANEOUS
##.ACQUISITION SCHEME= undefined
##.AVERAGES= 8
##.DIGITISER RES= 18
##SPECTROMETER/DATA SYSTEM= spect
##.PULSE SEQUENCE= zg30
##.SOLVENT NAME= CDCl3
##.SHIFT REFERENCE= (INTERNAL, CDCl3, 0, 14.3821)
##AUDIT TRAIL= $$ (NUMBER, WHEN, WHO, WHERE, WHAT)
$$ ##TITLE= Audit trail, XWIN-NMR		Version 3.5
$$ ##JCAMPDX= 5.01
$$ ##ORIGIN= Bruker BioSpin GmbH
$$ ##OWNER= Yarkov
$$ C:/Bruker/XWIN-NMR/data/yarkov2/nmr/H-C/1/audita.txt
$$ ##AUDIT TRAIL=  $$ (NUMBER, WHEN, WHO, WHERE, WHAT)
(   1,<2025-05-20 19:06:49.81 +0400>,<Yarkov>,<DPX200>,
      <created by zg, POWCHK disabled, PULCHK disabled
       configuration hash MD5:
       00 E9 B6 7A A2 85 ED C7 34 08 36 98 17 FE 4E 26
       data hash MD5: 16K
       05 31 9C A4 AC 1E 09 52 F0 59 9D 52 FC F2 18 13>)
$$ ##END=
$$ 
$$ hash MD5
$$ 5A 07 15 9F E8 D7 85 0A 61 97 34 05 FA E0 8D 86
##$RELAX= 
##$RELAX= 
##$RELAX= 
##$RELAX= 
##$RELAX= 
##$RELAX= 
$$ Bruker specific parameters
$$ --------------------------
##$DU= <C:/Bruker/XWIN-NMR>
##$EXPNO= 1
##$NAME= <H-C>
##$PROCNO= 1
##$TYPE= <nmr>
##$USER= <yarkov2>
##$AMP= (0..31)
100 100 100 100 100 100 100 100 100 100 100 100 100 100 100 100 100 100 
100 100 100 100 100 100 100 100 100 100 100 100 100 100 
##$AQSEQ= 0
##$AQ_mod= 1
##$AUNM= <au_zg>
##$AUTOPOS= <>
##$BF1= 200.13
##$BF2= 200.13
##$BF3= 200.13
##$BF4= 200.13
##$BF5= 200.13
##$BF6= 200.13
##$BF7= 200.13
##$BF8= 200.13
##$BYTORDA= 1
##$CFDGTYP= 0
##$CFRGTYP= 5
##$CHEMSTR= <none>
##$CNST= (0..31)
1 1 145 1 1 1 1 1 1 1 1 1 1 1 1 1 1 1 1 1 1 1 1 1 1 1 1 1 1 1 1 1 
##$CPDPRG= <>
##$CPDPRG1= <>
##$CPDPRG2= <>
##$CPDPRG3= <>
##$CPDPRG4= <mlev>
##$CPDPRG5= <mlev>
##$CPDPRG6= <mlev>
##$CPDPRG7= <mlev>
##$CPDPRG8= <mlev>
##$CPDPRGB= <>
##$CPDPRGT= <>
##$D= (0..31)
0 0.7 0 0 0 0 0 0 0 0 0 0.03 0 0 0 0 0 0 0 0 0 0 0 0 0 0 0 0 0 0 0 0 
##$DATE= 1747753609
##$DBL= (0..7)
120 120 120 120 120 120 120 120 
##$DBP= (0..7)
150 150 150 150 150 150 150 150 
##$DBP07= 0
##$DBPNAM0= <>
##$DBPNAM1= <>
##$DBPNAM2= <>
##$DBPNAM3= <>
##$DBPNAM4= <>
##$DBPNAM5= <>
##$DBPNAM6= <>
##$DBPNAM7= <>
##$DBPOAL= (0..7)
0.5 0.5 0.5 0.5 0.5 0.5 0.5 0.5 
##$DBPOFFS= (0..7)
0 0 0 0 0 0 0 0 
##$DE= 6
##$DECBNUC= <off>
##$DECIM= 32
##$DECNUC= <off>
##$DECSTAT= 4
##$DIGMOD= 1
##$DIGTYP= 9
##$DL= (0..7)
0 120 120 120 120 120 120 120 
##$DP= (0..7)
150 150 150 150 150 150 150 150 
##$DP07= 0
##$DPNAME0= <>
##$DPNAME1= <>
##$DPNAME2= <>
##$DPNAME3= <>
##$DPNAME4= <>
##$DPNAME5= <>
##$DPNAME6= <>
##$DPNAME7= <>
##$DPOAL= (0..7)
0.5 0.5 0.5 0.5 0.5 0.5 0.5 0.5 
##$DPOFFS= (0..7)
0 0 0 0 0 0 0 0 
##$DQDMODE= 0
##$DR= 18
##$DS= 0
$$ [...]
##$SUBNAM2= <"">
##$SUBNAM3= <"">
##$SUBNAM4= <"">
##$SUBNAM5= <"">
##$SUBNAM6= <"">
##$SUBNAM7= <"">
##$SUBNAM8= <"">
##$SUBNAM9= <"">
##$SW= 18.0517328524113
##$SWIBOX= (0..15)
0 0 2 0 0 0 0 0 0 0 0 0 0 0 0 0 
##$SW_h= 3612.71676300578
##$TD= 16384
##$TD0= 1
##$TE= 0
##$TE2= 300
##$TE3= 300
##$TEG= 300
##$TL= (0..7)
0 120 120 120 120 120 120 120 
##$TP= (0..7)
150 150 150 150 150 150 150 150 
##$TP07= 0
##$TPNAME0= <>
##$TPNAME1= <>
##$TPNAME2= <>
##$TPNAME3= <>
##$TPNAME4= <>
##$TPNAME5= <>
##$TPNAME6= <>
##$TPNAME7= <>
##$TPOAL= (0..7)
0.5 0.5 0.5 0.5 0.5 0.5 0.5 0.5 
##$TPOFFS= (0..7)
0 0 0 0 0 0 0 0 
##$TUNHIN= 0
##$TUNHOUT= 0
##$TUNXOUT= 0
##$USERA1= <user>
##$USERA2= <user>
##$USERA3= <user>
##$USERA4= <user>
##$USERA5= <user>
##$V9= 5
##$VALIST= <valist>
##$VCLIST= <CCCCCCCCCCCCCCC>
##$VD= 0
##$VDLIST= <DDDDDDDDDDDDDDD>
##$VPLIST= <PPPPPPPPPPPPPPP>
##$VTLIST= <TTTTTTTTTTTTTTT>
##$WBST= 1024
##$WBSW= 4
##$XGAIN= (0..3)
0 0 0 0 
##$XL= 0
##$YL= 0
##$YMAX_a= 187007
##$YMIN_a= -160157
##$ZGOPTNS= <>
##$ZL1= 120
##$ZL2= 120
##$ZL3= 120
##$ZL4= 120
##$ABSF1= 10
##$ABSF2= 0
##$ABSG= 5
##$ABSL= 3
##$ALPHA= 0
##$AQORDER= 0
##$ASSFAC= 0
##$ASSFACI= 0
##$ASSFACX= 0
##$ASSWID= 0
##$AUNMP= <proc_1d>
##$AZFE= 0.1
##$AZFW= 0.1
##$BCFW= 1
##$BC_mod= 2
##$BYTORDP= 1
##$COROFFS= 0
##$CY= 83.5205535888672
##$DATMOD= 1
##$DC= 2
##$DFILT= <>
##$DTYPP= 0
##$F1P= 10.8118882576601
##$F2P= -7.23987719738617
##$FCOR= 0.5
##$FTSIZE= 0
##$FT_mod= 4
##$GAMMA= 1
##$GB= 0.15
##$INTBC= 1
##$INTSCL= 1
##$ISEN= 128
##$LB= 0.25
##$LEV0= 0
##$LPBIN= 0
##$MAXI= 10000
##$MC2= 0
##$MEAN= 0
##$ME_mod= 0
##$MI= 1.114404
##$NCOEF= 0
##$NC_proc= 0
##$NLEV= 6
##$NOISF1= 3.799351
##$NOISF2= 2.8
##$NSP= 1
##$NTH_PI= 0
##$NZP= 0
##$OFFSET= 14.38212
##$PC= 1
##$PHC0= -1278.943
##$PHC1= 10.73376
##$PH_mod= 1
##$PKNL= yes
##$PPARMOD= 0
##$PSCAL= 0
##$PSIGN= 0
##$REVERSE= no
##$SF= 200.129724274929
##$SI= 16384
##$SIGF1= 3
##$SIGF2= 2
##$SINO= 400
##$SIOLD= 16384
##$SREGLST= <1H.CDCl3>
##$SSB= 0
##$STSI= 0
##$STSR= 0
##$SW_p= 3205.1282051282
##$SYMM= 0
##$S_DEV= 0
##$TDeff= 0
##$TDoff= 0
##$TI= <>
##$TILT= no
##$TM1= 0
##$TM2= 0
##$TOPLEV= 0
##$USERP1= <user>
##$USERP2= <user>
##$USERP3= <user>
##$USERP4= <user>
##$USERP5= <user>
##$WDW= 1
##$XDIM= 8192
##$YMAX_p= 0
##$YMIN_p= 0
$$ End of Bruker specific parameters
$$ ---------------------------------
##NTUPLES= NMR FID
##VAR_NAME=  TIME,          FID/REAL,        FID/IMAG
##SYMBOL=    X,             R,               I
##VAR_TYPE=  INDEPENDENT,   DEPENDENT,       DEPENDENT
##VAR_FORM=  AFFN,          ASDF,            ASDF
##VAR_DIM=   8192,          8192,            8192
##UNITS=     SECONDS,       ARBITRARY UNITS, ARBITRARY UNITS
##FACTOR=    0.0002768,     1,               1
##FIRST=     0,             0,               0
##LAST=      2.2672688,     0,               0
##MIN=       0,             -160157,         0
##MAX=       2.2672688,     187007,          0
$$ Real data points
##PAGE= N=1
##DATA TABLE= (X++(R..R)), XYDATA
$$ [...]
857A539L03r96j207J847J806l527m998N32N447L772l103o459N49P951L412n254
$$ 1539 1842 846 -361 1486 3292 -235 -5233 -4701 746 4518 1415 -5044 -4495 3456 6868 1614
873A614n320P41M452J371n017l215N006L913m709l926M130O145K72p201n818O335
$$ 1614 -3706 -2965 1487 2858 -2159 -5374 -368 3545 -1164 -5090 -960 5185 5457 -1744 -7562 -1227
889a227J0124l617j2045j855R234O961m024r907p95J0119L192r020m905N958N898
$$ -1227 8897 5280 -6765 -8620 614 7575 3551 -6356 -7151 2968 6160 -2860 -7765 -1807 4091
904D091k784q256o74J1732O367j0913r752P052J1671Q2j1917r523P406J3485l799
$$ 4091 1307 -6949 -7623 4109 10476 -437 -10189 -3137 8534 8616 -3301 -12824 -5418 8067 4268
919D268j4131m83J1257N597n158q203K161J1841L89j3996l597J1829O470p418
$$ 4268 -9863 -10346 911 6508 1350 -6853 -4692 7149 7538 -6458 -10055 1774 8244 826
933H26j1473n03J4876R123j2842j2749Q050J3002j55j0560q013O627J1932n381
$$ 826 -10647 -11150 3726 12849 7 -12742 -4692 8310 8155 -2405 -10418 -3791 8141 2760
947B760j3949L406J2813R81q623o131N405J3603p64j7755l460J6543P527r691
$$ 2760 -11189 -7783 5030 6011 -2612 -8743 -3338 10265 9501 -8254 -11714 4829 12356 2665
961B665j1093n12J2483Q981j1308j2355Q007J0829l913q863j972P891Q328p526
$$ 2665 -8428 -8940 3543 12524 1216 -11139 -3132 7697 3784 -5079 -7051 840 9168 1642
975A642j2483O879J4364j403j0469n536M800J2617l5j7436l973J5497N296q351
$$ 1642 -10841 -3962 10402 8999 -1470 -7006 -2206 10411 10376 -7060 -11033 4464 9760 1409
989A409n262l5O441P219p677r329R010P851r149p988K816P203N648o376j1939
$$ 1409 -3853 -3888 2553 9772 2095 -7234 1776 9627 478 -7510 -4694 2509 8157 1781 -10158
1004a0158N457J4506o98q954k902K972P434R29j1883l397J0918J448p970q81K139
$$ -10158 -4701 9805 9107 153 -2749 223 7657 8586 -3297 -6694 4224 5672 -2298 -3179 -1040
1019a040K204L073n789n309J0232O354j0024n764L646L715N297j241j0784P96
$$ -1040 1164 4237 -1552 -6861 3371 9725 -299 -6063 -2417 1298 6595 5354 -5430 -4634
1033d634J0462j907n648K706J59j023K516l849l122O910J145o811R72L779n96
$$ -4634 5828 3921 -1727 979 1138 115 2631 -1218 -4340 2570 3715 -3096 -2124 1655 1059
1048A059K90k998l953N930M563n692k246J117j824M801N330n658j801M897l816
$$ 1059 1349 -1649 -5602 328 4891 -801 -3047 -1930 -3754 1047 6377 719 -1082 3815 -1
1063ak125O982j662o184K949m16m773M005K305m572K053K834l612J662L306m193
$$ -1 -2126 4856 3194 -2990 -41 -457 -5230 -1225 1080 -3492 -1439 1395 -2217 -555 2751 -1442
1079a442p32L954k98Q91J84o992k38R137R81m459m61k429l34N355j765m667M711
$$ -1442 -2174 1780 1482 2373 2557 -4435 -4673 4464 5445 986 525 -1904 -2238 3117 1352 -3315 1396
1096A396J500o531m52L325J538L549k406p668M359Q046n277n741K587K317L560
$$ 1396 2896 -3635 -4087 -762 776 4325 1919 -5749 -1390 6656 1379 -4362 -1775 542 4102
1111D102J025r621l185J1299L570o909r73J842l00N52l687k856Q100M479r724
$$ 4102 5127 -4494 -7679 3620 7190 281 -692 1150 850 1402 -2285 -5141 2959 7438 -2286
1126b286o714M420O787L846m635q568M203J0173l357q399J194N629M054j659q809
$$ -2286 -9000 -4580 2207 6053 1418 -7150 -2947 7226 3869 -4530 -3336 2293 6347 4688 -4121
1141d121j541R611J308q491j278N037K195k809q193k219J2707P752j0453q671
$$ -4121 -5662 3949 5257 -3234 -4512 525 2720 -89 -8282 -10501 2206 9958 -495 -9166
1155i166M707P338L455l663p627K949R058m465j0500K186Q355J843m984o463J865
$$ -9166 -4459 2879 6334 2671 -4956 -2007 7051 2586 -7914 -5728 2627 4470 -514 -6977 -5112
1170e112R615M45r975j750Q718N117m927j0296k527J1164P603q185q350L447O221
$$ -5112 4503 4948 -5027 -6777 1941 7058 2131 -8165 -10692 472 8075 -110 -8460 -5013 1208
1185A208R92l877k855N584O607n877r234L325R157J684o504p056K294R235m65
$$ 1208 2200 -1677 -4532 1052 7659 1782 -7452 -4127 5030 6714 210 -6846 -4552 4683 4218
1200D218j0719k202Q701M867l826o739j553P392O156m694n283M188M813l101n846
$$ 4218 -6501 -8703 -2 4865 1039 -5700 -7253 139 6295 1601 -3682 506 5319 2218 -3628
1215c628qO900M125o843q512K468Q281K422m872n257K178P262Np685j355O409
$$ -3628 -3636 3264 7389 546 -7966 -5498 2783 5205 333 -4924 -2746 4516 4521 -3164 -4519 1890
1231A890K493l702l565K83L780J916l688k274M822M230l476o017m0O230M171m181
$$ 1890 4383 681 -2884 -2601 1179 3095 -593 -2867 1955 6185 2709 -3308 -3348 2882 7053 2872
1247B872o406L10M434J620j893k274L64K646j72l567j46L899Q51l015j426J907
$$ 2872 -3534 -3224 1210 2830 937 -1337 -973 1673 1501 -2066 -2212 1687 2538 -477 -1903 4
1263DK387k02k793r97L110K821j279l636j868K071L157l66k651p19L94l76N06
$$ 4 2391 2189 -604 -1601 1509 4330 3051 -585 -2453 -382 2775 2409 -242 -961 -567 -943 -437
1280d37J247j36p29m25q09J16J763P37j199p44P35J081N40l14r23o72M69J563
$$ -437 810 674 -55 -480 -1289 -1173 590 1327 128 -616 119 1200 1740 1426 503 -169 300 1863
1298A863M17k455k605O52K467J137q30k030j027J752K020o68j151P56N96j294
$$ 1863 2280 -175 -2780 -2128 339 1476 646 -1384 -2411 -659 1361 693 -458 298 894 -400
1314d00j194J022K289L19k669j745K321L234m64l688k007K980L941j525n081q69
$$ -400 -1594 -572 1717 2036 -633 -2378 -57 3177 2713 -975 -2982 -2 3939 2414 -2667 -3536
1330c536L758K109j752k234M78K374K23k890o74L824K392l391m427J288N672K028
$$ -3536 222 2331 579 -1655 -1177 1197 1420 -1470 -2144 1680 4072 681 -3746 -2458 3214 5242
1346E242m774m251K797N276J92m784l059L017M425j609n274j11M479Q90l756k076
$$ 5242 468 -3783 -986 4290 4482 -302 -3361 -344 4081 2472 -2802 -2913 1566 2456 -1300 -3376
1362c376L018M197j285n894r89O567M289m247o092O53O383L031n090n285K732
$$ -3376 -358 3839 2554 -3340 -4329 2238 6527 2280 -3812 -3159 3224 6255 1165 -4120 -1388
1377a388N206j118n096j446L732L141l101m941K286O513k5o105k337M809N605
$$ -1388 3818 2700 -2396 -3842 -110 3031 -70 -5011 -2725 3788 3763 -2342 -4679 130 5735
1392E735j565p535k298O552M457m207n453O50M954K338l967l688L713M738k739
$$ 5735 4170 -3365 -5663 889 5346 1139 -4314 -3664 1290 3628 -339 -4027 -314 4424 1685
1407A685n171O33M722J892m516n595K304P104J26o711k877M289N488l00n767j862
$$ 1685 -3486 -2853 1869 3761 -755 -6350 -4046 3058 3184 -3527 -6404 -2115 3373 3073 -2694 -4556
1423d556N577L193l864l051J980K968j02m160k733M412M348m440n788J885N254
$$ -4556 1021 4214 350 -2701 -721 2247 2145 -2015 -4748 -336 4012 -428 -6216 -4331 923
1438I23J838l233m692J401O624J046n295j833L060K431o73l112j009L587J257
$$ 923 2761 -472 -5164 -3763 2861 3907 -1388 -3221 -161 2270 1597 -1515 -2524 1063 2320
1453B320m179j641L411K543r67l502k135L883M473l153m964R66L092J247p86k921
$$ 2320 -1859 -3500 -89 2454 1487 -2015 -4150 -267 4206 1053 -3911 -2945 147 1394 608 -2313
1469b313m19L902P25l154M07K440k65r75q18k03K655R84m063j753L213J788p91
$$ -2313 -2732 1170 1895 -1259 -852 1588 1323 348 -470 -673 1982 2966 -1097 -2850 363 2151 1360
1486A360j707k279J030L562o38k762N10O02l15J249J0j021J417J21k140J309K143
$$ 1360 -347 -2626 -1596 1966 1328 -1434 -924 -322 -637 612 622 -399 1018 1139 -1001 308 2451
1503B451j344p52K33j292J048K212k036k097J243K69J11J438j627k428J606J594
$$ 2451 1107 355 588 -704 344 2556 520 -1577 -334 -65 46 1484 -143 -2571 -965 629
1519F29l53L95r24j515J807J460j260L36O08j416J42O34j005J218J198l255j317
$$ 629 276 671 -253 -1768 39 1499 239 575 1183 -233 -91 543 -462 756 1954 -1301 -2618
1536b618L212Q56j295m79j624M35M015m89m408K60K556K49J17q28j426J938J320
$$ -2618 594 1450 155 -324 -1948 -1513 2502 2013 -2395 -2135 421 670 787 -41 -1467 471 1791
1553A791k652J2L181K7j980j479p17K960K862l939m039K714K975n84j596k193
$$ 1791 -861 -849 2332 2359 379 -1100 -1817 1143 4005 66 -3973 -1259 1716 1132 -464 -2657
1569b657N46M306j34m450L99L263j7j131p33L02L038K38m955o16N253J678k892
$$ -2657 -2111 2195 2061 -2389 -1990 1273 1256 125 -608 -306 2732 2970 -1985 -2601 2652 4330 1438
1586A438l162j310L345M023l403m827K501L426j206j904q20J275L428q61m490
$$ 1438 -1724 -3034 311 4334 931 -3896 -1395 2031 825 -1079 -1899 -624 2804 1943 -2547
1601b547J213M671m41l194j090J693L810J04o118k202N364K999k628l229j269
$$ -2547 -1334 3337 2896 -298 -1388 305 4115 4219 -1899 -4101 1263 4262 1634 -1595 -2864
1616b864K376L292k250l447K909L206k305k741J92K519K829k040n026J305N127
$$ -2864 -488 2804 554 -2893 16 3222 917 -1824 -1632 887 3716 1676 -3350 -2045 3082
1631C082l70l821j407J778L908Q17n237k526M503K585k482j864L5R75R00k355
$$ 3082 2712 -1109 -2516 -738 3170 3987 -1250 -3776 727 3312 830 -1034 -999 -24 876 -1479
1647a479k179L567L461k997l874N79L469K898j551m219O01M249J05l114j285J045
$$ -1479 -3658 -91 3370 373 -3501 -2922 547 3445 1894 -2325 -1724 2525 2630 -484 -1769 -724
1663g24K355M84l699j883L140J219k503n11J673J026j13k360j802L456L974k076
$$ -724 1631 2115 -1584 -3467 -327 892 -1611 -2122 -449 577 464 -1896 -3698 -242 3732 1656
1679A656l901l13K025K014k18k438k84K198j37j871j1J221J001j56j963o69K197
$$ 1656 -2245 -2558 -533 1481 1263 -1175 -1459 739 602 -1269 -1280 -59 942 786 -1177 -1846 351
1696C51M28k353m92J680J214m6j981j987J904L259k28j844o07o2O98R60m01j88
$$ 351 779 -1574 -2066 -386 828 782 -1199 -3186 -1282 1977 1749 -95 -702 -764 -66 894 493 305
1714C05P73q92j613N20J194J81j76r54r21J040R74j027p69O76P85O15j85j358
$$ 305 1078 186 -1427 -907 287 468 292 -662 -1583 -543 431 -596 -1365 -689 96 711 526 -832
1732h32m66J233J157M17m40j391n98Q78N84J75K69o55j098j06J86L63J090m4j689
$$ -832 -1298 -65 1092 1509 1069 -322 -920 -42 542 717 986 331 -767 -873 -687 -324 766 722 -967
1751i67n28J215Q78n9p40o05J040J528o46j769k77J180J176j10j476p98P78K14
$$ -967 -1495 -280 598 539 -201 -806 234 1762 1116 -653 -930 250 1426 1316 -160 -958 -180 34
1769C4p23L01J041N6j187j441J54K408J383j960k240O98K202O84j479j443R87
$$ 34 -689 -388 653 709 -478 -1919 -1765 643 2026 66 -2174 -1476 726 1410 -69 -1512 -525
1786e25K022k17j919n42J317J027p71j396M68J629n64k345k36K500J709j398k962
$$ -525 1497 1280 -639 -1181 136 1163 392 -1004 -536 1093 529 -1816 -2052 448 2157 759 -2203
1803b203n64K965K231j714k536M20K142O60j531j188J387J868r28k096L44K099
$$ -2203 -2767 198 2429 715 -1821 -1401 741 1401 -130 -1318 69 1937 1009 -1087 -743 1356
1819A356N25j924j748J256K759l54l500j343K626K628p96k900r78K326K006j207
$$ 1356 1881 -43 -1791 -535 2224 1870 -1630 -2973 -347 2281 1485 -1415 -2393 -67 1939 732
1835G32j771Q53J888k13j985n87K173J654j856k707O33K774O98k414k260J300
$$ 732 -1039 -186 1702 1489 -496 -1083 1090 2744 888 -1819 -1186 1588 2286 -128 -2388 -1088
1851a088L289K21l091j363K034K026n21j862m25J650P01j864j067J863J782j044
$$ -1088 2201 2422 -669 -2032 2 2028 1507 -355 -780 870 1571 -293 -1360 503 2285 1241
1867A241k389m54K545K135j660k907L18K575Q11j793k005L55K166L76k062q28
$$ 1241 -1148 -1602 943 3078 1418 -1489 -1171 1404 2215 422 -1583 -1228 938 1314 -748 -1576
1883a576J486R36q26q95O51J722K13k152j076K040J998q52k386j014J560J911
$$ -1576 -90 846 20 -875 -224 1498 1711 -441 -1517 523 2521 1669 -717 -1731 -171 1740
1899A740q36k203o8J490M32o87o44K84J080l6j322J22J569J08j438q62N77J548
$$ 1740 904 -1299 -1367 123 555 -132 -776 -492 588 552 -770 -648 921 1029 -409 -1271 -694 854
1917H54M99j865j547J238J692m2r33q57J23J180K59r69j7N68m11m69K36K92L23
$$ 854 1353 -512 -2059 -821 871 829 -104 -961 -838 342 601 -368 -385 183 -228 -697 -461 -169 154
1936A54j79j103q7J413N24q40p19j54P65J206k97j285j08N83L19L92k37q68M2
$$ 154 -25 -1128 -1215 198 722 -118 -837 -991 -226 980 683 -602 -710 -127 192 584 347 -521 -479
1955d79M28k04J88L50n86l42K86m7M10P20p33r43O20P96K27M6j009q25J223J117
$$ -479 -51 -255 -67 283 -303 -645 -359 -406 4 724 -9 -952 -332 464 691 737 -272 -1097 126 1243
1975A243p69q21k22rQ17L88j012k63P05k86l99N40L25L3k20j001P5J766L59j604
$$ 1243 474 -347 -569 -578 239 627 -385 -648 57 -229 -628 -88 237 270 50 -951 -876 890 1249 -355
1995c55p89N32J081Q45j053j684P92J628l50q03j19M9N07M0j043K79J410o78j660
$$ -355 -1144 -612 469 1314 261 -1423 -631 997 647 -156 -275 -226 281 321 -722 -443 967 289 -1371
2014a371K33J260Q20k78j864p34K261J473j522j398L06R62Q98o76j486O18J360
$$ -1371 -1138 122 942 664 -1200 -1934 327 1800 278 -1120 -814 148 1046 370 -1116 -498 862
2031H62p71j063N25P25K52p41j499O95K427l54k502m09J467J332J97j780j365
$$ 862 91 -972 -447 278 530 -211 -1710 -1015 1412 1058 -1444 -1853 -386 946 1143 -637 -2002
2048b002J798J706j226j139O49O42N8o55q06J050J371j331j813P76J656M07j155
$$ -2002 -204 1502 276 -863 -214 428 486 -169 -975 75 1446 115 -1698 -922 734 1141 -14
2065a4j781M63K625L39k265p43J138J041K61j070j025J222R67j455o86J365O92
$$ -14 -1795 -1332 1293 1632 -633 -1376 -238 803 1064 -6 -1031 191 1158 -297 -983 382 1074
2082A074n89j063o95J439J971j191k309M55J693N26o66j488l05J801O63j595n44
$$ 1074 485 -578 -1273 166 2137 946 -1363 -908 785 1311 645 -843 -1148 653 1316 -279 -823
2099h23R94M18k20m09n0J137M00j646p23J557J053m91j309j166Q72J984n28j909
$$ -823 171 589 369 -40 -90 1047 1447 -199 -922 635 1688 1197 -112 -1278 -406 1578 1050 -859
2117h59J11R84J51l2l94l45R07L99j118j16J166P1q40m95K08J104M86j509j136
$$ -859 -748 236 387 355 -39 -384 523 922 -196 -312 854 925 85 -410 -202 902 1388 -121 -1257
2136a257R52J118J75n76j176j13J303K11q73J77L22n16o3K18l8N27J45j026j36
$$ -1257 -305 813 988 412 -764 -877 426 637 -236 -59 263 -253 -316 -98 -136 391 536 -490 -626
2155f26J068K65n12m45k66O46R55o16j139O5M58L84M14m53q56J98L72j17L50L55
$$ -626 442 707 195 -250 -516 130 1085 469 -670 -605 -147 237 651 198 -658 -460 -88 -205 145 500
2175E00m76m38p1J11O12M27o94n59K33L36L58l8q57j30J026K26o67k77k37Q2R24
$$ 500 24 -414 -485 -374 238 665 -29 -588 -355 -19 339 301 -556 -686 340 566 -101 -378 -615 -533 391
2196C91K06q75k03K96k13J22O27J71k08m88o33L92J195J90q38o97OP95N60p62
$$ 391 597 -278 -481 -185 -398 -276 351 522 314 -174 -807 -415 780 970 132 -565 -559 236 796 34
2216C4p80O24O65k77m51k82R9O14R0n26J21M18m65o07K76R10O77o26j494j75J454
$$ 34 -746 -122 543 266 -185 -467 -368 246 336 -190 -69 349 -116 -723 -447 463 1140 514 -980 -1155 299
2237B99Q76n18r10m39N33P50m48p39N08O04n03n99R2M68L66l94o99M56J052k58
$$ 299 1175 657 -253 -692 -159 591 143 -596 -88 516 13 -586 -494 -26 340 -54 -753 -297 755 497
2257D97j243m11J008J317j16j583q02J011R72k01n85k06K31J44n33l22Q89O93
$$ 497 -746 -1157 -149 1168 1052 -531 -1333 -322 650 449 -136 -342 -111 33 -500 -822 67 760
2275G60q05j045J80J038N80p28j049M21J345J40j154p80N33J156K37j067o91N44
$$ 760 -45 -1090 -910 128 708 -20 -1069 -648 697 837 -317 -1097 -564 592 829 -238 -929 -385
2293c85M19l79j55M00M09k20r28l65J213J160o37j327j82R67Q27m16j138l8J027
$$ -385 34 -345 -500 -100 309 89 -839 -1204 9 1169 532 -795 -977 -10 817 401 -737 -775 252
2312B52L11p37m95K83N94J18m83o9O45N8q30l06P70Q16j85j192p84Q29J209j20
$$ 252 563 -174 -669 -386 208 326 -157 -226 419 477 -353 -659 111 927 742 -450 -1234 -405 804 684
2332F84r87m37M60O75K1n29k4N43J1m50n8L53K05k70n81P2Q67K23r04o56M28R11
$$ 684 -303 -740 -280 395 416 -113 -137 406 417 -33 -91 262 467 197 -384 -312 555 778 -126 -782 -354 557
2354E57M57o09r17Q9Q52K57l12k59q8Q3J5j69J29M03j73n72pN25L51j49n94k63
$$ 557 1014 405 -512 -423 429 686 374 115 27 110 125 -44 85 488 315 -257 -264 261 612 463 -131 -394
2376c94O70O19l52p18k55L50N64Q2n47l20J17J17J25J76l0j18j39k48J58O28P6
$$ -394 276 895 543 -175 -430 -80 484 566 19 -301 -184 -67 58 234 204 86 -53 -301 -143 485 561
2397E61n95l41J69M10L61l30p10K6O57K53k58m11k46L07M56n1k54l9q4q0J48K06
$$ 561 -34 -375 -206 204 565 235 -475 -449 208 461 203 -208 -454 -147 309 258 4 -35 -119 -199 -51 155
2419A55J58k1n28l59N18O55j28n40m22J61P31K42o74m31L13L67J00j65l54J0K95
$$ 155 313 292 -236 -595 -77 578 450 -90 -512 -351 380 622 -52 -483 -170 197 297 132 -222 -212 83
2440H3j18j29L35J03m18k98J32N24N03l99q94K6Q40M48l27o45k55N56M74l78l95
$$ 83 -35 -164 171 274 -144 -442 -310 214 717 318 -576 -550 290 738 411 -234 -489 67 541 163 -232
2461b32J20J43j9l3p1K03K18m79m09O22O85l05o92l28M20Q97O4r85m42N79M93
$$ -232 -112 31 12 -21 -92 111 329 -150 -559 63 748 443 -249 -577 -157 740 804 -181 -623 -44 449
2482D49p4l20k90K02K53l10j74M42J34m72l36J34N71L84n98q46L73R92J66n92
$$ 449 375 55 -235 -33 220 -90 -264 178 312 -160 -496 -362 209 593 -5 -851 -478 514 680 88
2502H8n93M4P54L63n99l97K63J10j30o8K7K14L2o17k45P78N29m93o18j01N33P64
$$ 88 -505 -461 293 656 57 -340 -77 33 -97 -165 -138 76 108 -509 -754 24 553 60 -558 -659 -126 638
2524F38k18j002j19P57K79k30l21j97K47K37k87p6M22o2n47j07L14M69J27o97
$$ 638 420 -582 -701 56 335 105 -216 -413 -166 71 -216 -292 130 68 -479 -586 -272 197 324 -373
2544c73o25N68Q15r4n51l52J89O61J95n46j99L19M8r1M7l0N7m1m70k5P09J47o19
$$ -373 -998 -430 385 291 -260 -612 -423 238 433 -113 -312 7 55 -36 11 -19 38 -3 -473 -498 211 358 -261
2567b61l71J06M88N65l11q22P4O60J96j09k15k40J89K95k02j6K77j70l53J10K39
$$ -261 -632 -526 -38 527 216 -606 -532 128 324 215 0 -240 -51 244 42 26 303 133 -220 -110 129
2588A29K07L8n82l88O09N32k80m68k47J32O08J98n35k41K47J04J20J27j35m9L4
$$ 129 336 374 -208 -596 13 545 265 -203 -450 -318 290 488 -47 -288 -41 63 183 310 175 126 160
2609A60k66O4N25k2n06k26N9L19M31l46o93J38N64J32p6l05k91L56M17j98j42
$$ 160 -106 -42 483 461 -45 -271 -212 107 538 192 -501 -363 201 333 257 -48 -339 17 434 236 94
2630I4J06j53j14K24P0P2L6n09l31N55M56k57m05l05J05N92J69n59k36K62J86
$$ 94 200 47 -67 157 227 299 335 -174 -505 50 506 249 -156 -461 -356 236 405 -154 -390 -128 58
2651E8J39m0k69O0K17j55K6L34j13l81p6Q6L28L56m44p35J75N93J89j57m28k72
$$ 58 197 157 -112 -52 165 10 36 370 257 -124 -200 -114 214 570 126 -609 -434 159 348 191 -237 -509
2673e09L97L83k15j60J09m4M7R6m9J22J38m07j73N33K75l55l81k01K73O28k5p23
$$ -509 -112 271 56 -104 5 -39 8 104 55 177 315 -92 -265 268 543 188 -193 -394 -121 507 482 -241
2695b41k78L34L16J44j18k89O9J35j22Q5L22n7k79j05K9L10K98m16n20L00N18
$$ -241 -519 -185 131 275 157 -132 -63 72 -50 35 357 300 21 -84 -55 255 553 137 -383 -83 435
2716D35J0l50m16l7N42L00l27l10m8M5J84J30l1P6m5m30k3N96K66k60l57k15K22
$$ 435 445 95 -321 -358 184 484 157 -153 -201 -156 28 158 127 203 158 -272 -295 301 567 307 -50 -265 -43
2739d3N33q0n87j36L47J91q7l00j96K19K28l9nJ2j75r4R0J66L30P1n95m41L94
$$ -43 490 410 -177 -313 34 225 138 -162 -358 -139 89 50 45 57 -118 -212 -122 44 374 445 -150 -591 -197
2762a97N39O7k98m28j02L93K64k39k27M8J14K7j14q9J38K6j95R2K58l1k24j89
$$ -197 342 409 111 -317 -419 -26 238 -1 -228 -180 -66 -39 -153 -242 -104 -78 -273 -181 77 46 -178 -367
2784c67rM49M60l05o84q0M54L75J5l49l25P4J84QK7M3p1j22j15P1L12R2l59j80
$$ -367 -376 73 533 228 -456 -536 -82 293 308 -41 -366 -292 -108 -100 -73 -30 -101 -223 -338 -267 45 137 -222 -402
2808d02L30K94n3l23k82J93N68J16m69l62Q5K76K04n2j56o0q9j36J64L13P9k15
$$ -402 -72 222 169 -154 -436 -243 325 441 -28 -390 -305 -29 175 123 -33 -93 -182 -318 -154 159 238 23
2830B3l55q4M55L92k70m45O0L35K06j18l53j22L29K44j43j84p5kM1M2J20J71j48
$$ 23 -332 -416 39 431 161 -284 -224 111 317 199 -154 -276 53 297 154 -30 -105 -107 -66 -24 96 267 119
2853A19m31q4M16L80n7m12l54K24M99M6l43j66J18J72P5j26j29Q4M4r9O1J42p5
$$ 119 -312 -396 20 400 343 -69 -423 -199 300 346 3 -163 -45 127 202 76 -53 31 75 -24 37 179 104
2876A04k40j64J29M05J35m46l99J65M33K65j70l91p8K74J72n5n6n1o0K0j4N6J24
$$ 104 -136 -300 -171 234 369 -77 -476 -311 122 387 217 -174 -252 22 194 139 83 32 -28 -8 -22 34 158
2899A58j15l10M3L36J44j82l29j29L26M29j37l94j19J29K16J52p8k00l6K2QJ46
$$ 158 43 -267 -224 112 256 74 -255 -384 -58 371 234 -160 -279 -150 66 218 140 -60 -96 -74 -66 80
2921H0J21j17j94p8J25K95K4l25j93J56K69J29k00l49J3L31J56q9j11j70k2K12
$$ 80 201 84 -110 -188 -63 232 256 -69 -262 -106 163 292 92 -257 -244 87 243 154 43 -127 -149 63
2943F3J44j3j7j43j77J13K85N0j55k31j33K32K78q4k76j27R1K44J45j95k07M6
$$ 63 207 194 177 34 -143 -30 255 305 150 -81 -214 18 296 212 -64 -191 -100 144 289 94 -113 -67
2965f7J48J15J07r4k05j7P3Q9J67k6l21j77J52K31J37j30l66o7L44J98j04j92
$$ -67 81 196 303 209 4 -13 60 149 316 290 -31 -208 -56 175 312 182 -184 -251 93 291 187 -5
2987ej40Q1K29K3j59p5mk2R8J14J5p3j84r2K86L11j37l33j63J00L42J57l77k95
$$ -5 -145 -64 165 188 29 -46 -50 -72 26 140 155 82 -102 -194 92 403 266 -67 -230 -130 212 369 -8 -303
3011c03J57J93%nq9j11Q2O2k5J23Q5k67j73J86K50P4k49l68N1M13J83k47k96n8
$$ -303 -146 47 47 42 -47 -158 -76 -14 -39 84 169 -98 -271 -85 165 239 -10 -378 -327 86 269 22 -274 -332
3035c32K32K50j12j77M8K5p3N8J28J1n9k18j27L43K99k40l83KK72K99Lm33j70
$$ -332 -100 150 38 -139 -91 -66 -139 -81 47 58 -1 -219 -346 -3 296 56 -327 -325 -53 246 249 -184 -354
3058c54L22K10j11q1o5o2M3%J4J76ql31j09K84K84Ml18k67K41M10j2k98j59N5
$$ -354 -32 178 67 -14 -79 -141 -98 -98 -84 92 84 -247 -356 -72 212 216 -102 -369 -128 282 270 -28 -187 -132
3082a32K23J10j75j47J15l6j17J53J42o8j69j46N9L72J66l74l00J54L03J38j19
$$ -132 91 201 26 -121 -6 -42 -159 -6 136 68 -101 -247 -188 184 350 -24 -324 -170 133 271 152
3103A52l21l5K59Q7r1j2l5p7J8M5P7J00j48k90R2L08Q5j67k77q2K85K62j43k10
$$ 152 -169 -204 55 142 51 39 4 -73 -55 -10 67 167 19 -271 -179 129 214 47 -230 -312 -27 235 92 -118
3127a18l3K8J55J35q0r7K0q9rK50M8k35j61K4J03J99k3l09j28K03J93K8j07j57
$$ -118 -151 -123 32 167 87 -10 10 -79 -88 162 210 -25 -186 -162 -59 140 117 -192 -320 -117 76 104 -3 -160
3151a60PJ52Q8L7k8j89p2J54J22K8o6k24j03K33K02r6j28j04l3J70J60q7j12n7
$$ -160 -153 -1 87 124 96 -93 -165 -11 111 139 73 -151 -254 -21 181 85 -43 -147 -180 -10 150 63 -49 -106
3175a06l4J38J89r0j89m3M2J82J63j50k44L6J38Q1N5q0j79l7R9Q1R1n0k14q2J31
$$ -106 -140 -2 187 97 -92 -135 -93 89 252 102 -142 -106 32 113 168 88 -91 -128 -29 52 143 93 -121 -203 -72
3200g2K10P5j55k34Q6K79N1j05r1o0M8J84Lj21j1m3j03J20J92n7k06j85L0K99
$$ -72 138 213 58 -176 -90 189 240 135 44 -16 32 216 219 98 87 44 -59 61 253 196 -10 -195 -165 134
3224A34J57k07k49jJ86J78J1k25n1J58L0n1O0Pr5o3K7J15J09j31l00qL01K06j51
$$ 134 291 84 -165 -166 20 198 209 -16 -67 91 121 70 130 137 42 -21 6 121 230 99 -201 -209 92 298 147
3249A47l15j23K55K49o9j57l5RL9P2K7L5J6j85j25J88K31j01k64j14J72K49n0
$$ 147 -168 -291 -36 213 144 -13 -48 -39 0 72 99 134 150 -35 -160 28 259 158 -106 -220 -48 201 151
3272A51l29j11J93K19J1j67j42P1J10l0L3J49o2k39n2J64K28M3k46l04J14L17
$$ 151 -178 -289 -96 123 134 -33 -175 -104 6 -24 9 158 96 -143 -195 -31 197 240 -6 -310 -196 121
3294A21N0k37j67O5J95K9j42n2R1J5j3M6N6nj07j43R9L17O3l08k49J03K75J57
$$ 121 171 -66 -233 -168 27 56 -86 -138 -47 -32 -45 1 57 52 -55 -198 -99 218 281 -27 -276 -173 102 259
3318B59j42k48l5J39P3j3l1k5j8o3k8J35J26j45j79R4J96Q1j16k35j0K92J84j76
$$ 259 117 -131 -166 -27 46 33 2 -23 -41 -104 -132 3 129 -16 -195 -101 95 176 60 -175 -185 107 291 115
3342A15k05k7O1J12N2l7n4r5j06N2K02Q6j31j87m7K00K04q6k11j7J62Q3k4j10
$$ 115 -90 -117 -56 56 108 71 17 -78 -184 -132 70 156 25 -162 -209 -9 195 109 -102 -119 43 126 102 -8
3366ho8M4O4JJ0k8j05r8O4J68J03j41k57k1K33J74l5j51j02M6J48L4o1mk0q5L6
$$ -8 -76 -32 32 33 43 15 -90 -188 -124 44 147 6 -251 -272 -39 135 100 -51 -153 -107 41 75 14 10 -10 -95 -59
3393e9J26Pj10j12lJ51J41j38k21k2J91J58l3j57q3O3O6N0N7k1j05o9K4J47J30
$$ -59 67 74 -36 -148 -151 0 141 3 -218 -240 -49 109 76 -81 -164 -101 -35 15 72 51 -54 -123 -99 48 178
3418A78p9k44l1K02J26p4j84p2J19J57n1j16j4K9J5N3M2L7n2j64k1K11J66j12
$$ 178 99 -145 -176 26 152 78 -106 -178 -59 98 47 -69 -83 -54 -39 14 56 93 41 -123 -144 67 233 121
3442A21k42o8J53K10j4k12r2J24R6k3l8j7Lnl8O5J26m1k03k7J75J85k1k38j56
$$ 121 -121 -189 -36 174 160 -52 -144 -20 76 53 15 -2 1 -4 -42 23 149 108 -95 -122 53 238 217 -21 -177
3467a77J66K54k6j83q9M3Q4K1m1J0K3q3p1Q1J44J1j78j57J19K61Rk49j32J05J88
$$ -177 -11 243 217 34 -55 -12 72 93 52 62 85 2 -69 12 156 167 -11 -168 -49 212 221 -28 -160 -55 133
3492A33N9j30j56N4J00k1j0N3j2j01o9N5J67Q5j86k21R4K42N2j58j74J9K17N6
$$ 133 192 62 -94 -40 60 39 29 82 70 -31 -100 -45 122 207 21 -200 -106 136 188 30 -144 -125 92 148
3516A48j18q4L9K4PJ0L3L0q7j52N1K29N7j77j95J4K12J51j25k13MJ41L7j4m5r
$$ 148 30 -54 -15 9 16 26 59 89 2 -150 -99 130 187 10 -185 -171 41 192 67 -146 -142 -1 36 22 -23 -32
3542c2Rk7rR6P7j07j50L8J79J08j11k30j1K22J08r6j38j6M7J02rm0K5j4j09K2
$$ -32 -23 -50 -59 37 114 7 -143 -105 74 182 71 -159 -170 52 160 64 -74 -90 -43 59 50 10 35 21 -88 -66
3568f6J50N7j01j54k9J70J65j17k02KJ12J20j9j21n7Q2K4j8N9K9p9j00pJ47J30
$$ -66 84 141 40 -114 -143 27 192 75 -127 -125 -13 107 88 -33 -90 -8 16 -2 57 86 7 -93 -100 47 177
3593A77r1k24k8J83J45o3j54r0J21J28m7q0K2J3n1K9M6M6k5j46p8J78J69j06k02
$$ 177 86 -138 -166 17 162 99 -55 -145 -24 104 57 -23 -1 12 -39 -10 36 82 57 -89 -167 11 180 74 -128
3618a28o4J34J75pj81o6J03P4j1%lj7k9m4P0J36m0k11p2J49J46rk09j34J40J76
$$ -128 -192 -58 117 110 -71 -137 -34 40 29 29 26 9 -20 -64 6 142 102 -109 -181 -32 114 105 -104 -238 -98 78
3644G8l9j23m2J9Q2J8m0M4M3j14r0J27J56l7j60j28R6K14M4k25j11J07J34K1r8
$$ 78 39 -84 -126 -107 -25 -7 -47 -3 40 -74 -164 -37 119 82 -78 -206 -110 104 148 -77 -188 -81 53 74 -24
3669b4p4N4M4n7J4R1Pj13o2L8J85O5j94j78J23K01K6j32j33J5J24N6p9l8M6j6
$$ -24 -98 -44 0 -57 -43 48 55 -58 -120 -82 103 168 -26 -204 -81 120 146 14 -119 -104 20 76 -3 -41 5 -11
3695a1o2M0Q4M2q8j54M9J92O0j45j47L0J76J12j20j49L3J02J9k6Jpk5m2rJ20Q4
$$ -11 -73 -33 51 93 5 -149 -100 92 152 7 -140 -110 66 178 58 -91 -58 44 63 37 38 31 6 -36 -45 75 159
3722A59j25j64L7J68R6r6j84j8J84Q5q7q0J3K1K3J5KK9m7r3J0J21Q6j14j79kJ73
$$ 159 34 -130 -93 75 171 75 -109 -127 57 142 55 -25 -12 9 32 47 49 78 31 -62 -52 69 155 41 -138 -140 33
3749C3J05p6j55j7J01Q6j2o9rM4j8m3Q5N9p6r1j7J30R2p6j79n3J75J16o3j38m7
$$ 33 138 62 -93 -110 -9 77 65 -4 -13 31 13 -30 55 114 38 -53 -70 60 152 76 -103 -156 19 135 72 -66 -113
3776a13P9Q4j9l6K8oo7j0R7Q4o1j24o1J27J43n7j81l0J17R7l7j16k2P8K6l2J5
$$ -113 -34 50 31 -5 23 17 -50 -60 37 121 60 -64 -125 2 145 88 -93 -123 -6 91 54 -62 -84 -6 20 -12 3
3803CK8k2p5j8J00J43m8j95o6J78J33k2j49r2Q5J20m1q5LM0om2OO5K9j12p3J06
$$ 3 31 9 -66 -84 16 159 111 -84 -150 28 161 139 -10 -102 -17 103 62 -23 -20 20 14 -28 -22 43 72 -40 -113 -7
3831gJ51l4j67q0J12J81Lj70r0R1Q9ln4j7K2k4p2L0J25J8j37j23R7J55M4j78j20
$$ -7 144 110 -57 -137 -25 156 159 -11 -101 -10 79 76 22 5 27 3 -69 -39 86 104 -33 -156 -59 96 140 -38 -158
3858a58J07J61Lj30q4O1J11pp2MN4n7o6L5J07M8j27j63M0K14O4j56j38M9J34M3
$$ -158 -51 110 113 -17 -101 -40 71 64 -8 -4 50 -7 -73 -38 69 117 -10 -173 -133 81 145 -11 -149 -100 34 77
3884G7p9q1M7Q2l6m4K9L8k1q2RJ09Q4j35j60N0J56R2j11j60k2J37P6p0o0K6J3
$$ 77 -2 -83 -36 46 10 -34 -5 33 12 -70 -61 48 132 -3 -163 -113 43 135 24 -136 -158 -21 55 -15 -75 -49 -36
3911c6pk1M3P2k5j24j1J33Q9q3j34j8J26J11p4j55%J04N5k3o4JQj3k5J02O0p3
$$ -36 -43 -64 -21 51 26 -98 -109 24 113 30 -104 -122 4 115 41 -114 -114 -10 45 22 -42 -41 -33 -46 -71 31 91 18
3939A8r5j8J00J15j8j80l9J26P2m7p3l1M1N2k9k4L5j5m7%R2M8l9j14n2J29J17
$$ 18 -77 -95 5 120 102 -78 -117 9 81 34 -39 -70 -29 23 -6 -30 5 -10 -57 -57 35 83 44 -70 -122 7 124
3966A24l4j17n3O8R4kr0rM0j7j2L2N1o2n2k3Q2Q0k8j35m3J32P7k9j08n3N6Q1k8
$$ 124 90 -27 -80 -12 82 80 -10 -19 21 4 -8 24 75 13 -39 -62 20 100 72 -63 -106 26 103 74 -34 -87 -31 50 22
3995B2l6J8Jm1MM0N9nj19n8J04J21l7j28o2Q4J04Rj23k4O7L5j3qJ2Rm7o4O8J23
$$ 22 -14 4 5 -36 -32 8 67 62 -57 -115 -11 110 73 -55 -117 -33 71 80 -43 -67 0 35 22 14 26 35 -12 -76 -8 115
4025A15j9j36p5Q8J15K1j41r5Q3J04j9q3k3M8K9k8k1P1K8p7o8N8J21J8j19j17
$$ 115 96 -40 -115 -27 88 109 -32 -127 -44 60 41 -42 -65 -17 12 -16 -37 34 62 -15 -83 -25 96 114 -5 -122
4051a22N7J79J7j37r1N6Q9No3l5M4M0o9j8Q5M8p6j01J5J58O9j18j44O1J36L9q7
$$ -122 -65 114 131 -6 -97 -41 48 53 -10 -45 -1 39 -30 -48 37 85 9 -92 -77 81 150 32 -112 -51 85 124 37
4078C7j14K1J21ko0rL9No4kO7Q0o6j39JJ53P1p6j31rJ18R6q9r7K4Q0Kn9kK7Rn2
$$ 37 -77 -56 65 63 3 -6 33 38 -26 -28 39 119 53 -86 -85 68 139 63 -68 -77 41 137 48 -49 -25 55 57 -2 -4 23 32 -20
4110b0k9O6J03o0j36l5J20J13n4j30m6J18O6l5q0qO0J3l2j3O6Lr9k6R0Q1l8j02
$$ -20 -49 17 120 60 -76 -111 9 122 68 -62 -108 10 76 41 -39 -47 13 26 -6 -19 47 50 -49 -75 15 96 58 -44
4138d4o4R8J13m4j17l7Q3N8kn9j6K7j2j5L0N0k0o9l1M1R9oj16n6P0P2K2r4m3L7
$$ -44 -108 -10 103 59 -58 -95 -12 46 44 -15 -31 -4 -16 -31 -1 49 29 -40 -71 -30 69 63 -53 -109 -39 33 55 -39 -82 -45
4168d5N2J1l2Omk1nK4O4qo7o9O8J06pr2m4M3O9J6o9l0J9RLOJ2ml6m3M7Q2j6q3
$$ -45 7 18 -14 -8 -12 -33 -38 -14 50 42 -25 -94 -26 80 73 -19 -63 -20 49 65 -4 -34 -15 -6 -3 3 15 11 -25 -68 -21 61 45 -38
4202c8l9N0R2Mp3o4L7O5kl2%Kk3LRN9%p9n4O3R1Qj03n3N4J02Jq0m2L5M6j6k1R
$$ -38 -77 -27 65 69 -4 -68 -31 34 32 0 0 2 -21 -18 -9 50 50 -29 -83 -20 71 79 -24 -77 -23 79 80 0 -42 -7 39 23 2 11
4236A1J2k5n0K5P7J9r3p2L6J16L4j13p0M2R4J9o9m8L1N1k1k8L5L8m1q0K2R8K8
$$ 11 23 -2 -52 -27 50 69 -24 -96 -60 56 90 -23 -93 -51 43 62 -7 -55 -24 27 6 -22 13 51 10 -70 -48 50 78
4265G8p3r9J4J31M4q2j01K6R7K7o8m0L1M6m9j8L6N5l1p3k0R5P7o5j17LJ06O6n9
$$ 78 5 -94 -80 51 95 13 -88 -62 35 62 -6 -46 -15 31 -18 -36 0 55 24 -49 -69 26 103 38 -79 -76 30 96 37
4294C7j23J8Q6K0m6l0K1L9k0m5L7O8qj00m2R8R3l8j07l5Q7R0m1j07rP9K4k9m1
$$ 37 -86 -68 18 38 -8 -38 -17 22 2 -43 -6 62 54 -46 -88 10 103 65 -42 -77 10 100 59 -48 -57 22 46 17 -24
4323b4QL9j8n3L0R0j5q7n3O6R1J5j07q7R1Q9rp6l8N3M5k7l9L4K1l4l4J5O7K2o4
$$ -24 -16 23 5 -48 -18 72 57 -30 -83 -17 74 89 -18 -105 -14 75 66 -10 -48 5 50 23 -16 18 39 5 -29 -14 53 75 11
4354A1p9M6J03Pq4o0L8Q0Po2l3L5J1j9oK3J8l5n1J0P7K7o8n2K2N7L1m4n0KQ3p
$$ 11 -68 -22 81 88 4 -56 -18 62 69 7 -26 9 20 1 -5 18 36 1 -50 -40 37 64 -4 -56 -34 23 54 10 -40 -38 45 38
4386C8l0j3RnQjJ8K8n8m8L4P7Rn8o9J6P0L0m0m2pJ6J1KkMpl7J6O7jn2l7K7N6L5
$$ 38 8 -5 4 -1 7 6 24 52 -6 -54 -20 57 66 8 -61 -45 25 55 15 -27 -34 -18 -7 -5 -7 -3 -10 -47 -31 36 35 -17 -54 -27 29 64
4422F4n3p5K5N2J0k2qj7JJ1KK9K7m6m7J1Q2J6n7o4K7O6L5o9l0NM2J7k5l0K8j2
$$ 64 11 -64 -39 13 23 1 -7 -24 -23 -12 -10 19 46 0 -47 -36 46 62 5 -59 -32 34 69 0 -30 -25 17 34 9 -21 7 -5
4454el7QN0K4m0n5mQ6N6o5p8OP5L6m5m3J1M6ql4RM4j8m9oL7O3k9q9j4Q9N4m9p7
$$ -5 -42 -34 16 40 0 -55 -59 27 83 18 -60 -54 21 57 12 -31 -20 26 18 -16 -7 37 19 -30 -36 1 64 35 -54 -68 21 75 26 -51
4488e1j3R0L0m2n7J6M4Jm4J8L6Qo0m5N2P0or7l7O6P9k2q5k7P3N3k9m9pO0pl8k
$$ -51 -64 26 56 14 -43 -27 17 18 -26 -8 28 36 -24 -69 -17 53 47 -50 -87 -21 58 36 -49 -76 -3 50 21 -28 -35 25 18 -20 -22
4521b2N7J6o6m3K2P8L8j00p4N8R5j0p5l9M3N0pn9LM8pl6pN3K8l1p6J5R6K7p6p1
$$ -22 35 51 -15 -58 -36 42 80 -20 -94 -36 59 49 -26 -65 -22 28 21 -38 -35 13 6 -30 -37 16 44 13 -63 -48 48 75 -1 -72
4553g2L5O9L1o3n7L4M8j2l8J3M2j2k6j4M4L7l8p4J6O7M6n0p9QP3M3n6n0J2K0m
$$ -72 -37 32 63 0 -57 -23 25 13 -25 -12 30 18 -8 -22 22 59 21 -53 -37 30 76 26 -53 -45 28 71 15 -35 -23 -3 -7
4584gmjK0Rm1j4M7L9l7m2j4N9M2j7p1kL9L2j2l7OJ5Nj8K7J4j0m9j2M9L7k0n6k3
$$ -7 -11 -12 8 17 -24 -38 9 48 11 -31 -45 14 56 39 -32 -34 5 37 25 -12 -6 9 14 -4 23 37 27 -22 -34 15 52 32 -24 -47
4618d7N0L8pm6j6K8J5%j3kok4K5J7J6j2m2rL9M2k7m6%K9L5k0j7j4J4Rj1J9K4l0
$$ -47 3 41 34 -12 -28 0 15 15 2 0 -6 -30 -5 12 28 16 -26 -35 4 46 19 -27 -27 2 37 17 0 -14 0 9 -2 17 41 11
4652A1l3RK5L2k5n5j5N6K4k4m1mK9K7j2k0QJ4j8j3L3L3k2m6j8M9N0j6o3j6L9M3
$$ 11 -22 -13 12 44 19 -36 -51 5 29 5 -36 -40 -11 16 4 -16 -8 6 -12 -25 8 41 19 -27 -45 4 54 38 -25 -41 -2 41
4684D1j2n0pL4J1k2jJ7Jj1l3L3N2j0p1l2O0N2oo3m2M7N2j5m6%K8J3k4k1K7J9k0
$$ 41 29 -21 -28 6 17 -5 -6 11 12 1 -32 1 53 43 -28 -60 0 52 46 -17 -59 -12 40 25 -21 -21 7 20 -4 -25 2 21 1
4717An2K3O5J4o2n0M3P0J2p0n0N0N1ln4j5K8K8k6k5L1L7l2n0nO3M1m8p1jQ2K5
$$ 1 -51 -28 37 51 -11 -61 -18 52 64 -6 -56 -6 45 42 -12 -27 1 29 3 -22 9 46 14 -36 -41 22 63 15 -56 -57 25 50
4749E0m7n7K1M5Rl6j8L2K0k9pML9ln6k5O6N1l0p9LO2L5l7n9RM8K3l7qkL1j0l2
$$ 50 3 -54 -33 12 21 -15 -33 -1 19 -10 -17 -13 26 23 -33 -58 8 59 29 -50 -47 15 50 13 -46 -37 11 34 -3 -11 -13 18 8 -24
4783b4J7K9Kn3l4N5N2j5o1k7L7O7k4n7pK9J2mj4J4J4k1k0K7K6J5n9nK3L9J4o4
$$ -24 -7 22 24 -29 -63 -8 44 29 -32 -59 -22 45 21 -36 -43 -14 -2 -6 -20 -6 8 -13 -33 -6 20 35 -24 -29 -6 33 47 -17
4815a7k6L3L3Lk3k2K2NkJJ2nk5rK0J8J7l7l2J7L9Ml4j3OJ8Oj2j1mNLJ0J5nnl2
$$ -17 -43 -10 23 26 3 -19 3 8 6 7 19 14 -11 -20 0 18 35 -2 -34 -17 22 26 -8 -21 -15 3 9 -3 -14 -18 -13 -10 0 15 10 5 -27
4852b7K5L5ok9k5J7K5J2j5j8PMNjJ2j3kj8J1K7jm3k7M2K6kl7k1K8L3mk9jOroK4
$$ -27 -2 33 27 -2 -27 -10 15 27 12 -6 1 5 10 9 21 8 6 -12 -1 26 25 -18 -45 -3 23 21 -16 -37 -9 24 20 -9 -10 -4 -13 -19 5
4889EJ3Nl6k0J7M7Nl9k1K0L8Nl7k6K6J3Lj6lJ5kk2rM4Rl8m1J6M8L1m9n1K5M9J8
$$ 5 18 23 -13 -33 -16 31 36 -3 -24 -4 34 39 2 -24 2 15 18 2 -1 14 12 -10 -19 25 34 -4 -45 -29 19 50 1 -50 -25 24 42
4924D2n3j5K3J5nj6lL2Km7mM0L1j7o2nP3L4m4m4j1P1Pk6l4lL8k1j8K5RQl4l5M0
$$ 42 -11 -26 -3 12 7 -9 -12 20 22 -25 -29 11 42 25 -37 -42 31 65 21 -23 -34 37 44 18 -16 -19 19 -2 -20 5 14 22 -12 -47 -7
4959gN0j0o6k0N4M4k3n4mN2J6k8l7J9L3j0k3lM0Rm0k2L5N1k3m9l2N0N9k1n3j3
$$ -7 43 33 -33 -53 1 45 22 -32 -36 16 32 4 -33 -14 19 9 -14 -17 23 32 -8 -30 5 56 33 -16 -48 2 61 40 -13 -26
4991b6L0L0rl1RK1j0k4j1M0Mj9m4J6N2Rm6m0K8N2mj9m9L7K3pk2KJ4Jj6kK6J5j5
$$ -26 4 34 25 -6 3 24 14 -10 -21 19 23 4 -40 -24 28 37 -9 -49 -21 31 27 8 -41 -4 19 12 -10 -8 6 7 -9 -11 15 30 15
5026A5m8MM7K1l3l8LL1K4j9l3J2J1nn%J6j9pkM3Nl1l2PM0J5j1l2LK1KNj6%Pj1
$$ 15 -33 -29 18 39 6 -32 -29 2 26 7 -26 -14 -3 -8 -13 -13 3 -16 -23 -25 18 23 -8 -40 -33 7 22 11 -21 -18 3 5 10 -6 -6 1 -10
5063a0kJ3K3k2j1J0K7J2k3k6j5L7J4j1l6OOJ2jnKjj0RJ6Qk8k0OK8K1k6j6LJ6O
$$ -10 -12 1 24 2 -9 1 28 40 17 -9 -24 13 27 16 -20 -14 -8 4 3 -2 0 -1 -11 -2 14 22 -6 -26 -20 8 29 3 -13 -10 6 12
5099A2jj3J0j1pJ4J2Qk1k1LM3Mj8k7nL6J1k1j8JJ5Qnj4J7Nk5kK6Opm1mL8L5l5
$$ 12 11 -2 8 -3 -10 4 16 24 3 -18 -15 28 32 14 -13 -18 18 29 8 -10 -9 6 14 9 -5 12 17 -8 -10 16 22 15 -26 -30 8 43 8
5136Hl8KM0J8j2l2oL3Jj9JK6mj8k7L5K2Pn4j5L0N2j6n2j3L3K1ll8MK9Mk8RJ4J2
$$ 8 -30 -28 12 30 18 -14 -20 13 14 -5 -4 22 18 0 -27 8 30 37 -17 -32 -2 50 34 -18 -31 2 23 20 -18 -14 15 19 -9 0 14 26
5172B6k7l4K1M1jl8k8J4N7Pn5j2K1M6rl7jJ2K1k0rJ3K8j8k8QL7Pm0l2J2M6J4k9
$$ 26 -1 -35 -14 27 26 -12 -40 -26 31 38 -17 -29 -8 38 29 -8 -9 3 24 4 -5 8 36 18 -10 -2 35 42 2 -30 -18 28 42 13
5206A3m2K0L4kl2j9K4J6k2j0K1K7j2m4QK3L5j0n7nN5K4j7m1KM1lk3j1J6nOk1J0
$$ 13 -29 -9 25 23 -9 -28 -4 12 -10 -20 1 28 16 -28 -20 3 38 28 -29 -34 21 45 28 -13 -11 30 27 4 -7 9 4 10 -11 -1
5240aL0%m1rL7K8k5l6j3K7L0mm4kL1jjjoOlk4J7K5j1l2kK0L0j1j7j8K2K0J0l0
$$ -1 29 29 -12 -21 16 44 19 -17 -30 -3 27 23 -21 -23 8 7 6 5 -1 5 2 -22 -5 20 9 -23 -25 -5 25 14 -3 -21 1 21 31 1
5276AlM%QQjpqlOJ3%k5j0J4J8Nl1mkJ7Pj0JJKpK1Jj7j8j0K7K2j1k2j0K4R%j1n
$$ 1 -2 2 2 10 18 17 10 2 -1 5 18 18 -7 -17 -3 15 20 -11 -15 -17 0 7 -3 -2 -1 1 -6 15 16 -1 -19 -29 -2 20 9 -13 -23 1 10 10 -1 -6
5318fQm%QOpk9NL9LQn2j0K5K8j6k0joL0nj2jOMj6J3J6lj5j8PL2Mm6MK2L5pk3k5
$$ -6 2 -2 -2 6 12 5 -24 -19 20 23 31 -21 -31 -6 22 6 -14 -15 -21 9 4 -8 -9 -3 1 -15 -2 14 11 -4 -22 -15 17 21 -25 -21 1 36 29 6 -19
5359a9J3K5q%%Kpmj0L5Kl5k6K0M5J3n4k2J4K6J0k7j4QJ6lj6J1K7j4k5rL7J8k0
$$ -19 -6 19 11 11 11 13 6 2 -8 27 29 -6 -32 -12 33 46 -8 -30 -16 10 20 -7 -21 -13 3 0 -16 -5 22 8 -17 -26 11 29 9
5394Im8RM2K3l2m5K6L8K1l7j7J0J9mj7KK2kk1k6K7M3j9n0j8M7L4j5m6rK9K0j0
$$ 9 -39 -30 12 35 3 -42 -16 22 43 6 -11 -1 18 14 -3 -1 21 19 -2 -28 -1 42 23 -27 -45 2 36 21 -25 -34 -5 15 5
5427Ek8J5J0Oj8%K1Pj9k4K1L1Nm2j9L2L1Jn4kJ8K4mk3%J6Kj3j5K7lj5j4J6K9P
$$ 5 -23 -8 2 8 -10 -10 11 18 -1 -25 -4 27 32 -10 -29 3 34 35 -19 -21 -3 21 17 -6 -6 10 12 -1 -16 11 8 -7 -21 -5 24 31
5463C1l9k7LM8qj5k5LL5KomMpj2KK3Qj4k4K2L0Rk3k0MJ9Rmk5NjJ3qPnj2JJK0N
$$ 31 -8 -35 -32 16 8 -7 -32 -29 6 8 2 -2 2 -5 -17 -15 8 16 2 -22 0 30 39 16 -4 0 19 28 24 -1 4 3 16 8 15 10 -2 -1 0 20 25
5504B5k2j5J4J1J4j6l0oL2Qj0j6K0j7J4QKj1qj1J0J7Nk4qJ2K5j%j8OoNjJppJM
$$ 25 3 -12 2 13 27 11 -19 -25 7 15 5 -11 9 -8 6 14 16 5 -3 -14 -4 13 18 -6 -14 -2 23 22 22 4 10 4 9 8 9 2 -5 -4 0
5543@K7j0k3qJ4J4J3k3k7J4K1Ll0MLRnKJ2Mj6j4RK9Nk9k0jL7K2k5k3RJ7Pmj3J4
$$ 0 27 17 -6 -14 0 14 27 4 -23 -9 12 15 -15 -11 -8 1 -4 -2 10 14 -2 -16 -7 22 27 -2 -22 -23 14 36 11 -12 -3 14 21 17 4 18
5581A8j0j4%J1Rj1j3j3K8K9k6m1JM4Pl2rJ1J3Qj4jJ3lj0j5K6J8j2l3j2L7K4j6
$$ 18 8 -6 -6 5 14 3 -10 -23 5 34 8 -33 -32 12 19 -13 -22 -11 2 10 -4 -5 8 5 -5 -20 6 24 12 -21 -33 4 28 12
5615A2k5j6L5L1j5k2mJ3Rk7kJ1J0j0k5NM8Ml9l0K5L2km0j3K1N2l2k6J1J1PrkM
$$ 12 -13 -29 6 37 22 0 -4 9 18 -9 -11 0 10 0 -25 -20 28 32 -7 -37 -12 20 18 -22 -35 -14 38 6 -20 -9 2 9 0 -2 2
5650BJ7mk5mM2Ll2k3J0M0J2k8j8PK0mj8j2MJ5qj5K2J2ql0%L0J2j5l8ML0K2j7k8
$$ 2 19 15 -10 -14 28 31 -1 -24 -14 26 38 10 -8 -1 19 15 -3 -15 -11 4 -4 -19 3 15 7 -23 -23 7 19 4 -34 -30 0 22 5 -23
5686b3MK5J0j5kjJ6j7jOJ4j5j4kL4J3j8k1kJ8J6qk8JOJ1njj0KJ%KJ6nj7j3K6J7
$$ -23 -19 6 16 1 -1 -2 14 -3 -4 2 16 1 -13 -15 19 32 14 -7 -9 9 25 17 -11 -10 -4 7 2 1 -9 -7 -6 -6 -4 12 7 -10 -23 3 20
5725B0lk1k2K1J9lk1QPj1J6O%j3pj0K9J2k1ppJ5K8lk2rQJ1rOqj4nJ3PJ4k0k7J6
$$ 20 17 -4 -26 -5 14 11 -10 -2 5 -6 10 16 16 3 -4 -14 15 27 6 -1 -8 7 35 32 10 1 9 20 11 17 9 -5 -10 3 10 24 4 -23 -7
5764gJ7J3jm2J0J8nKj5J2RpQnOqplK3Omk3k5L6K3k1j7j0K8Qj0k8L3roj1MK1j3
$$ -7 10 23 22 -20 -10 8 3 5 -10 2 11 4 12 7 13 5 -2 -5 18 24 20 -3 -28 8 31 10 -7 -17 11 19 9 -19 14 5 -1 -12 -8 13 0
5803@j2qJ5K0Nm1nJ9L2j8k3LRJ9qrLJ5j3j4K4J3pj7k1K0L1Jm1k6K9L6nk3j8K1
$$ 0 -12 -20 -5 15 20 -21 -26 -7 25 7 -16 -13 -4 15 7 -2 1 16 3 -11 13 26 19 2 -19 1 32 33 -8 -34 -5 31 26 3 -15 6
5839FMpj2J4J0j6j0rL7Nl8j1LL1J7k5l0J8K6Jk0o%L2rmkJ0rj2oK6J5j7k4%L1K6
$$ 6 10 3 -9 5 15 -1 -11 -20 17 22 -16 -27 -24 7 24 -1 -31 -13 13 14 -6 -12 -12 20 11 7 5 15 6 -6 -12 14 29 12 -12 -12 19 45
5877D5k2l7%J8J6j1k3J6kJj3RNJj1k4K7J7Mm2NK0J8nk5j6K5RQj4pJ8j9LK1j1J3
$$ 45 23 -14 -14 4 20 9 -14 2 0 1 -12 -3 2 3 -8 -32 -5 12 16 -26 -21 -1 17 12 -13 -29 -4 5 13 -1 -8 10 -9 -6 15 4 17
5914A7k9oJ6K0%k1j0J1K0Ll1qJ0Nj2Nj1J3oMLJ2Jk3NnJ5Qk0kjK0Mkj5NNQmJ2m
$$ 17 -12 -18 -2 18 18 -3 -13 -2 18 21 -10 -18 -8 -3 -15 -10 -21 -8 -14 -10 -7 5 6 -17 -12 -17 -2 6 -14 -16 -17 3 7 5 -10 -5 0 8 4 16 12
5955A2j4mQOLj5j6J9kJ8j7k2J5KJ5j2mLllPQj7MKpJ4Rk5mJ1J4jrNLRj1J4Mk2j1
$$ 12 -2 -6 2 8 11 -4 -20 -1 -3 15 -2 -24 -9 -7 8 -4 -8 -5 -8 -11 -4 4 -13 -9 -7 -14 0 9 -16 -20 -9 5 4 -5 0 3 12 1 15 19 -3 -14
5997a4J1J1NLl2KOK7lj2k3J7J0Ok5J0pjNLlQj7qJ3J9J3l9kNL1Ol0j0RJ8J5k7R
$$ -14 -3 8 13 16 -16 -14 -8 19 16 4 -19 -2 8 14 -11 -1 -8 -9 -4 -1 -4 4 -13 -21 -8 11 24 -15 -17 -12 19 25 -5 -15 -6 12 27 0 9
6036InOp%K0J2k7k6J0K6Kk5j6J3L3ok1j5OJ2prMNLj1KJK3oj1j5K4K1j3l2J1J0
$$ 9 4 10 3 3 23 35 8 -18 -8 18 20 -5 -21 -8 25 19 -2 -17 -11 1 -6 -15 -11 -6 -3 -14 -12 -11 12 6 -5 -20 4 25 12 -20 -9 1
6074AK6j7k4kL1jplJ6j4j2jkM0j9j6oNL7j3k2j9J7K0kk6LJ0Qoj7K0J0j7mnK8%
$$ 1 27 10 -14 -16 15 14 7 4 20 6 -6 -7 -9 31 12 -4 -10 -5 32 19 -3 -22 -5 15 13 -13 -10 0 8 2 -15 5 15 -2 -6 -11 17 17
6112A7qk6K0PJ1k3j9K5QJ1j2m%J0%j5J5qmj4LJ6Oj1j4LJ3J4k1k0ML2j6onoK6r
$$ 17 9 -17 3 10 21 -2 -21 4 12 23 11 7 7 17 17 2 17 9 5 -9 -6 10 16 5 -9 -6 7 21 0 -20 -16 16 0 -6 -11 -17 9 0
6150@oJ4krrMJ6Qnj5%J4Pj0m%MJJo%j0KNNMrNjJ0nj4j0lJ3J0j1rJJ0kJ0%j4LL
$$ 0 -6 8 6 -3 -12 -8 8 16 11 -4 -4 10 17 7 3 3 7 8 9 3 3 -7 -5 0 5 9 0 5 4 14 9 -5 -15 -18 -5 5 -6 -15 -14 -4 -6 4 4 -10 -7 -4
6196dMPLj8PNORqj3MMjJ1jnj3nJ2pJ2rj1kK8rj5j0J2MQj2qRN%NLqLj3RJ9orrJ1
$$ -4 0 7 10 -8 -1 4 10 19 11 -2 2 6 5 16 15 10 -3 -8 4 -3 9 0 -11 -13 15 6 -9 -19 -7 -3 5 -7 -15 -6 -1 -1 4 7 -1 2 -11 -2 17 11 2 -7 4
6243DMK3j2l1ORQkMlkkpQJ0ok9MJ8Qpk7mK0J4j7jnK3j2KnOk%qLQRk0pJ4K4kk3
$$ 4 8 31 19 -12 -6 3 11 9 13 10 8 6 -1 7 17 11 -18 -14 4 12 5 -22 -26 -6 8 -9 -10 -15 8 -4 -2 -7 -1 -3 -3 -11 -8 0 9 -11 -18 -4 20 18 -5
6288erJ4J7Jl1mK8jnkjoQj4QRJok6J0J7Pk3j4K0RLj2j6J4LJ6j6PKOj2jJ0OLk9
$$ -5 -14 0 17 18 -13 -17 11 10 5 3 2 -4 4 -10 -2 7 8 2 -24 -14 3 10 -13 -27 -7 2 5 -7 -23 -9 -6 10 -6 1 3 9 -3 -4 6 12 15 -14
6330a4J1J1Rj6njJ8J2j9moNRqLJmMj0MOj2pPOJ5j4nqKK4j1j1LjMQrJ7krj0J6P
$$ -14 -3 8 17 1 -4 -5 13 25 6 2 -4 1 10 2 5 6 2 6 -4 0 6 -6 -13 -6 0 15 1 -4 -12 -10 14 3 -8 -5 -6 -2 6 -3 14 12 3 -7 9 16
6374A6j1jqJK2rj6MR%j%k3MKJM%Qj9PLrJ6j3nJ1J1LrnqRJ5j8MNj5J0J0Q%rj1J6
$$ 16 5 4 -4 -3 19 10 -6 -2 7 7 6 6 -17 -13 -11 -10 -6 -6 2 -17 -10 -7 -16 0 -13 -18 -7 4 7 -2 -7 -15 -6 9 -9 -5 0 -15 -5 5 13 13 4 -7 9
6419INmj1JpjJ3Jjj3NjORk7kORj2J1j0%J7Kj0j3K0jMqNkkqQJ1%Qk8JK3nmrlQj
$$ 9 14 10 -1 0 -7 -8 5 6 5 -8 -3 -4 2 11 -16 -18 -12 -3 -15 -4 -14 -14 3 5 -5 -18 2 1 5 -3 2 0 -2 -10 -2 9 9 17 -11 -10 13 8 4 -5 -8 0 -1
6466aJjrJ0j0JOMj2j0JRJ7%l1NJ9LLj2nOK0j0KJ%jj3MJ1J1pk4J6PRk3jKJ3kj8
$$ -1 0 -1 -10 0 -10 -9 -3 1 -11 -21 -20 -11 6 6 -25 -20 -1 2 5 -7 -12 -6 14 4 6 7 7 6 -7 -3 8 19 12 -12 4 11 20 -3 -4 -2 11 9 -9
6509i%pJ9mPpJ0rj2J7%Mj3j4PJ1J0k3j9K5K0Nj6r%ROnmkRJqRLkmpJ2Opk1JJ1R
$$ -9 -9 -16 3 -1 6 -1 9 0 -12 5 5 9 -4 -18 -11 0 10 -13 -32 -7 13 18 2 -7 -7 2 8 3 -1 -3 6 7 -1 8 11 9 5 -2 10 16 9 -12 -11 0 9
6554IopoRJMmnj0OM%Qj0kk1K7JPrj4J5J0Kj4K%JJ4j4J7j9JJQProj9K4kJ1j6%M
$$ 9 3 -4 -10 -1 0 4 0 -5 -15 -9 -5 -5 3 -7 -9 -30 -3 -2 5 -4 -18 -3 7 9 -5 -3 -3 -2 12 -2 15 -4 -3 -2 6 13 4 -2 -21 3 1 12 -4 -4 0
6599@MNrqRmrLMmj2J2J1JknkKJ2jQj3lNMnlnPJ0kJ0j2nJKJjj0mQJJ0plQj8J0L
$$ 0 4 9 0 -8 1 -3 -12 -9 -5 -9 -21 -9 2 3 1 -4 -6 -4 8 7 15 2 -1 4 8 3 0 -5 2 12 10 20 8 3 4 6 7 6 -4 -8 0 1 11 4 1 9 -9 1 4
6648Dkoj2J4jMkj2KJ0J0%Nj0OMLj0KLj5JJ2JkrLJ1Kj0j0j0RJPnnlJ6jlJJmjJJ
$$ 4 2 -4 -16 -2 -3 1 -1 -13 -11 -1 9 9 14 4 10 14 17 7 9 12 -3 -2 10 11 9 0 3 14 16 6 -4 -14 -5 -4 3 -2 -7 -10 6 5 2 3 4 0 -1 0 1
6695AOj2j0MJ5KJj2nJ5J8j1lQj9oK4pJ6j2j3PJ5j1j7kkJ5%mj5PNJ2j1mJKnlJ2
$$ 1 7 -5 -15 -11 4 6 7 -5 -10 5 23 12 9 17 -2 -8 16 9 25 13 0 7 22 11 -6 -8 -10 5 5 1 -14 -7 -2 10 -1 -5 -4 -2 -7 -10 2
6736B%j2OqJ5J0j3pnJ3J7kk2OJ1pMj0KJ2j3qK0jKrkpJ6j7rPjJ2Nk7JROJkKOjr
$$ 2 2 -10 -4 -12 3 13 0 -7 -12 1 18 16 -6 0 11 4 8 -2 0 12 -1 -9 11 10 12 3 1 -6 10 -7 -16 -9 -10 2 7 -20 -19 -10 -4 -3 -5 -3 3 2 -7
6781gRPrn%J7oJlj3PQKlmPj%Kj1J0nlMJ5j2j3mRKkqnJ0mJ5j3lkNPJ%rj1J1MPM
$$ -7 2 9 0 -5 -5 12 6 7 4 -9 -2 6 8 5 1 8 7 7 9 -2 8 3 0 4 19 7 -6 -10 -1 1 -1 -9 -14 -4 -8 7 -6 -9 -11 -6 1 2 2 -7 -18 -7 -3 4 8
6830Hkj5J0J4Nj8Nj3N%Qr%oMQKpLkj5J5Mj3lJ1j0J2jlj2J3pJ1Qoj9J0QKNj7KO
$$ 8 6 -9 1 15 20 2 7 -6 -1 -1 7 -2 -2 -8 -4 4 6 -1 2 0 -15 0 4 -9 -12 -1 -11 1 0 -3 -15 -2 -9 2 10 4 -15 -5 3 5 10 -7 -5 1
6874AJ2j2J1j3LLKLqKjoJ0j5J0mmOJ1Kj9j0MORrjKkJ0mkRpnJ0lknkPJ1Pj5j1O
$$ 1 13 1 12 -1 2 5 7 10 2 4 3 -3 7 -8 2 -2 -6 0 11 13 -6 -16 -12 -6 3 -6 -7 -5 -7 3 -1 -3 6 -1 -6 4 1 -1 -6 -8 -1 10 17 2 -9 -3
6920cJ5lpMjnLnOlLj3J0J5j1prNQNj8noJ5Rq%j3J6Jn%NLmOkKLqnK9JJk3mQJ1j7
$$ -3 12 9 2 6 5 0 3 -2 4 1 4 -9 1 16 5 -2 -11 -6 2 7 -11 -16 -22 -7 2 -6 -6 -19 -3 -2 -7 -7 -2 1 -3 3 1 3 6 -2 -7 22 23 24 1 -3 5 16 -1
6969aoKOLojnRjpJJ4pk3kPK5j5lmJ4j%NnLkkOQj2kQJQkoj2jJ7qnjkOoNoQj2Np
$$ -1 -7 -5 1 4 -2 -3 -8 1 0 -7 -6 8 1 -22 -24 -17 8 -7 -10 -14 0 -1 -1 4 -1 2 0 -2 4 12 0 -2 6 7 15 13 7 -5 -6 11 3 -2 -3 -5 1 -5 0 -6 2 -10 -5 -12
7021a2kJ6pnlMJ2j5JrJ5JOrnJ1J4j9jn%OJ8r%J1j7N%J2j5J0j1rOJ1orkR%lpOj0
$$ -12 -14 2 -5 -10 -13 -9 3 -12 -11 -20 -5 -4 2 -7 -12 -1 13 -6 -7 -12 -12 -6 12 3 3 14 -3 2 2 14 -1 9 -2 -11 -5 6 0 -9 -11 -2 -2 -5 -12 -6 -16
7066a6PLPoj5MJ5npRJmJ7LnroP%NMqKjJJ0j7RmklKLj5MJPnj1J3k2K0Nkpj3LK5
$$ -16 -9 -6 1 -5 -20 -16 -1 -6 -13 -4 -3 -7 10 13 8 -1 -7 0 0 5 9 1 3 2 3 13 -4 5 1 -1 -4 -2 1 -14 -10 -9 -2 -7 -18 -5 -27 -7 -2 -4 -11 -24 -21 4
7114Djk3MNnKJ1LllJ0j0OMrqJ2J2%j1pJ4lOk%pNm%j4OjnLJ2J0j8onJ2LqnJLRL
$$ 4 3 -20 -16 -11 -16 -14 -3 0 -3 -6 4 -6 0 4 -5 -13 -1 11 11 0 -7 7 4 10 8 8 1 6 2 2 -12 -6 -7 -12 -9 3 13 -5 -11 -16 -4 -1 -9 -14 -13 -10 -1 2
7162BrPLpJ2jrLLj0K4j4Lj3QJLMlnqJ1okkmLj4J8pJ0nj3QK1j0mqNMJj5jJ6RmJ
$$ 2 -7 0 3 -4 8 7 -2 1 4 -6 18 4 7 -6 2 3 6 10 7 2 -6 5 -1 -3 -5 -9 -6 -20 -2 -9 1 -4 -17 -9 12 2 -2 -10 -5 -1 0 -15 -16 0 9 5 6
7209FKPj6KmNJ0j3kmPQMj7LMJqJLKj3NnMlJjJ7mnj2J6lKmkmnK6%j9J4nJ5j2%j1
$$ 6 8 15 -1 1 -3 2 12 -1 -3 -7 0 8 12 -5 -2 2 3 -5 -4 -1 1 -12 -7 -12 -8 -11 -10 -11 6 2 -3 -15 1 -2 0 -4 -6 -10 -15 11 11 -8 6 1 16 4 4 -7
7257gKLONoOnJMqr%kQMQk1okK0j2J2j2Mj%J5kj1JQJmMMj8J1J4JNk4LJJ1mPj7m
$$ -7 -5 -2 4 9 3 9 4 5 9 1 -8 -8 -10 -2 2 10 -11 -17 -19 1 -11 1 -11 -7 -8 -8 7 5 -6 -5 3 4 0 4 8 -10 1 15 16 21 -3 0 1 12 8 15 -2 -6
7305fJ4oNlomjJ2qNKj5J7j4Ooj1PJ1LqnJ1pO%Kj5QMLMjqJ0P%Pj1p%kJ0Kj2kmO
$$ -6 8 2 7 4 -2 -6 -7 5 -3 2 4 -11 6 -8 -2 -8 -19 -12 -1 2 -6 -11 0 -7 -1 -1 1 -14 -6 -2 1 5 4 -4 6 13 13 20 9 2 2 0 10 12 0 -2 -6 0
7353@J5j3pNop%PnjjOlJ0j1M%RNnjoNJ0j5jJ6nNoN%JkpMmJ6k2LQLmj3MNqJ3j0
$$ 0 15 2 -5 0 -6 -13 -13 -6 -11 -12 -13 -7 -10 0 -11 -7 -7 2 7 2 1 -5 0 10 -5 -6 10 5 10 4 9 9 10 8 1 5 1 17 -5 -2 6 9 5 -8 -4 1 -7 6 -4
7402drJJ4omqOOmkJ6knmOjOp%mPNmJ2j4J4j5J0lRrj1mJ2mpkjQLkj8J0J3j7J1j2
$$ -4 -13 -12 2 -4 -8 -16 -10 -4 -8 -10 6 4 -1 -5 1 0 6 -1 -1 -5 2 7 3 15 1 15 0 10 7 16 7 -4 -8 4 0 -7 -9 -10 -2 1 -1 -19 -9 4 -13 -2 -14
7449a4LjQj0J1qKKjPMlJj0J4kLr%J3KmPj6rjJ2ojkjnOlLPjNr%%okLLJ3poOkJ5
$$ -14 -11 -12 -4 -14 -3 -11 -9 -7 -8 -1 3 0 1 -9 5 3 6 -3 -3 10 12 8 15 -1 -10 -11 1 -5 -6 -8 -9 -14 -8 -11 -8 -1 -2 3 -6 -6 -6 -12 -14 -11 -8 5 -2 -8 -2 -4 11
7500A1lJj2NPlJ0j1%NrJ2nj3NQp%j1Qm%rJ4Kk3K6j3%rK0j5RLojjrQRJ0joqPNl
$$ 11 8 9 -3 2 9 6 16 5 5 10 1 13 8 -5 0 8 1 1 -10 -2 -6 -6 -15 -1 1 -22 4 -9 -9 -18 2 -13 -4 -1 -7 -8 -9 -18 -10 -1 9 8 2 -6 1 6 3
7547CjJmNJjLnJknJ9mj3pQoM%mL%%NoJ0j4OqJklOjJ6MrMnLrKOnPJ5k0JKOLj5J3
$$ 3 2 3 -1 4 5 4 7 2 3 1 -4 15 11 -2 -9 -1 -7 -3 -3 -7 -4 -4 -4 1 -5 5 -9 -3 -11 -10 -12 -15 -9 -10 6 10 1 5 0 3 -6 -4 2 -3 4 19 -1 0 2 8 11 -4 9
7600InlkqJ1jonJ2jOj9Pj%lJ2rj6K6pj0LQRoJJ2j1K%KqJ3%Lj2PkQj8J3j1QlKj1
$$ 9 4 1 -1 -9 2 1 -5 -10 2 1 7 -12 -5 -6 -6 -9 3 -6 -22 4 -3 -13 -10 -2 7 1 2 14 3 5 5 7 -1 12 12 15 3 10 8 16 -2 11 0 8 5 7 -4
7647dJMj8J9nPlj4J1NMpnjKNqkJnJ2J%KllP%oPkn%J8oj0jKKOlkLqk%mMolNKMo
$$ -4 -3 1 -17 2 -3 4 1 -13 -2 3 7 0 -5 -6 -4 1 -7 -9 -8 -13 -1 0 0 2 -1 -4 3 3 -3 4 2 -3 -3 15 9 -1 -2 0 2 8 5 3 6 -2 -4 -4 -8 -4 -10 -13 -8 -6 -2 -8
7701hQpJ0%pqK%K1j0KLKj0J5LnJj0KJJ1j2JlJ4lj0KlnLjPj7NmJ2j2NlONLmqMJ0
$$ -8 0 -7 3 3 -4 -12 -10 -10 11 1 3 6 8 -2 13 16 11 12 2 4 5 16 4 5 2 16 13 3 5 2 -3 0 -1 6 -11 -6 -10 2 -10 -5 -8 -2 3 6 2 -6 -2 8
7749Hj1kJ4j8J0MoJ2lMLj3J5j0KlmoLRJoooNQLqj0LPojkLQjoJ%J1JkklkQoOQm
$$ 8 -3 -5 9 -9 1 5 -1 11 8 12 15 2 17 7 9 6 2 -4 -1 8 9 3 -3 -9 -4 4 7 -1 -11 -8 -1 -7 -8 -10 -7 1 0 -6 -5 -5 6 7 5 3 0 -2 6 0 6 14 10
7800A0%j7K3lmrjKOlrJ0nJ9j6%J2k1J2Ljj7jJ2%nMJqmPNmKNlo%%J0mlOJJ1Nj3
$$ 10 10 -7 16 13 9 0 -1 1 7 4 -5 5 0 19 3 3 15 -6 6 9 8 -9 -10 2 2 -3 1 2 -6 -10 -3 2 -2 0 5 2 -4 -4 -4 6 2 -1 5 6 17 22 9
7847Ij2PJ4rj5KJ1KnnmQLloPJj6J3j1NkRnkLJ1j0%J2j2No%nJ7mLoJ2nnPnOLj0
$$ 9 -3 4 18 9 -6 -4 7 9 4 -1 -5 3 6 3 -3 4 5 -11 2 -9 -4 -6 3 -2 -4 -1 10 0 0 12 0 5 -1 -1 -6 11 7 10 4 16 11 6 13 8 14 17 7
7894Gk%Rpj0jJ0njkoLkPjjKlnJOjLNnJ5j2%KLkMj3PPj3NPmqK0j7J5Jj7KmK%Ql
$$ 7 5 5 14 7 -3 -4 6 1 0 -2 -8 -5 -7 0 -1 -2 0 -3 -8 -7 -1 -2 1 6 1 16 4 4 6 9 7 11 -2 5 12 -1 4 11 7 -1 19 2 17 18 1 3 -1 1 1 9 6
7945FmjRpj3kJqMJ4JnJJK%KOmqJ5kokO%O%lqJ2jj0Qj1J%kJ%nmMPNKk0NmLJ4j4
$$ 6 2 1 10 3 -10 -12 -11 -19 -15 -1 0 -5 -4 -3 -1 -1 1 7 3 -5 10 8 2 0 6 6 12 12 9 1 13 12 2 10 -1 0 0 -2 -1 -1 -6 -10 -6 1 6 8 -12 -7 -11 -8 6 -8
7997hkLKJ3j2MKnNkJ0Lj3lJ1J1k4J0PlQLjkj2jnKJj1PJo%LNmJj0QMnnkJ3qJLr
$$ -8 -10 -7 -5 8 -4 0 2 -3 2 0 10 13 0 -3 8 19 -5 5 12 9 17 20 19 17 5 4 -1 1 2 -9 -2 -1 -7 -7 -4 1 -3 -2 -12 -4 0 -5 -10 -12 1 -7 -6 -3 -12
8046a2OOJ3k0RPj1MJ1oLJ1k2J1j0kOrOPopoKJ1J1kj1j2QmOkjKmO%Kj1J9oNlqn
$$ -12 -6 0 13 -7 2 9 -2 2 13 7 10 21 -1 10 0 -2 4 -5 1 8 2 -5 -11 -9 2 13 11 0 -12 -4 -8 -2 -4 -5 -3 -7 -1 -1 1 -10 9 3 8 5 -3 -8
8092hJ1J9j3KPk0J4j0jOjkpMJ4k1%LnPp%JOj2LOpjQj2J1JPj3RljNlPRoKkJlJM
$$ -8 3 22 9 11 18 -2 12 2 1 7 6 4 -3 1 15 -6 -6 -3 -8 -1 -8 -8 -7 -1 -13 -10 -4 -11 -12 -4 -16 -5 -4 3 -10 -1 -4 -5 0 -3 4 13 7 9 7 8 5 6 10
8141A0jkj3J7nkqJ3okJJ3j5nkJOj3J5qj1J1OlkkoJ5j6QNpJLJ1OJj4LOJo%lj0J8
$$ 10 9 7 -6 11 6 4 -4 9 3 1 2 15 0 -5 -7 -6 0 -13 2 -6 -17 -6 0 -3 -5 -7 -13 2 -14 -6 -1 -8 -7 -4 7 13 14 0 3 9 10 4 4 1 -9 9
8187InJj%
$$ 9 4 5 4 4
8191D
$$ Imaginary data points
##PAGE= N=2
##DATA TABLE= (X++(I..I)), XYDATA
0@%%%%%%%%%%%%%%%%%%%Mj2J6j6J6j6J6k0K8l2L2l7M5m9N4o2O9p7Q6r7J09j19
$$ 0 0 0 0 0 0 0 0 0 0 0 0 0 0 0 0 0 0 0 0 4 -8 8 -8 8 -8 8 -12 16 -16 16 -21 24 -25 29 -33 36 -41 45 -52 57 -62
41f2J30j43J58j75J96k16K37k61K85l14L49l86M24m68N22n84O53p36Q39r63J121
$$ -62 68 -75 83 -92 104 -112 125 -136 149 -165 184 -202 222 -246 276 -308 345 -391 448 -515 606
62F06j330J612k020K649l721N875j1680N3961J41055k01023j46141Q0270L6497
$$ 606 -724 888 -1132 1517 -2204 3671 -8009 45952 187007 -14016 -160157 -79887 -43390
75d3390J2288K5483p1933R933J55576K112j47739m074J25306O2899o7684j11819
$$ -43390 -31102 -5619 -77552 -67619 87957 90069 -57670 -61744 63562 126461 58777 -53042
87e3042K0907J19438j6754j08084m132O0430N4997J2835j22369r6685J31014J09382
$$ -53042 -32135 87303 70549 -37535 -41667 18763 73760 86595 -35774 -132459 -1445 107937
99A07937j06191p3925N1599K8638Q029j7342n3452N9439J05218p4825j15701L8766
$$ 107937 1746 -72179 -20580 8058 16087 -1255 -54707 4732 109950 35125 -80576 -41810
111d1810O7433J8954q561p5603j4194J29451K4843j27070p025R9201J5984l4856
$$ -41810 25623 44577 36016 -39587 -53781 75670 100513 -26557 -33582 65619 81603 46747
123D6747m6214n6539K5524N4607m6755n2520L9594M2375j1997m1196j0513Q2775
$$ 46747 533 -56006 -30482 24125 -22630 -75150 -35556 6819 -5178 -46374 -56887 25888
135B5888P1654o2024o3430L4488K3268K832J5737m5747l3198P3661J4166r1398
$$ 25888 97542 35518 -27912 6576 29844 32676 48413 2666 -30532 43129 57295 -34103
147c4103p85O2989j8462k8292N343k3353l465K7951k0346j5512M9078L0751j6895
$$ -34103 -34888 28101 9639 -18653 -13310 -36663 -40128 -12177 -32523 -48035 1043 31794 14899
160A4899j7132o339K7066M2178j8441m1989J897m547j6847J9141M991k2666J3797
$$ 14899 -2233 -8572 18494 60672 42231 242 2139 -2408 -19255 -114 4877 -17789 -3992
173c992J2392k3313R219K3759j9851q280J7407j2386j3178P823r789r50K4173
$$ -3992 8400 -14913 -5694 18065 -1786 -10066 7341 -5045 -18223 -10400 -20189 -21139 3034
186C034J53k379K2750q700k7826J6691K5214k236o201k3064k5693K6937L3973
$$ 3034 3187 808 23558 14858 -12968 3723 28937 26701 20500 -2564 -28257 -1320 32653
199C2653k1980k4591J1775J1005l467j4982j8683J1679K3714j7660k8392J3141
$$ 32653 10673 -13918 -2143 8862 5395 -9587 -28270 -16591 7123 -10537 -38929 -25788
211b5788L0339J2560j0873j7723K1825N0612o465n9287j6640L5760K2846j8422
$$ -25788 4551 17111 6238 -11485 10340 60952 54487 -4800 -21440 14320 37166 18744
223A8744m3919j9430L6593K9447l0833k6493L0536L4643j2117l9333j3368L8779
$$ 18744 -25175 -44605 -8012 21435 -9398 -35891 -5355 29288 17171 -22162 -35530 3249
235C249L5369l3780n2345J6569N7562J3951m0694l2877K8876N7079m059o4039
$$ 3249 38618 4838 -47507 -30938 26624 40575 -119 -32996 -4120 52959 48900 -15139
247a5139k5099M1885K9725k9897m4152N130M6505J2851m5606k5969M5422M9542
$$ -15139 -40238 1647 31372 1475 -42677 -37547 8958 21809 -23797 -49766 -4344 45198
259D5198k2413o1115j0489N5673L7725m0569n6738J6391O3548J5399m9253l3961
$$ 45198 22785 -38330 -48819 6854 44579 4010 -52728 -36337 27211 42610 -6643 -40604
271d0604L5076N0384j5314n9124j0669M8774K2829m3141m2633K5831N8696K211
$$ -40604 -5528 44856 29542 -29582 -40251 8523 31352 -11789 -54422 -28591 30105 32316
283C2316n9871k7892N1142N2431k6385o4609q109N5135L2531l6980m4135K1940
$$ 32316 -27555 -55447 -4305 48126 21741 -42868 -50977 4158 36689 -291 -44426 -22486
295b2486N6299N995m6905j9954L9410L3553l1039n4596L96M9101J4985m8556l9412
$$ -22486 33813 39808 -7097 -27051 12359 45912 14873 -39723 -39327 9774 24759 -23797 -63209
308f3209L2759N9514K314m9923j9494M3649M1973k1108m9125k580M1558J4005
$$ -63209 -30450 29064 31378 -18545 -38039 5610 47583 26475 -22650 -25230 16328 30333
320C0333l7488k8571K6135L9793q520m2565p978M2362K8055l2001m5528Q371M6476
$$ 30333 -7155 -35726 -9591 30202 21682 -20883 -28861 13501 41556 9555 -35973 -27602 18874
333A8874J2759l8328k9835K3406M1240p96l6033j1591K8813J9463k1426k7463
$$ 18874 31633 -6695 -36530 -13124 28116 27320 -8713 -20304 8509 27972 6546 -20917
345b0917Q712K9668L095k9185j3732K8153K9868j2428l3680n235K7236J6501k1500
$$ -20917 -12205 17463 20558 -8627 -22359 5794 35662 23234 -10446 -15681 11555 28056 6556
358F556l1124J991K6427P508j7973r855J4497J8174j950j5139j48J6828K596k0333
$$ 6556 -24568 -22577 3850 11358 -6615 -16470 -1973 16201 14251 -888 -1036 15792 18388 -1945
372a945j3448J0174J5820j212j7830q637J7183J9202m842j4824l200N767N016
$$ -1945 -15393 -5219 10601 9389 -8441 -17078 105 19307 14465 -359 -3559 2208 7224
385G224k946j0119k645O190j069l765O630O499j424j100r84p0N857n26j1246l545
$$ 7224 4278 -5841 -8486 -2296 -3365 -7130 -500 5999 4575 3475 2491 2421 8278 7752 -3494 -7039
401g039M161j19K841M646n355m515N473N472M455q1j4408r667J1426Q436o998
$$ -7039 -2878 -2997 -156 4490 -865 -5380 93 5565 10020 9939 -4469 -14136 -2710 5726 -1272
416a272o155j038M894J0921j412j0142P386J1119r160j0716K208N870N156o914
$$ -1272 -7427 -8465 -3571 7350 5938 -4204 3182 14301 5141 -5575 -3367 2503 7659 745
430G45j7224P579K7321q46k2951n932J1717J5845L406k4580j7911K0988J6191
$$ 745 -16479 -8900 18421 17575 -5376 -11308 409 16254 19660 -4920 -22831 -1843 14348
443A4348j7410j0864J1770J2270K808j3239j3744J8769K3918j7949k9107L336
$$ 14348 -3062 -13926 -2156 10114 12922 -317 -14061 4708 28626 10677 -18430 -15094
455a5094K1418J2018j4323k7680R764L9998P98l2532p286J5349J3691J246k5109
$$ -15094 6324 18342 4019 -23661 -13897 26101 26899 -5633 -12919 2430 16121 17367 -7742
468g742j6920K8449J5967l3220j4160K9761K1133n808k2333j7432K4478L5404
$$ -7742 -24662 3787 19754 -13466 -27626 2135 23268 17460 -4873 -22305 2173 37577
480C7577k0448m1122M900K8368Q460j8053k6076J0098M0793m07l7952l540K6144
$$ 37577 17129 -23993 -19093 9275 17735 -318 -26394 -16296 24497 24090 -13862 -17402 8742
493H742J0130j1051k3104m187L4537J1038m3213j9064L4268K6636o415k7494k2388
$$ 8742 18872 7821 -15283 -19470 15067 26105 -17108 -36172 -1904 24732 18317 -9177 -31565
506c1565K4844L7056k2627l5908J7339K4896m372j2169j5002N502L6898n75m6835
$$ -31565 -6721 30335 7708 -28200 -10861 14035 9663 -2506 -17508 -12006 24892 24317 -22518
519b2518l591L7289K589k6156j5802O362L0511J3094l4523k1260K9833K9596l062
$$ -22518 -26109 11180 13769 -12387 -28189 -21827 8684 21778 -12745 -34005 -4172 25424 22362
532B2362k3370j7604J9170K3205k7706k7271K5952J9977j5558j2908p855P794
$$ 22362 -1008 -18612 558 23763 -3943 -31214 -5262 14715 -843 -13751 -21606 -13812
544a3812L6042N86m4703Q04L9833j848k6646q640M590K0937J3169k8400k0222
$$ -13812 22230 22816 -21887 -21083 18750 16902 -9744 -18384 -13794 7143 20312 -8088 -28310
557b8310K4903J7201r783p057k093P744J1505j9576k1178K5852K5081j6133j7848
$$ -28310 -3407 13794 4011 -3046 -5139 2605 14110 -5466 -26644 -792 24289 8156 -9692
570i692l424N666K0840J702k8107j292K2865l972j4403j544J218J5040J3142k0192
$$ -9692 -13116 -7450 13390 15092 -13015 -14307 8558 4586 -9817 -11361 -10143 4897 18039 -2153
584b153j0225K3461J828j7392N889N739m117O188j1106k3675J6065K7346r728
$$ -2153 -12378 11083 12911 -4481 1408 7147 3030 9218 -1888 -25563 -9498 17848 8120
597H120j3536K472p30M834O876p500r81P523p810o960M617r23M717R826r922n376
$$ 8120 -5416 -2944 -3674 1160 8036 536 -445 7078 -732 -7692 -3075 -3998 719 10545 623 -4753
613d753J5283l941j5028J0091O215r887N300J397j7887J439J5385j204J611N870
$$ -4753 10530 6589 -8439 1652 7867 -2020 3280 4677 -13210 -11771 3614 2410 4021 9891
627I891j2599p642J0947L620j156J536q640l834R154l027n159J2060M134p984
$$ 9891 -2708 -10350 597 4217 3061 4597 -4043 -7877 1277 -1750 -6909 5151 9285 1301
641A301J361j303n004Q790R19j4607L609J3202o944j0815o21M198J4227P484j7919
$$ 1301 2662 1359 -3645 5145 6064 -8543 -4934 8268 1324 -9491 -10112 -5914 8313 15797 -2122
656b122j1553J2110O517l783j036k662K824P326j0459j0967J6794J5189j0655
$$ -2122 -13675 -1565 4952 1169 133 -2529 295 7621 -2838 -13805 2989 18178 7523
669G523j2471j746N829J1030n035j9983L428K2023L69j6545o989O891J5871N784
$$ 7523 -4948 -6694 -865 10165 5130 -14853 -11425 10598 10967 -5578 -12567 -5676 10195 15979
683A5979j7285j0110J4827O791j3525p070Q864J3307K412j7936j3140J8683K1903
$$ 15979 -1306 -11416 3411 10202 -3323 -10393 -1529 11778 14190 -3746 -16886 1797 23700
696B3700r076k0973l989J2846J1349j0421k0664N121K3349J262j8278o125J2146
$$ 23700 14624 -6349 -10338 2508 13857 3436 -17228 -12107 11242 12504 -5774 -11899 247
709B47J4464j787j7365l020J9451N515k1178j3905J2363K0111J491k1779j4652
$$ 247 14711 12924 -4441 -7461 11990 17505 -3673 -17578 -5215 14896 16387 -5392 -20044
722b0044J7295K1684p634j9320o21J4312P319j1426j5370P135K0712j454k1117
$$ -20044 -2749 18935 11301 -8019 -8640 5672 12991 1565 -13805 -6670 14042 12588 -8529
735h529m901J7355J1663j0825j7964K372K1412O987j9758j5913J1526K1623J790
$$ -8529 -13430 3925 15588 4763 -13201 -10829 10583 17570 -2188 -18101 -6575 15048 16838
748A6838j9230j0743J3709J3220j0538j5957L565J4031J190j4689r890J2353J9282
$$ 16838 -2392 -13135 574 13794 3256 -12701 -9136 4895 6085 -8604 -18494 -6141 13141
761A3141k757j9114k791J8575J1338j2347j7637J924J6776M223j5588j2028P659
$$ 13141 10384 -8730 -11521 7054 18392 6045 -11592 -9668 7108 11331 -4257 -16285 -8626
774h626J3566k19j1295k735J1858P095j0730j1064P473J4034j539j5166p514J0416
$$ -8626 4940 4721 -6574 -9309 2549 9644 -1086 -12150 -4677 9357 7818 -7348 -14862 -4446
788d446J3586k696j4251l384J2352Q311p806j0677K553J0212J373q473l837O697
$$ -4446 9140 6444 -7807 -11191 1161 9472 1666 -9011 -6458 3754 5127 -3346 -7183 -486
802d86O027m256p734J615R406K176j0251q456N408J0718Q16q760m817N912P982
$$ -486 5541 1285 -6449 -4834 4572 6748 -3503 -11959 -6551 4167 4983 -3777 -8594 -2682 5300
817E300L3n178j317L460J534l266l418J180K665k028m367Q54N326K053l307l231
$$ 5300 5333 155 -1162 2298 3832 566 -2852 -1672 993 -1035 -5402 -4548 778 2831 -476 -3707
833c707J314M666K290l164m389k78K799K314M15j311j616m6J583K072O06k527
$$ -3707 -2393 2273 4563 1399 -2990 -3268 -469 1845 2260 949 -667 -713 870 2942 3548 1021
849A021l209O3J761l5j082n39J75R26O42L47K184J700l025l929J622M604O27n266
$$ 1021 -2188 -2125 -364 -399 -1481 -2020 -1845 -919 -277 70 2254 3954 929 -3000 -1378 3226 3853 -1413
867a413n766J947Q010K212o185l867L596N306M92n010l068M284K942n480m108
$$ -1413 -7179 -5232 2778 4990 -1195 -5062 -1466 3840 4332 -678 -3746 538 3480 -2000 -6108
882f108M682N200j822o314k462P441Q433n311j1762P57J0815M336o882q698J610
$$ -6108 -1426 3774 1952 -4362 -6824 617 9050 3739 -8023 -7266 3549 7885 1003 -7695 -6085
897f085J0591K543r583m169P353M840n002p515O75R851L526j1420p564J0403J2004
$$ -6085 4506 7049 -2534 -6703 650 5490 488 -7027 -6352 3499 7025 -4395 -11959 -1556 10448
912A0448k879j1490m663R790J1573o453j5352P01J2243K597q282o662M063J0932
$$ 10448 7569 -3921 -8584 1206 12779 6326 -9026 -8325 3918 6515 -1767 -8429 -4366 6566
926F566R6j2419j347J3575M709j0564r609K998J2968M704j4520j1220J1467J4114
$$ 6566 6662 -5757 -7104 6471 11180 616 -8993 -5995 6973 11677 -2843 -14063 -2596 11518
940A1518l416j1259l638Q624J0262o327j3952L822J3003k043j1174l333P219J0311
$$ 11518 8102 -3157 -6795 1829 12091 5764 -8188 -4366 8637 6594 -4580 -7913 -694 9617
954I617k629j5733r18J8190N654j3765r535M620J2055N309j2096j1191J0007J2079
$$ 9617 6988 -8745 -9663 8527 14181 416 -9119 -4499 7556 12865 769 -10422 -415 11664
968A1664o141r929Q04P685M688q279j1152P319J3982m340j2439j309Q304R739
$$ 11664 5523 -4406 -3602 4083 8771 492 -10660 -3341 10641 6301 -6138 -7447 857 10596
982A0596j972j5571k432J6825M296j3015n755L859N784M433o457q176R030R194
$$ 10596 8624 -6947 -9379 7446 11742 -1273 -7028 -3169 2615 7048 591 -7585 1445 10639
996A0639r411p953O104O813L39p889j0184N552J3795l089j1742k25O832O095J53
$$ 10639 1228 -6725 -621 6192 6531 -1358 -11542 -5990 7805 4716 -7026 -7251 -419 5676 5829
1011E829r399k293J1827K219j0455j640M463O22L54l901m481Q372O163j0774o160
$$ 5829 -3570 -5863 5964 8183 -2272 -3912 551 1173 1527 -2374 -6855 1517 7680 -3094 -9254
1026i254P508M801P34k533q836P34J1487r90q049K859L023k095J620j360l296
$$ -9254 -1746 3055 3789 1256 -7580 -6846 4641 3651 -4398 -1539 1484 -611 1009 -351 -3647
1041c647N544K110p474rN604j070j570p44k211M765M472o780m307L227l06J689
$$ -3647 1897 4007 -3467 -3476 2128 1058 -512 -1256 -3467 1298 5770 -1010 -5317 -2090 -2396 -707
1057g07L930n672l853O191j03k666O832Q76o851K517K821m699J939L193n460p31
$$ -707 3223 -2449 -6302 -111 -214 -2880 3952 4828 -2023 494 3315 -1384 555 3748 -1712 -2443
1073b443L604l371n86M026k866j646M911J81j922K74m185j73Q848P66p277n51
$$ -2443 1161 -2210 -2796 1230 -1636 -3282 1629 1810 -112 162 -4023 -4196 4652 5418 -1859 -2410
1089b410J237L00M799k57n491K953K616o608j218N098N20j80j930n968L605Q650
$$ -2410 -1173 -873 3926 3669 -1822 1131 3747 -2861 -4079 1019 1539 1359 -571 -6539 -2934 5716
1105E716m825o896M523M013J3q65p167k445J1257L898r261j985M665L52Or70j700
$$ 5716 891 -6005 -1482 2531 2544 1679 -5488 -7933 3324 7222 -2039 -4024 641 993 999 29 -1671
1122a671N851L224j0219o340P186O543o32o006o882M268R886l723r319K867P415
$$ -1671 4180 7404 -2815 -9155 -1969 4574 3942 -2064 -8946 -4678 5208 1485 -7834 -4967 2448
1137B448J506l387o415K03J0102K170q938r92O788J029m462n480j77J0204M468
$$ 2448 3954 567 -5848 -5645 4457 6627 -2311 -3303 3485 4514 52 -5428 -5605 4599 9067
1152I067j2994r088P930Q625J33m655n190L657R128l388r833L648R400r16p349
$$ 9067 -3927 -13015 -5085 3540 3673 -982 -6172 -2515 6613 3225 -6608 -2960 6440 5524 -1825
1167a825m765K928Q214m22r710m92J0143L637o887p588J379J1149N183j0589r097
$$ -1825 -6590 -3662 4552 4130 -5580 -6072 4071 7708 821 -6767 -5388 5761 10944 355 -8742
1182h742N320P072j227m783j847M707M938n629p675N526J0089n52p787m285M463
$$ -8742 -3422 3650 2423 -2360 -4207 500 5438 -191 -7866 -2340 7749 7197 -590 -4875 -412
1197d12Q488j289j0418j090R648K953p199o579N63P010M146o054n819M779N500
$$ -412 8076 6787 -3631 -4721 4927 7880 681 -5898 -5335 1675 5821 -233 -6052 -1273 4227
1212D227l079m436K410O875K098p380o900M610Q477l43p088m268L309O526p63
$$ 4227 1148 -3288 -878 5997 8095 715 -6185 -1575 6902 6559 -529 -4797 -1488 5038 4275
1227D275p409m43P445J970n342l393J589L359O95l918k241M310L248m212m810
$$ 4275 -3134 -3577 3868 5838 496 -2897 -1308 2051 2746 -1172 -3413 897 4145 -67 -4877
1242d877K364O781K486n393n727K132N598P14l301k235P65K290k81l159j0L777
$$ -4877 -2513 4268 6754 1361 -4366 -2234 3364 4078 777 -1458 -693 1597 1316 -1843 -1853 1924
1258A924L38l767j322K324J783j095k558j93L341K227k139l210q1L237K844j196
$$ 1924 2262 -1505 -2827 -503 1280 185 -2373 -2566 775 3002 863 -2347 -2428 809 3653 2457
1274B457l265n85J368J41J46Q62n14j263l19j12K37J269J51j780r12R40J017J06
$$ 2457 -808 -1393 -25 116 262 1124 610 -653 -972 -1084 -847 422 573 -1207 -2119 -1179 -162 -56
1292e6n02m41K81J219J459P7k106j652J585K513n7k157k090l78J894J761j071
$$ -56 -558 -999 -718 501 1960 2037 -69 -1721 -136 2377 2320 163 -1927 -2305 -411 1350 279
1309B79j568P37Q94r62p47J236J660n28k687j075K689K687j317l345m62L722L209
$$ 279 -1289 -552 342 -620 -1367 -131 1529 1001 -1686 -2761 -72 2615 1298 -2047 -2509 1213 4422
1326D422k261m770K13M473J455k979k471Q47K151r0k532l17L447J407l880l498
$$ 4422 2161 -2609 -2396 2077 3532 553 -1918 -1071 1080 990 -1542 -1859 1588 2995 -885 -4383
1342d383K466N154L11n494l258M038N130j120m972j474M177L984k237n077N40
$$ -4383 -1917 3237 3548 -1946 -5204 -1166 3964 2844 -2128 -3602 575 4559 2322 -2755 -2215
1357b215M741K68m383j651L175K844k431n257J99O480K679n680n303K687O672
$$ -2215 2526 2794 -1589 -3240 -65 2779 348 -4909 -4710 1770 4449 -1231 -6534 -3847 2825
1372B825J566n624m109M219N647j781n194k65M209K024l785m457K377N553j447
$$ 2825 4391 -1233 -5342 -1123 4524 2743 -2451 -2716 1493 3517 -268 -4725 -2348 3205 1758
1387A758o570r52N874M309l012o538j82P498L598n693n334K176N027Q00m566l142
$$ 1758 -4812 -5764 110 4419 1407 -5131 -5313 2185 5783 90 -5244 -3068 1959 2759 -1807 -4949
1403d949L925M504l043m697K166N239O83m687l893L360O299j496p563j810N447
$$ -4949 -1024 3480 437 -4260 -2094 3145 3828 -859 -4752 -1392 4907 3411 -4152 -5962 -515
1418e15M170k337n796q22O018L019m456k832L313L258p98l278j207M406L551m828
$$ -515 3655 1318 -4478 -5300 718 3737 -719 -3551 -238 3020 2222 -1056 -2263 2143 5694 866
1434H66n496L083N371m37m678l623K200N942J7o016j239M582K465j538k557k34
$$ 866 -4630 -1547 3824 3387 -1291 -4914 -2714 3228 3245 -2771 -4010 572 3037 1499 -1058 -1292
1450a292L335J133m086j568L871J952k385l001m85L991L675l573m948K177M161
$$ -1292 2043 3176 -910 -2478 1393 3345 960 -2041 -2526 1465 5140 1567 -3381 -1204 2957
1465B957N2k096k455j88L372O02l713j54K948l53j559N9N33J857P43l462j355
$$ 2957 3009 913 -1542 -1730 1642 2244 -1469 -1623 1325 972 -587 -528 5 1862 2605 -857 -2212
1482b212L947J806k159j811q41J329L118q98l562L65J544o69L23J00j464O09O89
$$ -2212 1735 3541 1382 -429 -1270 59 3177 2279 -1283 -918 626 -43 280 380 -1084 -475 214
1499B14j784Q07K500j276j386J095j37N38J984j661k355J782J222p47N00j146
$$ 214 -1570 -763 1737 461 -925 170 33 571 2555 894 -1461 321 1543 796 1296 150
1515A50k290J607K007j286q25m93j183J477J774j491m33J209q01L3J500m20L31
$$ 150 -2140 -533 1474 188 -637 -1130 -2313 -836 938 -553 -986 223 -578 -545 955 535 866
1532H66J187k407j409L408R92k595p14k11L80K997m95m525L72L642j12j302o26
$$ 866 2053 -354 -1763 1645 2637 42 -672 -883 -503 2494 1999 -2526 -2154 1488 1376 74 -552
1549e52j108J307J559k301n46L225j5k609m15R09K419J975l624l726L461L600
$$ -552 -1660 -353 1206 -1095 -1641 1584 1569 -1040 -1455 -546 1873 3848 224 -3502 -41 3559
1565C559j880k407r52Q83L317l38m685J88L938l16k213k29O11J830J12l998k09
$$ 3559 1679 -728 -1680 -797 2520 2182 -2503 -2315 1623 1307 -906 -1135 -524 1306 1418 -2580 -2789
1582b789N609J261m231k334R24L419K953l497m846K875M085k134k813R6J305K023
$$ -2789 2820 4081 -150 -2484 -1560 1859 4812 1315 -3531 -656 3429 1295 -1518 -1422 -117 1906
1598A906j134m224J011M768q85l933k3K673K622o56m972j041O219K783m275l390
$$ 1906 772 -3452 -2441 2327 1442 -2491 -2514 159 2781 2125 -2847 -3888 2331 5114 839 -2551
1614b551M43K608K320k442l704K446L239k831k931J529K737J425k252m119J680
$$ -2551 -2108 500 2820 378 -3326 -880 2359 -472 -3403 -1874 863 2288 36 -4083 -2403
1629b403N256r57m733m43K843K661l88m666j672N326K957l421k154J222J221M14
$$ -2403 2853 1896 -2837 -3280 -437 2224 1836 -2830 -4502 824 3781 360 -1794 -572 649 1063
1645A063j673j745K810K566l850m035J829L743J278k467l641J196M651M5l522
$$ 1063 -610 -2355 455 3021 -829 -4864 -3035 708 1986 -481 -4122 -2926 1725 1770 -1752
1660a752l66K356J976j50l164j406L424J535l036j026J886L74j126j720p83L181
$$ -1752 -2118 238 2214 2064 -1100 -2506 918 2453 -583 -1609 277 651 -475 -2195 -2978 203
1676B03L147k897m098J078L222J443r23k333k04K347P9k066K00J677N00o07j478
$$ 203 3350 453 -3645 -2567 655 2098 1175 -1158 -1362 985 1064 -1002 -802 875 1375 768 -710
1693g10k96K196O18k353m65K017O07j160j828j119K050K839j118k755k20R77R22
$$ -710 -1006 1190 1808 -545 -1010 1007 1614 454 -1374 -2493 -443 2396 1278 -1477 -1697 -720 202
1710B02R03l46n78N79l80j205Q79J564k05q06p05n52R23R37j159r94Q37O91j65
$$ 202 1105 759 181 760 380 -825 54 1618 1413 607 -98 -650 273 1210 51 -943 -106 585 420
1729D20n89j098p7J552J038l61q26r47mJ403Q67k61j74n41q45L06P49K54L72m06
$$ 420 -169 -1267 -1344 208 1246 885 59 -888 -892 511 1378 1117 943 402 -443 -137 612 866 1238 832
1749H32j684m00J431O33p38q88l17R01J128q51j642L64J717Q99n60j412m40J190
$$ 832 -852 -1252 179 812 74 -814 -1131 -230 898 47 -1595 -1231 486 1385 825 -587 -1027 163
1767A63O26o80J03Q08l28j259p31P88K041N71k424k003J322K264j8j907j151J253
$$ 163 789 109 212 1020 692 -567 -1298 -510 1531 2102 -322 -2325 -1003 1261 1243 -664 -1815 -562
1785e62J822n40j960n5J797R61r14j127O16J507n27k020K40K496Q75k187k531
$$ -562 1260 720 -1240 -1295 502 1463 549 -578 38 1545 1018 -1002 -762 1734 2609 422 -2109
1802b109L98L083J467k471k567R87K371J65j816r22J493J607j106j948P78K253
$$ -2109 -1711 1372 2839 368 -2199 -1212 1159 1324 -492 -1414 79 1686 580 -1368 -590 1663
1818A663J47j943j050J671K274r35l316n75L131J957j919l067k83K607J589j758
$$ 1663 1810 -133 -1183 488 2762 1827 -1489 -2064 1067 3024 1105 -1962 -2245 362 1951 193
1834A93j944J050J899m46j756J2K266J232k033k193J319K765r8k792j657J784
$$ 193 -1751 -701 1198 752 -1004 -992 1274 2506 473 -1720 -401 2364 2266 -526 -2183 -399
1850c99K761o64l406q65K690J839j188j924qJ779O25j759r20J842J293j685k242
$$ -399 2362 1698 -1708 -2573 117 1956 768 -1156 -1164 615 1240 -519 -1439 403 1696 11 -2231
1867b231L30K571J357k122k580J138L014L78k155j415J108K132k6k301q08J633
$$ -2231 -1901 670 2027 -95 -2675 -1537 1477 1855 -300 -1715 -607 1525 1499 -802 -1610 23
1883B3P50j292r65O76J246k55j915m95K351J756j421k182j1K139J598j206k266
$$ 23 773 -519 -1484 -808 438 183 -1732 -2227 124 1880 459 -1723 -1734 405 2003 797 -1469
1900a469K67J782J65j198o38L56Q15j26j201J27J538K8j512l76J133J248m9j824
$$ -1469 -1202 580 745 -453 -1091 -735 80 -46 -1247 -1120 418 446 -1066 -1442 -309 939 890 -934
1918i34j110J647J724o53j400m52N47J158K10j060j52P88k13n18L98L21n1k92
$$ -934 -2044 -397 1327 674 -726 -1178 -631 527 737 -323 -475 313 100 -418 -20 301 250 -42
1936d2p83J0J333K84j251o26M03Q24P98n26j312J35J085L14rk63p17J38P49j22
$$ -42 -825 -815 518 802 -449 -1075 -672 152 950 424 -888 -753 332 646 637 374 -343 -205 544 422
1956D22j49K55n19m77M57J27lL46o71r12P66R49j92l94o28l95J265J104j052j025
$$ 422 273 528 9 -468 -11 116 113 459 -212 -1124 -358 591 399 5 -623 -1018 247 1351 299 -726
1976g26K88M15N91K50j010m29Q53m6n70M81L33l52k77m86J76J468J43j816n80
$$ -726 -438 -23 568 818 -192 -621 232 186 -384 97 430 78 -199 -685 -509 959 1102 -714 -1294
1995a294J134R68J72j129j388R39J780n45j242J38M30L57J23p33Q1J253n60j648
$$ -1294 -160 808 980 -149 -1537 -598 1182 637 -605 -467 -37 320 443 -290 -209 1044 484 -1164
2013a164N17J486J83r16j429k90K169J189k002j480J000J253L89p32j235O41J536
$$ -1164 -647 839 1022 106 -1323 -1613 556 1745 -257 -1737 -737 516 905 173 -1062 -421 1115
2030A115o87j210P21Q83k06p19q50P27K028o11k622j8K074Q68o75j649q98J866
$$ 1115 428 -782 -61 822 616 -103 -953 -226 1802 1191 -1431 -1449 625 1493 818 -831 -1729 137
2048A37J674j529j444J006R17k64n05l52Q79J147j249j652J148J774l11j507j184
$$ 137 1811 282 -1162 -156 761 497 -8 -360 519 1666 417 -1235 -87 1687 1376 -131 -1315
2065a315P57K274q7k614n92J796R51l60j017p22J177J091j327p94J465O05j082
$$ -1315 -558 1716 1629 -985 -1577 219 1170 810 -207 -929 248 1339 12 -782 683 1288 206
2082B06q71k0J282J413j390k243R18K144N0j192j047Q1J689N09j859p18J247M07
$$ 206 -665 -685 597 2010 620 -1623 -705 1439 1489 297 -750 -669 1020 1529 -330 -1048 199 606
2100F06o36l80N7P47K83j402m56J809R62j078j200l56J126J650p62k158K32J399
$$ 606 -30 -410 -353 394 677 -725 -1181 628 1590 512 -688 -1044 82 1732 970 -1188 -956 443
2118D43o7n27k98k44O49M49j010k25J237R6j032j73N65P99J15j428q73J327J194
$$ 443 376 -151 -449 -693 -44 405 -605 -830 407 503 -529 -702 -137 662 777 -651 -1524 -197 997
2137I97m30r34p55K08J365K75j147k6N70m12j71M27qJ04P9q73j62J130K11q37
$$ 997 567 -367 -1122 -914 451 726 -421 -447 123 -289 -460 -33 -41 63 142 -731 -893 237 448 -389
2157c89l06J90N98P04o61j110L73R16J87j7m83q01L08O73j46j0J95n46m68K49
$$ -389 -695 -505 93 797 136 -974 -601 315 502 485 2 -799 -491 182 36 26 221 -325 -793 -544
2177e44L17L83J97p24n27N24N23J26j28o16j7J060K14q98k69K40K14O21M9j062
$$ -544 -227 156 353 -371 -898 -374 149 275 147 -469 -486 574 788 -110 -379 -139 75 696 745 -317
2197c17l19N56ln3M64l4n29l59j63N59J050p9j092m72M76Q08L50q07p46O94P14
$$ -317 -636 -80 -83 -136 328 294 -235 -594 -757 -198 852 773 -319 -791 -315 493 843 36 -710 -16 698
2218F98n10n96l2K60M92L3o27l1M44l15m78M77Q04J44q86j161K66J628N92j039
$$ 698 188 -408 -440 -180 312 345 -282 -313 131 -184 -662 -185 619 763 -123 -1284 -1018 610 1202 163
2238A63r74j7P45O79m33p77M73O78n54o40L16N22J48m17n61M10R02m24j207j3
$$ 163 -811 -828 -83 596 163 -614 -141 537 -17 -657 -341 181 329 -88 -649 -239 663 239 -968 -981
2258i81J222Q91o04j568l81J397J014n55p98n4L67K18l16j83P33M87r52r49N09
$$ -981 241 1132 528 -1040 -1421 -24 990 435 -363 -417 -50 168 -148 -331 402 889 -63 -1012 -503
2277e03J049J93r32q80N77J261j22j319m14R45J085o6j138n22Q23O18m26k58L48
$$ -503 546 739 -193 -1073 -496 765 643 -676 -1090 -145 940 874 -264 -786 37 655 229 -29 319
2296C19J90m08p06k1J163P93r94j309K66J265N83o60j014J70J104J70r24m56M60
$$ 319 509 101 -605 -626 537 1330 336 -973 -707 558 1141 481 -533 -363 741 911 -13 -469 -9
2315iN41o4n43j43N55Q1p10r2R14N82n15j087l05J067J058n31j241k55P10N85
$$ -9 532 468 -75 -218 337 418 -292 -384 530 1112 597 -490 -795 272 1330 799 -442 -697 13 598
2335E98j91o16m6N82O5m55K1M44J43k93l95J79P07Mj005m83O91P87kq26p74L93
$$ 598 407 -209 -255 327 392 -63 -42 402 545 252 -143 36 743 747 -258 -741 -50 737 735 -91 -865 -472
2357d72R83J69n66k77P7J56R8r7K1K39k05n64P7N57J57l68n00k1O99M83n36p06
$$ -472 511 680 114 -163 -86 70 168 71 92 331 126 -438 -361 196 353 -15 -515 -536 163 646 110 -596
2379e96Q4N97M57j32o30k96L28K24J1M4j37k15p2l9J97M97l3o84j87M34M21J29
$$ -596 -512 85 542 410 -220 -516 -188 36 47 91 -46 -261 -333 -372 -175 322 289 -395 -582 -148 273 402
2401D02l98n72J82P42J19n03l74j4L78M08j67m24j9O1j4J83J78k9j47l80j69O02
$$ 402 4 -568 -386 356 475 -28 -402 -416 -38 370 203 -221 -240 -179 -193 -10 168 139 -8 -388 -557 45
2423D5N55l39o59j61L73O29P8p45l62N20M48r7k65k63N4L64m2k25J94P6m38j98
$$ 45 600 261 -398 -559 -186 443 521 -224 -586 -66 382 285 20 -243 -189 175 133 -92 102 178 -260 -458
2445d58L09M07J87n19p40K46R85K56n97n65M1O55M41m70m85K19K45q3r8l7O3R5
$$ -458 -149 258 445 -74 -814 -568 417 673 76 -489 -448 207 648 178 -307 -88 157 74 -24 -61 2 97
2467I7l53l14N69N78n11p24J0O26O79j92j010k85Q27N13l07m43j34K40L07k48
$$ 97 -256 -570 -1 577 66 -658 -648 -22 657 465 -545 -830 -3 510 203 -240 -374 -134 173 -75
2487g5k21L81J23m96k42L39M31J04o43o66N11R79j04q48l97L63P57K31o81l97
$$ -75 -296 85 208 -288 -530 -191 240 344 -299 -965 -454 525 421 -427 -824 -461 296 527 -154 -551
2507e51M56K76j72o3O5Q9k1m60j52P25L70p20n96K07O07M65l79r31Q0R19K46m71
$$ -551 -95 181 9 -54 11 100 79 -381 -533 192 562 -158 -754 -547 60 525 146 -785 -705 214 460 -11
2529a1l38LK87K76k21j62L79J4n08K1M96K89j22o25m28O69P54l91p53j67L70N41
$$ -11 -349 -346 -59 217 -4 -166 213 227 -281 -260 236 525 403 -222 -650 19 773 382 -371 -538 -168 373
2551C73N5o26k19M89J70j41O6M2J1mk51L0O05N0p61l03L62M37K34m61p62J99Q23
$$ 373 428 -198 -417 72 242 101 167 209 220 216 -35 -5 600 650 -111 -414 -52 385 619 158 -604 -405 418
2574D18Q3l92j98r9K51L16j70j46K37r0l36J98L20J8j14m20k30O41M61n08n50
$$ 418 501 109 -89 -188 63 379 209 63 300 210 -126 72 392 410 296 -124 -354 287 748 240 -310
2595c10oK74M56M1o46k76M03K08k7N2j36j06J13m0N3M42n7n56j00K95K75J84l91
$$ -310 -316 -42 414 455 -191 -467 -64 144 117 169 33 -73 40 0 53 495 438 -118 -218 77 352 536 145
2618A45o60K24O54j1l85k61j40L40M03k61l22J60j1o7K66J38j06j4k93j85N97
$$ 145 -515 -291 363 352 -33 -294 -434 -94 309 48 -274 -114 -125 -192 74 212 106 92 -201 -386 211
2639B11M27m44m89l6K55M76J8o55k57M17K21n6j40k38N0K97q4p4K80q4l63O3K94
$$ 211 638 194 -295 -331 -76 400 418 -237 -494 -77 144 88 -52 -290 -240 57 -27 -101 179 95 -268 -205 89
2662H9K33J41m30o06L48P21J1m23l57j09M20L52l27l12J46M6k7J04m9J6J21k43
$$ 89 322 463 33 -573 -225 496 507 84 -273 -382 38 390 63 -249 -103 -57 -84 20 -29 -13 108 -135
2684a35j33N29K57m61l52J26L54M44j69p75j83N56L17j18k56k87O2K28q2oK43
$$ -135 -268 261 518 57 -295 -169 185 629 460 -315 -498 58 375 257 1 -286 -224 4 -78 -84 159
2705A59j00l26J4J90K28J58l87m03L88N50j48m64k39J78N16J90m88l69J10J72
$$ 159 59 -267 -253 -63 165 323 -64 -467 -79 471 323 -141 -380 -202 314 504 16 -353 -243 -71
2725g1J31M9j45j01l8k75N2N66J49m51l24N0L25M48j30n84j2M81J61k37k87r5
$$ -71 60 109 -36 -137 -175 -450 -398 168 317 -134 -458 -408 -83 365 235 -349 -361 120 281 44 -243 -338
2747c38K40K29j56j71Pj14m2J71J71J18o5m92k37N63N62j53m58k99J00M58K33
$$ -338 -98 131 -25 -196 -189 -303 -345 -174 -3 115 50 -442 -679 -116 446 293 -165 -464 -364 94 327
2768C27l32k70J26J69Kj01p1J11M9j61K0K18q8k69p8J43L58K49m19o02J65O48
$$ 327 -5 -275 -149 20 22 -79 -150 -39 10 -151 -131 87 -1 -270 -348 -205 153 402 -17 -619 -454 194
2790A94K81j95l66k31K19K96Jq4Pr7j30k7R8K23J0l74j38L68K55k00l07r1K92
$$ 194 475 280 -86 -317 -98 198 199 115 122 25 -105 -132 -34 189 199 -175 -313 55 310 110 -197 -288 4
2813DM80k4n65k53L02L78J08j76k41l5J2j4J51K22p5l17k46N7M18K66l66m65J77
$$ 4 484 460 -105 -358 -56 322 430 254 13 -22 -10 -24 127 349 274 -43 -289 -232 186 452 86 -379 -202
2836b02M14J05k13l01J3L89K18k46k38OR8Q7O0J8K1j76l29N1M76K27k80m29j77
$$ -202 212 317 104 -197 -184 205 423 177 -61 -55 43 130 190 208 229 53 -276 -225 251 478 198 -231 -408
2859d08L16M68n7m83j35K44J83lj46j10J25J04p1K1J20q4j88l8J97K97l4m86k94
$$ -408 -92 376 319 -164 -299 -55 128 125 -21 -131 -6 98 27 48 168 84 -104 -142 55 352 318 -168 -462
2882d62L04M49N5l20l76K1L87J58j39j05Lj4N5N7K7P3j14k35R8L40K5k93k57J1
$$ -462 -158 291 346 26 -350 -329 58 216 77 -28 -25 -39 16 73 100 173 59 -176 -78 262 287 -6 -263 -252
2906b52L75K95k76m49j4K96K12M1j67k08J7J24O3R9M9j46j78L9J88K07o1l30j27
$$ -252 123 418 142 -307 -321 -25 187 228 61 -147 -130 -6 57 156 205 59 -119 -80 108 315 254 -76 -203
2929b03K70K44k2k67k64J06L63R0k35j68q5N8K09J25j36j01o9p5J73K74j8k49
$$ -203 67 311 289 22 -242 -136 227 317 82 -86 -171 -113 96 221 85 -16 -85 -160 13 287 269 20
2951B0j62K0K55K23j86l28k5J88J81Rk58k10J35K00L2J1j24j69N6J80P6M4o5k98
$$ 20 -142 -122 133 356 170 -158 -183 5 186 195 -63 -273 -138 62 94 105 -19 -188 -132 48 124 168 103 -195
2975a95q6K61K23l6k20k91K5L92J49k34k23j7J68K05qk26o1P1K9N9O7p8j37r6
$$ -195 -281 -20 203 167 -53 -344 -319 73 222 -12 -235 -252 -84 121 113 -113 -174 -103 -74 -15 52 -26 -163 -259
2999b59RK67K26k35l58J9K55K95L8l90k65K75K58r6j17q3q1R0R9o3K8P5k08j07
$$ -259 -250 17 243 8 -350 -331 -76 219 257 -133 -398 -123 135 39 -78 -161 -242 -152 -53 -116 -88 -13 -221 -328
3023c28K78K49n9k75k19J64M33P1l79k71R2K85J71j69k43N8J13m1M3J15m4j03
$$ -328 -50 199 140 -135 -354 -190 243 314 -65 -336 -244 41 212 43 -200 -142 -29 -70 -27 88 44 -59
3045e9j16rK88K26l19l67J25L47J82j43l92r0M10K42k09j53J6JO7M9k0P2l5k80
$$ -59 -175 -184 104 330 11 -356 -231 116 298 155 -237 -327 83 325 116 -37 -21 -20 47 96 76 148 113 -167
3069a67n9L26K04j79l36j42L05L80j20l77o4J88K32N9k02j62J47N8r3Q7J25j50
$$ -167 -226 100 304 125 -211 -353 -48 332 212 -165 -229 -41 191 250 48 -114 33 91 -2 85 210 60
3091F0j87j7J07K72O0m10k65K85L35Mk19k55L8L20Q4j91n3Ql7N8O6L0K2j34j92
$$ 60 -127 -144 -37 235 295 -115 -380 -95 240 244 25 -230 -192 128 212 21 -32 -24 -61 -3 63 93 115 -19 -211
3116b11J32L24kk66k09K2L19J88k54k76M1J17J20Q3j43j36P3L2J6J89O4k52j23
$$ -211 -79 245 243 -23 -232 -210 109 297 43 -233 -192 -75 45 128 -15 -151 -78 -46 -30 159 223 -29 -152
3139a52J46J48J06r1k97p6K70J53r8j73j25N3J81O5m7o5j41J7K03J34o6r7j43
$$ -152 -6 142 248 157 -140 -216 54 207 109 -64 -189 -136 45 110 63 -2 -143 -126 77 211 145 48 -95
3162i5l9K61J82j83j75l4N0J67J13j62j57RL8J10J27j50k16K1J42J13Q4j77k25
$$ -95 -134 127 309 126 -49 -83 -33 134 247 85 -72 -63 -25 85 212 62 -154 -133 9 122 206 29 -196
3185a96J24K26N9l5q9j36K8J69Q3j7r9j89m2K04J38n5k16j89J30K87Lk14r3M4
$$ -196 -72 154 213 178 89 -47 -19 150 233 216 117 -72 -114 90 228 173 -43 -232 -102 185 188 -26 -119 -75
3209g5R3J56j7j56l0M2j7Q9J51j18k41o9J18K52N7l02k32J14K14J27j01k24l0
$$ -75 18 174 157 1 -29 13 -4 85 236 118 -123 -192 -74 178 235 -67 -299 -185 29 156 55 -169 -199
3232a99J97N8q5K8L5r8l8J02R4L0j28k24M1L35J03k50k99MK91K14j72k40jQ1N1
$$ -199 -2 56 -29 -1 34 -64 -102 0 94 124 -4 -228 -187 148 251 1 -298 -294 -3 211 39 -201 -202 -121 -70
3257g0N6lj6j3j07o1K21J99j48k70QK44K07j33l12m7K70J74j06k22j25J12J53
$$ -70 -14 -17 -33 -46 -153 -214 7 206 58 -212 -204 40 247 114 -198 -245 25 199 93 -129 -254 -142 11
3280A1m0n4Q6p1j96K5K47J87o9k43j84K16L44j8k97j28J33J91j0j93o4J13L6m1
$$ 11 -29 -83 3 -68 -264 -239 8 195 126 -117 -301 -85 259 241 -56 -184 -51 140 130 -63 -127 -14 22 -19
3304a9ML3m2p1n7J14K51ol39j69K48K95N2k34k38N1K17O7p5o8k2rm5j4J12O8j69
$$ -19 -15 18 -24 -95 -152 -38 213 207 -132 -301 -53 242 294 60 -178 -127 90 157 82 14 -8 -17 -62 -76 36 104 -65
3331f5j56J30K04qj81j46P5L00J10k34k04N2J73J05Mr0q9l7k5Q0J50J1k07j62
$$ -65 -221 -91 113 105 -76 -222 -147 153 263 29 -175 -123 50 155 159 69 -20 -57 -82 -2 148 159 -48 -210
3355b10L8K04J56j62k31L4K10P1r3r8k0R0Q7j7l6l3p3l0J17J30J3j95j92N7K72
$$ -210 -172 32 188 26 -205 -171 39 110 17 -81 -101 -11 76 59 23 -10 -83 -113 4 134 147 -48 -240 -183 89
3380H9J09j54j77l9R3J56K6j22k7K7l2N1J15j5j15p7O6J57P0j63k04O2K26R7j14
$$ 89 198 44 -133 -172 -79 77 103 -19 -46 -19 -51 0 115 100 -15 -92 -26 131 201 38 -166 -104 122 219 105
3405A05j82n9J14R4J2j3n6r8j2R1J21O9j37j89L2K61R8j41j73j7J59J37j01j63
$$ 105 -77 -136 -22 72 84 71 15 -83 -95 -4 117 186 49 -140 -108 153 251 110 -63 -80 79 216 115 -48
3429d8KP3J6J6K0l6o2q1L5K02J20j76k30J8K22J73p1k48o2J82J05o3p4j6J4Kj5
$$ -48 -46 27 43 59 79 43 -19 -100 -65 137 257 81 -149 -131 91 264 193 -55 -117 65 170 107 33 17 31 33 18
3456A8L1Q9p5j85QK06J22j13k44o8K15K49j01k37n1J18J22mn8k3J7n3n2J00J15
$$ 18 49 138 63 -122 -114 92 214 101 -143 -211 4 253 152 -85 -136 -18 104 100 42 19 36 -17 -69 31 146
3481A46q1j68p4J40K19n5k91p3J88J90k2j75j25R2J52k5n8L6j4q8j3Q6J31Nk03
$$ 146 65 -103 -177 -37 182 127 -164 -237 -49 141 119 -56 -181 -89 63 38 -20 16 2 -86 -99 -13 118 123 -80
3506h0j66J52K49j0k03j46Q6K01M0j79q1Q1O1j4J1J2Rp3q6P1K07J1k46j29J07
$$ -80 -246 -94 155 145 -58 -204 -118 83 123 -56 -137 -56 5 -9 2 14 23 -50 -136 -65 142 153 -93 -222 -115
3531a15K12P4j69k05O8J99Pp2n4JL3jLN2M5j20j16R4J71M4j58j80N7K62O5j71
$$ -115 97 171 2 -203 -135 64 71 -1 -55 -54 -21 -22 -19 33 78 -42 -158 -64 107 151 -7 -187 -130 132 197 26
3557B6j29NJ09R2l1q0LPq1K5J44J0j34j21K9J80J22j55k10N9J82P8p8j34k8J11
$$ 26 -103 -98 11 103 72 -8 -5 2 -79 -54 90 100 -34 -155 -126 54 176 21 -189 -130 52 130 52 -82 -110 1
3583AO0m7KL1p9o9M2J21P0j22j98K7K15J01j23j71j2J35J29o8j25M1M3n0M3N1
$$ 1 61 14 16 47 -32 -101 -59 62 132 10 -188 -161 54 155 32 -139 -151 -16 113 45 -80 -39 4 -46 -3 48
3609D8rm1r9j6J69J31j58k10L2J74J26n6j98n7J50P5n2l8Kk3rj0O1J06p4j79k
$$ 48 39 -2 -101 -117 52 183 25 -185 -153 21 147 91 -107 -164 -14 61 9 -29 -27 -50 -59 -69 -8 98 24 -155 -157
3636a57J78J26p8k00o6J89J83j02j63oP1Q2Mn4mL8p5o3J33J40r7j76m4J36J89
$$ -157 21 147 69 -131 -197 -8 175 73 -90 -96 -25 57 61 7 3 41 -34 -97 36 176 79 -97 -141 -5 184
3661A84k4k36q3J60J56l3j27o0O8O8m5k8P6k6j08m2R6J27J3k03j35J73K26m2j78
$$ 184 160 -76 -159 1 157 124 -3 -63 5 73 28 0 76 50 -58 -100 -4 123 136 -67 -202 -29 197 155 -23
3686b3q0Q5J41L3r9n9N1%m0J5P0mj10r9P0J94Kk03j07R5J98M1j56j39R8J28ko2
$$ -23 -103 -18 123 156 57 -2 49 49 9 24 94 90 -20 -119 -49 145 147 -56 -163 -68 130 171 15 -124 -26 102 100 38
3714C8okj9j8J6R4M1j48j22Q1J66M5j46j62K1K01O7j45r9N1O2J0Kk2Rk0m8J6J40
$$ 38 32 30 11 -7 9 103 144 -4 -126 -45 121 166 20 -142 -121 80 147 2 -97 -46 16 26 28 6 15 -5 -53 -37 103
3743A03L2j56j18L9J91O7j48j57L3J39O1n6q1k4O1J7l5M6O0q0q2N1J24N9j03j72
$$ 103 135 -21 -139 -100 91 158 10 -147 -114 25 86 30 -51 -75 -14 3 -32 14 74 -6 -88 -37 87 146 43 -129
3769a29K0J94Q9j36j41%J14P0m2q6J6J4n1%J13L8r9j14K2J53J05q8j91K1J62P9
$$ -129 -109 85 174 38 -103 -103 11 81 39 -47 -31 -17 -68 -68 45 83 -16 -130 -108 45 150 62 -129 -108 54 133
3795A33q2j23NR5M3o0j3K2k9n2QJ00Q5q4j99jJ96J33r5j59l8J33J23o6r8NN5j
$$ 133 51 -72 -67 28 71 11 -2 20 -9 -61 -53 47 132 48 -151 -152 44 177 82 -77 -115 18 141 75 -23 -18 37 36
3823C6m6NM2Jr1o3J26J09r2j75k6J59J53o4k02l7J27J27m9p3KJ8Lk6K5R6jj55
$$ 36 -10 -5 37 38 -53 -116 10 119 27 -148 -174 -15 138 74 -128 -165 -38 89 40 -33 -31 -13 -10 -36 -11 85 84 -71
3851g1p2J19J44k9j81r0J32J67m3j60o1J07J01k7q1kN9k8m8O7Q7k0j26j06Q1K02
$$ -71 -143 -24 120 91 -90 -180 -48 119 76 -84 -145 -38 63 36 -45 -47 12 -16 -64 3 90 70 -56 -162 -81 121
3877A21K1k15j12Q3J62Rj31n9N9Q6k7n8L9M2l0n4K5R3N0j35j30R1J89K0j49j43
$$ 121 142 -73 -185 -102 60 69 -62 -121 -62 24 -3 -61 -22 20 -10 -64 -39 54 104 -31 -161 -70 119 139 -10 -153
3903a53M5J71N3j14p6M0L0orJ9M8l3r5JJ39O0j16j09L4J42P9j18j41L7J39L4o0
$$ -153 -108 63 116 2 -74 -34 -4 -10 -19 0 48 15 -80 -79 60 120 4 -105 -71 71 150 32 -109 -72 67 101 41
3930D1p3RL6j2lN4L5q3r8L6J22P3q0j57qJ63P7j01p8J3N6M0j8m8K8Nn1J2P7K0
$$ 41 -32 -23 13 1 -2 52 87 4 -94 -58 64 137 57 -100 -108 55 132 31 -47 -34 22 62 44 -4 24 29 -22 -10 67 87
3960H7p5j11K0J40P0q9j43PR8Q3k3r4j4O4Jj5L2L0o1m8QP6N7n6j48qJ49P5q3j19
$$ 87 12 -99 -79 61 131 42 -101 -94 4 87 64 -30 -44 20 21 6 38 68 7 -41 -33 43 100 44 -104 -112 37 112 29 -90
3990i0k9J02Q3m4n9K1Nj0nO2L1k4r9m1J21J13q4j44j2J27P3m2j23j5R1K5l5j7
$$ -90 -119 -17 66 22 -37 -16 -11 -21 -26 36 67 43 -56 -97 24 137 53 -91 -103 24 97 55 -68 -83 8 33 -2 -19
4018a9J9%k4l7O3J09m9j43l0J23J13l0j48o5J14J30o7j11PN0L6m9k6M9K9p4n9
$$ -19 0 0 -24 -61 2 111 62 -81 -111 12 125 95 -53 -118 -4 126 59 -52 -45 5 41 -8 -34 15 44 -30 -89
4045h9P9J02k2j27p9J02J71m0j64n8J15J01l2o8l8M5M1m7k0Q1K4r5p2N3J20L3
$$ -89 -10 92 70 -57 -136 -34 137 97 -67 -125 -10 91 59 -9 -47 -2 39 -8 -28 53 77 -18 -90 -37 83 116
4071A16j53j01R9J53Lj34r3P7J18nr9qO3rn1jN1N9q4j23J9J64N2j35j19M0J37
$$ 116 -37 -138 -39 114 117 -17 -110 -33 85 80 -19 -27 36 27 -24 -25 26 85 1 -122 -103 61 113 -22 -141 -101 36
4098C6O5j00j22P0J13k8n5JL0kl6j9P0O5q4j28K4J27Q5r1j54RJ38O1p7q9J6Q1
$$ 36 101 1 -121 -51 62 34 -21 -20 10 8 -28 -47 23 88 4 -124 -100 27 112 21 -133 -124 14 75 -2 -91 -75 6
4126FOl5j4N2Jp5j6R6N8n9r0l9J25R6p8j37kR4P4l4r0PM9Kk6K7L3k1o5pO5Q5l8
$$ 6 12 -23 -37 15 16 -59 -75 21 79 20 -70 -109 16 112 34 -103 -105 -11 63 29 -61 -54 -5 -3 -29 -2 31 10 -55 -62 3 88 50
4159E0j22k4Q6R2l2r2l6O7M8j3n0J0LrJM0L0l0o1l8Q5R5m7j08j8Q0N8Op7l3L3
$$ 50 -72 -96 -10 82 50 -42 -78 -11 37 24 -26 -16 -13 -22 -21 19 49 19 -42 -80 5 100 53 -55 -73 7 65 71 -6 -39 -6
4190fL6j0j7J2rl0j9N0P2l8r7j7P9P7k2r2m8P6O7k1n0nJ6jmJ3L0kq8j3O5R5l6
$$ -6 30 20 3 15 6 -24 -43 7 79 41 -56 -73 6 83 61 -31 -79 -3 64 43 -7 -12 4 3 -1 12 42 40 -48 -61 4 99 63
4223F3j14m0Q0R6j5j18j9O5N0k0k9MJ2k8k2L8O2Kj14n2Q1J05j1j15o6R3Q3j7r0
$$ 63 -51 -91 -11 85 70 -48 -67 -2 48 28 -1 3 15 -13 -35 3 65 67 -47 -99 -18 87 76 -39 -105 -12 71 54 -36
4252c6k7N0L6j9m7L5M1m6m8M3P1K1q7q7O0J38J4j30p9O7J06%q2n0N6N0n1k7M6
$$ -36 -63 -13 23 4 -43 -8 33 -13 -61 -18 53 74 -13 -100 -40 98 112 -18 -97 -30 76 76 -6 -56 0 50 -1 -28 18
4281A8M6n6o2mJ14N7r9j13K8J50L3j11q9L8J01K4q4m1M5M1l2l9L7O1k9r6j7J19
$$ 18 64 8 -54 -58 56 113 14 -99 -71 79 112 1 -88 -50 51 75 -9 -50 -5 36 4 -35 2 63 34 -62 -79 40
4309D0P1q1j07mJ18Q4q3j10K4R3K8m8m7J5L8j0n7L4O9k8j02j2Q1Q8m1j20m4J12
$$ 40 111 30 -77 -81 37 121 38 -72 -48 45 73 25 -22 -7 31 21 -36 -2 67 39 -63 -75 6 94 53 -67 -111 1
4337AR4n5r2j2Q1K6k9m3L1K5m0j6K6M6lo5n1N9R4j7j16l9P5P0po9n0M8M9k3rK7
$$ 1 95 40 -52 -64 17 43 14 -29 2 27 -13 -29 -3 43 40 -25 -76 -17 77 60 -56 -95 -20 50 43 -26 -76 -28 21 -2 -11 16
4369A6j0k0l2L2N6Rq2n3M7P7qo2m9L9P4j5n0j3L0NNLJ0J2m5l3M2O8kp9m3L8P5
$$ 16 6 -14 -46 -14 42 51 -31 -84 -37 40 32 -30 -79 -40 34 19 -31 -44 -14 -9 -4 -1 9 21 -24 -57 -15 53 51 -28 -71 -33 42
4402D2J8p1m4K7K5J2j7pJpk1K1N6j8m9k4L5P3Mp0n2N1O8k1k8k6mJ7QPJ1J5n9m5
$$ 42 60 -11 -55 -28 -3 9 -8 -15 -14 -21 -42 -21 35 17 -32 -56 -21 52 56 -14 -66 -15 53 32 4 -22 -26 -9 -1 6 17 32 -27 -72
4436g2N0P8kp0n5M7Q9j6q0rK7N6om2k1L7Lk6nN0jn8m2M0Q1K7q4p9L4Q5K7o1n0
$$ -72 -22 56 54 -16 -71 -24 65 49 -31 -40 -13 43 37 -5 -26 11 14 -12 -17 33 32 -26 -68 -28 53 80 -4 -83 -49 36 63 2 -48
4469d8K7M8qm3K1L4k1l5j3O7K1l4q3MJ01N1r0p0J2R1L7o7n1L0N4j6k7oL9Jo0l3
$$ -48 -21 27 19 -24 -3 31 10 -25 -38 29 50 16 -67 -63 38 89 -1 -71 -59 32 69 2 -49 -19 35 19 -8 -14 25 26 -34 -67
4501f7Q6N7m1j04j1R5O1o3q2lR6M8o6n8K1N1km1%N4Pn5m5O2P6j9r5l5O4R2l5r0
$$ -67 19 76 35 -69 -80 15 76 13 -69 -72 24 72 6 -52 -31 20 18 -23 -23 31 38 -17 -62 0 76 57 -38 -73 -9 83 48 -42
4533d2j9O6N6m1n5J0M8nk7lM0J3m5n7L7R1Kj09l9P0O8Rp8m8M4P8l8l6LK7Kk6j8
$$ -42 -61 5 61 20 -35 -25 23 18 -9 -12 28 41 -4 -61 -24 67 69 -40 -79 -9 59 68 -10 -58 -14 64 26 -10 -7 20 22 -4 -22
4566b2L9L0n1n0L7P4J7p3n1J2Q9K2p0l7K0L6%k2kJ0ok6kM8K1l6n6MO2L6n2n9K4
$$ -22 17 47 -4 -54 -17 57 74 1 -50 -38 51 73 3 -34 -14 22 22 0 -2 8 2 -24 -26 22 43 7 -49 -45 17 53 1 -58 -34
4599c4O0K7n0j8jK5J0j9J1J7k0l5JN3K8m9n7ON9L4m7m2QL2K1j8k0LNj4K6J7Lk8
$$ -34 26 53 3 -15 -16 9 19 0 11 28 8 -27 -26 27 55 6 -51 -45 14 48 1 -41 -33 -1 20 2 -18 -15 -10 -24 2 19 22 -6
4633fk3LN3J5m3m5JN2J6j6m0mK1J7j2J8J2l5j8K5L4Rl0l9lP4J2m5n2K3L9Qj2k9
$$ -6 -29 -26 27 42 -1 -46 -45 7 23 7 -33 -37 -16 1 -11 7 19 -16 -34 -9 25 34 4 -35 -38 36 48 3 -49 -26 13 21 9 -20
4667b0J2Pj9nK9K1k7m7J3M5M5l1q0ON6L7k8m7jM3K0l6j2J8J3j2k8J9M0j9o0j0
$$ -20 -8 -1 -20 -25 4 25 -2 -49 -36 9 54 23 -57 -51 5 42 14 -33 -34 9 29 -7 -19 -1 12 0 -28 -9 31 12 -48 -58
4699e8O6L6j8o5k0N6N6k5o8J4M1Rk8qK1Nk4l8K6O6rq1k2O0N6qp5l4N1P3k8m7p
$$ -58 8 44 26 -39 -59 -3 53 28 -40 -26 15 24 -4 -12 9 14 -10 -48 -22 44 35 -46 -68 -8 48 40 -35 -69 -18 55 27 -20 -27
4732b7M2K3l9k1L6K9m5m5K1N7J6p2n5M5P5Np0m2M6M8qm0k5L7K2k2k2L5K7j9n5
$$ -27 15 38 -1 -22 14 43 -2 -47 -26 31 47 -25 -80 -35 40 45 -25 -67 -21 27 19 -21 -46 -9 13 -9 -31 4 31 12 -43
4763d3JO6L5n9p0K1P4K3n3m7J1O5J9o0j0K3K0k3k2K5M3j1n6nN4K7l3o0jM6N5m1
$$ -43 -42 24 59 0 -70 -49 25 48 -5 -52 -41 24 43 -17 -27 -4 16 -7 -29 -4 39 28 -28 -33 21 48 15 -45 -46 0 55 14
4795A4n9KL7L1j6k9J2J8k5j1K6K5%m6k2M1N0j4p1%M2L9j9l7rQK9%k2K3Kl2mL0
$$ 14 -45 -43 -6 25 9 -20 -8 10 -15 -26 0 25 25 -21 -43 -2 48 34 -37 -37 5 44 25 -12 -21 -13 16 16 -6 17 19 -13 -17 13
4829A3J1Jm9j6L4N2j9m1j6K6K0Ok5qMqQJ4Lnj4j7L0L5k1m5pL7K4nk4k2J7J4LK
$$ 13 24 25 -24 -40 -6 46 27 -14 -30 -4 16 22 -3 -11 -7 -15 -7 7 10 5 -9 -26 4 39 18 -27 -34 3 27 22 -2 -24 -7 7 10 12
4865A2Rk0j5nK4L0j7n0kL5L2k6k5k4L5K2Ol9oJ2J7j6K1jmk6j9L7L9k7m3oL6M3
$$ 12 21 1 -14 -19 5 35 18 -32 -34 1 33 7 -18 -42 -7 15 21 -18 -24 -12 5 -11 10 9 5 -21 -40 -3 36 9 -34 -40 -4 39
4899C9k1m2j2K7L3j0k4JJ1nk1J1K5Om7j6L0M9jo3l1M0N9rn6jJ7J7ok2J6J9rl3
$$ 39 18 -24 -36 -9 24 14 -10 -9 2 -3 -24 -13 12 18 -29 -45 -15 34 33 -30 -61 -21 38 29 -27 -28 -11 6 0 -22 -6 13 4 -29
4933b9nM1K0l8l8J2P2J7o4m1M1M2J1m8l0K8L1j0k6J6J6j3l3pL7M4m8m1lN6L7l9
$$ -29 -34 7 27 -11 -49 -37 35 52 -12 -53 -12 30 41 -7 -37 -9 22 12 -14 2 18 5 -28 -35 2 46 -2 -43 -46 10 47 8
4965Hn4j1P8J6l8l7K7K5ok0kK0J0l5k6N0L8k9n1j4N1M5k4o2oN0K9j7l0JK6qk0
$$ 8 -46 -57 21 37 -1 -38 -11 14 8 -12 -14 6 16 -19 -45 5 43 14 -37 -51 0 45 21 -41 -47 3 32 15 -15 -14 12 4 -16
4998a6KK9Km1j7K1M7on7l5O4M8k8l6l3L9L4ll4NK6pj5JK4Ok1l2J3M6Qn1k6K2M3
$$ -16 -14 15 17 -24 -41 -20 27 21 -36 -71 -7 41 13 -23 -56 -17 17 14 -20 -15 11 4 -11 -10 14 20 -1 -33 -20 26 34 -17 -43 -21 22
5033B2Nl4l0J8J3J2jk0L1j2k0lM0Ml0l4K9K6J4k7l1LL1J9k8j2mK1nPRLj0k7J5
$$ 22 27 -7 -37 -19 -6 6 5 -15 16 4 -16 -19 21 25 -5 -39 -10 16 30 3 -28 -25 6 25 -3 -15 -19 2 -3 4 13 16 6 -21 -6
5068fM2j3j4l2K1K5Rk1k2kK1NJj8pKnJ5K9ol7pJ3L4nk3k2J0K6Pk2j0mRKKJ2nj8
$$ -6 36 23 9 -23 -2 23 32 11 -11 -13 8 13 14 -4 -11 -9 -14 1 30 24 -13 -20 -7 27 22 -1 -23 -13 13 20 -2 -12 -16 -7 -5 -3 9 4 -14
5107a4j5K1L3Ll5k8K7L8Rm0k4K2J7J0j8npJ4j1j4L4Ol0l1J1M8Rl4n1K7M2J9l9
$$ -14 -29 -8 25 28 -7 -35 -8 30 39 -1 -25 -3 14 24 6 1 -6 8 -3 -17 17 23 -7 -38 -27 21 30 -4 -55 -28 14 33 -6
5140fk7J1L7jk5rK6Mk5oK3L3k5l4kL3M6m6l8%M8K1k8l3OL4lprQJ1k2k0K5L3j8
$$ -6 -33 -22 15 14 -11 -20 6 10 -15 -21 2 35 10 -24 -26 7 53 7 -31 -31 17 38 10 -23 -17 17 14 7 -2 6 17 -5 -25 0 33 15
5176A5l6j3L4M7k0n1j6M4L6l2l1OK0K8l2j3K6Nk7j4J7L9Ml8k8K1N4j1m0l9L2M5
$$ 15 -21 -34 0 47 27 -24 -40 4 40 8 -23 -17 3 31 -1 -14 12 17 -10 -24 -7 32 36 -2 -30 -9 45 34 -6 -45 -13 32
5208C2j3k3k3L2J2j5j4jL4j1k6jM4Jm4j9J4L3K7l7l8J2K8J9k2k0K5Rrj2QJ8rk4
$$ 32 19 -4 -27 5 17 2 -12 -13 21 10 -16 -17 27 28 -16 -35 -21 12 39 2 -36 -24 4 23 1 -19 6 15 6 -6 2 20 11 -13
5242a3j1L5K4l1l4qL8K3j2l5JK4Oj2joMkLQMpk2LL2Pj8l6j2L2K6mk6j1K7KJ2j4
$$ -13 -24 11 35 4 -30 -38 0 23 11 -24 -23 1 7 -5 -6 -12 -8 -10 -7 1 5 -2 -24 -21 11 18 0 -36 -48 -16 10 6 -20 -31 -4 -2 10 -4
5280dMMj3%J8J2j3k5oK7J6ol0MpK6qj2j0PPnNJ0j1j6J7RJ4j3k3%L5Lqj4rJ5%N
$$ -4 0 4 -9 -9 9 21 8 -17 -23 4 20 14 -16 -12 -19 7 -1 -13 -23 -16 -9 -14 -9 1 -10 -26 -9 0 14 1 -22 -22 13 16 8 -6 -15 0 0 5
5320Ej1J2rj3lL6prrpK2J7pl5NK4J0ok1%J3j3lJ8Qj2k6oK5K3%n0RK3J7pk0j3J8
$$ 5 -6 6 -3 -16 -19 17 10 1 -8 -15 7 24 17 -18 -13 11 21 15 -6 -6 7 -6 -9 9 17 5 -21 -27 -2 21 21 -29 -20 3 20 13 -7 -20 -2
5359bJ8j4oJ2Qj2j5QK4pl5pK3K9j2l8j0L5K8qk2k4L2%Ok6KJ4Rk7LL7%l5k1J5M1
$$ -2 16 2 -4 8 16 4 -11 -3 21 14 -21 -28 -5 24 12 -26 -36 -1 27 19 -3 -27 5 5 11 -15 -13 1 10 -17 -14 23 23 -12 -33 -18 23
5396B3J4m5k9K4M1Nm0j0PL7j5j4QM%k0lL3J0j4m6J4M9J4m8l4J2L3K7j8l3JK5o
$$ 23 37 -8 -37 -13 28 33 -7 -17 -10 27 12 -2 6 10 10 -10 -13 20 30 16 -30 -16 33 47 -1 -35 -23 10 37 19 -14 -13 12 6
5430FmkJ4Ok9j3K9L4j6l9lK8K6j2m1j5M4J6k3j1JJ8Mj4nK5pl1MJ6J4J0l9j3J8
$$ 6 2 0 14 20 -9 -22 7 41 25 -14 -17 11 37 25 -16 -31 13 29 6 -5 -4 14 18 4 -1 24 17 -14 -10 6 20 30 -9 -22 -4
5465dM3j4m9jK8RLj8lOJ0ojJ4Nj9j9J8J9Rl8mOK9Jk3j8J0K0nLkj2MpKK2mj9j8
$$ -4 39 25 -24 -25 3 12 15 -3 -6 0 10 4 3 17 22 3 -16 2 21 30 -8 -12 -6 23 24 1 -17 -7 13 8 11 9 -3 1 -6 -4 18 14 -5 -23
5505b3K9J2kk5%nQJ6j7roJ0OnJ1Lk0lJ7L5j3k7j3MK7Kj1j3QjJ0j2J5j7OmNJ4o
$$ -23 6 18 16 -9 -9 -14 -6 10 -7 -16 -22 -12 -6 -11 0 3 -17 -20 -3 32 19 -8 -21 -17 10 12 1 -12 -4 -5 5 -7 8 -9 -3 -7 -2 12 6
5544Fk5pK9J6lj7k5L5J3Kk4j3nJ9Jj7J8lj6oJ0L1qk1j8K1L4%k7j8J9J8Nk8PJL
$$ 6 -19 -26 3 19 16 -1 -26 9 22 24 0 -13 -18 1 2 -15 3 0 -16 -22 -12 19 11 -10 -28 -7 27 27 0 -18 1 19 24 -4 3 4 7
5581Gj2JJ2J8l2k1J0L1Ol0k3J1L7J0k3l4RL5Ok2rJ6Jj7%K3J0pl8kL2L1k6m4J1
$$ 7 -5 -4 8 26 -6 -27 -17 14 20 -10 -33 -22 15 25 2 -32 -23 12 18 -4 -13 3 4 -13 -13 10 20 13 -25 -27 5 36 10 -34 -23
5616b3L0J4j8k6NL2J3k8j8K8Rj5k7K0J6ml2j3L0L3k0m3mL4L0k1k2MJ7J7k0j0J3
$$ -23 7 21 3 -23 -18 14 27 -1 -19 9 18 3 -24 -4 12 8 -24 -37 -7 26 6 -37 -41 -7 23 2 -20 -16 1 18 -2 -12 1
5649AOj6j6J0L8ll3k3K8L5kl5k5J6K8Jk4JOJ6j1KkNkqKK0pj5k7J1M7qk3k1J3K6
$$ 1 7 -9 -25 -15 23 20 -13 -36 -8 27 25 -10 -35 -19 9 10 -14 -13 -7 9 -2 0 -2 3 1 -7 -5 15 8 -7 -34 -23 24 16 -7 -28 -15 11
5687A1Pk4OlJQj4J3Qpk7K5OK6l4j8mL7J5k4k3oK0K5k6kMjkmJ5Lj2j8J6QJ4pk6
$$ 11 18 -6 0 -3 -2 6 -8 5 13 6 -21 4 10 36 2 -16 -20 17 32 8 -15 -21 -1 24 -2 -4 0 -1 -3 -7 8 11 -1 -19 -3 5 19 12 -14
5726a4j3L4Onj3Oj2J7J1j0qrJ2KJ1mk0JLK1Lkk5pJ7kJlpkOmRlpj4KL3j2lj3nK2
$$ -14 -27 7 13 8 -5 1 -11 6 17 7 -1 -10 2 4 15 11 -9 -8 -5 16 19 17 -8 -15 2 0 1 -2 -9 -11 -5 -9 0 -3 -10 -24 -22 11 -1 -4 -17 -22 0
5769@J8k5nKJ3kLOqMj7MJ9Oj4k1J2J7J7k8k1PJ8RqpkRnj5QJ4j2j3j2K9J4j3l0
$$ 0 18 -7 -12 -10 3 1 4 10 2 6 -11 -7 12 18 4 -17 -5 12 29 1 -20 -13 5 14 6 -1 -3 6 1 -14 -6 8 -4 -17 -29 0 14 1 -29
5808b9lL7J5j5k7NL4qj2mQJ2rj5RJ3Kk4j2J9K4rl4j1M1K0qk8j1K0J5j4j1OK2j4
$$ -29 -32 5 20 5 -22 -17 17 9 -3 -7 1 13 4 -11 -2 11 13 -11 -23 -4 20 11 -23 -34 7 27 19 -9 -20 0 15 1 -10 -4 18 4
5844Dj6NK0Ll2j9K0M0nl8j3J1M2Jk9j6K1J8j0lj1K7j0k3KJ5J4j9k4J1L8Ll7k0
$$ 4 -12 -7 13 16 -16 -35 -15 25 20 -18 -31 -20 22 23 -6 -22 -1 17 7 4 -7 20 10 -13 -11 4 18 -1 -25 -14 24 27 -10 -30
5878c0J0L1%qk2MK9oj8KJ9j1j2PPJ6pm0PK5J1j1k5KJ9K0j1k3JJ3J4j4PJOj3j6
$$ -30 -20 11 11 3 -19 -15 14 8 -10 -8 11 0 -12 -5 2 18 11 -29 -22 3 14 3 -22 -20 -1 19 8 -15 -14 -1 13 -1 6 7 13 0 -16
5915a6K5K3k1k2j3J3L2mk6j1J6J3Ok3JKJ3j3LJ1pnpK3N%k3j0J9J0jj9klJ7KlJ
$$ -16 9 32 11 -11 -24 -11 21 17 -9 -20 -4 9 15 -8 -7 -5 8 -5 -2 9 2 -3 -10 13 18 18 -5 -15 4 14 13 -6 -8 -11 6 8 5 6
5953Fj8jJ1NJ8j8qjJ3J1nk0N%J3j2Jj4lOJ1Qkk2pJ3NJ6j7k%K0J0j1j7%jJ4l%%
$$ 6 -12 -13 -2 3 21 3 -5 -6 7 18 13 -7 -2 -2 11 -1 0 -14 -17 -11 0 8 6 -16 -23 -10 -5 11 -6 -8 -8 12 22 11 -6 -6 -7 7 4 4 4
5994Djo%PRj5j0j0K1J8rj9JQJ2nk8J3J2J2j5MlMj0j7K1PQl1j7L7J5kk2j0J0L0
$$ 4 3 -3 -3 4 13 -2 -12 -22 -1 17 8 -11 -10 -2 10 5 -23 -10 2 14 -1 3 0 4 -6 -23 -2 5 13 -18 -35 2 17 15 -7 -17 -7 23
$$ [...]
8191I
##END NTUPLES=NMR FID
##END=
