##TITLE=1H_DE-80H_X3
 200.13MHz, d2o
 8 sc
 
 19ns.26.2.2025
##JCAMPDX= 6.0         $$ Bruker NMR JCAMP-DX V2.0
##DATA TYPE= NMR FID
##DATA CLASS= NTUPLES
##ORIGIN= UXNMR, Bruker Analytische Messtechnik GmbH
##OWNER= pz
$$ XWIN-NMR		Version 3.5
$$ Mon Mar 24 10:38:26 2025 Russian Standard Time (UT+4h)  Yarkov@DPX200
##.OBSERVE FREQUENCY= 200.1313
##.OBSERVE NUCLEUS= ^1H
##.DELAY= (6, 6)
##.ACQUISITION MODE= SIMULTANEOUS
##.ACQUISITION SCHEME= undefined
##.AVERAGES= 8
##.DIGITISER RES= 18
##SPECTROMETER/DATA SYSTEM= spect
##.PULSE SEQUENCE= zg30
##.SOLVENT NAME= CDCl3
##.SHIFT REFERENCE= (INTERNAL, CDCl3, 0, 14.3821)
##AUDIT TRAIL= $$ (NUMBER, WHEN, WHO, WHERE, WHAT)
$$ ##TITLE= Audit trail, XWIN-NMR		Version 3.5
$$ ##JCAMPDX= 5.01
$$ ##ORIGIN= Bruker BioSpin GmbH
$$ ##OWNER= Yarkov
$$ C:/Bruker/XWIN-NMR/data/yarkov2/nmr/H-C/1/audita.txt
$$ ##AUDIT TRAIL=  $$ (NUMBER, WHEN, WHO, WHERE, WHAT)
(   1,<2025-03-24 10:36:34.59 +0400>,<Yarkov>,<DPX200>,
      <created by zg, POWCHK disabled, PULCHK disabled
       configuration hash MD5:
       00 E9 B6 7A A2 85 ED C7 34 08 36 98 17 FE 4E 26
       data hash MD5: 16K
       E0 D9 34 79 93 58 46 73 3A 08 57 D5 70 6A C3 A6>)
$$ ##END=
$$ 
$$ hash MD5
$$ C4 3F 2D F0 29 52 61 CB C8 A7 BD 30 AC 69 01 C3
##$RELAX= 
##$RELAX= 
##$RELAX= 
##$RELAX= 
##$RELAX= 
##$RELAX= 
$$ Bruker specific parameters
$$ --------------------------
##$DU= <C:/Bruker/XWIN-NMR>
##$EXPNO= 1
##$NAME= <H-C>
##$PROCNO= 1
##$TYPE= <nmr>
##$USER= <yarkov2>
##$AMP= (0..31)
100 100 100 100 100 100 100 100 100 100 100 100 100 100 100 100 100 100 
100 100 100 100 100 100 100 100 100 100 100 100 100 100 
##$AQSEQ= 0
##$AQ_mod= 1
##$AUNM= <au_zg>
##$AUTOPOS= <>
##$BF1= 200.13
##$BF2= 200.13
##$BF3= 200.13
##$BF4= 200.13
##$BF5= 200.13
##$BF6= 200.13
##$BF7= 200.13
##$BF8= 200.13
##$BYTORDA= 1
##$CFDGTYP= 0
##$CFRGTYP= 5
##$CHEMSTR= <none>
##$CNST= (0..31)
1 1 145 1 1 1 1 1 1 1 1 1 1 1 1 1 1 1 1 1 1 1 1 1 1 1 1 1 1 1 1 1 
##$CPDPRG= <>
##$CPDPRG1= <>
##$CPDPRG2= <>
##$CPDPRG3= <>
##$CPDPRG4= <mlev>
##$CPDPRG5= <mlev>
##$CPDPRG6= <mlev>
##$CPDPRG7= <mlev>
##$CPDPRG8= <mlev>
##$CPDPRGB= <>
##$CPDPRGT= <>
##$D= (0..31)
0 0.7 0 0 0 0 0 0 0 0 0 0.03 0 0 0 0 0 0 0 0 0 0 0 0 0 0 0 0 0 0 0 0 
##$DATE= 1742798194
##$DBL= (0..7)
120 120 120 120 120 120 120 120 
##$DBP= (0..7)
150 150 150 150 150 150 150 150 
##$DBP07= 0
##$DBPNAM0= <>
##$DBPNAM1= <>
##$DBPNAM2= <>
##$DBPNAM3= <>
##$DBPNAM4= <>
##$DBPNAM5= <>
##$DBPNAM6= <>
##$DBPNAM7= <>
##$DBPOAL= (0..7)
0.5 0.5 0.5 0.5 0.5 0.5 0.5 0.5 
##$DBPOFFS= (0..7)
0 0 0 0 0 0 0 0 
##$DE= 6
##$DECBNUC= <off>
##$DECIM= 32
##$DECNUC= <off>
##$DECSTAT= 4
##$DIGMOD= 1
##$DIGTYP= 9
##$DL= (0..7)
0 120 120 120 120 120 120 120 
##$DP= (0..7)
150 150 150 150 150 150 150 150 
##$DP07= 0
##$DPNAME0= <>
##$DPNAME1= <>
##$DPNAME2= <>
##$DPNAME3= <>
##$DPNAME4= <>
##$DPNAME5= <>
##$DPNAME6= <>
##$DPNAME7= <>
##$DPOAL= (0..7)
0.5 0.5 0.5 0.5 0.5 0.5 0.5 0.5 
##$DPOFFS= (0..7)
0 0 0 0 0 0 0 0 
##$DQDMODE= 0
##$DR= 18
##$DS= 0
$$ [...]
##$SUBNAM2= <"">
##$SUBNAM3= <"">
##$SUBNAM4= <"">
##$SUBNAM5= <"">
##$SUBNAM6= <"">
##$SUBNAM7= <"">
##$SUBNAM8= <"">
##$SUBNAM9= <"">
##$SW= 18.0517328524113
##$SWIBOX= (0..15)
0 0 2 0 0 0 0 0 0 0 0 0 0 0 0 0 
##$SW_h= 3612.71676300578
##$TD= 16384
##$TD0= 1
##$TE= 0
##$TE2= 300
##$TE3= 300
##$TEG= 300
##$TL= (0..7)
0 120 120 120 120 120 120 120 
##$TP= (0..7)
150 150 150 150 150 150 150 150 
##$TP07= 0
##$TPNAME0= <>
##$TPNAME1= <>
##$TPNAME2= <>
##$TPNAME3= <>
##$TPNAME4= <>
##$TPNAME5= <>
##$TPNAME6= <>
##$TPNAME7= <>
##$TPOAL= (0..7)
0.5 0.5 0.5 0.5 0.5 0.5 0.5 0.5 
##$TPOFFS= (0..7)
0 0 0 0 0 0 0 0 
##$TUNHIN= 0
##$TUNHOUT= 0
##$TUNXOUT= 0
##$USERA1= <user>
##$USERA2= <user>
##$USERA3= <user>
##$USERA4= <user>
##$USERA5= <user>
##$V9= 5
##$VALIST= <valist>
##$VCLIST= <CCCCCCCCCCCCCCC>
##$VD= 0
##$VDLIST= <DDDDDDDDDDDDDDD>
##$VPLIST= <PPPPPPPPPPPPPPP>
##$VTLIST= <TTTTTTTTTTTTTTT>
##$WBST= 1024
##$WBSW= 4
##$XGAIN= (0..3)
0 0 0 0 
##$XL= 0
##$YL= 0
##$YMAX_a= 177595
##$YMIN_a= -141615
##$ZGOPTNS= <>
##$ZL1= 120
##$ZL2= 120
##$ZL3= 120
##$ZL4= 120
##$ABSF1= 10
##$ABSF2= 0
##$ABSG= 5
##$ABSL= 3
##$ALPHA= 0
##$AQORDER= 0
##$ASSFAC= 0
##$ASSFACI= 0
##$ASSFACX= 0
##$ASSWID= 0
##$AUNMP= <proc_1d>
##$AZFE= 0.1
##$AZFW= 0.1
##$BCFW= 1
##$BC_mod= 2
##$BYTORDP= 1
##$COROFFS= 0
##$CY= 83.5205535888672
##$DATMOD= 1
##$DC= 2
##$DFILT= <>
##$DTYPP= 0
##$F1P= 10.8118882576601
##$F2P= -7.23987719738617
##$FCOR= 0.5
##$FTSIZE= 0
##$FT_mod= 4
##$GAMMA= 1
##$GB= 0.15
##$INTBC= 1
##$INTSCL= 1
##$ISEN= 128
##$LB= 0.25
##$LEV0= 0
##$LPBIN= 0
##$MAXI= 10000
##$MC2= 0
##$MEAN= 0
##$ME_mod= 0
##$MI= 1.114404
##$NCOEF= 0
##$NC_proc= 0
##$NLEV= 6
##$NOISF1= 3.799351
##$NOISF2= 2.8
##$NSP= 1
##$NTH_PI= 0
##$NZP= 0
##$OFFSET= 14.38212
##$PC= 1
##$PHC0= -1258.208
##$PHC1= 2.392248
##$PH_mod= 1
##$PKNL= yes
##$PPARMOD= 0
##$PSCAL= 0
##$PSIGN= 0
##$REVERSE= no
##$SF= 200.129724274929
##$SI= 16384
##$SIGF1= 3
##$SIGF2= 2
##$SINO= 400
##$SIOLD= 16384
##$SREGLST= <1H.CDCl3>
##$SSB= 0
##$STSI= 0
##$STSR= 0
##$SW_p= 3205.1282051282
##$SYMM= 0
##$S_DEV= 0
##$TDeff= 0
##$TDoff= 0
##$TI= <>
##$TILT= no
##$TM1= 0
##$TM2= 0
##$TOPLEV= 0
##$USERP1= <user>
##$USERP2= <user>
##$USERP3= <user>
##$USERP4= <user>
##$USERP5= <user>
##$WDW= 1
##$XDIM= 8192
##$YMAX_p= 0
##$YMIN_p= 0
$$ End of Bruker specific parameters
$$ ---------------------------------
##NTUPLES= NMR FID
##VAR_NAME=  TIME,          FID/REAL,        FID/IMAG
##SYMBOL=    X,             R,               I
##VAR_TYPE=  INDEPENDENT,   DEPENDENT,       DEPENDENT
##VAR_FORM=  AFFN,          ASDF,            ASDF
##VAR_DIM=   8192,          8192,            8192
##UNITS=     SECONDS,       ARBITRARY UNITS, ARBITRARY UNITS
##FACTOR=    0.0002768,     1,               1
##FIRST=     0,             0,               0
##LAST=      2.2672688,     0,               0
##MIN=       0,             -141615,         0
##MAX=       2.2672688,     177595,          0
$$ Real data points
##PAGE= N=1
##DATA TABLE= (X++(R..R)), XYDATA
0@%%%%%%%%%%Qj6J6j6K4l2M0n6O4p2R1j15J36j60J92k24K56k96L44l98M59n25
$$ 0 0 0 0 0 0 0 0 0 0 0 8 -8 8 -8 16 -16 24 -32 32 -40 51 -64 72 -88 104 -120 136 -160 184 -214 245 -280
32b80N97o76P65q62R68j086J217j360J515j684J871k075K296k538K803l091L406
$$ -280 317 -359 406 -456 512 -574 643 -717 798 -886 985 -1090 1206 -1332 1471 -1620 1786
49A786l752M132m548N007n519O089o727P446q266R207j0302J1598j3155J5065
$$ 1786 -1966 2166 -2382 2625 -2894 3195 -3532 3914 -4352 4855 -5447 6151 -7004 8061
63H061j7476K0632k4968L1355m1872O3479j80826J11491J5750p9249J69167j05531
$$ 8061 -9415 11217 -13751 17604 -24268 39211 -141615 -30124 -14374 -93623 75544 -29987
75b9987K07582j87296Q1049j9173l3657L8005j42341Q2723j8313o6896L8749L6176
$$ -29987 177595 -9701 71348 52175 18518 56523 -85818 -3095 -21408 -88304 -49555 -13379
87a3379j1278P6696j4066l6536R5450r7011p927n7186J02068o1449o4122J49668
$$ -13379 -24657 52039 37973 1437 96887 -124 -8051 -65237 36831 -24618 -88740 60928
99F0928q9894O6104o8470L7786N7765q0217J8806j6411Q4414j50791N8221L8222
$$ 60928 -28966 37138 -31332 6454 64219 -15998 2808 -13603 70811 -79980 -21759 16463
111A6463n7131O5260m1428Q2916p3615O0266o8027l8817J12071j41450Q3831j6996
$$ 16463 -40668 24592 -16836 66080 -7535 52731 -15296 -54113 57958 -83492 339 -16657
123a6657J8191K4430n5002N5675p009J9479p3662M3390L5117q3277j7520P3074
$$ -16657 1534 25964 -29038 26637 19628 39107 -34555 8835 43952 -39325 -56845 16229
135A6229k2562m7399R8893m4614O0050l0244l1539M9569p9944L3338p4968O1486
$$ 16229 -6333 -53732 45161 547 60597 30353 -1186 48383 -31561 1777 -73191 -11705
147a1705k0383l3716R7426q2148R5008R47l5036L9248J0586k4635p3643N7517
$$ -11705 -32088 -65804 31622 -50526 44482 45429 10393 49641 60227 35592 -38051 19466
159A9466m3106l6633J0333K3897J8977n904K4495M204N5502p5863J7693M0283
$$ 19466 -23640 -60273 -49940 -26043 -7066 -12970 11525 15729 71231 -4632 13061 53344
171E3344p7233J1471j1103J0718l4391M0169L153k3318P6360l8860L992J4327
$$ 53344 -23889 -12418 -23521 -12803 -47194 -7025 -3872 -27190 49170 10310 14302 28629
183B8629j259k7728r467Q050k0514K6153m9937L9394L1680m4329J3299L1310j45
$$ 28629 27370 -358 -9825 -1775 -22289 3864 -46073 -6679 25001 -19328 -6029 25281 25136
196B5136o1536N1745l206l5677L3099j4510J0682j023K63q516J8217q410j8146
$$ 25136 -36400 15345 12139 -23538 9561 -4949 5733 4710 4973 -3543 14674 6264 -11882
209a1882K5538l1843O249R558j4912k357M1420j690l9295O1877j8748m0058J4882
$$ -11882 13656 -18187 -11938 -2380 -17292 -19649 21771 20081 -19214 42663 23915 -16143 -1261
222a261J56j1288j4831K0125o069J4488r126k351M3952k4096l700K8771j3997
$$ -1261 -1105 -12393 -27224 -7099 -13168 1320 -7806 -10157 33795 9699 5999 34770 20773
235B0773l3603J6325r116l5557L3058K767j4033K3841J5659k0533J726J2648j7009
$$ 20773 -12830 3495 -5621 -41178 -8120 -5353 -19386 4455 20114 -419 1307 13955 -3054
248c054Q965j0928r56J6564k4594p518L0097P06k5212L9739J1657l9097J3762
$$ -3054 5911 -5017 -5973 10591 -14003 -21521 8576 9282 -15930 23809 35466 -3631 10131
261A0131R82k9639k130J0870j0397Q781J2566q498J4595k336o493K0147n352j2578
$$ 10131 11113 -18526 -20656 -9786 -20183 -11402 1164 -7334 7261 4925 -1568 18579 13227 649
275F49K1079p938l6412J9397N496l2409K0817K5031j9179J490J5313j5059m365
$$ 649 21728 13790 -22622 -3225 2271 -30138 -9321 15710 -3469 -1979 13334 -1725 -6090
288f090M902l948J2440j118r750J6177o291k3572J9329O735k4971J8046J4159
$$ -6090 -1188 -5136 7304 6186 -3564 12613 6322 -17250 2079 8814 -16157 1889 16048
301A6048l0550K455J7394j9174K706K4258l179Q01O236r916j066p093j4273J4660
$$ 16048 -14502 -12047 5347 -13827 -11121 13137 9958 10759 16995 7079 6013 -1080 -15353 -693
315f93J393k0102J7407Q981k8653J0712K3638j8736O057K5211j6224r905Q854
$$ -693 700 -19402 -1995 6986 -21667 -10955 12683 -6053 4 25215 8991 -914 7940
328G940j0818m944P379j244O803K187j3688R023K097k3066J3080J5400k2448M941
$$ 7940 -2878 -7822 -443 -1687 5116 7303 -6385 2638 4735 -18331 -5251 10149 -12299 -7358
342g358K1719k0757o692K3352q298m339J6115k890o536k84q229j155L002j2022
$$ -7358 14361 -6396 -13088 10264 1966 -2373 13742 10852 4316 4032 -4197 -5352 -2350 -14372
356a4372J1577J1433j9193R770J4684j9462k005K2792j3362j0532K1159j1192
$$ -14372 -2795 8638 -10555 -785 13899 -5563 -7568 15224 1862 -8670 12489 1297
368A297j1713Q193o94k818N320K028J098O529j4954O050J0798k0250N107J6284
$$ 1297 -10416 -2223 -2917 -5735 -415 1613 2711 9240 -5714 336 11134 -9116 -4009 12275
382A2275j3204r882K2989j0799j4681J9944o637n814O283K533p075K990M7l629
$$ 12275 -929 -10811 12178 1379 -13302 6642 5 -5809 474 3007 -4068 -1078 -1031 -4660
396d660J2426j3925P893R871j6939K412J3063q194j6498K5432p864j5375J8503
$$ -4660 7766 -6159 1734 11605 -5334 -2922 10141 1947 -14551 10881 3017 -12358 6145
409F145k131n496j616P464q333L931k331m264J4393j6947O823Q703p092m241J3312
$$ 6145 4014 -1482 -3098 4366 -3967 -36 -2367 -6631 7762 -9185 -2362 6341 -751 -4992 8320
424H320j511j8880K6490j0471j1874J1313q9q750k718J6191j3405Q944n222Q2
$$ 8320 6809 -12071 14419 3948 -7926 3387 3298 -5452 -8170 8021 -5384 3560 -1662 -1580
438a580J1283k1419R323M153k44j3830J8385N050k6142K4968q386l784O129L958
$$ -1580 9703 -11716 -2393 1760 1516 -12314 6071 11121 -15021 9947 1561 -2223 3906 7864
452G864m680m824R461j9015Q790m116K822O085o918N629K103J560k1368K8981
$$ 7864 3184 -1640 7821 -11194 -2404 -6520 -3698 2387 -4531 1098 3201 4761 -16607 12374
466A2374n386j8569K2682n588j811j6222J9228j1032l511J4433j5892K2079j8690
$$ 12374 6988 -11581 11101 5513 3702 -12520 6708 -4324 -7835 6598 -9294 12785 -5905
479e905K237N688m851K303M01J3479j9815J9155r175j4593J2436k265n328o649
$$ -5905 -3668 2020 -2831 -528 -127 13352 -6463 12692 3517 -11076 1360 -905 -6233 -12882
493a2882K6737k0727O63P428n317J1970j4499J7107L00n54j6117P057Q068k9204
$$ -12882 13855 -6872 -6209 1219 -4098 7872 -6627 10480 10780 10226 -5891 1166 9234 -19970
507a9970K1060k793J579n608Q315l533j0053K4069k7458K1287j182n201O101j5740
$$ -19970 1090 -1703 -124 -5732 2583 -950 -11003 13066 -14392 6895 5713 512 6613 -9127
521i127J9316j7974J0535o898J0240R448l1490K3396k347j4167l637J7068m657
$$ -9127 10189 -7785 2750 -4148 6092 15540 -15950 7446 5099 -9068 -12705 4363 -294
534b94o720J0366m792Q140j3460J0268m187R525m708j0171K2990l2276J9131r044
$$ -294 -7014 3352 -1440 6700 -6760 3508 -679 8846 4138 -6033 16957 -15319 3812 -5232
548e232o589K0423j2763R528j4680K4720j7644j1482K5693j3306M986q556J2019
$$ -5232 -11821 8602 -4161 5367 -9313 15407 -2237 -13719 11974 -1332 3654 -4902 7117
561G117m567n918m152N609J1941k3979J7334J076m395p499O211O223j3951K1822
$$ 7117 2550 -3368 -7520 -1911 10030 -13949 3385 4461 66 -7433 -1222 5001 -8950 12872
575A2872j5306P278M706j1135J65k116R363j5907J0607n738O795j232j4947K1628
$$ 12872 -2434 4844 9550 -1585 -1420 -3536 5827 -10080 527 -5211 1584 352 -14595 7033
589G033n343J260j0881K3387p184k2746K5884j6839P301p432L387Q433j0345Q056
$$ 7033 1690 2950 -7931 15456 8272 -14474 11410 -5429 1872 -5560 -2173 6260 -4085 3971
603C971j0341J3682q714k534Q434p514L682q74k972l591J6185j4411m40J4664
$$ 3971 -6370 7312 -1402 -3936 4498 -3016 666 -208 -3180 -6771 9414 -4997 -5437 9227
617I227o013k834o331J7835j5621m25N199m729J2452k0644J3983M313q810J01
$$ 9227 3214 380 -5951 11884 -3737 -4162 1037 -3692 8760 -11884 2099 6412 -2398 -2297
631b297L252O129j5939J2909m949l298P130n242l7J294Q411j2910P897J803l738
$$ -2297 955 7084 -8855 4054 -895 -4193 2937 -2305 -2342 -1048 7363 -5547 2350 4153 415
646D15K712r867J1245l890m579j780J1593j659j5265J8078l684o677O41N185j436
$$ 415 3127 -6740 4505 615 -3964 -5744 5849 4190 -11075 7003 3319 -3358 -2717 2468 1032
661A032l787N522o703P473n508p95N244k930K943k537K148o124P996n014p681
$$ 1032 -2755 2767 -3936 3537 -1971 -2766 2478 -452 2491 -46 2102 -4022 3974 -1040 -8721
676h721J5447m025n395K335R014r738m533Q304m630K465o021M563L231o082o23
$$ -8721 6726 2701 -2694 -359 8655 -1083 -5616 2688 -1942 523 -5498 -935 2296 -3786 -4409
691d409M968M874r022R736J072p543M446l589m857Q80O136q003K556O552n993
$$ -4409 559 5433 -3589 6147 7219 -324 4122 533 -4324 -3444 2692 -5311 -2755 3797 -2196
706b196m65o05N456m15j846N50N449k866j2028J1026J338q429M657O615m121m539
$$ -2196 -2661 -3266 2190 1775 -71 479 5928 3062 -8966 2060 3398 -5031 -374 6241 2120 -2419
722b419M763m866O2J269j247L006J86m11j515J675k462M350P23n525Q663k308
$$ -2419 2344 -2522 -2460 -1191 -2438 568 754 343 -1172 503 -1959 2391 3114 -2411 6252 3944
738C944r126K095N216o550k641J1144j705l541K300K27j75k179j92N056K87o521
$$ 3944 -5182 -3087 2129 -4421 -7062 4082 2377 -1164 1136 1363 1188 -991 -1183 3873 4160 -2361
754b361L590K89o762K445L776k911L13O147o356k183O593m544p58M650K047q20
$$ -2361 1229 1518 -5244 -2799 977 -1934 -1621 4526 -1830 -4013 2580 -1964 -2722 1928 3975 3155
770C155j745O28N79k812m175M783K461p624J353N978o644k161Q307j392j068M838
$$ 3155 1410 2038 2617 -195 -4370 413 2874 -4750 -3397 2581 -4063 -6224 2083 691 -377 4461
786D461m52k181n23q23j987L11j02R40J313l608K373K320n952K821O484n312j825
$$ 4461 4009 1828 1305 482 -1505 -1194 -1296 -356 957 -2651 -278 2042 -3910 -1089 5395 83 -1742
803a742N910l295n626L465K134k976J731K133k34j37k856J940J300m411K367L404
$$ -1742 4168 873 -4753 -1288 846 -2130 -399 1734 1500 1363 -1493 447 1747 -2664 -297 3107
819C107m535j124M945l203k929O526k85m241L577Q95m352K44R89k68l26j100K676
$$ 3107 -1428 -2552 2393 -810 -3739 2787 2502 -1739 1838 2733 -1619 -1375 -386 -654 -980 -2080 596
836E96R83l507J058M416l816k300O622k555m302M513J91m397J695K532k883M74
$$ 596 1579 -1928 -870 3546 -270 -2570 4052 1497 -2805 1708 1899 -2498 -803 1729 -1154 -680
852f80Q64Rk24j913J913R74k520j81M904k789l273O588j952m139L224J656m394
$$ -680 184 193 -31 -1944 -31 943 -1577 -1758 3146 357 -2916 3672 1720 -2419 805 2461 -1933
869a933K46L623k882L53N64O07pj949J634J585j958k001M838l277l861N195m51
$$ -1933 -1687 1936 -946 -593 -29 578 571 -1378 256 1841 -117 -2118 2720 -557 -4418 777 326
886C26k610J932M627m499l7L522l360O36j167J930j021k281Q31M27n76l195O469
$$ 326 -2284 -352 4275 -224 -261 3261 -99 537 -630 1300 279 -2002 -1171 -744 -1320 -4515 1954
903A954p46l198M895K29l556o64M308m701J94K825j792k7j761K322j697K97L85
$$ 1954 1208 -1990 2905 3134 -422 -1086 3222 -1479 -1285 1540 -252 -279 -2040 282 -1415 -1118 -733
920g33K925L6m442N947l325k991K001K541k486j552O281n718M5O77j14M54j382
$$ -733 2192 2228 -2214 3733 408 -2583 -582 1959 -527 -2079 4202 -1516 -1471 -794 -908 -454 -1836
937a836M159k172R83k478K367m9l974O324j541j451l82K696m710k082N780l958
$$ -1836 2323 151 1134 -1344 1023 974 -3000 3324 1783 332 -50 2646 -2064 -4146 1634 -2324
953b324J390N56K436k769r39K523j614K643l740O018j976m257L496k028L0k905
$$ -2324 -934 -378 2058 -711 -1650 873 -741 1902 -1838 4180 2204 -2053 1443 -585 -555 -3460
969c460O846l522j483M614n062J218j724L237j843P99K551j731R35l657M788k220
$$ -3460 3386 -136 -1619 2995 -2067 -849 -2573 664 -1179 -380 2171 440 1375 -2282 2506 286
985B86j371K405J606k859m001O723o100L85K228J279Q66k885N537m974K159j691
$$ 286 -1085 1320 2926 67 -3934 2789 -3311 -2926 -698 581 1447 -1438 4099 -875 1284 -407
1001d07L84K701n216N168l838k95n69J521l83k064P677m920L13J134N45k636j302
$$ -407 -23 2678 -2538 2630 -1208 -1503 -2072 -551 -934 -2998 4679 -241 72 1206 1751 -885 -2187
1018b187N399l779J525k199K694j092m158M243n22M90l079N208k589k458M002
$$ -2187 3212 -567 958 -1241 1453 361 -3797 446 -76 414 -2665 2543 -46 -2504 1498
1033A498k759K306j489L744l648Q46J952m954L356l652M648l002j123M271k537
$$ 1498 -1261 1045 -444 3300 -348 498 2450 -2504 852 -2800 1848 -1154 -2277 1994 -543
1048e43J002l652O864l053l165M972j625r31k535L924k158M4Q51N23J428k910
$$ -543 459 -3193 3671 618 -2547 2425 800 -131 -2666 1258 -900 -856 -5 518 1946 -964
1064i64K823k460J418j697J027M4l196N894n373J360J998J61j045j714O078n447
$$ -964 1859 -601 817 -880 147 191 -3005 2889 -2484 -1124 874 1035 -10 -1724 4354 -1093
1080a093M89O25N87m05l431M543j366J37j718L754l98l761M147k648P00j348J758
$$ -1093 -604 21 608 203 -3228 1315 -51 86 -1632 2122 1724 -2037 2110 -538 162 -1186 572
1097E72j150q13L475m140K253j15J014j289o40K939k219n41j244M121k940j685
$$ 572 -578 -1391 2084 -2056 197 82 1096 -193 -833 2106 -113 -654 -1898 2223 -717 -2402
1113b402L882k16j070k130M957l502r22J947j320K113k991K848j366l41P95j313
$$ -2402 1480 1264 194 -1936 3021 -481 -1403 544 -776 1337 -1654 1194 -172 -513 282 -1031
1129a031J881k045L103k373r91K328j057j027%M818l349m88K038p54j450k271
$$ -1031 850 -1195 1908 -465 -1456 872 -185 -1212 -1212 3606 257 -231 1807 1053 -397 -2668
1145b668L614j396q27m1J465J60k869L343Q4q2J94J205j346j221J674l393J035
$$ -2668 946 -450 -1277 -1318 147 307 -2562 781 865 783 977 2182 836 -385 1289 -2104 -1069
1162a069M93P87j132O5L002l180M21n7K426j008k443M185j664j952o71K636o19
$$ -1069 -576 211 -921 -856 2146 -1034 -613 -670 1756 748 -1695 2490 826 -1126 -1797 839 220
1179B20j882L141n63n84j156N23m79j45J178l54J113q18R04j553n74K265q59p79
$$ 220 -1662 1479 916 332 -824 -301 -780 -925 253 -101 1012 194 1098 -455 -1029 1236 377 -402
1197d02K46K280l116j578K816k48j247L22L186j450j302L95O54k69k074K945j49
$$ -402 -156 2124 -992 -2570 246 -2 -1249 -927 2259 809 -493 -98 556 287 -1787 1158 1009
1214A009q24P4j10l3j565K154j261j75J866j462r10K11J596j250j51K282Q26j720
$$ 1009 185 259 149 116 -1449 705 -556 -731 1135 -327 -1237 -1026 570 -680 -831 1451 2277 557
1232E57r17J899j173k025L79K462j529j714K619o91p93K28J520K91q55J182j031
$$ 557 -360 1539 366 -1659 -1280 1182 -347 -2061 558 -133 -926 -698 822 1113 258 1440 409
1249D09m86k76k21j79r4J484l62r66P67J193k034l15K465n50j546K81J922j918
$$ 409 -77 -353 -574 -753 -847 637 275 -691 76 1269 -765 -1080 1385 835 -711 -430 1492 -426
1267d26j231K132R9n49o01J477j75j927Q24N17o41j36J281l09o51R22q3j101N32
$$ -426 -1657 475 574 25 -576 901 726 -1201 -377 140 -501 -637 644 335 -316 606 523 -578 -46
1286d6J171j501k16J068k16j106p9K008q61j122J332O59j331r55J847l20j609
$$ -46 1125 -376 -592 476 260 -846 -925 1083 222 -900 432 1091 -240 -1195 652 332 -1277
1303a277J062J024r93j44J172k25o49J80N37j068l23R94o70l96M44J031j007m62
$$ -1277 -215 809 -184 -328 844 619 -30 150 687 -381 -704 290 -380 -776 -332 699 -308 -770
1321g70K015o99j133Q19P62j379q61J430j21j058P25J371o57n21P53J45j166k90
$$ -770 1245 546 -587 232 994 -385 -1246 184 63 -995 -270 1101 444 -77 676 821 -345 -635
1339f35J334j138m97J003j81p53J69J603q51j51J413l24j130l09R84j008o99J201
$$ -635 699 -439 -936 67 -114 -867 -698 905 54 -97 1316 992 -138 -447 537 -471 -1170 31
1357C1O09j127j36J453r10o63Q43Q50j102j79J402j257m49M03O65o78j59J620
$$ 31 640 -487 -623 830 -80 -743 100 950 -152 -331 1071 -186 -635 -232 433 -245 -404 1216
1375A216j082p17J83N10j006j54J987n05n15M83P84j399l76J466o04n09pQ80j470
$$ 1216 134 -583 -400 110 -896 -1050 937 432 -83 400 1184 -215 -591 875 271 -238 -245 635 -835
1394h35n75J301j52k7L66J561j371o12Q94o57n79J64J650j324j04R01m50n85k99
$$ -835 -1410 -109 -261 -288 78 1639 268 -344 550 -107 -686 -522 1128 -196 -300 601 151 -434 -733
1413g33J845j284j57Q01l81q63p06J964j017K68J375J45o88p53J249j541k56O85
$$ -733 1112 -172 -329 472 91 -772 -1478 486 -531 -263 1112 1257 569 -184 1065 -476 -732 -47
1431d7K60p32m39J418j198OO46J191p47j88J666j849m10k12Q02r40j22K019j410
$$ -47 213 -519 -958 460 -738 -732 -86 1105 358 170 1836 -13 -423 -635 167 -773 -895 1124 -286
1450b86J60l38R55p96m59J915j017k9l20J008j235m21J736q37O8p5J007j665l15
$$ -286 -126 -464 491 -305 -764 1151 134 105 -215 793 -442 -863 873 36 104 29 1036 -629 -944
1469i44J062p44J85q4J780j370j01J079n51k61o48J950j735k10R69o25k80n99
$$ -944 118 -626 -441 -525 1255 -115 -216 863 312 51 -597 1353 -382 -592 377 -248 -528 -1127
1487a127K045j258L74Q91m87l06j037J490j356J78P45J55l68n98J974j582J01
$$ -1127 918 -340 34 925 438 132 -905 585 -771 -593 152 307 -61 -659 1315 -267 -166
1504a66P69J48r92m67J584j835J92K27R29m94l71J933j306J46m99J032j004r08
$$ -166 603 751 -241 -708 876 -959 -767 -540 389 -105 -476 1457 151 297 -202 830 -174 -1082
1522a082J869j590M38j01R78p14k65J810j535M97j82N50j045n74J441r11n3j1
$$ -1082 787 -803 -365 -466 512 -202 -467 1343 -192 305 123 673 -372 -946 495 -416 -469 -480
1540d80J544j299l52J516n89m21n12J609j665l4J071n53M64q67J532j222J2P11
$$ -480 1064 -235 -587 929 340 -81 -593 1016 -649 -683 388 -165 299 -568 964 -258 -246 465
1558D65n79L25r25J648j473j81J233m00k40j07J787j909j41O02l37l30m66J965
$$ 465 -114 211 -714 934 -539 -720 513 113 -127 -234 1553 -356 -497 105 -232 -562 -1028 937
1576I37j078N3J79N51k76j003J932j223j96M1M7o90m76J620j245P82N99K71o42
$$ 937 -141 -88 91 642 366 -637 1295 72 -124 -83 -36 -726 -1202 418 -827 -45 554 825 183
1595A83l46J173j440J74J1J004j006p93J808j090j36N0J525r14o73J472j344j8
$$ 183 -163 1010 -430 -256 -245 759 -247 -1040 768 -322 -458 -408 1117 203 -470 1002 -342 -360
1613c60m23Q01k98L7J093p07L18o64Q24r56k64J310p55m34j72J385j641j7J773
$$ -360 -783 18 -280 -243 850 143 461 -203 621 -335 -599 711 -44 -478 -650 735 -906 -923 850
1632H50m69o9k61J225j270o79N30lP1p16J506n82n24L34J03k56j97J438j309K32
$$ 850 381 312 51 1276 6 -673 -143 -146 -75 -791 715 133 -391 -57 46 -210 -407 1031 -278 -46
1652d6N20n89m30R7J510j319L76N13j56p29j086J747p72n36Q02Q99o25r25J562
$$ -46 474 -115 -545 -448 1062 -257 119 632 476 -253 -1339 408 -364 -900 -98 801 176 -749 813
1671H13n75l66M34L69n00l79K56q58L59n7O27j65O5R88r17l23P2R35j318k65J883
$$ 813 238 -128 306 675 175 -204 52 -806 -447 -504 123 -42 23 1011 94 -229 -157 778 -540 -805 1078
1692A078j090n88L07R43q74l66J282k35k62p01O91k85p42O22L68rl00R62p43k43
$$ 1078 -12 -600 -293 650 -224 -590 692 457 195 -506 185 -100 -842 -220 148 139 -161 801 58 -185
1712a85Q32p38l03L64N62j229J08R33m54l09J78J199n90o84N70M85j031o69J531
$$ -185 647 -91 -394 -30 532 -697 -589 344 -110 -419 -241 958 368 -316 254 739 -292 -961 570
1731E70n95o17O32M66m62k70P73p41K10J53k00O5k30M87n30q0N59L97p14j97J252
$$ 570 -25 -642 -10 456 -6 -276 497 -244 -34 119 -81 -16 -246 241 -289 -369 190 587 -127 -324 928
1752I28q95q90Q76N50j182LJ201m58l31J40O17l72n77M97N3l01m13P81k80m34
$$ 928 33 -857 19 569 -613 -610 591 133 -198 -58 559 187 -390 107 160 -141 -554 227 -53 -487
1772d87R39k43m50N31M08j001J18P06p77m48M05N96n86o8P05K09o34l09J201o22
$$ -487 452 209 -241 290 698 -303 -185 521 -256 -704 -299 297 -289 -357 348 557 -77 -386 815 193
1792A93q44P78K24p77l7R04o71j31O52j14j04J41J57m97k16J64K68l48k8R89m97
$$ 193 -651 127 351 -426 -463 441 -230 -361 291 177 73 214 371 -126 -342 -178 90 -258 -286 703 206
1813B06o88O67M22j111J22J132q07l75M23J03n32K6O78O7j12j27M01n33n41O86
$$ 206 -482 185 607 -504 -382 750 -57 -432 -9 94 -438 -412 266 333 221 94 495 -38 -579 107
1833A07j6m86M02O00j033MQ66o32k59O43L41o74M4L51k29l18k4R05k87n10N40
$$ 107 91 -395 7 607 -426 -422 444 -188 -447 196 537 -137 -93 258 29 -289 -313 592 305 -205 335
1854C35M3r71J3R14p42PP94j84m47L50L17o38K62K46O2l48l07N18o12m16O16O69
$$ 335 378 -593 -580 334 -408 -401 393 209 -238 112 429 -209 53 299 361 13 -294 224 -388 -804 -188 481
1876D81o83P0J063r60m12O40P0n95L02N00n83n0jK15k51n5O61q0m32K3N05j006
$$ 481 -202 -132 931 -29 -441 199 269 -326 -24 476 -107 -157 -158 57 -194 -249 412 332 -100 -77 428 -578
1898e78LJ098n09k37N72K40r93K31M78m52L4J9N05m88l31M08M0m19P8J102p85
$$ -578 -575 523 14 -223 349 589 -404 -173 305 -147 -113 -94 411 -77 -408 0 40 -379 -301 801 16
1919A6k20O79m54n58M34O23p95L67L13m33k07o0N15l74o1L05L20o43j90J042p52
$$ 16 -204 475 21 -537 -103 520 -275 92 405 -28 -235 -295 220 -154 -215 90 410 -233 -423 619 -133
1940a33j69P54Q9q03J70N26r80K65K48O5j69jM98l51l1qN51o58k37R44p12l34
$$ -133 -302 452 541 -262 -92 434 -546 -281 -33 32 -137 -138 360 9 -22 -30 521 -137 -374 570 -142 -476
1962d76M41L55q76L72Q05p61J80J29J56m67m5L56j79j60j74Q15o56j65Q39l26
$$ -476 -35 320 -556 -184 621 -140 40 169 325 -142 -187 169 -10 -170 -344 471 -185 -350 489 163
1982A63m44K74O13j062L27N59o26QJ10L75n54J87K51l5j82l19Q70p26k41P03K8
$$ 163 -281 -7 606 -456 -129 430 -196 -188 -78 297 -257 -70 181 146 -36 -355 515 -211 -452 251 279
2003B79n67J82Q16j078J81M53l20j68J09M14n48K18j2K43k18k65R11n91k59L51
$$ 279 -288 -106 710 -368 -187 266 -54 -222 -113 301 -247 -29 -41 202 -16 -281 630 39 -220 131
2023A31K31r01J68R30r70K84M15K5n18J08M25n94K65j84N18m14l90Q29m24j81
$$ 131 362 -539 -371 559 -411 -127 288 313 -205 -97 328 -266 -1 -185 333 -81 -471 358 -66 -247
2043b47K48O50p77J6P37q98j20K85J57n03M32L50l46O7k10O10n29r3O12j52n15
$$ -247 1 651 -126 -110 627 -271 -391 -106 51 -452 -20 330 -16 51 -159 451 -78 -171 441 289 -226
2064b26j54Q68j092J26Q81m04k4J36L74p82K01J77j62J62k24N89m93k56K83J63
$$ -226 -380 488 -604 -478 403 -1 -25 111 485 -297 -96 81 -81 81 -143 446 -47 -303 -20 143
2084A43m49R7R90j034l3N12k73m17L31O55o65L14M2Kk81l13N93k67q7N7N04o95
$$ 143 -306 -209 781 -253 -286 226 -47 -464 -133 522 -143 171 213 215 -66 -379 214 -53 -140 -83 421 -274
2106b74j46Q99p64J67M11J06n95J67M65r12L37Q9K06j44j71O05l45l93K8O32o13
$$ -274 -420 479 -285 -118 293 399 -196 -29 436 -476 -139 -50 156 12 -159 446 101 -292 -264 368 -245
2127b45j28Q64m16m50K98L84o73M88L07m02J71k93K39m80N6K95m9k3j09Q04q28
$$ -245 -373 491 75 -375 -77 307 -366 122 429 27 198 -95 144 -336 -280 15 -34 -57 -166 638 -190
2148a90j52Q43l60m12L74M82r44Q9L57k00p9%N24k64n9OK28l22l35P89m92q6M89
$$ -190 -342 501 141 -271 103 585 -359 -270 87 -113 -192 -192 332 68 9 15 243 -79 -414 375 -117 -203 286
2171B86j43n23L05M51p21L42L95k85l64J34L02l43j5J39N37n89k64Q60m54l90
$$ 286 143 -380 -75 376 -345 -3 392 107 -257 -123 179 -164 -179 -40 497 -92 -356 504 50 -340
2191c40L12M45o67O2N74o08J62J28Mr6O5R2k20Ql4L52m43o6O17k89m13M66N04
$$ -340 -28 417 -250 -188 386 -222 -60 68 72 -24 41 133 -87 -79 -113 239 -204 -270 347 58 -355 111 615
2214F15r63J36O33n14j71J91K95l45k2K04J36j55k42N01k42k77L48P8m90J83M09
$$ 615 -348 -212 421 -93 -264 -73 222 -123 -145 59 195 40 -202 299 57 -220 128 206 -284 -101 308
2235C08p24L07M89l35k00L28J51n82J35J63O1k76j19O62l35m34M45L46o03J00
$$ 308 -416 -109 380 45 -155 173 324 -258 -123 40 101 -175 -294 368 33 -401 44 390 -213 -113
2255a13O35n40j82K78j04k92K92J38k21J83n0J01k19n9M25j87k93L47L18p97N1
$$ -113 522 -18 -200 78 -26 -318 -26 112 -109 74 24 125 -94 -153 272 85 -208 139 457 -340 -289
2276b89O63n05k26N46J31n30J39J64j69l8pL91j66k00K48Mm18O5M88n45P9N80
$$ -289 374 -131 -357 189 320 -210 -71 93 -76 -114 -121 270 104 -96 152 156 -262 -197 291 -254 -175 405
2298D05m23l42M09Q4m54L20L40j72k07j3K02k55k25L64L23n16L0N40n57j96M78
$$ 405 -18 -360 49 133 -321 -1 339 167 -40 -53 149 -106 -331 33 356 -160 -130 410 -147 -343 135
2319A35Ll43L65J42n05J18O6n3l8J29K74j73k50J26K21n71P7O68l90l17M96M8
$$ 135 138 -205 160 302 -203 -85 -19 -72 -110 19 293 120 -130 -4 217 -354 -277 391 1 -316 180 228
2341B28o27L00L28k77Q6J39K5k49j00J09L5j61J03L93m67o4M71l02l19N21J96
$$ 228 -399 -99 229 -48 38 177 202 -47 -147 -38 -3 -164 -61 332 -135 -199 272 -30 -349 172 368
2362C68n80K61K76m05j42J93J45k19K0J68J12l77l7N07l76j55M82j3m75L10J80
$$ 368 -212 49 325 -80 -222 -29 116 -103 -83 85 197 -180 -217 290 -86 -241 241 228 -247 63 243
2383B43n57K21K70j82j10K13M5k71K5R0J79l03J2N46m21k76M13R3n66K80M38n01
$$ 243 -314 -93 177 -5 -115 98 143 -128 -103 -13 166 -137 -125 421 0 -276 137 230 -336 -56 382 -119
2405a19J2K53j07k00J33J14q1m8K2K31l37l8L46j64k78L46K48o55K80L37m47k5
$$ -119 -107 146 39 -161 -28 86 5 -43 -21 210 -127 -165 181 17 -261 85 333 -322 -42 295 -152 -177
2427a77K94O8l73J75J22r9j17lL78l26j26L66l5l72K30L43n89J39L47k91j48K93
$$ -177 117 185 -188 -13 109 10 -107 -110 268 -58 -184 182 147 -225 5 348 -241 -102 245 -46 -194 99
2449I9N3l42J84R3k9j65K6L20k66j57K77J14n52K43M58n29P2L19j13l36K43J41
$$ 99 152 -190 -6 87 58 -107 -81 239 -27 -184 93 207 -345 -102 356 -173 -101 218 105 -231 12 153
2471A53l06J56K3J00k17m1L09k05j46K45K64n06J25L97n24p0L59L3l72K93J35
$$ 153 -153 3 26 126 -91 -132 177 -28 -174 71 335 -171 -46 351 -173 -243 116 149 -223 70 205
2492B05k97K8KJ97k36J3K75q8k51P7L34n23J12M53k76j76K78M9n24K75J52j24
$$ 205 -92 -64 -62 135 -101 -88 187 99 -152 -75 259 -264 -152 301 25 -151 127 176 -348 -73 79 -45
2514d5L4M4J87l20j6J79Q0k73R1M64n64k1L25j82k80L34K51m39K32N6j38j30M9
$$ -45 -11 33 220 -100 -116 63 143 -130 -39 425 -139 -160 165 -17 -297 37 288 -151 81 137 -1 -131 -82
2537h2K52j91j4J12J36m22K8M45m33k2L84Jm27K38J78m45J57J76Q3j69P2J15k10
$$ -82 170 -21 -35 77 213 -209 -181 264 -169 -191 193 194 -233 5 183 -262 -105 71 154 -15 57 172 -38
2560c8j19N3L30l55M3L82l54j82K56J63m37L31K76l99K0O5K4k76J49J91m1j35
$$ -38 -157 -104 226 -129 -86 296 -58 -240 16 179 -258 73 349 -50 -30 35 59 -217 -68 123 82 -53
2582e3pL14m40j1L80j20k55K40K31n39J95J90k06j7J62J34k54M9K5Ok01O2L72
$$ -53 -60 254 -186 -197 183 63 -192 48 279 -260 -65 125 -81 -98 64 198 -56 -7 18 24 -177 -115 257
2605B57l24m2K66j6m15K60L15m77J81J72j11k34J29J51k32R1M9J56k50l7L02k49
$$ 257 -67 -109 157 141 -274 -14 301 -176 5 177 66 -168 -39 112 -120 -29 20 176 -74 -111 191 -58
2627e8j11K31J24m15K02K72m17P3K15k6k66K11J11k11mL2K02k96PL27j06k52K00
$$ -58 -169 62 186 -229 -27 245 -172 -99 116 90 -176 35 146 -65 -69 -37 165 -131 -124 203 97 -155 45
2650D5K09m69J47K58k29p8J79N9k86K15L4p6k9LK03k96RK20q4k58K02K84m70J02
$$ 45 254 -215 -68 190 -39 -117 62 121 -165 50 84 8 -21 -18 185 -111 -102 118 34 -224 -22 262 -208 -106
2674a06L40j96k01K42P0l08Q9Q3N4j59M2K07j83p9J42J21k95J33K62l91M3K18
$$ -106 234 38 -163 79 149 -159 -70 13 67 -92 -50 157 -26 -105 37 158 -137 -4 258 -133 -90 128
2696A28j17k17K92J02k84Q5R2lk32Q1J98j16j44J70K05m49R0L38k63n9K15L9l00
$$ 128 11 -206 86 188 -96 -11 81 78 -154 -73 125 9 -135 35 240 -209 -119 219 -44 -103 112 151 -149
2719a49J26Q0j85O2J01O7j44N9Q7q2j97J73K24l67R9K88k39k19K65J16l36J78
$$ -149 -23 57 -128 -66 35 102 -42 17 104 22 -175 -2 222 -145 -46 242 3 -216 49 165 -171 7
2741GJ87j63j18M4J02j44jJ66O9k24P5J81l04j7K39m2k35K61P5l77J41J35q0p1
$$ 7 194 31 -87 -43 59 -85 -86 80 149 -75 0 181 -123 -140 99 57 -178 83 158 -219 -78 57 -23 -94
2765i4J39J62k11q2J12N2k51P6L12k03j45K49j3l15K08J46j85M2J08m3j92R9Q3
$$ -94 45 207 -4 -86 26 78 -173 -97 215 12 -133 116 103 -212 -4 142 -43 -1 107 64 -128 -29 54
2788E4j03KJ21J16k79kK38k17j60K93Q7l11J44J73k08q2J64O1j54Q0Q9o5j42K1
$$ 54 -49 -47 74 190 -89 -91 147 -70 -230 63 150 -161 -17 156 -52 -134 30 91 -63 17 106 41 -101 -80
2812h0J75j98L9K53j14j99J73Q6l17J27K50j85j11J76J2j96L1J39M0j83O7J84
$$ -80 95 -103 -64 189 75 -124 49 135 -182 -55 195 10 -101 75 87 -109 -78 61 101 -82 -15 169
2834A69k20r1J92K6k33J62J83k79N5J54j38j28J60P4j56L3J05k0j84Q6J98j51
$$ 169 -51 -142 50 76 -157 5 188 -91 -36 118 -20 -148 12 86 -70 -37 68 48 -136 -50 148 -3
2856cj11K19P0l45J07K23k37l2J98J6j96R7R7j25k8O3P3j38rJ47j05j26J88Q4
$$ -3 -114 105 175 -170 -63 160 -77 -109 89 105 -91 6 103 -22 -50 13 86 -52 -61 86 -19 -145 43 127
2880A27k76J19K00k07j14K28K5k42J03J27q3j09J02J33j84m4J72j0k02J25J61
$$ 127 -149 -30 170 -37 -151 77 102 -140 -37 90 7 -102 0 133 -51 -95 77 67 -135 -10 151
2901A51k39L1J71j00j33J84M6k01J04Q1p1j12P6J20j78k3J81J5k26R6J96k50n2
$$ 151 -88 -57 114 14 -119 65 111 -90 14 95 24 -88 -12 108 -70 -93 88 103 -123 -27 169 -81 -133
2924a33K24k5j94J46P6j63kR6L1j30P6R1q6r6Q8Q2k40J44J90j81o4J67Mk61J55
$$ -133 91 66 -128 18 94 -69 -71 25 56 -74 2 93 7 -89 -1 81 -159 -15 175 -6 -70 97 101 -160 -5
2949eJ36j61j2R4L8j91K1J46l1j10J18J25k45jJ76j10j29J94N5k11R7R0j15q7
$$ -5 131 -30 -42 52 90 -101 -80 66 35 -75 43 168 -77 -78 98 -12 -141 53 108 -103 -6 84 -31 -118
2973a18J22Q1j59O6Q4mk00R0J70k29M5J85m5k06J09J00k28R0J36j2j13O2O1j48
$$ -118 4 85 -74 -8 76 72 -128 -38 132 -97 -52 133 88 -118 -9 91 -137 -47 89 77 -36 26 87 -61
2997f1j5J19N2j65P7J23j90q0J78L0k06J75J03j76l2Q5J8j83J31R3p2n1N3R9k30
$$ -61 -76 43 95 -70 7 130 -60 -140 38 68 -138 37 140 -36 -68 17 35 -148 -17 76 4 -47 6 105 -125
3022a25O0J68r7p7J32M7k51R6J40j19l4J51K6j75O2N9o9r9J13J23j91J4J19n9
$$ -125 -65 103 6 -71 61 108 -143 -47 93 -26 -60 91 117 -58 4 63 -6 -105 8 131 -60 -46 73 14
3046A4j60J53J19k23R6R7p6j34J08P0j55P4P6J8j61O3J04j72J3J35J9j90J19J19
$$ 14 -146 7 126 -97 -1 96 20 -114 -6 64 -91 -17 59 77 -84 -21 83 -89 -76 59 78 -112 7 126
3070A26k17L8J32j6j33R2P5j35j7O5M7j54R4J08j07o6J20M5k27J19R3j22l7J29
$$ 126 -91 -53 79 63 -70 22 97 -38 -55 10 57 -97 -3 105 -2 -68 52 97 -130 -11 82 -40 -77 52
3094E2Oj86J13Q8r3k5P2O4j74L1J11n8j28J38Q7j98Q1J19r0r0J28L6j65O4P0m0
$$ 52 58 -128 -15 73 -20 -45 27 91 -83 -52 59 1 -127 11 98 -100 -19 100 10 -80 48 84 -81 -17 53 13
3120A3q5R2O6j41K7R7j0j62J19Q1j94L9J05k3j55J53P5j44L1N4Nj42P0R5j16l
$$ 13 -72 20 86 -55 -28 69 59 -103 16 97 -97 -58 47 24 -131 22 97 -47 -16 38 43 -99 -29 66 -50 -53
3146e3R0J8j45P6J09j33KJ34l5j65J15L5j01qJ32J8j53P3O9q4p3R9P7j95Q9Q8
$$ -53 37 55 -90 -14 95 -38 -36 98 63 -102 13 48 -53 -61 71 89 -64 9 78 -6 -79 20 97 -98 -9 79
3172G9j00p9J25M5j44R6O9q6p1O4K1j18N9J00m1r3J02O3j87N8J23n8r6J18L8j72
$$ 79 -21 -100 25 70 -74 22 91 5 -66 -2 19 -99 -40 60 19 -74 28 91 -96 -38 85 27 -69 49 87 -85
3198h5L1J10k7q0J02N6j26l9Q8nj22J13P0j15j5R6k4j38J31O7j46L9N3j4j20N8
$$ -85 -54 56 29 -51 51 107 -19 -58 30 25 -97 16 86 -29 -44 52 28 -110 21 88 -58 -19 34 20 -100 -42
3224d2R7r6oJ10K3j45L1R1j10n5J39J8j34Q5O7j10k5R8M3j18P7M5r7o1P1N6j13
$$ -42 55 -41 -47 63 86 -59 -28 63 -47 -102 37 55 -79 6 73 -37 -62 36 79 -39 38 83 -14 -75 -4 52 -61
3251f1N8J06r3q9J11K7j51O8R2p0q3Q8L1j17M3R6k2p9N5Q5j54nJ02n1n9J07N3
$$ -61 -3 103 10 -79 32 59 -92 -24 68 -2 -85 3 34 -83 -40 56 34 -45 10 95 -59 -64 38 -13 -72 35 88
3278H8j39J7R3m8q0J01M0r5qP5j3j17P1R8r3j6Q7qj29O1P0j04RR0l3p9M8O8q9
$$ 88 -51 -34 59 11 -69 32 72 -23 -31 44 31 -86 -15 83 -10 -26 61 53 -76 -15 55 -49 -40 50 17 -62 -14 54 -35
3307c5qP8Rj22O2P5r8m7J12M0j50Q1J02j13l3P2K8j06K8Q2n4m7P4M2r2MR0n0q0
$$ -35 -43 35 44 -78 -16 59 -39 -86 26 66 -84 -3 99 -14 -47 25 53 -53 -25 57 3 -44 30 72 -20 -16 74 24 -56
3336e6Q4L4j35M0R3o8n7R8M7j40L2Q6m4q6N2P1r7k7J18jj08O0P8j12J6O6k0p2
$$ -56 28 62 -73 -33 60 -8 -65 33 80 -60 -28 58 14 -72 -20 51 -46 -73 45 44 -64 -4 74 -38 -22 44 24 -48
3364d8N6N2j03K3N5kp0N0Q3j18j9R0k0j21P4J04j08k3R9pj18O2P4o2m4N5K4j05
$$ -48 8 60 -43 -20 35 33 -37 13 96 -22 -41 49 29 -92 -18 86 -22 -45 54 47 -71 -9 65 3 -41 14 38 -67
3392f7L7N4l1l8Q0K1j09N0O4r6k9R3K2j04N1O5o9n8R4N5j08J3Q1l7j11P9O0r4
$$ -67 -30 24 -7 -45 35 56 -53 -3 61 -35 -64 29 51 -53 -2 63 -6 -64 30 85 -23 -10 71 34 -77 2 62 -32
3420c2K0Q9l5r1N2L9r8M4N5k4o9M4L2q7J1R5Lr9O8N7j20j9R6rq6Q5O0j04j2N6
$$ -32 -12 77 42 -49 3 42 -56 -12 43 19 -50 -6 26 -61 -50 45 48 -51 17 74 -46 -65 31 22 -64 21 81 -23 -35 21
3450B1J4q3N3P0o3l4M6L1j17N6Q2o4l6O7Mj16O1N1o0k4O4K9j02J8O8m7n0O6O1
$$ 21 35 -48 5 75 12 -22 24 55 -62 -6 76 12 -24 43 47 -69 -8 43 -17 -41 23 52 -50 -32 36 -11 -61 5 66
3479F6j19K4O6m5p6R1L0p6L8M3l9n3N7L6q0L0N2j2q4N5O8j14J6Q1j6q2N6L5j00
$$ 66 -53 -29 37 -8 -84 7 37 -39 -1 42 3 -50 7 43 -37 -7 45 33 -51 4 72 -42 -26 55 39 -43 13 48 -52
3508e2K2O3lp0N2L7o7k6N4J5q7M9N8p1m1R5%r7Q2M2q0j5O4Or8O0N2m4l4N8L5r9
$$ -52 -30 33 30 -40 12 49 -18 -44 10 25 -62 -13 45 -26 -67 28 28 -69 13 55 -25 -40 24 30 -68 -8 44 0 -34 24 59 -40
3540d0M0N7m7m7O5L4j21N7N0n4k7N4K5q9L3M1l1n4P0L0r7K1N8j9p3Q0K3r7K2N9
$$ -40 0 57 10 -37 28 62 -59 -2 48 -6 -33 21 46 -43 -10 31 0 -54 16 46 -51 -30 28 9 -64 16 39 -58 -36 23
3570B3k3n5N6L4n8J3M3lp8N6M5p3JN5jj05P6N0p0LN6j9r2O5M9p6RL8J0p0L3L4
$$ 23 0 -55 1 35 -23 -10 33 30 -48 8 53 -20 -19 36 35 -70 6 56 -14 -11 45 26 -66 -1 48 -28 -19 19 29 -41 -8 26
3602B6m3k5O4J3q8L8N2o0l0P4Qp4N0L2l4l5N2J8q0L6L3j3n7M9M4r5M0M7l1l3N8
$$ 26 -17 -42 22 35 -53 -15 37 -23 -53 21 29 -45 5 37 3 -32 20 38 -42 -6 27 14 -43 6 50 -45 -5 42 11 -22 36
3633C6Lq7K3N8k4m2M0J9o1jN1j9n8N9M4q7J2O5l1n8O1K5n1K0L2k3m4L1K8k8j6
$$ 36 39 -48 -25 33 9 -33 7 26 -35 -36 15 -4 -62 -3 41 -46 -34 31 0 -58 3 28 -23 -3 29 6 -38 -7 21 -7 -23
3664b3N0J2q5M6M7p1lN7J2q5M7K2n1nN4J2n3L2J9n3m4P0L1o9K8N5o1l5N5Rp2M7
$$ -23 27 39 -46 0 47 -24 -27 30 42 -43 4 26 -25 -30 24 36 -17 15 34 -19 -63 7 38 -31 -3 52 -9 -44 11 20 -52 -5
3696eM6n1j2K8Ln4K6M9j2l6K6M1p9QN9k8m9O1K0o2J1M1j9m4M6J7m5lL6ko3L2M7
$$ -5 41 -10 -22 6 9 -45 -19 30 18 -18 8 49 -30 -22 37 9 -40 21 41 -21 -10 31 12 -32 14 31 -14 -17 19 17 -46 -14 33
3729C3m5k3O1pp5N4K6n3J4L5Jn3K1M1m2pM4J5o0K3M5n7k1N5J8o4L6L5o1oK8Om2
$$ 33 -12 -35 26 19 -56 -2 24 -29 -15 20 21 -32 -11 30 -12 -19 25 40 -20 3 48 -9 -30 25 43 -21 15 50 -11 -17 11 17 -25
3762b5K7K6k9l4L4J8m4J1M7l3k6L6K2p2K7M7m0j2L1K7n9JM2k0k5K9L4n6mM8j6
$$ -25 2 28 -1 -35 -1 17 -27 -16 31 -2 -28 8 30 -42 -15 32 -8 -20 11 38 -21 -20 22 2 -23 6 40 -16 -20 28 12
3793A2l8L0L9o1QM0l0l1M3J5m2LK9J3m8J8L2m3j7K6K5o8M2M4n0k6M9pl3K4K4l3
$$ 12 -26 4 43 -18 -10 30 0 -31 12 27 -15 -12 17 30 -18 0 32 -11 -28 -2 23 -45 -3 41 -9 -35 14 7 -26 -2 22 -11
3825a1NJ9mk4RL8k0k5M4Mn3NN3l3k7N6Po3K0J9j0l0L5K3l9j5L8l2k3L8J9n2MM9
$$ -11 -6 13 9 -15 -6 32 12 -13 31 35 -18 -13 40 7 -20 36 43 -20 0 19 9 -21 14 37 -2 -17 21 -11 -34 4 23 -29 -25 24
3859B4k5l4M1Ol3J6K3j2k8J7L0l4rM0J0n0K4M4n6j5M7mn3M3K1l9JK9j3j6QK9k9
$$ 24 -1 -35 6 12 -21 -5 18 6 -22 -5 25 -9 -18 22 32 -18 6 50 -6 -21 26 22 -31 12 33 -6 -5 24 11 -5 3 32 3
3892Ck8K5J3m3J5M9m8j1M0on1K1L3l0j4M4Ml7J0J7j2pJ1L6m2KM0k9k4L7J3m5L1
$$ 3 -25 0 13 -30 -15 34 -14 -25 15 9 -42 -21 12 -18 -32 12 16 -21 -11 6 -6 -13 -2 34 -8 -6 34 5 -19 18 31 -14 17
3925A7K3l1k0J4K0m1J6K6j2l4J0L5l5%K8lm5L0K2n6ON1k3k9L2J4l3lK3J9l7RL9
$$ 17 40 9 -11 3 23 -18 -2 24 12 -22 -12 23 -12 -12 16 13 -32 -2 20 -36 -30 21 -2 -31 1 15 -18 -21 2 21 -16 -7 32
3958C2l6j1L6Lm1K3K8l8KK8om0J5J8pj1J9Pm3JL6k1l7N3J5n5K3K9l1j3K4K3m7
$$ 32 -4 -15 21 24 -17 6 34 -4 -2 26 20 -20 -5 13 6 -5 14 21 -22 -21 15 -6 -43 10 25 -30 -7 22 -9 -22 2 25 -22
3991b2J9K4k3j0RK4l1%L2ql3L0K4l4RK0rk4J4J8l4J8PNl7J8J6l4nL1Kl1J0K5l1
$$ -22 -3 21 -2 -12 -3 21 -10 -10 22 14 -19 11 35 1 10 30 21 -3 11 29 -5 13 20 25 -12 6 22 -12 -17 14 16 -15 -5 20 -11
4026a1j2L0qk3J6J6k6nK4J1l1J4K9j1k3J3K3l8K3K4k3k4L2Rl8J3K1j2j8J4J4m3
$$ -11 -23 7 -1 -24 -8 8 -18 -23 1 12 -19 -5 24 13 -10 3 26 -12 11 35 12 -12 20 29 -9 4 25 13 -5 9 23 -20
4058b0J2K1Kl4J8K8l9jL0j4l2K9Jl1J4K0j0j3K3J1k4qL0Jk7J9J8k8%K1pk3K0L3
$$ -20 -8 13 15 -19 -1 27 -12 -13 17 3 -29 0 1 -30 -16 4 -6 -19 4 15 -9 -17 13 14 -13 6 24 -4 -4 17 10 -13 7 40
4092D0l1oK5j4k5J7J1k4kK1j0j6%M3m4rL4lk5QRk4MRJ6l1J2J8nmLJ5j6kK5j7j8
$$ 40 9 3 28 14 -11 6 17 -7 -9 12 2 -14 -14 29 -15 -24 10 7 -18 -10 -1 -25 -21 -12 4 -27 -15 3 -2 -6 -3 12 -4 -6 19 2 -16
4129a6K0J2l1J0K8j3j0J8J1l6J5KJj8J1J7k2j8L0rj7OK1l4PJ8j3nPJ2qj2J4pM
$$ -16 4 16 -15 -5 23 10 0 18 29 -7 8 10 11 -7 4 21 -1 -19 11 2 -15 -9 12 -22 -15 3 -10 -15 -8 4 -4 -16 -2 -9 -5
4164ej4M3k2nJ9mk8NM1l3j4M2j1qnJ1j9JNJ3j6%J1jk7J9K5k6kJ5j1l6K8J7k5J
$$ -5 -19 24 2 -3 16 12 -16 -11 30 -3 -17 25 14 6 1 12 -7 -6 -1 12 -4 -4 7 6 -21 -2 23 -3 -5 10 -1 -37 -9 8 -17 -16
4200a6K1pj5QJ7l3J4J9%j2QJ9k8j1M2j1j4NQk9J2J8j2klK9k5qJ5Jk4LJ8j3j0J1
$$ -16 5 -2 -17 -9 8 -25 -11 8 8 -4 4 23 -5 -16 26 15 1 6 14 -15 -3 15 3 1 -2 27 2 -6 9 10 -14 -11 7 -6 -16 -5
4236eOj6J3J0k2kK2Kk2jK7j3j6K6nj2mK1opRRj9QK1k3jLK5l3MP%j2JJ8j7j1J7
$$ -5 1 -15 -2 8 -14 -16 6 8 -14 -15 12 -1 -17 9 4 -8 -12 9 3 -4 5 14 -5 3 24 1 0 3 28 -5 -1 6 6 -6 -5 13 -4 -15 2
4275BKj6J2Qk1NRlj2OJ2k1%K0jk5K0K0k0rK2Oj6MQj0j5K7jj5J7mm%OQj8kJ5j4
$$ 2 4 -12 0 8 -13 -8 1 -2 -14 -8 4 -17 -17 3 2 -23 -3 17 -3 -12 10 16 0 4 12 2 -13 14 13 -2 15 11 7 7 13 21 3 1 16 2
4315Bj5J3jnjK1j5k6K2Oj2mJ1J0k0J4%j1oK6kj2jJ9j2pK4pj0RJ2k5LJ3kj2JJ4
$$ 2 -13 0 -1 -6 -7 14 -1 -27 -5 1 -11 -15 -4 6 -14 0 0 -11 -17 9 7 -5 -6 13 1 -6 18 11 1 10 22 -3 0 13 11 -1 0 14
4353A4j1pJ9oj3nK2j9k7L7j0k4K3Mj7OJ7lk4LK5lj4J2Rj2LK5k5j3L0Lk3J1J8k1
$$ 14 3 -4 15 9 -4 -9 13 -6 -33 4 -6 -30 -7 -3 -20 -14 3 0 -24 -21 4 1 -13 -1 8 -4 -1 24 -1 -14 16 19 -4 7 25 4
4389DnNJ8j9OlMk4J3Qpj5K4j6qRJ0k1LJ5qJOJ8k5KJ0Jj8QJ3qnK3rj0LJ7mj2QK
$$ 4 -1 4 22 3 9 6 10 -14 -1 7 0 -15 9 -7 -15 -6 4 -17 -14 1 -7 -6 0 18 -7 -5 5 6 -12 -4 9 1 -4 19 10 0 3 20 16 4 12 14
4431A4j6J5J7k3pLJ0j9MK0j5j4J1J9l3NJ3j5mJ3oK%J1omkOqpK0lj0J1J5k0KJ2
$$ 14 -2 13 30 7 0 3 13 -6 -2 18 3 -11 0 19 -14 -9 4 -11 -15 -2 -8 -6 -6 5 -1 -5 -7 -1 -9 -16 4 1 -9 2 17 -3 -1 11
4469A1mmRQj5j0K2qpJJ1rj4K4rj9J0J1oj0J6j0rnK7j7JJ3onjONk0K0Mk0J4Oj0
$$ 11 7 3 12 20 5 -5 17 9 2 3 14 5 -9 15 6 -13 -3 8 2 -8 8 -2 -11 -16 11 -6 -5 8 2 -3 -4 2 7 -13 7 11 -9 5 11 1
4509ArK5kj8J7J1j6jjPj7MK8j8j3mJ3j1rL1j5j2J2Ok6LJ2qJJ5Kj6oK3oJj5K0k
$$ 1 -8 17 15 -3 14 25 9 8 7 14 -3 1 29 11 -2 -6 7 -4 -13 18 3 -9 3 9 -17 -14 -2 -10 -9 6 8 -8 -14 9 3 4 -11 9 7
4548GmJ0Lk4RJ8j9oK5j1%rJ2kj3QJ0j2pJ9j9kJ6jk2LJ7j0mJ0pnjLnMJ8oj4J2P
$$ 7 3 13 16 -8 1 19 0 -6 19 8 8 -1 11 9 -4 4 14 2 -5 14 -5 -7 9 8 -14 -11 6 -4 -8 2 -5 -10 -11 -8 -13 -9 9 3 -11 1 8
4589Hoj7J3J7j5JQJ1rMmooJ9lj3jLorL3j5j9QOj0rK4rj4NK0j0rK3j6k%J2j0lJ6
$$ 8 2 -15 -2 15 0 1 9 20 11 15 11 5 -1 18 15 2 1 4 -2 -11 22 7 -12 -4 2 -8 -17 7 -2 -16 -11 9 -1 -10 13 -3 -5 -5 7 -3 -6 10
4631A0Qk9RJ4Jk0K9pk2J9Noj3PJ0j0j0K8qk0OJ0j6pL3j9k1K3kj2PJ7j9jKJ3j2
$$ 10 18 -11 -2 12 13 -7 22 15 -7 12 17 11 -2 5 15 5 -5 23 15 -5 1 11 -5 -12 21 2 -19 4 2 -10 -3 14 -5 -6 -4 9 -3
4668cqJ5KqlJ7j0j1K8oj5PJ2j5pK8rj3J5J1mk2PJ5k7MJ6j2kJ1kk5QJ7k0JKLK%
$$ -3 -11 4 6 -2 -5 12 2 -9 19 13 -2 5 17 2 -5 23 14 1 16 27 23 1 8 23 -4 0 16 4 2 13 11 -14 -6 11 -9 -8 -6 -3 -1 -1
4708aOmj7J3J5k5K0Nj5qL2j2l%J3nk5J7J4j9LJ2rj0NQj3JJ3j0j1J2Qk6mK6j4p
$$ -1 5 1 -16 -3 12 -13 7 12 -3 -11 21 9 6 6 19 14 -11 6 20 1 4 16 7 -3 2 10 -3 -2 11 1 -10 2 10 -16 -20 6 -8 -15
4746a5PMLj6J5krJ0Mpj1L1oj5J1J2j5j1K4Pk0POkk0J8LrJJ0Lk9K6rj7kK3k0rL0
$$ -15 -8 -4 -1 -17 -2 -4 -13 -3 1 -6 -17 14 8 -7 4 16 1 -10 14 21 1 8 14 12 -8 10 13 4 5 15 18 -11 15 6 -11 -13 10 -10 -19 11
4786A1lj7j6K4mj6K9jk7JJ9Qj6J6J1k5kJ9jj4RPKj3PKk2J9OMj9J8ok9J4K0k8M
$$ 11 8 -9 -25 -1 -5 -21 8 7 -20 -19 0 8 -8 8 19 -6 -8 11 10 -4 5 12 14 1 8 10 -12 7 13 17 -2 16 10 -19 -5 15 -13 -9
4824iJ5Rl8J6J1j5nJ7lj1J2J0k6lK2Nk3J3K4k8j0L1lj1mK6j0k4K3krnJ6Lj4J0
$$ -9 6 15 -23 -7 4 -11 -16 1 -2 -13 -1 9 -17 -20 2 7 -16 -3 21 -7 -17 14 11 0 -4 22 12 -12 11 9 0 -5 11 14 0 10
4860A0Jj4qK4j5j7K5nj3nL5l7LJ7pqMQj3oJ2J9k6JK3kj5K0jlqK2j5j2QJ1%pJ4
$$ 10 11 -3 -11 13 -2 -19 6 1 -12 -17 18 -19 -16 1 -6 -14 -10 -2 -15 -21 -9 10 -16 -15 8 6 -9 11 10 7 -1 21 6 -6 2 13 13 6 20
4899B0j0npK2j6qJ5pnjJ5k7jJ2n%oJ1Jj1RRk1LJ3Mj0PNk1J0K3j5j2K9j1JJMpk
$$ 20 10 5 -2 20 4 -4 11 4 -1 -2 13 -14 -15 -3 -8 -8 -14 -3 -2 -13 -4 5 -16 -13 0 4 -6 1 6 -15 -5 18 3 -9 20 9 10 11 15 8 6
4940FLPj1oK3j7rNJ0k5KL1j7j9J5Nj4J0Ooo%J2j3nJ4JrlK3j5%K0j6mJ8mOj3J9
$$ 6 9 16 5 -1 22 5 -4 1 11 -14 -12 19 2 -17 -2 3 -11 -1 5 -1 -7 -7 5 -8 -13 1 2 -7 -10 13 -2 -2 18 2 -2 16 12 18 5 24
4980B4pj1nJ5kj4J8j0jj0J2j0j1J9Ok1lLKkOnPk0K0oj9J7K1rj8J9j2rJ6J1j6R
$$ 24 17 6 1 16 14 0 18 8 7 -3 9 -1 -12 7 13 -8 -11 -8 -6 -8 -2 -7 0 -20 0 -6 -25 -8 13 4 -14 5 -7 -16 0 11 -5 4
5018DQmlLJ1k0KJ5%k2J1K1k2j2K3j4j4J3Qj2oJ6j0j6PJ7k0KLJ0lkJ9j6rK1lj4
$$ 4 12 8 5 8 19 -1 1 16 16 -6 5 26 4 -8 15 1 -13 0 8 -4 -10 6 -4 -20 -13 4 -16 -14 -11 -1 -4 -6 13 -3 -12 9 6 -8
5056hJ2LjlPKrLQj5MONj9J4Lj0oK5j1j0mPpKJJ4k7RKJ2k5LJ7k3J3J0%njJ8j7j
$$ -8 4 7 6 3 10 12 3 6 14 -1 3 9 14 -5 9 12 2 -4 21 10 0 -4 3 -4 -2 -1 13 -14 -5 -3 9 -16 -13 4 -19 -6 4 4 -1 -2 16 -1 -2
5099bK3j4kNJJkK%pLnkJK0j0rMLj2%K1j8qJ1j1Oj5J7nj1RQmj6J4J2j2JJ4j7KK2
$$ -2 21 7 5 10 11 12 10 12 12 5 8 3 1 2 22 12 3 7 10 -2 -2 19 1 -7 4 -7 -1 -16 1 -4 -15 -6 2 -2 -18 -4 8 -4 -3 11 -6 -4 18
5142A8j5LJ5Mk5RJ6pj8JPkmRQk2jJ7oj6J6nj1LLJj2J2JjmRLk2KK6j7KJ2j2KPo
$$ 18 3 6 21 25 0 9 25 18 0 1 8 6 2 11 19 -3 -4 13 7 -9 7 2 -9 -6 -3 -2 -14 -2 -1 -2 -6 3 6 -16 -14 12 -5 -3 9 -3 -1 6 0
5185@njJ5j2JQJ1loJ2Jk1QJ1j3oJKkMnj3mJ4rjpK6j1j4J8nMRKlk2K2qj0J2J2j4
$$ 0 -5 -6 9 -3 -2 6 17 14 8 20 21 0 8 19 6 0 1 3 1 5 0 -13 -17 -3 -12 -13 -20 6 -5 -19 -1 -6 -2 7 9 6 -16 6 -2 -12 0 12 -2
5228bLOmj1J5Q%kjJ2j4j8J3mj4J1Ok4J4QqoQKp%JRk1NJ6rrK4j8j0K0RpQKloLj
$$ -2 1 7 3 -8 7 15 15 13 12 24 10 -8 5 1 -13 -2 4 -20 -6 2 -6 -12 -4 -2 -9 -9 -8 1 -20 -15 1 -8 -17 7 -11 -21 -1 8 1 9 11 8 2 5 4
5273DnRnKmNOj8pJ8Nj1JJ3k0oJ5p%Poj1%J1Mj8KK2k1j0K4LrmJ2j1KJ9j4Q%kLo
$$ 4 -1 8 3 5 1 6 12 -6 -13 5 10 -1 0 13 -7 -13 2 -5 -5 2 -4 -15 -15 -4 0 -18 -16 6 -15 -25 -1 2 -7 -11 1 -10 -8 11 -3 5 5 3 6 0
5317@MMkmQj4j0K5nj1kjjnNJ5j8j0K2Lj2%J3qk1K9j3ooK7j6qJ6mLPlLqJ9oqnJ9
$$ 0 4 8 6 2 10 -4 -14 11 6 -5 -7 -8 -9 -14 -9 6 -12 -22 0 3 -9 -9 4 -4 -25 4 -9 -15 -21 6 -10 -18 -2 -6 -3 4 1 4 -4 15 9 1 -4 15
5361A5j1oJ6%j0mK5l1LJ6qj3MMjlQj6Rj5K0oj1QQpnK4j3j6K8j1MJOrj0RPjj0J3
$$ 15 4 -2 14 14 4 0 25 -6 -3 13 5 -8 -4 0 -1 -4 4 -12 -3 -18 2 -4 -15 -7 1 -6 -11 13 0 -16 12 1 5 6 12 3 -7 2 9 8 -2 11
5403A1oJoJ1j4JJ1p%J5lj9qOKjrJ5rj0J6j5%OJ4k1J4J2j6oJ0J6j6LJ7%rpRMmM
$$ 11 5 6 0 11 -3 -2 9 2 2 17 14 -5 -13 -7 -5 -6 -15 0 -9 -19 -3 -18 -18 -12 2 -19 -5 7 -9 -15 -5 11 -5 -2 15 15 6 -1 8 12 8 12
5445A2j0LkJ1mj7J0Jj8RQpmORk2LRJr%QqJRok2J8Pj2%K6j7lkJ3nKMMn%J7j9NP
$$ 12 2 5 3 14 10 -7 3 4 -14 -5 3 -4 -8 -2 7 -15 -12 -3 -2 -11 -11 -3 -11 -10 -1 -7 -29 -11 -4 -16 -16 10 -7 -10 -12 1 -4 -2 2 6 1 1 18 -1 4 11
5491A1Jj6PNj9QJ1j2qPMmrPmk%J7j7LQJj0JQJj3J3Mj9J0J8rjL%nQOj0j0J0J3j1
$$ 11 12 -4 3 8 -11 -3 8 -4 -12 -5 -1 -5 -14 -7 -11 -13 -13 4 -13 -10 -2 -1 -11 -10 -2 -1 -14 -1 3 -16 -6 12 3 2 5 5 0 8 14 4 -6 4 17 6
5535Fj0J5j6LJ4mk0R%jqRJj1KJ7j8jPOmmJ7mj4J1Lj0RkQj2PJ0j2J1%Nj5J8%k8
$$ 6 -4 11 -5 -2 12 8 -12 -3 -3 -4 -12 -3 -2 -13 -11 6 -12 -13 -6 0 -4 -8 9 5 -9 2 5 -5 4 2 10 -2 5 15 3 14 14 19 4 22 22 -6
5577fJ1J3qj7LJ2oljPj6MLjj0J3mpPJ5j6KRNk6J7Rj2MjOj1MNJNkKnJJ3j6nQk%
$$ -6 5 18 10 -7 -4 8 2 -1 -2 5 -11 -7 -4 -5 -15 -2 -6 -13 -6 9 -7 -5 4 9 -17 0 9 -3 1 0 6 -5 -1 4 5 10 8 10 5 6 19 3 -2 6 4 4
5623DmJk2J6OMj4KL%rLJ5j5rJ7Jj9J1klJ0J2rOj4Qj%J1j%JMj9RNJj9K2lj0kOj0
$$ 4 0 1 -21 -5 1 5 -9 -7 -4 -4 -13 -10 5 -10 -19 -2 -1 -20 -9 -11 -14 -4 8 -1 5 -9 -1 -2 -2 9 8 8 9 13 -6 3 8 9 -10 12 9 -1 -3 3 -7
5668gQLMk9KJ3jqmJ2pJMNk1J9PKmnLpJ0QMkj1RqNJ0j5%MNrOJ2j1j1PlkJJqjmP
$$ -7 1 4 8 -21 -19 -6 -7 -15 -19 -7 -14 -13 -9 -4 -25 -6 1 3 -1 -6 -3 -10 0 8 12 10 -1 8 0 5 15 0 0 4 9 0 6 18 7 -4 3 0 -2 -1 0 -8 -9 -13 -6
5717fj1jJ5Jpj0J1p%J6j8mJ7J2pMjJrNJ1j6KPKkJMlj1J5rnnJ0jj2RNpKlj4L%P
$$ -6 -17 -18 -3 -2 -9 -19 -8 -15 -15 1 -17 -21 -4 8 1 5 4 5 -4 1 12 -4 -2 5 7 5 6 10 7 -4 11 2 -3 -8 2 1 -11 -2 3 -4 -2 -5 -19 -16 -16 -9
5763irPjrNOJ%%KLmJPoOLJ5j8JJ2qJmJ0k6J5kJLlLj2Rjj2KLJ0j1JOjj7J5rqJ5
$$ -9 -18 -11 -12 -21 -16 -10 -9 -9 -9 -7 -4 -8 -7 0 -6 0 3 18 0 1 13 5 6 2 12 -14 1 -1 0 3 0 3 -9 0 -1 -13 -11 -8 2 -9 -8 -2 -3 -20 -5 -14 -22 -7
5811gJ5k0J1OrM%njMPOj0JROj6J4jj1jLnjJ0lopQj3%J3kj3lNJkQ%j1J2NplJJR
$$ -7 8 -12 -1 5 -4 0 0 -5 -6 -2 5 11 1 2 11 17 1 15 14 3 2 5 0 -1 9 6 0 -7 1 -12 -12 1 -1 -14 -17 -12 -11 -13 -5 -5 -16 -4 1 -6 -9 -8 -7 2
5859Bj0J8%rKN%mMqLJ1JrnNpNLmmmJ5j6%LJj1kJ9ppkRoMo%QnJ8pJkJmJ5nn%j3
$$ 2 -8 10 10 1 3 8 8 4 8 0 3 14 15 6 1 6 -1 4 7 3 -1 -5 10 -6 -6 -3 -2 -13 -15 4 -3 -10 -12 -3 -9 -5 -11 -11 -3 -8 10 3 4 2 3 -1 14 9 4 4 -9
5910iK0j1kJ3oJmKj2NPj5PNj4J3j2J1pkMplRKj3oK4j3kJ1MnjQj2PKRrjmJ2%JO
$$ -9 11 0 -2 11 5 6 2 4 -8 -3 4 -11 -4 1 -13 0 -12 -1 -8 -10 -6 -13 -16 -7 -5 -18 -24 0 -13 -15 -4 0 -5 -6 2 -10 -3 -1 8 -1 -2 -6 6 6 7 13
5956A3mj4K3j0koOj0kNqJoKKj2K0mj0J3pk%PpJ0jLkpO%MjMQoQj1lPNlLnjj5J2
$$ 13 9 -5 18 8 6 0 6 -4 -6 -1 -9 -8 -14 -12 -10 -22 -2 -6 -16 -3 -10 -12 -12 -5 -12 -2 -3 0 -2 -9 -3 -3 1 0 4 12 6 14 3 0 7 12 9 12 7 6 -9 3
6004Cojj1NLoJ4j3PmLoK%j1K2qqLLKQmJJ1nm%J0kpNMqnjQLqNkkLk%okmnMJ0nK
$$ 3 -3 -4 -15 -10 -7 -13 1 -12 -5 -9 -6 -12 -10 -10 -21 1 -7 -15 -12 -9 -7 1 -3 -2 9 4 0 0 10 8 1 6 10 2 -3 -4 4 7 -1 4 2 0 3 1 1 -5 -7 -11 -16 -12 -2 -7 -5
6057eq%j1J0R%pPNkPjqJ0J0onqPjRKj2JJ6k0J3Jj0O%Qj3JrMpOjnKj5OJ2opJQJ
$$ -5 -13 -13 -24 -14 -5 -5 -12 -5 0 -2 5 4 -4 6 16 10 5 -3 4 3 12 14 2 3 19 -1 12 13 3 9 9 17 4 5 -4 0 -7 -1 -2 -7 -5 -20 -14 -2 -8 -15 -14 -6 -5
6106eQj0KJOjLkJ5j9J1NjLkpLrJ1mj3J8j0Pj4QmpNMj2pK1nml%%pJ5j3KLkkJ1%
$$ -5 3 -7 -5 -4 2 1 4 2 17 -2 9 14 13 16 14 7 10 1 12 8 -5 13 3 10 -4 4 0 -7 -2 2 -10 -17 4 -1 -5 -8 -8 -8 -15 0 -13 -11 -8 -10 -12 -1 -1
6153aKj0J3QnlQmlpMmK3qlmqJ5j0K%pjL%pKOpjj4J9mj0RJ0j7PJ1j0mP%kJKRKp
$$ -1 1 -9 4 12 7 4 12 8 5 -2 2 -2 21 13 10 6 -2 13 3 5 5 -2 -3 0 0 -7 -5 1 -6 -7 -21 -2 -6 -16 -7 3 -14 -7 4 -6 -10 -3 -3 -5 -4 -2 7 9 2
6202BJ1pJ6j6J6j6mLpJ9j9J3nj1KJQnnkmJ3j6KQmqQRj3J0nlmKLPJ0JojKOpkLJ0
$$ 2 13 6 22 6 22 6 2 5 -2 17 -2 11 6 -5 -3 -2 6 1 -4 -6 -10 3 -13 -11 -3 -7 -15 -7 2 -11 -1 -6 -9 -13 -11 -8 -1 9 10 4 3 5 11 4 2 5 15
6249A5j1jQp%Pj8J1pNmKoOj2NO%j2Om%NnmQmJ0Mj0Oj1J0ONmMmKPljL%j2mQQqK
$$ 15 4 3 11 4 4 11 -7 4 -3 2 -2 0 -6 0 -12 -7 -1 -1 -13 -7 -11 -11 -6 -11 -15 -7 -11 -1 3 -7 -1 -12 -2 4 9 5 9 5 7 14 11 10 13 13 1 -3 5 13 5 7
6299GmNnMpPlk0J4JoOorJMKPKlMoMlqNJ3Lj5J0%%NJRj7K1oj2jmLj1MJ2pmRmpJ0
$$ 7 3 8 3 7 0 7 4 -16 -2 -1 -7 -1 -7 -16 -15 -11 -9 -2 0 -3 1 -5 -1 -4 -12 -7 6 9 -6 4 4 4 9 10 19 2 23 17 5 4 0 3 -8 -4 8 1 -3 6 2 -5 5
6350E%j3jQj4pJ6rJ2Jj5ONLJ0j8NPOj0OrJ4lLoRjkj6J0NLJj3%j0QJlLj0KkJ0k
$$ 5 5 -8 -9 -1 -15 -22 -6 -15 -3 -2 -17 -11 -6 -3 7 -11 -6 1 7 -3 3 -6 8 5 8 2 11 10 8 -8 2 7 10 11 -2 -2 -12 -4 -3 -6 -3 -13 -11 -13 -3 -5
6396eQj3rjPJPNj9J7mJ%J1jj5K3jrMJ2j2kpPMKJo%j1K%OjojJRj1pQmmpJ6nJ1p
$$ -5 3 -10 -19 -20 -13 -12 -5 0 -19 -2 -6 -5 -5 6 5 -10 13 12 3 7 19 7 5 -2 5 9 11 12 6 6 -5 -3 -3 3 2 -4 -5 -4 5 -6 -13 -5 -9 -13 -20 -4 -9 2 -5
6445eknPRnNoMMoQmJ1JpJ3k2J5kmnMmQnj4Rj1J0ojKLj3QPj8Rkkj3QJ4knlJJ2l
$$ -5 -7 -12 -5 4 -1 4 -2 2 6 0 8 4 15 16 9 22 0 15 13 9 4 8 4 12 7 -7 2 -9 1 -5 -6 -4 -1 -14 -6 1 -17 -8 -10 -12 -25 -17 -3 -5 -10 -13 -12 0 -3
6494cQkJ4j5RLqJ0ok%jJNpJ%q%mL%Rj3jJ2ooJ5j0j2MPjmMlMJMLj1%K0j4MJ5j4
$$ -3 5 3 17 2 11 14 6 16 10 8 8 7 8 13 6 7 7 -1 -1 -5 -2 -2 7 -6 -7 5 -1 -7 8 -2 -14 -10 -3 -4 -8 -4 -7 -3 -2 2 5 -6 -6 14 0 4 19 5
6542ELMKnoMJ5k2J3KrnQrKqJ7j2kkoLLKj4R%Oj8J2mMLjJ1knRnlNpjK2omjKkkO
$$ 5 8 12 14 9 3 7 22 0 13 15 6 1 9 0 2 -6 11 -1 -3 -5 -11 -8 -5 -3 -17 -8 -8 -2 -20 -8 -12 -8 -5 -6 5 3 -2 7 2 -1 4 -3 -4 18 12 8 7 9 7 5 11
6593A1nJ0j3kkqJ3nlljkkmOljjLPnOOqQMj4J8JmlJ0lmPm%j5J7J0j1kQj7Rj0J8
$$ 11 6 16 3 1 -1 -9 4 -1 -4 -7 -8 -10 -12 -16 -10 -13 -14 -15 -12 -5 -10 -4 2 -6 2 6 -8 10 11 7 4 14 11 7 14 10 10 -5 12 22 11 9 17 0 9 -1 17
6640A7k0MKj2jLNj6J0LKj3QMJj8J7kLjMmJ2ljqJ3JrQNloRJ1j1mPkj0MMqj4kK1
$$ 17 -3 1 3 -9 -10 -7 -2 -18 -8 -5 -3 -16 -8 -4 -3 -21 -4 -6 -3 -4 0 -4 8 5 4 -4 9 10 1 9 14 11 5 14 25 14 10 17 15 5 9 13 5 -9 -11 10
6686A0roLPj5J0j0j0J9p%oJ2nJkN%mJ4jj4QRkRJoj1ORj2nJ5qjpJ0Mk2J2qJKJ1
$$ 10 1 -5 -2 5 -10 0 -10 -20 -1 -8 -8 -14 -2 -7 -6 -8 -3 -3 -7 7 6 -8 0 9 7 16 17 11 0 6 15 3 -2 13 5 4 -3 7 11 -11 1 -7 -6 -4 7
6731GppkQqOKrJkKMMMJqMNRj2K0Jj7J4krPj8J9j4ONKj2KJJ4l1J6plOjj1mJ0Jj3
$$ 7 0 -7 -9 -1 -9 -3 -1 -10 -9 -11 -9 -5 -1 3 4 -4 0 5 14 2 22 23 6 20 18 9 16 -2 17 3 9 14 16 4 6 7 21 -10 6 -1 -4 2 1 -10 -14 -4 -3 -16
6779a6RKJ%Ljj3J7%j0J3QkllRqKJ3jomJlrNqPkNj1J2Kpj8J7mj1J1Pj6JJ3mmkK
$$ -16 -7 -5 -4 -4 -1 -2 -15 2 2 -8 5 13 11 8 5 14 6 8 21 20 14 10 11 8 -1 4 -4 3 1 6 -5 7 9 2 -16 1 -3 -14 -3 4 -12 -11 2 -2 -6 -8 -6
6826fOqLQj2J1J1lqPJ0j9J0JLMrMj4J4j1J3mmj0J3k4J6Kj1RMj1lRKrkJJ1k0J1
$$ -6 0 -8 -5 3 -9 2 13 10 2 9 19 0 10 11 14 18 9 13 -1 13 2 15 11 7 -3 10 -14 2 4 -7 2 6 -5 -8 1 3 -6 -8 -7 4 -16 -5
6868eKkKPj0OjMKpOjJ6ljmMJllLMj6Qjj5J0KqNNj4R%j0%qJ2Rk2J3j4RJNNjmnJ6
$$ -5 -3 -5 -3 4 -6 0 -1 3 5 -2 4 3 19 16 15 11 15 16 13 10 13 17 1 9 8 -7 3 5 -3 2 7 -7 2 2 -8 -8 -16 -4 5 -17 -4 -18 -9 -8 -3 2 1 -3 -8 8
6918Hj6kKJ6KklJkJ0kpoOoRnmkjMkj5lQLMnnlJ4Jj1LLJ5j5Rkkj%J3nLmjNNjKj
$$ 8 -8 -10 -8 8 10 8 5 6 4 14 12 5 -1 5 -1 8 3 -1 -3 -4 0 -2 -17 -20 -12 -9 -5 -10 -15 -18 -4 -3 -14 -11 -8 7 -8 1 -1 -3 -4 -4 9 4 7 3 2 7 12 11 13 12
6970A2%kMj2Kj7J2MKlLJj5LJj1RmJpPknQJ3j1LrJ7pnJ6nnJ1LnoJ1JpNPpqNqNo
$$ 12 12 10 14 2 4 -13 -1 3 5 2 5 6 -9 -6 -5 -16 -7 -11 -10 -17 -10 -12 -17 -9 4 -7 -4 -13 4 -3 -8 8 3 -2 9 12 7 1 12 13 6 11 18 11 3 8 0 5 -1
7019aJ0mKj0QpNMj6mNpPJ1oo%J1Nk0J0J3j8OQQj8PJ4opJ3%qkJ0r%lMj1PQrl%q
$$ -1 9 5 7 -3 5 -2 3 7 -9 -13 -8 -15 -8 3 -3 -9 -9 2 7 -13 -3 10 -8 -2 6 14 -4 3 17 11 4 17 17 9 7 17 8 8 5 9 -2 5 13 4 1 1 -7
7066gJ0lQj6Jj3J5Jjl%oLKRmPQj5MQnkRpPj1J1rJ2Okj4Qk%l%MpKom%NLj4jJ1%
$$ -7 3 0 8 -8 -7 -20 -5 -4 -5 -8 -8 -14 -11 -9 0 -4 3 11 -4 0 8 3 1 10 3 10 -1 10 1 13 19 17 3 11 9 9 6 6 10 3 5 -1 -5 -5 0 3 -11 -12 -1 -1
7116aj4PnMOlOj2QJ0mj1J7ljLOoNlPj4J1Jj4J1lQj4MMmj3RpKj0QmJKPj2J4qj0
$$ -1 -15 -8 -13 -9 -3 -6 0 -12 -4 6 2 -9 8 5 4 7 13 7 12 9 16 2 13 14 0 11 8 16 2 6 10 6 -7 2 -5 -3 -13 -5 -9 -8 -6 1 -11 3 -5 -15
7162a5jJ4Nj3J1jOnNNr%%J4q%NmokQmMlj1J2lJ0k2J0jj4OjPj0OmjnJ1l%l%JpJ8
$$ -15 -16 -2 3 -10 1 0 6 1 6 11 2 2 2 16 8 8 13 9 3 1 9 5 9 6 -5 7 4 14 -8 2 1 -13 -7 -8 -1 -11 -5 -9 -10 -15 -4 -7 -7 -10 -10 -9 -16 2
7210BNj9J6no%J3J1j2jJ1jnKnknOKj2PlpJ3j0%pONj3MJkMkj3RkPJNJomJ4KKj0
$$ 2 7 -12 4 -1 -7 -7 6 17 5 4 15 14 9 11 6 4 -1 5 7 -5 2 -1 -8 5 -5 -5 -12 -6 -1 -14 -10 -9 -11 -7 -9 -22 -13 -15 -8 -7 -2 -1 -7 -11 3 5 7 -3
7258cKJ9k3K2nmmKrMJ5j1%nJoQrkRj8ORj4JJ2loJ0pklOMj6NOjrPJ7rJ3pPj3J0
$$ -3 -1 18 -5 17 12 8 4 6 -3 1 16 5 5 0 1 -5 3 -6 -8 1 -17 -11 -2 -16 -15 -3 -6 -12 -2 -9 -11 -14 -8 -4 -20 -15 -9 -10 -19 -12 5 -4 9 2 9 -4 6
7305FOmpRj0J4kj2M%Lj3J0ppJJPj4jRpMLklMjPrJJ1NpMLpOLJ0j7J%NONj3j0QR
$$ 6 12 8 1 10 0 14 12 0 4 4 7 -6 4 -3 -10 -9 -8 -1 -15 -16 -7 -14 -10 -7 -9 -12 -8 -9 -2 -11 -10 1 6 -1 3 6 -1 5 8 18 1 2 2 7 13 18 5 -5 3 12
7355A2j3%Rj8Pjjj3QKlPj0jJ6j4nJ3p%LnKJ3mMnKOpOKrK1lmmm%mJ6pppO%qkNO
$$ 12 -1 -1 8 -10 -3 -4 -5 -18 -10 -8 -11 -4 -14 -15 1 -13 -18 -5 -12 -12 -9 -14 -12 1 -3 1 -4 -2 4 -3 3 5 -4 17 14 10 6 2 2 -2 14 7 0 -7 -1 -1 -9 -11 -6 0
7405@nKorLRj4PJnMROKqJ1j2L%J0qnJ6j1OKK%KJj1MMlKjjNj3Nn%lQj2j3QJ1j0
$$ 0 -5 -3 -9 -18 -15 -6 -20 -13 -12 -17 -13 -4 2 4 -4 7 -5 -2 -2 8 0 -5 11 0 6 8 10 10 12 13 2 6 10 7 9 8 7 12 -1 4 -1 -1 -4 4 -8 -21 -13 -2 -12
7454a2oJLPkPlJpJ0pQJOoNOj1RpJ4jj1Qj0lJ3mpjOmj2J7rj6JJ1jlJkpRMqmQQp
$$ -12 -18 -17 -14 -7 -9 -2 -5 -4 -11 -1 -8 0 1 7 1 6 12 1 10 3 17 16 5 13 3 0 13 9 2 1 7 3 -9 8 -1 -17 -16 -5 -6 -9 -8 -10 -17 -8 -4 -12 -16 -8 0 -7
7504gJLJ0j5PPj7J7Rj3QLknN%JkJpPpjkpJ6Loj1J1j4NrNrJ1%kqQjkOkJ0OpJ%n
$$ -7 -6 -3 7 -8 -1 6 -11 6 15 2 10 13 11 6 11 11 12 10 11 4 11 4 3 1 -6 10 13 7 -4 7 -7 -2 -11 -6 -15 -4 -4 -6 -14 -6 -7 -9 -3 -5 5 11 4 5 5 0
7554@NMmPKmrPkRmmj2QJ3rj0PLj0nJ2Jj1JlqOnKJ0Kmj0J1JmPrMJ4pJ8ooQj1RK
$$ 0 5 9 5 12 14 10 1 8 6 15 11 7 -5 3 16 7 -3 4 7 -3 -8 4 5 -6 -5 -8 -16 -10 -15 -13 -3 -1 -5 -15 -4 -3 -7 0 -9 -5 9 2 20 14 8 16 5 14 16
7603A6rOJnpQj2Qj0J0jnKj5PkklRj4RMlj2K0n%lJ0LJoJ2Ok1RQnjKlPL%Omljmj2
$$ 16 7 13 14 9 2 10 -2 6 -4 6 5 0 2 -13 -6 -8 -10 -13 -4 -18 -9 -5 -8 -20 0 -5 -5 -8 2 5 6 0 12 18 -3 6 14 9 8 10 7 14 17 17 23 19 16 15 11 -1
7653aPkqPoKqJ6%k5J7kj2QQrlKJ0j4RJ3j0oONj2J3LL%KLj3PLo%%OnpJ1pmmRj0
$$ -1 6 4 -4 3 -3 -1 -9 7 7 -18 -1 -3 -15 -7 1 -8 -11 -9 1 -13 -4 9 -1 -7 -1 4 -8 5 8 11 11 13 16 3 10 13 7 7 7 13 8 1 12 5 1 -3 6 -4
7701dJM%j1lPlMkmqJ3rRJ4mj8QJ3JLk%LNoQrpPlnOMmpLJ1j1KNj5PoqOjLj3J2k
$$ -4 -3 1 1 -10 -13 -6 -9 -5 -7 -11 -19 -6 -15 -6 8 4 -14 -6 7 8 11 9 9 12 17 11 19 10 3 10 7 2 8 12 8 1 4 15 4 6 11 -4 3 -3 -11 -5 -6 -3 -16 -4 -6
7752fo%mJ1lkJ4j0jNoJ3pJ7kkNj0J4mj0PlkJ2orjjqJ1noj0OMlMllpJ1PoMqlJ7
$$ -6 -12 -12 -16 -5 -8 -10 4 -6 -7 -2 -8 5 -2 15 13 11 16 6 20 16 6 13 10 8 20 14 5 4 3 -5 6 1 -5 -15 -9 -5 -8 -4 -7 -10 -17 -6 1 -5 -1 -9 -12 5
7800Ej9OPnRLj3RnJ1k1K1Jj3K1j8OlQJ3j7j2N%JNrJ0k0J4pj0LKMJLJnJjJQjkM
$$ 5 -14 -8 -1 -6 3 6 -7 2 -3 8 -13 8 9 -4 17 -1 5 2 10 23 6 -6 -1 -1 0 5 -4 6 -14 0 -7 -17 -14 -12 -8 -7 -4 -3 -8 -7 -8 -7 1 0 -2 2
7846BNj8jJ1NpJ7pPjljpOkNlomk%J0rrKJ2qj0J4pPkoj%JRjj4NrK6mqJ1qJ2nOn
$$ 2 7 -11 -12 -1 4 -3 14 7 14 13 10 9 2 8 6 11 8 2 -2 -4 -4 6 -3 -12 -10 2 -6 -16 -2 -9 -2 -4 -10 -11 -11 -10 -1 -2 -16 -11 -20 6 2 -6 5 -3 9 4 10 5
7896EmoKK3j0j1JJ1nmjk%kkrRmj4J3%l%kJ7nqjJmLQlojK3k3J0OlnRJ0jj2OOom
$$ 5 1 -5 -3 20 10 -1 0 11 6 2 1 -1 -1 -3 -5 -14 -5 -9 -23 -10 -10 -13 -13 -15 2 -3 -11 -12 -11 -15 -12 -4 -7 -13 -14 9 -14 -4 2 -1 -6 3 13 12 0 6 12 6 2
7945BlPj2J1mkmkk%J6k7OmJ5qoN%JMJkJ0oLlpJ2mjJ4JlkMM%qOmpJRj3%jNOqm%
$$ 2 -1 6 -6 5 1 -1 -5 -7 -9 -9 7 -20 -14 -18 -3 -11 -17 -12 -12 -11 -7 -6 -8 2 -4 -1 -4 -11 1 -3 -4 10 11 8 6 10 14 14 6 12 8 1 2 11 -2 -2 -3 2 8 0 -4 -4
7997dLoqJPonkJ5knqRO%Mk%NKoJ4JjMmKJoJljjRpoOOj4OpKJo%jkKj5K3r%kOj1
$$ -4 -1 -7 -15 -14 -7 -13 -18 -20 -5 -7 -12 -20 -11 -5 -5 -1 -3 -3 2 4 -2 12 13 12 16 12 14 15 9 10 7 6 5 14 7 1 7 13 -1 5 -2 0 1 -5 -5 -6 -8 -6 -21 2 -7 -7 -9 -3 -14
8052a4KLQmOKKj2J6mKKj2J2NpmOnRk2MlJ2rjNJ0j5JQj1Nj1OoJ3j0LnjNJnOLJK
$$ -14 -12 -9 -1 -5 1 3 5 -7 9 5 7 9 -3 9 14 7 3 9 4 13 -9 -5 -8 4 -5 -6 -1 9 -6 -5 3 -8 -3 -14 -8 -14 -1 -11 -8 -13 -14 -9 -8 -13 -7 -4 -3 -1
8100aOlknJ0j0J0JJ0pmJ8Lk3J2Pj3jj0%jJjllQKj2nOj2OOKpJPKKoRLoJ0j4J6o
$$ -1 5 2 0 -5 5 -5 5 6 16 9 5 23 26 3 15 22 9 8 -2 -2 -3 -2 -3 -6 -9 -1 1 -11 -16 -10 -22 -16 -10 -8 -15 -14 -7 -5 -3 -9 0 3 -3 7 -7 9 3
8147CnJJ6jokJnMQmj0Rr%pJ2j5KJ3rrMJrmJ4nljOLrOJ7%j4K%MMJ0lj0
$$ 3 -2 -1 15 14 8 6 7 2 6 14 10 0 9 0 0 -7 5 -10 -8 5 -4 -13 -9 -8 -17 -21 -7 -12 -15 -16 -10 -7 -16 -10 7 7 -7 -5 -5 -1 3 13 10 0
8191@
$$ Imaginary data points
##PAGE= N=2
##DATA TABLE= (X++(I..I)), XYDATA
0@%%%%%%%%%%%%%%%%%KoJ0j2J4j6J6j6J6j6J6j6J6j6J5j4J4j3J2j2J1qLJmJ0j5
$$ 0 0 0 0 0 0 0 0 0 0 0 0 0 0 0 0 0 0 2 -4 6 -6 8 -8 8 -8 8 -8 8 -8 8 -8 7 -7 7 -6 6 -6 5 -3 0 1 -3 7 -8
44hJ9k6L5m2M8n6O3p0P6q2Q3p8P2n6K3K7j04K27m19P20j209K042l562O684j4757
$$ -8 11 -15 20 -22 26 -30 33 -37 39 -43 40 -38 34 -22 1 28 -76 151 -268 452 -757 1285 -2277 4407 -10350
69a0350O0520J23652k21186J94695j02467O1143o4006j11214J27450j42116Q6238
$$ -10350 50170 173822 -47364 147331 44864 106007 42001 -69213 58237 -83879 2359
80B359j04204M2055P4424q1293N8995N5595r346J2127J9269r8901P4845o3188
$$ 2359 -101845 -59790 14634 -66659 -7664 47931 38585 50712 69981 -28920 45925 -17263
92a7263n2117K8482L1467M8155j29870J62360m3221l5221L2017n7747J09125j08211
$$ -17263 -69380 -40898 -9431 38724 -91146 71214 27993 -7228 24789 -32958 76167 -32044
104c2044J4348K207M3420o1011l7887J45116j04730O4824k3135K0748j8252m2034
$$ -32044 -17696 -15489 27931 -33080 -70967 74149 -30581 34243 11108 31856 13604 -28430
116b8430L9909j07605J45731q3646J130Q5795o5192O3989p3360M0118N210j6711
$$ -28430 11479 -96126 49605 -34041 -32911 52884 -12308 51681 -21679 18439 23649 6938
128F938l2151o007P1111q0490j1618P2744J8209p4113Q3657o393l4432K7646r3355
$$ 6938 -25213 -31220 39891 -40599 -52217 20527 38736 -35377 48280 41887 7455 35101 -58254
141e8254O9648n9175O057Q232R14P2513q1573J08147m2589K986N7886r9165L7887
$$ -58254 11394 -47781 -41724 -33492 -32578 39935 -41638 66509 23920 26906 84792 -14373 23514
154B3514j1456k4792o3607M2463K0102n3398N3223K5182K8077k0278J6827o786
$$ 23514 12058 -12734 -76341 -33878 -13776 -67174 -13951 11231 39308 19030 35857 29071
166B9071J3940m1050m5259P6172p6208m02K9014K398K523Q326M4537n0073N5538
$$ 29071 43011 1961 -43298 32874 -43334 -43736 -14722 -12324 -9801 -1475 43062 -7011 48527
179D8527j7774m3846L0370k0639j4468j8602L0014j5960K0784j0474J598N9300
$$ 48527 30753 -13093 17277 -3362 -17830 -36432 -6418 -22378 -1594 -12068 -10470 48830
191D8830n5809K745K7965k846n1689K1856L9748n9443L4652J891q604Q841r583
$$ 48830 -6979 -4234 23731 20885 -30804 -8948 30800 -28643 6009 7900 -704 8137 -1446
204a446m26J792P226k9666K4810j0605j0332K8565j3042K413K4061R570n1579
$$ -1446 -1872 -80 7146 -22520 2290 -8315 -18647 9918 -3124 -711 23350 32920 -18659
217a8659L2959Q654o4466K5330J1241o366p451K1413Q100l360Q704j6849L4222
$$ -18659 14300 22954 -41512 -16182 -4941 -11307 -18758 2655 10755 7395 16099 -750 33472
230C3472j5308k9391K5617j2899l4612J0780J7349k9348K9675K4928k3332J6407
$$ 33472 18164 -11227 14390 1491 -33121 -22341 -4992 -34340 -4665 20263 -3069 13338
242A3338J3105k2806j1551J8519j5126j444N126j0401J9234j3279j0061K9693
$$ 13338 26443 3637 -7914 10605 -4521 -5965 -839 -11240 7994 -5285 -15346 14347
254A4347P479k8366J7739J9946m9515K9J7241k5480J570K3711j68J739J7847j0114
$$ 14347 21826 -6540 11199 31145 -18370 -18341 -1100 -26580 -25010 -1299 -1467 272 18119 8005
268H005K536M808j4894J2220j397k0493J0364J199l3136J3859K5471k6404J2296
$$ 8005 10541 15349 455 12675 11278 -9215 1149 2348 -30788 -16929 8542 -17862 -5566
281e566L2690k1298j1994J7505j1236j0786J2610j294M886L040j4147Q006J870
$$ -5566 27124 5826 -6168 11337 101 -10685 1925 631 5517 8557 -5590 2416 4286
294D286k2497J3355J7790k3769O176K1464k6852n628K7217j0618n437K5382m524
$$ 4286 -18211 -4856 12934 -10835 -4659 16805 -10047 -15675 11542 924 -4513 20869 16345
307A6345j3847L505j0485o709J613q419J2057J1319j7727R382J7652k3497K227
$$ 16345 2498 6003 -4482 -11191 -9578 -17997 -5940 5379 -12348 -2966 14686 -8811 -6584
320f584L0116j5273r437K3027j5337k0891J2448k749o887J1817J972m80K994j2326
$$ -6584 23532 8259 -1178 21849 6512 -14379 -1931 -4680 -11567 250 2222 1742 4736 -7590
334g590J844R803j7391O244K2500j8371n058K4155j3542j5217K5055j474j5065
$$ -7590 -5746 4057 -13334 -7090 15410 -2961 -8019 16136 2594 -12623 12432 10958 -4107
347d107J3629k458j3767L80k438j351Q223m123M474J5865j6759q78J8400j6365
$$ -4107 9522 7064 -6703 -6323 -8761 -10112 -1889 -6012 -1538 14327 -2432 -3310 15090 -1275
361a275q945K1636n690j9762J9285j979j8134J2689M780l714M074L702l875K976
$$ -1275 -10220 11416 5726 -14036 5249 3270 -14864 -2175 2605 -1109 2965 6667 2792 5768
375E768q618l422J6061j5866k255J9109r570j3927J8231J121k2701J9570K447
$$ 5768 -2850 -6272 9789 -6077 -8332 10777 1207 -12720 5511 6632 -16069 3501 5948
388E948j3269Q577K545n433j229O596o333R183n185n072J5774j6718j978J3309
$$ 5948 -7321 1256 3801 -1632 -2861 3735 -2598 6585 1400 -3672 12102 -4616 -6594 6715
402F715m062j6528J7069P198k5345J8603L264j1154K62N693k277m177P669r016
$$ 6715 2653 -13875 3194 10392 -14953 3650 6914 -4240 -3978 1715 -562 -4739 2930 -6086
416f086J3254p743m541J6235j0278l440O541N357k0987J5707N045k4364J6138
$$ -6086 7168 -575 -5116 11119 841 -2599 3942 9299 -11688 4019 9064 -15300 838
429H38J034o057l944J5779o220n077Q817j1926J5167j6035J448J3603o116m888
$$ 838 1872 -4185 -8129 7650 1430 -3647 5170 -6756 8411 -7624 -6176 7427 1311 -3577
443c577M080J6967l0015J4533Q447j8164J2419k218j297j0504J0714j0181K48
$$ -3577 503 17470 -12545 1988 10435 -7729 4690 2472 1175 -9329 1385 -8796 -8548
456h548J1769p040J2181r645M126O53P53j2984J1425J4625l3240K2361o48j0182
$$ -8548 3221 -3819 8362 -1283 2843 3496 4249 -8735 2690 17315 -15925 6436 5788 -4394
470d394n811P614R273j9537K3708j4467Q239r83j5139J9794j0862O008l267J0153
$$ -4394 -10205 -2591 6682 -12855 10853 -3614 4625 3642 -11497 8297 -2565 3443 176 10329
484A0329j3435J94R417k5328J8477N09l114m671J8434n020j8194K2961j1582J0416
$$ 10329 -3106 -2912 6505 -18823 -346 163 -2951 -7622 10812 5792 -12402 10559 -1023 9393
498I393q815L218P754j4485m177n218K0463k5272J1873J4350j2470M863l661R759
$$ 9393 578 3796 11550 -2935 -7112 -12330 8133 -17139 -5266 9084 -3386 1477 -2184 7575
512G575j8165K2261j2139l099K0421k4826J4383j5638J2557k925o347J2444j0017
$$ 7575 -10590 11671 -468 -3567 16854 -7972 6411 -9227 3330 405 -5942 6502 -3515
525c515J8358l0631J0635J4170k1528M006J2861M992j6630J3805m340K096n502
$$ -3515 14843 -15788 -5153 9017 -12511 -8505 4356 9348 -7282 6523 2183 4279 -1223
538a223l27Q398p244P989k0984K1679j6193l644K0385k3472K7898j2137P08l139
$$ -1223 -1550 6848 -396 7593 -13391 8288 -7905 -11549 8836 -14636 13262 1125 1833 -1306
552a306M257N511k8633L2516q912o389J849M25N585j4401O534n18J5101j8834
$$ -1306 2951 8462 -20171 12345 3433 -2956 -1107 -682 4903 -9498 -2964 -3482 11619 -7215
566g215M127J4603j5663J717r57J4398j5987J1979j065j2320J5725j7691L574
$$ -7215 -3088 11515 -4148 -2431 -3388 11010 -4977 7002 5937 -6383 9342 -8349 -4775
579d775q48Q490q329P38R020p615J0828j8137J8069J994r655o78M722R412l4082
$$ -4775 -5623 2867 -5462 -4724 4296 -3319 7509 -10628 7441 9435 -220 -898 3824 13236 -20846
594b0846K4662j763r761J0382r043J6357j3989N096k838K339L961j3427J4233
$$ -20846 3816 2053 -7708 2674 -6369 9988 -4001 1095 -1743 596 4557 -8870 5363
607E363p260N52J737j831k090J0163l004j2467K0090q547n109l243J0446k881
$$ 5363 -1897 -1345 392 -1439 -3529 6634 3630 -8837 11253 2706 -2403 -5646 4800 1919
621A919j3996J7601r382R838j0274l39J6786j7090L345R43O775j2228L593Q006
$$ 1919 -12077 5524 -3858 5980 -4294 -4633 12153 -4937 -1592 -649 6126 -6102 -2509 5497
635E497j2410J1224m789l61J346N682p309k198J0714j1189M960o792N648L539
$$ 5497 -6913 4311 -478 -839 507 6189 -1120 -3318 7396 -3793 1167 -5625 23 3562
649C562r335L979M882M508j7619J2430N318j4394N006L043J836p261O165l307
$$ 3562 -5773 -1794 3088 7596 -10023 2407 7725 -6669 -1663 1380 3216 -4045 2120 -1187
663a187J192K348o977R016m094R64j488j0j735J213L941j1356J3770L95j0438
$$ -1187 5 2353 -4624 4392 298 1262 -226 -236 -1971 -758 3183 -8173 5597 5992 -4446
678d446L610N457m681r728J2095k515j385M6l78P274p203N44M251M572p782J428
$$ -4446 -836 4621 -60 -9788 2307 -208 -1593 -1547 -1925 5349 -1854 -1310 2941 7513 -269 1159
694A159O297j2505L087k1m244K247O262l365k785R746o323j846K534K964R94m574
$$ 1159 7456 -5049 -1962 -1983 -6227 -3980 2282 -1083 -3868 5878 -445 -2291 243 3207 4201 -373
710c73J192J503l62j0656P504P936j0996L419O461m108o912M863n80k734M913
$$ -373 819 2322 1960 -8696 -1192 6744 -4252 -833 5628 1520 -5392 -529 -1109 -3843 1070
725A070j640K332K16j415j166J152kL57L269o927M210J246j0312K927O927k999
$$ 1070 -570 1762 1978 563 -603 549 547 904 4173 -2754 1456 2702 -7610 -4683 2244 -755
741g55m082J0390M67q057K768O45j072j171o2L327M18o679J061L876n951K075
$$ -755 -4837 5553 6020 -2037 731 1376 304 -867 -929 2398 2816 -3863 -2802 1074 -4877 -2802
757b802N737k160j822M811l226n275P922j662l324N509N80k632k781Q2L54j776
$$ -2802 2935 775 -1047 3764 538 -4737 3185 1523 -1801 3708 4288 1656 -1125 -1043 -689 -2465
773b465k434L634M090o363m66P527l701l918Q811N72m948L534q81m283o56J55
$$ -2465 -4899 -1265 2825 -3538 -4004 3523 -178 -4096 4715 5287 339 3873 2992 -1291 -1947 -1792
789a792q91P59J522J69J412k284K08L781m395K45O800m552m747N684j248o025
$$ -1792 -2683 -1924 -402 -233 1179 -1105 -897 2884 -1511 -1266 5534 982 -3765 1919 671 -5354
805e354L850M328l053K15K835j684r38j692M95K677l584O28M213l663k382N007
$$ -5354 -1504 2824 -229 -14 2821 1137 199 -1493 -998 1679 -1905 -1277 2936 -727 -3109 1898
821A898p70m210N442J358n959J981K278m570j34K857m26L6l58J594J421l217k8
$$ 1898 1128 -3082 2360 3718 -2241 -260 2018 -2552 -2686 171 -255 -219 -577 1017 2438 -779 -807
838h07L992k265l998N547k32o220L980J958m586Q70L762k525q68K203p96J6j235
$$ -807 3185 920 -3078 2469 2237 -3983 -3 1955 -2631 -1761 2001 -524 -1392 811 15 31 -1204
855a204J192J647k125m83L614p62n001N239M27n994L003K500l631j052M701j960
$$ -1204 -12 1635 -490 -973 2641 1879 -3122 2117 2544 -3450 -447 2053 -1578 -2630 2071 111
871A11j464K177n73L86j764J063J549j622k162L252m9n255N460J489l486J367
$$ 111 -1353 824 251 637 -1127 -64 1485 -137 -2299 953 904 -4351 1109 2598 -888 479
887D79L536l062l497M976l127r76R72rQ71l063J920P15M44j877L784K336o059
$$ 479 4015 953 -2544 2432 -695 -1671 -699 -708 163 -2900 -980 -265 179 -1698 2086 4422 -1637
904a637L812N89m167j098L996j909k820N077k343l73n14J473M86j251K173J23
$$ -1637 2175 2764 -1403 -2501 1495 -414 -3234 1843 -500 -873 -1387 86 572 -679 1494 1617
920A617J194n323L378M60n446L936J654q27l431N441k698l713M621j570J874j771
$$ 1617 2811 -2512 866 1326 -4120 -184 1470 643 -2788 2653 -45 -3758 863 -707 1167 -604
936f04K921r17j876N00q38L108m933M504N95m407Q74Q12r40l936P311j733j492
$$ -604 2317 1400 -476 24 -814 2294 -2639 1865 2460 -1947 -1073 -261 -1201 -5137 2174 441 -1051
953a051K859m40l96l310M395j848J336j484Q20K201p725M654o31n18n88L186J166
$$ -1051 1808 1368 972 -2338 2057 209 1545 61 881 3082 -4643 11 -620 -1138 -1726 1460 2626
970B626o488O366l925n68J749P00J442k650L977l173M06j954J893J448m393L712
$$ 2626 -3862 2504 -1421 -1989 -240 460 1902 -748 3229 56 462 -1492 401 1849 -2544 1168
986A168k96j291m514N876r53l716O523j439J661m042L330j691k716L318l468M770
$$ 1168 872 -419 -4933 943 -10 -3726 2797 1358 3019 -1023 2307 616 -2100 1218 -2250 2520
1002B520n095K307N47l633L405o62K653l497N638k054m453M020j791k02k698N624
$$ 2520 -2575 -268 279 -3354 51 -611 2042 -1455 4183 2129 -2324 1696 -95 -297 -2995 2629
1018B629k301j776J294r54K431n311M528R10j185j187J656J690n894N539j766
$$ 2629 328 -1448 -154 -1108 1323 -3988 540 1450 265 -922 734 2424 -3470 2069 303
1033C03K51M10P2q0l706M944n352K389J49K69K140n034O167k783j44j133K509
$$ 303 554 964 1036 956 -2750 2194 -3158 -769 -620 -351 1789 -3245 2922 139 -5 -1138 1371
1050A371J690p211O044j075k019q85K450R29k781L066j265J656l034J165m4j338
$$ 1371 3061 -4150 1894 819 -1200 -2085 365 1294 -1487 1579 314 1970 -1064 101 57 -1281
1066a281J473j841K931l973M415j284k872N354k462M20k809M654k437l499M320
$$ -1281 192 -1649 1282 -2691 1724 440 -2432 2922 460 880 -1929 2725 288 -3211 1109
1081A109j746J390l460L670P40k253N74N42K185n691L598l65j750J296m84J619
$$ 1109 -637 753 -2707 963 1703 -550 24 566 2751 -2940 658 293 -1457 -161 -645 974
1097I74k814L900k614k82K482j601O39k212L173j806j204L09K101J21m058M842
$$ 974 -1840 2060 -554 -836 1646 45 684 -1528 1645 -161 -1365 -1056 1045 1166 -2892 1950
1113A950m35j639j606K971j99m199M396j770J356j362K10J568k859K540j806J700
$$ 1950 1515 -124 -1730 1241 1042 -3157 1239 -531 825 -537 -327 1241 -1618 922 -884 816
1129H16r57N85L94l147L559r87o92M5L269j603l586L447j540r09j434K972O85
$$ 816 -141 444 838 -2309 1250 263 -429 -384 2885 1282 -2304 1143 -397 -1306 -2740 232 917
1146I17k532J629L33J222k825K209J535k091M06k73l96k386K139j578j10K601
$$ 917 -1615 14 347 1569 -1256 953 2488 397 803 530 134 -2252 -113 -1691 -1801 800
1162H00o12K82j310K991k262j137J952K37O02l666L294j67l246R45J774R90k986
$$ 800 188 470 -840 2151 -111 -1248 704 941 1543 -2123 1171 1004 -2242 -1297 477 1467 -1519
1179a519K598J75k020j55J19R32o86J607m97K58m27m70jj413K550n86j261L10
$$ -1519 1079 1254 -766 -921 -802 130 -556 1051 554 812 385 -85 -86 -1499 1051 465 -796 -486
1197d86J371j449k449L758L82j478K48K280q72k749J277L01K88j722J824J147
$$ -486 885 -564 -3013 745 1127 -351 -103 2177 1305 -1444 -167 134 422 -1300 524 1671
1213A671k467O13l92M44j089J302M86j665K217j190j064Q09J411m05r81K043R0
$$ 1671 -796 -183 -575 -131 -1220 82 568 -1097 1120 -70 -1134 -325 1086 681 -300 1743 1833
1230A833k003j402J720l24j993R69K197m84k461K587M12j656Q77Q57L89j680M92
$$ 1833 -170 -1572 148 -176 -2169 -1200 997 513 -1948 639 1051 -605 272 1129 1518 -162 330
1247C30m08j149N70j04M92nJ106r2j274N48J014j296r62K549l85j947L10J624
$$ 330 -78 -1227 -657 -761 -269 -274 832 740 -534 14 1028 -268 -1230 1319 934 -1013 -703 921
1265I21r32j851K473M39j187l34P34M36k039P03J230o43j91R71J3j148O72J59
$$ 921 -11 -1862 611 1050 -137 -471 263 699 -1340 -637 593 -50 -241 730 743 -405 267 426
1283D26j021K29J198j086p99J467k06q50k5J694k82j763J259O71j254r35J598
$$ 426 -595 -366 832 -254 -1053 414 208 -642 -667 1027 745 -1018 241 912 -342 -1277 321
1300C21M84j847R04J332r87o00J108j72r92J13M62n62n92J244k22n60O65O85m76
$$ 321 805 -1042 -138 1194 207 -393 715 543 -449 -336 126 -436 -1028 216 -6 -566 99 784 308
1319C08j005J711k40j725Q03P48j036r32J572M55j139N65J223o88j115O66J17
$$ 308 -697 1014 774 -951 -148 600 -436 -1368 204 659 -480 85 1308 620 -495 171 288
1336B88r49l84J338l70j006J367L5o04J71J316m13j101J270m79j308j90J040k57
$$ 288 -661 -1045 293 -77 -1083 284 319 -285 -114 1202 789 -312 958 479 -829 -1019 21 -236
1354b36q67J364O16j006n15J418m42j078R81O45q28q09J440p56r31R94L80j91
$$ -236 -1103 261 877 -129 -644 774 332 -746 235 880 52 -757 683 -73 -1004 -10 370 179
1372A79p04J374o75j261P24M79k04m89J889l03j270M59M06q42r15J699l76q77
$$ 179 -525 849 174 -1087 -363 116 -88 -577 1312 1009 -261 198 604 -238 -1153 546 170 -707
1390g07K18O01n19r31J894R1l24J86P04q48j581J406l88m15L10J233o33j190J452
$$ -707 -489 112 -407 -1338 556 647 323 509 1213 365 -1216 190 -198 -613 -303 930 297 -893 559
1409E59o32l56j88J385m26j312J403o00l88m05J762P0j013J633o41q27j000J012
$$ 559 -73 -429 -617 768 342 -970 433 -167 -555 -960 802 872 -141 1492 851 24 -976 36
1427C6m88r17J500n5k52o64J456m25o20J225L15l12j336J480j357j087R47L59
$$ 36 -452 -1369 131 76 -176 -840 616 191 -429 796 1111 799 -537 943 -414 -1501 -554 -195
1445a95K55r12K109j029q03O54M5L40j275J926o89q95L49K22m8j206K085o14o15
$$ -195 60 -852 1257 228 -575 79 124 464 -811 1115 426 -469 -120 102 54 -1152 933 319 -296
1464b96K77K36n72j109J963n76Q5J97Q65m49j438J698q70k36m48J181l82j560
$$ -296 -19 217 -355 -1464 499 -77 8 205 1070 621 -817 881 11 -225 -673 508 126 -1434
1482a434J954p83n4k37J424j68j214J592j185j51p55J099m5q41J612n00lq74J479
$$ -1434 520 -263 -317 -554 870 702 -512 1080 -105 -256 -1011 88 43 -798 814 314 311 -563 916
1501I16o06j176J530n35m48q59J680q76n91J420M4K84j251J710r24q99M53l5L32
$$ 916 310 -866 664 129 -319 -1178 502 -374 -965 455 499 783 -468 1242 318 -581 -128 -163 169
1520A69j695K127o95n43J056q7L06j269J840j139n92P36m14K9j114J823m67m62
$$ 169 -1526 601 -94 -637 419 332 638 -631 1209 70 -522 214 -200 -171 -1285 538 71 -391
1538c91M86O87l16j443J888o37o84k09J031l63j221K056q79K56m77N57M4j289
$$ -391 95 782 466 -977 911 274 -410 -619 412 49 -1172 884 5 261 -216 341 385 -904
1556i04J593r65L40n37P48k5j362J985o43k31k33J122r43j355J724o16J41l72
$$ -904 689 -276 64 -473 275 250 -1112 873 230 -1 -234 888 -55 -1410 314 -302 -161 -533
1574e33J506k87j161R88k94K89j368J393k79j312R25l53J96o26J704m38l65J222
$$ -533 973 686 -475 513 219 508 -860 533 254 -1058 -133 -486 -290 -916 788 350 -15 1207
1592A207p19k75r20J229q74m29Q79J23j9j453J945m34q11P21N61q1j742J662p94
$$ 1207 488 213 -707 522 -352 -781 98 221 202 -1251 694 260 -551 170 731 650 -1092 570 -224
1611b24o26O23K42N66p43J148q12k38j40O6J54r96J615o32n89J73R47m47j006
$$ -224 -850 -227 15 581 -162 986 174 -64 -204 -138 16 -980 635 3 -586 -413 534 87 -919
1630i19K289o72o40j53M91m50j331J323qK20n25P99J95j319Q06l9N8l99J045o08
$$ -919 1370 698 58 -95 396 -54 -1385 -62 -70 150 -375 424 619 -700 106 67 125 -274 771 163
1650A63q40J226q51m9O8J239p59p64J141q17k14q48J508L03j218J183M37m09j251
$$ 163 -677 549 -302 -351 -283 956 197 -567 574 -243 -457 -1305 203 506 -712 471 908 499 -752
1669g52J275P3j102O84M4l26o77N73l76K17O07P8K92o12Q26q02o33M40M84l99
$$ -752 523 596 -506 178 222 -104 -781 -208 -584 -367 240 318 610 -2 824 22 -611 -171 313 -86
1689h6r56K010o82j152P84O25l24r20J365k16p27k81L15M37q93P80M50j20m23
$$ -86 -1042 968 286 -866 -82 543 219 -701 664 448 -279 -560 -245 192 -701 79 529 409 -14
1708a4M34j60r28J044n13m57M84M69p00l65J365m51l74K44P45l28j169O56L81
$$ -14 420 260 -668 376 -137 -594 -110 359 -341 -706 659 208 -166 78 823 495 -674 -18 363
1727C63o64p58J431Q2j143Q32L77l83n58P42l21l53O34m43J73j87L06j05l23O63
$$ 363 -301 -1059 372 454 -689 143 520 137 -421 321 0 -353 281 -162 11 -176 130 25 -298 365
1747C65J15m96n25J065m11j149R86O79r10l34J372l50o90K94L43j79p58N40J98
$$ 365 480 -16 -541 524 113 -1036 -50 629 -281 -615 757 407 -283 11 354 175 -583 -43 155
1766A55l23k09N31K32p55P85K7p12L50L80p97k89R65n89m48O31N68l83l37P15
$$ 155 -168 -377 154 386 -369 416 443 -269 81 461 -336 -625 340 -249 -697 -66 502 119 -218 497
1786D97Pn76m25R31j55j183Q38M54p02j51R26k85n63Q17j09l29L9P1l50k07L84
$$ 497 504 -72 -497 434 279 -904 -66 388 -314 -465 461 176 -387 430 321 -8 31 102 -248 -455 -71
1807g1K36j05k28P70k83r24O03N10q51k54J253n53p73O72J74l57m6P44m6l56j63
$$ -71 165 60 -168 602 319 -605 -2 508 -343 -597 656 103 -670 2 176 -181 -227 517 471 115 -48
1828d8J00j63o07P34K67n51J87N81o93m09J115m11m77O48K96o55k43N66k49k13
$$ -48 52 -111 -718 16 283 -268 -81 500 -193 -602 513 102 -375 273 569 -86 -329 237 -12 -225
1848b25P2O39r6q48M43J64p23o2J093l35m47R14k24n66J81M51n95j9M56k52j88
$$ -225 -153 486 390 -458 -15 149 -574 -636 457 122 -325 589 365 -201 -20 431 -164 -183 273 21 -167
1869a67l86N25j36m38P67N58n05m71R60o49q18R03J51n18K4O41n64k16L02O9M6
$$ -167 -553 -28 -164 -602 165 723 218 -253 707 58 -760 143 294 -224 -200 441 -123 -339 -37 32 78
1890G8k34N88j13n53m4M57m24l70J296l50o15N19J70p88j14Q78n02o2J85K11j93
$$ 78 -156 432 319 -234 -278 179 -245 -615 681 331 -284 235 405 -383 -497 381 -121 -183 2 213 20
1911B0n42N74J02k28p2Q61m42q40Q62l15n00M09O96o37j91O57o17r5O3M49j06
$$ 20 -522 52 154 -74 -146 715 273 -567 295 -20 -520 -111 585 -52 -243 414 -203 -298 -235 214 108
1932A08k96M08O7l35m41J016l29o51Q59l3p13j49Q10p05n9P49k17nj73M79k87
$$ 108 -188 220 287 -48 -489 527 198 -453 406 373 -340 -489 321 -384 -443 306 89 84 -89 390 103
1953A03k37J56J87j97o40J012l81o15O57L21n34j12J057p62k25M07j38j74k56
$$ 103 -134 22 209 12 -628 384 3 -612 45 366 -168 -280 777 15 -210 197 59 -115 -371
1972c71N62k18q9p0N29j40o74R48k60n42J96N83o70k63J014p02q4K81K02k77j80
$$ -371 191 -27 -116 -186 343 203 -471 477 217 -325 -129 454 -216 -479 535 -167 -251 30 232 -45 -225
1993b25N59l32k5l34O29j66o82R16j6m92p5Q00p21l85R32m44j16R4L94l67j12
$$ -225 334 2 -23 -357 272 106 -576 340 324 -168 -243 557 -164 -549 383 -61 -177 -83 311 -56 -168
2014a68L80j32R7m71P28k76o49N28J39m82k07J172p16k36P42k86l18j61O43n18
$$ -168 212 80 177 -294 434 158 -491 37 176 -306 -513 659 -57 -293 449 163 -155 -316 327 -191
2034a91K1K12L0R3p09Q47j16m45L53L70m14n80R56o83l44O32J31k60N5O29n87
$$ -191 -170 42 72 165 -544 303 187 -258 95 465 51 -529 427 -256 -600 32 163 -97 -42 587 0
2055@Jo3K86q4n25P37k55m25j87Q01l92m90J305n04k57J41J82m54k19O84m03K36
$$ 0 1 -62 224 140 -385 352 97 -328 -515 286 -106 -596 709 205 -52 89 271 -183 -402 282 -121 115
2077A15j91K44j14n45N35P7j59k05Q67o41o04R39l09k62J98P00o03j91M17l76
$$ 115 -76 168 54 -491 44 121 -38 -243 624 -17 -621 318 9 -253 -55 645 42 -149 268 -108
2097a08J7l58N89k2l15K24K02k15n52J044m44l04O53j92l99j81P26p22N2N63j86
$$ -108 -91 -449 140 118 -197 27 229 14 -538 506 62 -242 411 219 -180 -361 365 -357 -305 258 72
2118G2J06l90M88k01m90J80M97j94n19R16k78n85L25M58m63j3O50o92P0r8K6l0
$$ 72 178 -212 276 75 -415 -235 262 68 -451 465 187 -398 -73 385 -78 -91 559 -133 -63 -161 -135 -165
2140a65j66N85j94N8j68M73l16o76J036k54n61K80M72p00k60P85k78j4K7L65j35
$$ -165 -331 254 60 118 -50 423 107 -569 467 213 -348 -68 404 -296 -556 229 -49 -63 -36 329 194
2161A94l51J71J8j7m65O95r0m96O04j55m10J21O11n74l7O23m52k86J07M26k78
$$ 194 -157 14 32 15 -450 245 155 -341 263 108 -302 -181 430 -144 -181 442 -10 -296 -189 237 -41
2182d1q3K26K45k70n88Q82k06o04M11L70m04l32P84m60j65M32j74k7n1J62k38
$$ -41 -124 102 347 77 -511 371 165 -439 -28 342 -62 -394 390 -70 -235 197 23 -4 -55 107 -131
2203a31L0O0J83j42l03O46j78m86L43M88p38k68R22m65l09L54K37k27j92L39%
$$ -131 -101 -41 142 0 -303 343 165 -321 22 510 -228 -496 426 -39 -348 6 243 16 -176 163 163
2224A63q7k81L52J3m69L43J36l88KN53m89n7P14m38k65K39J96n15MM07j10q3j87
$$ 163 76 -205 147 160 -309 34 170 -218 -216 337 -152 -209 505 67 -198 41 237 -278 -274 133 23 -60 -247
2247b47N39r5n98M39L71m81k00O87m14m36M46Pk26J97K93l17O2O9o7k8j69L94
$$ -247 292 197 -401 38 409 -72 -272 415 1 -435 11 18 -208 -11 282 -35 27 96 29 1 -168 226
2269B26j05l40K43L06n83k05Q38l39l99N66J49n59j1L89k25rL9K45n9l70K35M2
$$ 226 121 -219 24 330 -253 -458 380 41 -358 208 357 -202 -213 176 -49 -58 -19 226 167 -203 32 74
2291G4l04k4N24k97k45O49l18m55M28K31m30J47M25l17k55J6J98j07j95L25L07
$$ 74 -230 -254 270 -27 -272 377 59 -396 32 263 -167 -20 405 88 -167 -151 47 -60 -255 70 377
2312C77m08k41N81l47l61N64Q6l88J49K76n08kL09j05J5O5J81j91k89J14K47l16
$$ 377 -31 -272 309 -38 -399 165 251 -137 12 288 -220 -222 87 -18 -3 62 243 52 -237 -123 124 -192
2334a92j20P21k67m81M44J56n64J35N57l47p9J59o2j91j09K24M5p6J5L30k79l15
$$ -192 -312 409 142 -339 105 261 -303 -168 389 42 -37 122 60 -131 -240 -16 29 -47 -32 298 19 -296
2356b96N24j43l72M18K81o05J3M57m10j64K99J62j96p2K08J8k28j52M83j55l30
$$ -296 228 85 -287 131 412 -193 -180 277 -133 -297 2 164 -32 -104 104 122 -106 -258 225 70 -260
2377b60M60M5m83J08L84m95M8M58k48j18J45J04k82J6J84P3j48j56N03k78m14
$$ -260 200 245 -238 -130 254 -241 -193 265 17 -101 44 148 -134 -118 66 139 -9 -165 338 60 -354
2398c54M19J82m69N7N87m67k02L86q9k07J17J77j38m0LJ33j54j79M01j01k81K43
$$ -354 65 247 -222 -165 422 -45 -247 139 50 -157 -40 137 -1 -41 -38 95 -59 -238 163 62 -219 24
2420B4L02n50mN90m63j22L58N9l51M3K81k11j6l1L00j39l20M12Ml47Q5M11m50
$$ 24 326 -224 -228 362 -101 -223 135 194 -157 -114 167 -44 -60 -91 209 70 -250 162 166 -181 -96 315 -135
2443a35j24N40k99j98K91J25l54Q4K17j52o0k6K80j75k44K82J21l78qO17m49j71
$$ -135 -259 281 -18 -216 75 200 -154 -70 147 -5 -65 -91 189 14 -230 52 173 -205 -213 404 -45 -216
2465b16M50j68l02J35L18l52Q2J68q1n4j43L26j12j81J92K21l64j67N53m11j97
$$ -216 234 66 -236 -101 217 -135 -53 115 34 -20 -163 163 51 -130 62 283 -81 -248 305 -106 -303
2486c03M41N9l52J01L16l98L1R6J17q9j45L08j08k29J3L47l11j47N93k81k77K33
$$ -303 138 197 -155 -54 262 -136 -105 -9 108 19 -126 182 74 -155 -142 205 -106 -253 340 59 -218 15
2508A5J32m33J41L96k72N7jJ13k04j28K75J0j42q1M38l82k83N17j40k27K18L48
$$ 15 147 -286 -145 251 -21 36 35 148 -56 -184 91 101 -41 -122 316 -66 -349 168 28 -199 19 367
2530C67m45j9K79k79j2K6K54j53j04J34L3k16j40N15k69k04M33k7l64M7L75m22
$$ 367 -78 -97 182 -97 -109 -83 171 18 -86 48 81 -135 -275 240 -29 -233 200 173 -191 -144 231 -191
2552a91P2L24m7j43r1J77k11m7R7K57j79k03M49k88k42K96K09l30L8M32m94n0
$$ -191 -119 205 158 15 -76 101 -110 -157 -60 197 18 -185 264 -24 -266 30 239 -91 -53 379 -115 -165
2574a65J70j0j08K0K95j48r1o8K58k14k18M96j08k73J23K97m45j9M37k72k2J36
$$ -165 5 -5 -113 -93 202 54 -37 -105 153 -61 -279 217 109 -164 -41 256 -189 -208 229 -43 -65 71
2596G1J11k51n2J52p5l3k2L70k35k11L16k6k94P5M54m50l7L27k09j35L9K72k16
$$ 71 182 -69 -121 31 -44 -77 -99 271 36 -175 141 115 -179 -104 350 -100 -137 190 -19 -154 -115 157 -59
2619e9KJ44jq3j88L41j70j77K45J08k88k2M14l87n5L08m8k22J05K24k98K6O2J32
$$ -59 -57 87 86 3 -185 156 -14 -191 54 162 -126 -148 266 -121 -176 132 84 -138 -33 191 -107 -81 -19 113
2643A13j29j38L82j24k62J12K77l66m5M27k64j04J79J01k73Q4J78k09N4l6J52
$$ 113 -16 -154 228 104 -158 -46 231 -135 -180 247 -17 -121 58 159 -114 -30 148 -61 -7 -43 109
2664A09j63j06K78r0j82Q7L31l55r3M39k03k52J88J78l24M5K01m9o2n7K32j42
$$ 109 -54 -160 118 28 -154 -67 264 -91 -184 255 52 -200 -12 166 -158 -113 88 39 -23 -80 152 10
2686A0j30J59R8j94m7L39l14r9L17q2k03J67K13l44K8J57n2j55K3K72j33j46J14
$$ 10 -120 39 137 -57 -104 235 -79 -178 139 57 -146 21 234 -110 -82 75 23 -132 -109 163 30 -116 -2
2709bK02l23q4M40k21j62K13N7k82L5K42k09N4J37J8j31k8J30r1j16J07K39l00
$$ -2 200 -123 -207 233 12 -150 63 120 -162 -127 115 -94 -40 97 115 -16 -44 86 -5 -121 -14 225 -75
2732g5n9L60k30k30K39K14l26N6K63k14j32P5J26r4m7J60M4j78o7K33k10r1K89
$$ -75 -134 226 -4 -234 5 219 -107 -51 212 -2 -134 -59 67 -27 -74 86 130 -48 -115 118 -92 -183 106
2755A06k7k11J29J90l75N9K82j23o3Q3J27k08j34J60O7j62QL16j53k38K19O2k84
$$ 106 79 -132 -3 187 -188 -129 153 30 -33 50 177 -31 -165 -5 62 -100 -92 224 71 -167 52 114 -170
2778a70J13K66k39j9J39o8j48N8J78j30oP7O1k13p7K88j36j80K74J44l29K7K63
$$ -170 -57 209 -30 -49 90 22 -126 -68 110 -20 -26 51 112 -101 -178 110 -26 -206 68 212 -117 -90 173
2801A73k24r8J78R6j73QJ23j06q5K7J77r2p1K55j21k22J44J47k66L5L05j64j77
$$ 173 -51 -149 29 125 -48 -40 83 -23 -108 -81 96 4 -67 188 67 -155 -11 136 -130 -95 210 46 -131
2824a31J60P1k13QJ87J7j56qJ94j71j35K13O5j95N1K41k57p0K32j12j15J32J06
$$ -131 29 100 -113 -105 82 99 -57 -65 129 -42 -177 36 101 -94 -43 198 -59 -129 103 -9 -124 8 114
2847A14j61rJ25k4j31L5K20j30j50J73R2l02J7L23k19j04K22K7j92K2J56j26l4
$$ 114 -47 -56 69 45 -86 -51 169 39 -111 62 154 -148 -131 192 -27 -131 91 118 -74 -52 104 -22 -56
2870e6O8N2j03n5J74o7j26J27J22k33lK72k01j32J93O6k26N1J95j08q4O5J30j46
$$ -56 12 64 -39 -94 80 13 -113 14 136 -97 -100 172 -29 -161 32 98 -128 -77 118 10 -74 -9 121 -25
2894b5q0J75J1j77L5K31k15o1K27r0j38J32J04k02L5J44j11p5N1J36j30p0J72
$$ -25 -105 70 81 -96 -61 170 -45 -106 121 31 -107 25 129 -73 -38 106 -5 -80 -29 107 -23 -93 79
2917G9K1k06MK51k00j17K58Pk11Q3J55j87k5J27L6j30K6J20j00p5O5J08j51J1
$$ 79 100 -106 -102 149 -51 -168 90 97 -114 -31 124 -63 -88 39 75 -55 -29 91 -9 -84 -19 89 -62 -51
2941e1K55j89j11J48K6k26P2K40j85n1R9M1j57%J95m8j02L4J24j88q2K18m3j60
$$ -51 204 15 -96 52 78 -148 -76 164 -21 -72 27 68 -89 -89 106 58 -44 -10 114 -74 -156 62 19 -141
2965a41J58J16k28L1J34r9p5J03J15j51oJ19m9j25K1K29j82l9J93m8j90N9J77
$$ -141 17 133 -95 -64 70 -29 -104 -1 114 -37 -43 76 27 -98 -77 152 -30 -69 124 76 -114 -55 122
2988A22j95J3J87o6j01J0J09j46j6J37L6j34l0J80j61p8J68O9j91O5J70k08n9
$$ 122 -73 -60 127 61 -40 -30 79 -67 -83 54 90 -44 -74 106 -55 -133 35 104 -87 -22 148 -60 -119
3011a19J26L3j37O9J59j30l6K6R5j56k9K27j01r3Q8P9k11L0K07j27l7J18K5j72
$$ -119 7 40 -97 -28 131 1 -35 -9 86 -70 -99 128 27 -66 22 101 -110 -80 127 0 -37 81 106 -66
3035f6jJ12o8n3O5J36j64n8J58n9j12J05J63k23OJ48j06r9O8J46j54K7J00l5j01
$$ -66 -67 45 -23 -76 -11 125 -39 -97 61 2 -110 -5 158 -65 -59 89 -17 -116 -48 98 -56 -29 71 36 -65
3060f5nJ61j47k6J58J2j67M0J80j91k2J61k2j28L6J19j69OQ2L3q9K2J30j14o8
$$ -65 -70 91 -56 -82 76 88 -79 -39 141 -50 -72 89 67 -61 -25 94 -75 -69 13 46 -43 -21 109 -5 -73
3085g3P2Q6j88K9J96j68m0J10L4j40M6J50j33k4N9N6j45nJ51o7q7P8J40j98LJ78
$$ -73 -1 85 -103 -74 122 -46 -86 24 58 -82 -36 114 -19 -43 16 72 -73 -78 73 6 -81 -3 137 -61 -58 120
3111A20j05q4Q7P8j61K4J19p7n8N4R9j32k0J14j0j39N9J35j86lJ48k6j33Q6J28
$$ 120 15 -69 18 96 -65 -41 78 1 -57 -3 96 -36 -56 58 48 -91 -32 103 -83 -86 62 36 -97 -11 117
3136A17j87K2P6k0q5J7J59j17m5R9K9j19J5J58j21o7J34j0j59P2J05r9j0J11K3
$$ 117 -70 -48 28 8 -77 -60 99 -18 -63 36 65 -54 -39 119 -2 -69 65 55 -104 -32 73 -26 -36 75 98
3161I8j56K1J00q7n1P1J02j69kJ70j14o1R6P1j44K3J19j19p3P8O5r8K7J08m6q5
$$ 98 -58 -37 63 -24 -75 -4 98 -71 -73 97 -17 -78 18 89 -55 -32 87 -32 -105 -27 38 -60 -33 75 29 -56
3187e6N3Q9j48lJ67o4j25R3O3j60K6J49l9q8P8N3j27m4R1K9r9M9J21j48pP5mr4
$$ -56 -3 86 -62 -65 102 38 -87 6 69 -91 -65 84 45 -43 35 88 -39 -83 8 37 -62 -13 108 -40 -47 28 24 -70
3215g0N0J26j64kJ05n6o6K6J33r5l1J09Nj42JJ35r0n0J18M1j39L9J03r6m6Q6M6
$$ -70 -20 106 -58 -60 45 -11 -77 -51 82 -13 -44 65 70 -72 -71 64 -26 -76 42 83 -56 -17 86 -10 -56 30 76
3242G6r6%R1j05n7Q6O7p9JJ23r4j13R3O6j34L0J29p5p8N4P5j24J9J13m2o6K4P7
$$ 76 -20 -20 71 -34 -91 -5 62 -17 -16 107 13 -100 -7 59 -75 -45 84 9 -69 -15 60 -64 -45 68 26 -40 -16 61
3270F1j24l0J39j6q5R1N7j34j7J20l4r1Q7P3j23k8Q4Lr2L2J37j07o0J05j7j20
$$ 61 -63 -93 46 30 -55 36 93 -41 -58 62 28 -63 24 97 -26 -54 30 33 -59 -27 110 3 -57 48 31 -89
3296h9K2J32r7k2J11j9j00L6R2r1k8P7Qj03K4J12p5o7J12N6j28J2J22j01o8R8
$$ -89 -67 65 -32 -54 57 38 -62 -26 66 -25 -53 24 32 -71 -47 65 -10 -77 35 91 -37 -25 97 -4 -72 26
3322B6K7j03NJ03m9n1N9N0p7k2Q5m2p3P1N3j29J4J10n0p0Q3M7j24J3J00m4q7N1
$$ 26 53 -50 -45 58 9 -42 17 67 -10 -32 53 11 -62 9 62 -67 -53 57 7 -63 20 67 -57 -44 56 12 -75 -24
3350b4Q6q6m2J13nq4J7R6q3l9R3rq9O1N1q1jO2Kp1K0R7j01n2J12%j00L0J27j08
$$ -24 62 -24 -66 47 42 -42 -25 71 -12 -51 42 33 -56 5 56 -25 -26 36 38 -33 -13 84 -17 -69 43 43 -57 -27 100 -8
3380ho3J08lj04L8Q7o4m3M5L0q0MJ01m7m4N2N8j18jJ02o3l8Q6L5j06J3R0p1m3
$$ -8 -71 37 34 -70 -32 55 -9 -52 -7 23 -57 -53 48 1 -43 9 67 -51 -52 50 -13 -51 35 70 -36 -23 67 -4 -47
3409d7O0O1r7k5Q8l1q3O0R0q9j8J02m3r1K7P7q6J0Q3l5o1J3O1o0pP8Rq9K3O6j02
$$ -47 13 74 -23 -48 40 9 -74 -14 76 -13 -31 71 28 -63 -36 41 -45 -35 48 13 -48 -35 26 -34 -41 37 46 -43 -20 46 -56
3440e6j5J02J6r1N0P4j01k6M8L1o2K9P1o3m6L3L8p6J1J24r0n8P1J0r9L2R4o0k8
$$ -56 -71 31 47 -44 6 80 -21 -47 1 32 -30 -1 70 7 -39 -6 32 -44 -33 91 1 -57 14 24 -75 -43 51 -9 -37
3469c7N3K5q9kQ5m5n0O0N5j03j7J09m7n9P6N7j03LQ1n2l6K7O4p8J3O0j8p3J9Q9
$$ -37 16 41 -48 -50 35 -10 -60 0 55 -48 -65 44 -3 -62 14 71 -32 -29 52 0 -36 -9 55 -23 -10 50 32 -41 -22 67
3499F7r2j5R6j7q8J5Q4r9OQ6k6m2rP2p1j8O3J5p3K1Q8p6m4Q5Qp4K5Q4q0m0N7K1
$$ 67 -25 -40 56 39 -49 -34 50 -49 -43 43 17 -25 -34 38 -33 -51 12 27 -46 -25 63 -13 -57 28 36 -38 -13 71 -9 -49 8 29
3531B9o5K7P8o2k9K8M5q5KQ9n4m2M2O0j05J5Q4o8k6N1K5q3J5N7l5m5L1N9p7rQ3
$$ 29 -36 -9 69 7 -22 6 51 -34 -32 57 3 -39 3 63 -42 -27 57 -11 -37 14 39 -44 -29 28 -7 -52 -21 38 -39 -48 35
3562C5j5p6M8O2q3k1Q1j4n2M6M0o4jM5ln9J0R0q0j6M9J7p4J5R1r5j1N8qo6L2O6
$$ 35 20 -56 -8 54 -29 -50 31 17 -35 11 51 -13 -14 31 28 -31 -21 69 -11 -27 22 39 -35 -20 71 -24 -35 23 15 -51 -19 47
3594D7p5lL7Qm2kO6m8l4O3K1p7J0P5n6l2P3J5o9K3M7n3k4L0M2o9OP5k9n0L4L9
$$ 47 -28 -31 6 14 -28 -30 36 -12 -46 17 38 -39 -29 46 -10 -42 31 46 -23 0 47 -6 -30 0 42 -27 -21 54 25 -25 9 48
3626D8p7LP6l8n0L8K9q0K9N6j4m2K8K1o9oO1Ln2K4O0q1mO8j8n9M5N6o7nM0on6
$$ 48 -29 -26 50 12 -38 0 29 -51 -22 34 20 -22 6 27 -42 -48 13 16 -36 -12 48 -33 -37 31 13 -46 -1 55 -12 -17 23 17 -39
3659c9K6N7m1qM2J3q6jP7o0j2O2Jo4QN6o0KN1Kl9j9M1l4l7N4N3p9%P4m8m5O8J9
$$ -39 -13 44 3 -5 37 50 -36 -37 40 -20 -32 30 31 -33 -25 31 -29 -27 24 26 -13 -32 9 -25 -62 -8 45 -34 -34 40 -8 -53 15 34
3693C4o5J9N8m7k8K6K6n3J1O6j6n1J6L9o5rQ1k3m7K9L8p4RO1l8k8L2L0n7j7N3
$$ 34 -31 -12 46 -1 -29 -3 23 -30 -19 47 31 -20 -4 35 -30 -39 42 19 -28 1 39 -35 -26 35 -3 -31 1 31 -26 -43 10
3724A0mn8L1N2m3k6N4po2K6O4n5oN0j4m0K0L8l5j0K8J9n2LO0m3m2O7J4n6J3M1
$$ 10 6 -52 -21 31 -12 -38 16 9 -53 -27 37 -18 -24 26 12 -28 -8 30 -5 -15 13 32 -20 -17 43 0 -42 25 39 -17 -4 37
3756C7m5l2N5om0J1M3l8j8K4K7n4PO3k5p2M8L9o6J6N4k5l2M5K0m6kL4j2k6MM6
$$ 37 -8 -40 15 9 -31 -20 23 -15 -33 -9 18 -36 -29 34 9 -63 -15 24 -42 -26 28 3 -29 16 36 -10 -12 22 10 -16 -12 34
3788C4l3l3O2j4l1J6L9m4j1M4j9m4K9K5m3j9N7pl6J2M5l8l7M4J6m3QN6n1rM2l
$$ 34 1 -32 30 16 -15 1 40 -4 -15 29 10 -34 -5 20 -23 -42 15 8 -28 -16 29 -9 -46 -2 14 -29 -21 35 -16 -25 17 14
3820A4l4J1N0m4j9L7pk6JN7k9l3M9J1o2LN9m7j6N3jn3mM2k2j4L0J3l8j3K8om1
$$ 14 -20 -9 41 -3 -22 15 8 -18 -17 40 11 -22 27 38 -24 -21 38 -9 -25 28 27 -26 -30 12 -10 -24 6 19 -19 -32 -4 -10 -51
3853e1K9N4n2j2N8l1l4K8K4l9QM0k2k0J0L4j9k1M2Nm5%N1m7k0N1%l8J3L6m8JK7
$$ -51 -22 32 -20 -32 26 -5 -39 -11 13 -26 -18 22 0 -20 -10 24 5 -16 26 31 -14 -14 37 -10 -30 21 21 -17 -4 32 -16 -15 12
3886A2j7j9NK6k4j3K0J3k6%N7m1l4M7Mn0LN6l2j6M1Qm6J4K7ok6K1K3m1j2M1pk6
$$ 12 -5 -24 -19 7 -17 -30 -10 3 -23 -23 34 -7 -41 6 10 -40 -37 19 -13 -29 12 20 -26 -12 15 9 -17 4 27 -14 -26 15 8 -18
3920a8K5K7n1KL4k7j1J2K7m0JL6k5k4K2K9l7j3L8j0l4K2L3k0j8L9lk9J0K5m1n
$$ -18 7 34 -17 -15 19 -8 -19 -7 20 -20 -19 17 -8 -32 -10 19 -18 -31 7 -3 -37 -15 18 -2 -20 19 16 -13 -3 22 -19 -24
3952b4L8Pk1oL5l5j2K9J6l5MK9l7kL0ml5J2K9l4NPQk2j7M8k1j9K6J8n2J1L6j2
$$ -24 14 21 0 -6 29 -6 -18 11 27 -8 -4 25 -12 -14 16 12 -23 -11 18 -16 -11 -4 4 -18 -35 13 -8 -27 -1 17 -35 -24 12 0
3986@j6J8J6l2MK5j9j0J9K6j7l0L6qj9J1L7n0mM0j8l2J9K7l4KJ9j1j9OK3k1j1
$$ 0 -16 2 18 -14 -10 15 -4 -14 5 31 14 -16 20 12 -7 4 41 -9 -13 27 9 -23 -4 23 -11 -9 10 -1 -20 -14 9 -12 -23
4019b3K1Ml2RL4j8k0L2J7n5K3J9j5nJ7J0l0PL2j0j6JJ7j9j9N8k4l1L3nl0K1J8
$$ -23 -2 2 -30 -21 13 -5 -25 7 24 -31 -8 11 -4 -9 8 18 -12 -5 27 17 1 2 19 0 -19 39 15 -16 17 12 -18 3 21
4052B1k5j2J7%j9nL3rk1oL5k4rM3k6j3J5J5m4J7K8j6rJ6J3j0k0K2J0k4PK5k6j8
$$ 21 -4 -16 1 1 -18 -23 10 1 -20 -26 9 -15 -24 19 -7 -20 -5 10 -34 -17 11 -5 -14 2 15 5 -15 7 17 -7 0 25 -1 -19
4086a9L8Mm2J3L0k4j4K6j1j6jK5j2j7K2Pk9lK5j8j2J8K2m0LM5l3nK7J1l3%K2r
$$ -19 19 23 -19 -6 24 0 -14 12 1 -15 -16 9 -3 -20 2 9 -20 -23 2 -16 -28 -10 12 -28 -25 20 -13 -18 9 20 -13 -13 9 0
4120@j4J7Rj6j7L8Pm1K9Kk1jK8j7k1J0J3j7oL0j1j3LQj9j1L5j0j2JK3k3j0K7p
$$ 0 -14 3 12 -4 -21 17 24 -17 12 14 -7 -8 20 3 -18 -8 5 -12 -18 12 1 -12 -9 -1 -20 -31 4 -6 -18 -17 6 -17 -27 0 -7
4155goJ1J9k8PJ1%j4%K7oj7K0%j5MK0k2j3L4j9j8LK6j9j1J6%j0qJ5oj4OJ7j3q
$$ -7 -13 -2 17 -11 -4 7 7 -7 -7 20 14 -3 17 17 2 6 26 4 -9 25 6 -12 -9 17 -2 -13 3 3 -7 -15 0 -6 -20 -14 3 -10 -18
4192a8K1rj1K1jj5nK6j0ojJ9qj1J7kk2J6J5j3qL3%m0J6J1k2qL2k2mJJ6j5j3J7
$$ -18 3 -6 -17 4 3 -12 -17 9 -1 -7 -8 11 3 -8 9 7 -15 1 16 3 -5 28 28 -12 4 15 -7 -15 17 -5 -9 -8 8 -7 -20 -3
4228cMj7j0L9j8j8J6Qk3OK6k2rL5nj5j3K8okNlkj8L7nk4K4Lj1j1J7%k4J8ojj7
$$ -3 1 -16 -26 13 -5 -23 -7 1 -22 -16 10 -12 -21 14 9 -6 -19 9 3 1 6 3 1 -17 20 15 -9 15 18 7 -4 13 13 -11 7 1 0 -17
4266a7K4j0k%Nj3rK0nrKK0j7oK2nk1J3J9lj0J3kj7OROj4K2%j9qJ8pj6K4%qqJ3
$$ -17 7 -3 -5 -5 0 -13 -22 -2 -7 -16 -14 6 -11 -17 5 0 -21 -8 11 8 -2 11 9 -8 -2 7 13 -1 21 21 2 -6 12 5 -11 13 13 5 -3 10
4306A0j2j1J1Ljj3J6j3j6J5J4j5JJ7j3j6J5J1k6PK5qj8J1K1k2QJ5Lj6QPj2rJ7
$$ 10 -2 -13 -2 1 0 -13 3 -10 -26 -11 3 -12 -11 6 -7 -23 -8 3 -23 -16 9 1 -17 -6 15 -7 1 16 19 3 11 18 6 -3 14
4341A4J3k5QJ4j8qJ5j0j8RJ2j4kQnjnK7j6k2K6pqRJ3j0nJ7qj7MJ8j0oJ5J1k1o
$$ 14 27 2 10 24 6 -2 13 3 -15 -6 6 -8 -10 -2 -7 -8 -13 14 -2 -24 2 -5 -13 -4 9 -1 -6 11 3 -14 -10 8 -2 -8 7 18 -3 -9
4379iK4ppJ3Pk1RPj3j1PK0j6j1J1lj1oJ5j1j4L2j2j5J5J6k5JK7j6kmOjMkJ3lo
$$ -9 15 8 1 14 21 0 9 16 3 -8 -1 19 3 -8 3 0 -11 -17 -2 -13 -27 5 -7 -22 -7 9 -16 -15 12 -4 -6 -10 -4 -5 -1 -3 10 7 1
4418AK3pj8J6onQJ0j1j8K1j1qLPj4j3J1J2j4kK9j9j9J9J3l5RNJj5J7N%j6J7J2
$$ 1 24 17 -1 15 9 4 12 22 11 -7 14 3 -5 -2 5 -9 -22 -11 1 -13 -15 14 -5 -24 -5 8 -27 -18 -13 -12 -27 -10 -5 -5 -21 -4 8
4455Hl0K2Nnj1J4J2k3QJ5j4kK2j0j5OJ1j4OOj5mpJ6mj9K7lj9PJ7k9%J4jj3PK5
$$ 8 -22 0 5 0 -11 3 15 -8 0 15 1 -1 21 11 -4 2 13 -1 5 11 -4 -8 -15 1 -3 -22 5 2 -17 -10 7 -22 -22 -8 -9 -22 -15 10
4493A0j6qJ3oJj5L1onJ6Jj6MJ8j8j2K4Kqj0J1qpJOroNLk0kJ9j9LK0lk3QJ8k4R
$$ 10 -6 -14 -1 -7 -6 -21 10 4 -1 15 16 0 4 22 4 -8 16 18 10 0 11 3 -4 -3 3 -6 -12 -7 -4 -24 -26 -7 -26 -23 -3 -6 -29 -21 -3 -27 -18
4534a8J0jj4J0J3j6kJ5J2j6OJ7pj0KJ6k3RJ2Jj2PPk6N%J1k7J7KJk3K0qj5K0Ok0
$$ -18 -8 -9 -23 -13 0 -16 -18 -3 9 -7 -1 16 9 -1 1 17 -6 3 15 16 4 11 18 -8 -3 -3 8 -19 -2 0 1 -22 -2 -10 -25 -5 1 -19
4572a9OR%j9K6Kj7JQlj0PJ2kkRjqLJ2j0mJ4nk0RRoj9J5J7k0mJ2j0j5J6Pk8J4R
$$ -19 -13 -4 -4 -23 3 5 -12 -11 -3 -6 -16 -9 3 1 -1 8 7 -1 2 14 4 0 14 9 -11 -2 7 1 -18 -3 14 -6 -10 2 -8 -23 -7 0 -28 -14 -5
4613ej6KJ7Kj8RQNmNjrJJ0%nJ0jkoROk5J9Pk7PJ1j6nK0pj3kMJ3j7QJ0k1%J8j1
$$ -5 -21 -19 -2 0 -18 -9 -1 4 0 5 4 -5 -4 6 6 1 11 10 8 2 11 17 -8 11 18 -9 -2 9 -7 -12 8 1 -12 -14 -10 3 -14 -6 4 -17 -17 1 -10
4656a0j8J9Oj0JOJjMRj1j3J2J8k1J5J4j5j0K0Kk8J0Rj3JJ8j5j5J3J6k6mJ7Lj4
$$ -10 -28 -9 -3 -13 -12 -6 -5 -6 -2 7 -4 -17 -5 13 -8 7 21 6 -4 16 18 -10 0 9 -4 -3 15 0 -15 -2 14 -12 -16 1 4 -10
4692a0qK8k4oJ4Qk5J3Rmj7J4K0k1JOjLMLJj6K9ok0K7Lk9J4J7j1j6MMj0oJ0%j0
$$ -10 -18 10 -14 -20 -6 2 -23 -10 -1 -5 -22 -8 12 -9 -8 -2 -3 0 4 7 8 -8 21 15 -5 22 25 -4 10 27 16 0 4 8 -2 -8 2 2 -8
4731hQnqj3K7oqRpj0OMJj3L2moj0J7nmoJ4%j2J7Nk0QK4k3oK2ok9J9NKl2K8oj2
$$ -8 0 -5 -13 -26 1 -5 -13 -4 -11 -21 -15 -11 -10 -23 9 5 -1 -11 6 1 -3 -9 5 5 -7 10 15 -5 3 27 4 -2 20 14 -15 4 9 11 -21 7 1 -11
4773a1%K0nj6%K4l5QK6k3j2J6J3l1J5J1Pk7K9jlrJ1J4l1K7jrkJ1nj8K6Jj0j3O
$$ -11 -11 9 4 -12 -12 12 -23 -15 11 -12 -24 -8 5 -26 -11 0 7 -20 9 8 5 -4 7 21 -10 17 16 7 5 16 11 -7 19 20 10 -3 3
4810CjnOJ3k1jQRk9QL0l0j2K0jj7J0J4j1kJ7qj3PJ2lj7J5K3j9qJ8Mk1J7Ok5J3
$$ 3 2 -3 3 16 -5 -6 2 11 -18 -10 20 -10 -22 -2 -3 -20 -10 4 -7 -9 8 0 -13 -6 6 3 -14 1 24 5 -3 15 19 -2 15 21 -4 9
4848IO%k0QJ2plOoj9NJ2j2j1K8kk6J8Ll0J7J1mnoJ7p%J5Lj2nK6j3rK0nk0K2Pj2
$$ 9 15 15 -5 3 15 8 5 11 5 -14 -9 3 -9 -20 8 6 -20 -2 1 -29 -12 -1 -5 -10 -16 1 -6 -6 9 12 0 -5 21 8 -1 19 14 -6 16 23 11
4889A1j2K2j3j1J9Lj9rK3mk5NJ0Jj9RQj5JJ4oj6J8%rpJ2Pj1MPJoJ7jj4OK0j6J
$$ 11 -1 21 8 -3 16 19 0 -9 14 10 -15 -10 0 1 -18 -9 -1 -16 -15 -1 -7 -23 -5 -5 -14 -21 -9 -2 -13 -9 -2 -1 -7 10 9 -5 1 21 5 6
4929FJ4j0j0J5r%rRlj1RJ6k7MJ6qj8QRj3kJ5mj6lK2nj1J5Nj6kK6j8jJ8Oj7JK1
$$ 6 20 10 0 15 6 6 -3 6 3 -8 1 17 -10 -6 10 2 -16 -8 1 -12 -14 1 -3 -19 -22 0 -5 -16 -1 4 -12 -14 12 -6 -7 11 17 0 1 22
4969B2j1k1J9Lk6K7Oj6j0QN%j9J9kj5LOj5J0Oj2j6K6nj0mJ8r%J8j0nJ0%J0j3J9
$$ 22 11 -10 9 12 -14 13 19 3 -7 1 6 6 -13 6 4 -11 -8 -2 -17 -7 -1 -13 -29 -3 -8 -18 -22 -4 -13 -13 5 -5 -10 0 0 10 -3 16
5007A6J2k4nJ3Jk2PK1poRjpP%qj8J9kj8QJ3k6%J2%j7J6RqrPQrlK0oj9OJ4jjJ7
$$ 16 28 4 -1 12 13 -9 -2 19 12 6 15 14 7 14 14 6 -12 7 5 -13 -5 8 -18 -18 -6 -6 -23 -7 2 -6 -15 -8 0 -9 -12 8 2 -17 -11 3 2 1 18
5050A8nl0K2mjRJ3j3j5J1Oj6O%J7k0jQmj0Oj3qJ0K2j8kQj0kJ5Nj7OLJj5J5J3j
$$ 18 13 -17 5 1 0 9 22 9 -6 5 11 -5 1 1 18 -2 -3 5 1 -9 -3 -16 -24 -14 8 -10 -12 -4 -14 -16 -1 4 -13 -7 -4 -3 -18 -3 10 9
5090Ij4K4j5lLJ5j7nJ7jj9PPnoJ3rpJ0Nj1k7L1lj0NKj2kJ4Kj5MQnj3J3OjlJ6p
$$ 9 -5 19 4 1 4 19 2 -3 14 13 -6 1 8 3 -3 10 1 -6 4 9 -2 -29 2 -1 -11 -6 -4 -16 -18 -4 -2 -17 -13 -5 -10 -23 -10 -4 -5 -8 8 1
5132Aj4RRlMJ4kj9QPj3KJ1omKJ5j3JjpMmPj8lJ4kl0L0Nj2lJ0rnOkn%J6%pMJ1k
$$ 1 -13 -4 5 2 6 20 18 -1 7 14 1 3 14 8 4 6 21 8 9 8 1 5 1 8 -10 -13 1 -1 -31 -1 4 -8 -11 -1 -10 -15 -9 -11 -16 -16 0 0 -7 -3 8 6
5178FJ%Mj6J5NnoM%qJ0Ok1%MQj6j1K2j7KR%j2JJ0j7MJ1Mj8QJ8qj2J2J2j3jJ2j1
$$ 6 7 7 11 -5 10 15 10 4 8 8 0 10 16 -5 -5 -1 7 -9 -20 2 -15 -13 -4 -4 -16 -15 -5 -22 -18 -7 -3 -21 -13 5 -3 -15 -3 9 -4 -5 7 -4
5220dlJ5Jj1J0K0j8lPj1oQP%kqJ3k5mJ7jj0QJ0l2PM%KPoKKOJpRMj6KK4pk1J9O
$$ -4 -7 8 9 -2 8 28 10 7 14 3 -3 5 12 12 10 2 15 -10 -14 3 2 -8 0 10 -22 -15 -11 -11 -9 -2 -8 -6 -4 2 3 -4 5 9 -7 -5 19 12 -9 10 16
5265A6rlJ0jj8J2JqjR%oJLppJ7lj2%Loj6J8nj4J1J5j3jjJ2qjJ7qrRJ0j0pK1nq
$$ 16 7 4 14 13 -5 7 8 0 -1 8 8 2 3 6 -1 -8 9 6 -6 -6 -3 -9 -25 -7 -12 -26 -15 0 -13 -14 -15 -3 -11 -12 5 -3 -12 -3 7 -3 -10 11 6 -2
5309bJ0Ko%Kj1JJ0JokJ0j3nJ0%k0MNQj9nJ8j5%JQjkJ2Lj4J5kk4J9J8onJ3oj4J
$$ -2 8 10 4 4 6 -5 -4 6 7 1 -1 9 -4 -9 1 1 -19 -15 -10 -2 -21 -26 -8 -23 -23 -22 -14 -15 -17 -5 -2 -16 -1 -3 -27 -8 10 4 -1 12 6 -8 -7
5352gK1rKRqkj0NlrJJ2k0K1nj1pK2pj4KJ2j7MJ1LrPlJ3j8QMjkJ6lj0QNJrJ3mp
$$ -7 14 5 7 16 8 6 -4 1 -2 -11 -10 2 -18 3 -2 -13 -20 2 -5 -19 -17 -5 -22 -18 -7 -4 -13 -6 -9 4 -14 -6 -2 -3 -5 11 8 -2 6 11 12 3 16 12 5
5397EJ0oLqlL%j2Ojj2J2JoJ5j4pnJ0nKjjRj4J9jj1lJ9qkJ9jkQnj3j1K1pqJ4ll
$$ 5 15 9 12 4 1 4 4 -8 -2 -3 -15 -3 -2 -8 7 -7 -14 -19 -9 -14 -12 -13 -14 -5 -19 0 -1 -12 -15 4 -4 -6 13 12 10 18 13 0 -11 10 3 -5 9 6 3
5442C%MNj6MPoj2J2Pk0KJ5qj7J6lk0J0LpJ0Pj3J1qJ3J2j7J0Rj8NK0j5oJ2kj4j
$$ 3 3 7 12 -4 0 7 1 -11 1 8 -12 -10 5 -3 -20 -4 -7 -27 -17 -14 -21 -11 -4 -17 -6 -14 -1 11 -6 4 13 -5 0 20 5 -1 11 9 -5 -6
5482fJ5OqkOj4lJ6ok0RJ8k3j2K6j3Mj0Rj0lNOrjJ2OkJMo%J8rLLj1mJ0KlqJ5No
$$ -6 9 15 7 5 11 -3 -6 10 4 -16 -7 11 -12 -24 2 -11 -7 -17 -8 -18 -21 -16 -10 -19 -20 -8 -2 -4 -3 1 -5 -5 13 4 7 10 -1 -5 5 7 4 -4 11 16 10
5527A0qNmLkkmrJ3j4qK4j2pjJ5j6jQlJ1rRjoO%Lj1J0Lj3J3%OpJ2j8J1jNj3NKN
$$ 10 2 7 3 6 4 2 -2 -11 2 -12 -20 4 -8 -15 -16 -1 -17 -18 -10 -13 -2 -11 -2 -3 -9 -3 -3 0 -11 -1 2 -11 2 2 8 1 13 -5 6 5 10 -3 2 4 9
5572Ilnkmj5K8j7noJ6mj0QJj0QRoj7J8jOKJ9j1kQj1rNJ6j5LJRj4KN%j5jJ0moJ6
$$ 9 6 1 -1 -5 -20 8 -9 -14 -20 -4 -8 -18 -10 -9 -19 -11 -2 -8 -25 -7 -8 -2 0 19 8 6 14 3 -6 -1 15 0 3 4 13 -1 1 6 6 -9 -10 0 -4 -10 6
5617FqnQj2oQlJ3k3J8j2NMj1QnOMmoJ7Oj8J8j3JJ2Rj8NMJJj7J2Mj2JPLpPNj7M
$$ 6 -2 -7 1 -11 -17 -9 -12 1 -22 -4 -16 -11 -7 -18 -10 -15 -9 -5 -9 -15 2 8 -10 8 -5 -4 8 17 -1 4 8 9 10 -7 5 9 -3 -2 5 8 1 8 13 -4 0
5662@Mk4J0K0j4KpKLj9K3j4nPPonJ9Lk2J0J4j4PJ0JqlMJnMJp%NJlj3J0okJ3kj1
$$ 0 4 -20 -10 10 -4 -2 -9 -7 -4 -23 0 -14 -19 -12 -5 -11 -16 3 6 -16 -6 8 -6 1 11 12 4 1 5 6 1 5 6 -1 -1 4 5 2 -11 -1 -7 -9 4 2 -9
5707i%JnoN%nONoOQj3NNkPpJ6nnPMmNj2OjlKOj1J1orNKmrNjj1RkrOLJjlPllJJ3
$$ -9 -9 -8 -13 -19 -14 -14 -19 -13 -8 -14 -8 0 -13 -8 -3 -5 2 -5 11 6 1 8 12 8 13 1 7 6 3 5 11 0 11 5 -4 1 3 -1 -10 -5 -6 -17 -8 -10 -19 -13 -10 -9 -10 -13 -6 -9 -12 -11 2
5762Bj3LjJ%J5%k0J7J2qnlK%JLKj2LJ2k0J4mOrj%j7J0LJj1lQnKMJkJ0JnlOJ2k0
$$ 2 -11 -8 -9 -8 -8 7 7 -13 4 16 8 3 0 2 2 3 6 8 -4 -1 11 -9 5 1 7 -2 -3 -3 -20 -10 -7 -6 -17 -20 -12 -17 -15 -11 -10 -12 -2 -1 -6 -9 -3 9 -11
5809a1kJ7oKOPpmJ5j3KoJ6rj1NJrJ3r%Lnj2JQnqQLj5mJ1MKnQRrJ2%rlJ0jj0J4
$$ -11 -13 4 -2 0 6 13 6 2 17 4 6 0 16 7 -4 1 2 -7 6 -3 -3 0 -5 -17 -16 -8 -13 -21 -13 -10 -25 -29 -18 -14 -12 -17 -9 0 -9 3 3 -6 -9 1 0 -10 4
$$ [...]
8191D
##END NTUPLES=NMR FID
##END=
