##TITLE=1H_DE-80H_X3
 200.13MHz, d2o
 8 sc
 
 19ns.26.2.2025
##JCAMPDX= 6.0         $$ Bruker NMR JCAMP-DX V2.0
##DATA TYPE= NMR FID
##DATA CLASS= NTUPLES
##ORIGIN= UXNMR, Bruker Analytische Messtechnik GmbH
##OWNER= pz
$$ XWIN-NMR		Version 3.5
$$ Thu Feb 27 14:40:48 2025 Russian Standard Time (UT+4h)  new_Human@DPX200
##.OBSERVE FREQUENCY= 200.1313
##.OBSERVE NUCLEUS= ^1H
##.DELAY= (6, 6)
##.ACQUISITION MODE= SIMULTANEOUS
##.ACQUISITION SCHEME= undefined
##.AVERAGES= 8
##.DIGITISER RES= 18
##SPECTROMETER/DATA SYSTEM= spect
##.PULSE SEQUENCE= zg30
##.SOLVENT NAME= CDCl3
##.SHIFT REFERENCE= (INTERNAL, CDCl3, 0, 14.3821)
##AUDIT TRAIL= $$ (NUMBER, WHEN, WHO, WHERE, WHAT)
$$ ##TITLE= Audit trail, XWIN-NMR		Version 3.5
$$ ##JCAMPDX= 5.01
$$ ##ORIGIN= Bruker BioSpin GmbH
$$ ##OWNER= new_Human
$$ C:/Bruker/XWIN-NMR/data/yarkov/nmr/H-C/1/audita.txt
$$ ##AUDIT TRAIL=  $$ (NUMBER, WHEN, WHO, WHERE, WHAT)
(   1,<2025-02-27 14:38:44.09 +0400>,<new_Human>,<DPX200>,
      <created by zg, POWCHK disabled, PULCHK disabled
       configuration hash MD5:
       00 E9 B6 7A A2 85 ED C7 34 08 36 98 17 FE 4E 26
       data hash MD5: 16K
       84 A4 62 DD 2F 9D D3 92 23 35 6C 70 06 F1 85 42>)
$$ ##END=
$$ 
$$ hash MD5
$$ 70 22 25 56 6E 52 81 20 18 7C 8E 5C EA 8F B3 D7
##$RELAX= 
##$RELAX= 
##$RELAX= 
##$RELAX= 
##$RELAX= 
##$RELAX= 
$$ Bruker specific parameters
$$ --------------------------
##$DU= <C:/Bruker/XWIN-NMR>
##$EXPNO= 1
##$NAME= <H-C>
##$PROCNO= 1
##$TYPE= <nmr>
##$USER= <yarkov>
##$AMP= (0..31)
100 100 100 100 100 100 100 100 100 100 100 100 100 100 100 100 100 100 
100 100 100 100 100 100 100 100 100 100 100 100 100 100 
##$AQSEQ= 0
##$AQ_mod= 1
##$AUNM= <au_zg>
##$AUTOPOS= <>
##$BF1= 200.13
##$BF2= 200.13
##$BF3= 200.13
##$BF4= 200.13
##$BF5= 200.13
##$BF6= 200.13
##$BF7= 200.13
##$BF8= 200.13
##$BYTORDA= 1
##$CFDGTYP= 0
##$CFRGTYP= 5
##$CHEMSTR= <none>
##$CNST= (0..31)
1 1 145 1 1 1 1 1 1 1 1 1 1 1 1 1 1 1 1 1 1 1 1 1 1 1 1 1 1 1 1 1 
##$CPDPRG= <>
##$CPDPRG1= <>
##$CPDPRG2= <>
##$CPDPRG3= <>
##$CPDPRG4= <mlev>
##$CPDPRG5= <mlev>
##$CPDPRG6= <mlev>
##$CPDPRG7= <mlev>
##$CPDPRG8= <mlev>
##$CPDPRGB= <>
##$CPDPRGT= <>
##$D= (0..31)
0 0.7 0 0 0 0 0 0 0 0 0 0.03 0 0 0 0 0 0 0 0 0 0 0 0 0 0 0 0 0 0 0 0 
##$DATE= 1740652723
##$DBL= (0..7)
120 120 120 120 120 120 120 120 
##$DBP= (0..7)
150 150 150 150 150 150 150 150 
##$DBP07= 0
##$DBPNAM0= <>
##$DBPNAM1= <>
##$DBPNAM2= <>
##$DBPNAM3= <>
##$DBPNAM4= <>
##$DBPNAM5= <>
##$DBPNAM6= <>
##$DBPNAM7= <>
##$DBPOAL= (0..7)
0.5 0.5 0.5 0.5 0.5 0.5 0.5 0.5 
##$DBPOFFS= (0..7)
0 0 0 0 0 0 0 0 
##$DE= 6
##$DECBNUC= <off>
##$DECIM= 32
##$DECNUC= <off>
##$DECSTAT= 4
##$DIGMOD= 1
##$DIGTYP= 9
##$DL= (0..7)
0 120 120 120 120 120 120 120 
##$DP= (0..7)
150 150 150 150 150 150 150 150 
##$DP07= 0
##$DPNAME0= <>
##$DPNAME1= <>
##$DPNAME2= <>
##$DPNAME3= <>
##$DPNAME4= <>
##$DPNAME5= <>
##$DPNAME6= <>
##$DPNAME7= <>
##$DPOAL= (0..7)
0.5 0.5 0.5 0.5 0.5 0.5 0.5 0.5 
##$DPOFFS= (0..7)
0 0 0 0 0 0 0 0 
##$DQDMODE= 0
##$DR= 18
$$ [...]
##$SUBNAM0= <"">
##$SUBNAM1= <"">
##$SUBNAM2= <"">
##$SUBNAM3= <"">
##$SUBNAM4= <"">
##$SUBNAM5= <"">
##$SUBNAM6= <"">
##$SUBNAM7= <"">
##$SUBNAM8= <"">
##$SUBNAM9= <"">
##$SW= 18.0517328524113
##$SWIBOX= (0..15)
0 0 2 0 0 0 0 0 0 0 0 0 0 0 0 0 
##$SW_h= 3612.71676300578
##$TD= 16384
##$TD0= 1
##$TE= 0
##$TE2= 300
##$TE3= 300
##$TEG= 300
##$TL= (0..7)
0 120 120 120 120 120 120 120 
##$TP= (0..7)
150 150 150 150 150 150 150 150 
##$TP07= 0
##$TPNAME0= <>
##$TPNAME1= <>
##$TPNAME2= <>
##$TPNAME3= <>
##$TPNAME4= <>
##$TPNAME5= <>
##$TPNAME6= <>
##$TPNAME7= <>
##$TPOAL= (0..7)
0.5 0.5 0.5 0.5 0.5 0.5 0.5 0.5 
##$TPOFFS= (0..7)
0 0 0 0 0 0 0 0 
##$TUNHIN= 0
##$TUNHOUT= 0
##$TUNXOUT= 0
##$USERA1= <user>
##$USERA2= <user>
##$USERA3= <user>
##$USERA4= <user>
##$USERA5= <user>
##$V9= 5
##$VALIST= <valist>
##$VCLIST= <CCCCCCCCCCCCCCC>
##$VD= 0
##$VDLIST= <DDDDDDDDDDDDDDD>
##$VPLIST= <PPPPPPPPPPPPPPP>
##$VTLIST= <TTTTTTTTTTTTTTT>
##$WBST= 1024
##$WBSW= 4
##$XGAIN= (0..3)
0 0 0 0 
##$XL= 0
##$YL= 0
##$YMAX_a= 522283
##$YMIN_a= -627883
##$ZGOPTNS= <>
##$ZL1= 120
##$ZL2= 120
##$ZL3= 120
##$ZL4= 120
##$ABSF1= 10
##$ABSF2= 0
##$ABSG= 5
##$ABSL= 3
##$ALPHA= 0
##$AQORDER= 0
##$ASSFAC= 0
##$ASSFACI= 0
##$ASSFACX= 0
##$ASSWID= 0
##$AUNMP= <proc_1d>
##$AZFE= 0.1
##$AZFW= 0.1
##$BCFW= 1
##$BC_mod= 2
##$BYTORDP= 1
##$COROFFS= 0
##$CY= -3
##$DATMOD= 1
##$DC= 2
##$DFILT= <>
##$DTYPP= 0
##$F1P= 0
##$F2P= 0
##$FCOR= 0.5
##$FTSIZE= 0
##$FT_mod= 4
##$GAMMA= 1
##$GB= 0.15
##$INTBC= 1
##$INTSCL= 1
##$ISEN= 128
##$LB= 0.25
##$LEV0= 0
##$LPBIN= 0
##$MAXI= 10000
##$MC2= 0
##$MEAN= 0
##$ME_mod= 0
##$MI= 1.114404
##$NCOEF= 0
##$NC_proc= 0
##$NLEV= 6
##$NOISF1= 3.799351
##$NOISF2= 2.8
##$NSP= 1
##$NTH_PI= 0
##$NZP= 0
##$OFFSET= 14.38212
##$PC= 1
##$PHC0= -1181.595
##$PHC1= 5.992222
##$PH_mod= 1
##$PKNL= yes
##$PPARMOD= 0
##$PSCAL= 0
##$PSIGN= 0
##$REVERSE= no
##$SF= 200.129724274929
##$SI= 16384
##$SIGF1= 3
##$SIGF2= 2
##$SINO= 400
##$SIOLD= 16384
##$SREGLST= <1H.CDCl3>
##$SSB= 0
##$STSI= 0
##$STSR= 0
##$SW_p= 3205.1282051282
##$SYMM= 0
##$S_DEV= 0
##$TDeff= 0
##$TDoff= 0
##$TI= <>
##$TILT= no
##$TM1= 0
##$TM2= 0
##$TOPLEV= 0
##$USERP1= <user>
##$USERP2= <user>
##$USERP3= <user>
##$USERP4= <user>
##$USERP5= <user>
##$WDW= 1
##$XDIM= 8192
##$YMAX_p= 0
##$YMIN_p= 0
$$ End of Bruker specific parameters
$$ ---------------------------------
##NTUPLES= NMR FID
##VAR_NAME=  TIME,          FID/REAL,        FID/IMAG
##SYMBOL=    X,             R,               I
##VAR_TYPE=  INDEPENDENT,   DEPENDENT,       DEPENDENT
##VAR_FORM=  AFFN,          ASDF,            ASDF
##VAR_DIM=   8192,          8192,            8192
##UNITS=     SECONDS,       ARBITRARY UNITS, ARBITRARY UNITS
##FACTOR=    0.0002768,     1,               1
##FIRST=     0,             0,               0
##LAST=      2.2672688,     0,               0
##MIN=       0,             -627883,         0
##MAX=       2.2672688,     522283,          0
$$ Real data points
##PAGE= N=1
##DATA TABLE= (X++(R..R)), XYDATA
0@%%%%%%%%%%%%%%Nj3J6j6J6j6K1k9L2l6M4m8N3o4P2q1R6j06J18j36J52j69J87
$$ 0 0 0 0 0 0 0 0 0 0 0 0 0 0 0 5 -8 8 -8 8 -8 13 -16 16 -20 24 -24 29 -35 37 -44 52 -54 64 -72 80 -89 98
37I8k06K28k53K79l09L44l78M16m60N05n55O11o72P40q16R01r97J106j232J376
$$ 98 -108 120 -133 146 -163 181 -197 219 -241 264 -291 320 -352 388 -428 473 -524 582 -650 726
57G26j547J754k003K315k715L243l974N042o719R641j5642L2269j55626m94647
$$ 726 -821 933 -1070 1245 -1470 1773 -2201 2841 -3878 5763 -9879 22390 -133236 -627883
71f27883N13195L96510k14496M9913M2905m01485j02405L98033K06400j19768
$$ -627883 -114688 281822 67326 117239 160144 -241341 -343746 54287 260687 140919
81A40919j29359j20235j31355Q3325L62462J43255l62101k68731J58393J17663
$$ 140919 11560 -108675 -240030 -156705 205757 349012 -13089 -281820 -123427 -5764
91e764M4443J91355p0440l55500m3400K21194J35185P4367r8683k38958J74J21886
$$ -5764 38679 230034 159594 -195906 -239306 -18112 117073 191440 92757 -146201 -146027 -24141
103b4141J3079J39376R7042k87793k18500J90017J99715L2314k6422j55491j58821
$$ -24141 -11062 128314 225356 -62437 -280937 -90920 108795 141109 114687 -40804 -199625
114a99625Q3871K10795P5782j15027j35229O518L1107q606J35737J09730k12370
$$ -199625 -115754 95041 170823 55796 -79433 -72915 -41808 -50414 85323 195053 -17317
125a7317j86259J44113J32309k1458K0803m4316j50551J4056J61639M8118p3901
$$ -17317 -203576 -59463 72846 51388 72191 27875 -122676 -108620 53019 101137 27236
136B7236n8399o588L142Q231P1262N2634j00233r1795P6315N2510l5437L7677
$$ 27236 -31163 -37751 -34609 -26378 44884 97518 -2715 -94510 -18195 34315 -1122 36555
148C6555J4088j08481j9875J02900K4000l7366q021l1643k2469N7141M3439l6777
$$ 36555 50643 -57838 -77713 25187 49187 11821 3800 -27843 -50312 6829 50268 13491
160A3491l3620R308M408l484K5170K1630l3010l8128J7786K8579M561K257k3121
$$ 13491 -20129 -10821 -6413 -9897 15273 36903 3893 -34235 -16449 12130 16691 18948 -4173
173d173l4274K6289M1981k2210k0439J5626j2435j2574L7707J3471l7084r430
$$ -4173 -38447 -12158 29823 7613 -12826 2800 -9635 -22209 15498 28969 -8115 -17545
185a7545J7433P26P180J4224j9832k6126J4349K2683k343m561m748k2407l088
$$ -17545 -112 614 7794 22018 2186 -23940 -9591 13092 10749 6188 1440 -20967 -24055
198b4055L6350J4920k7417j3865L601m179J5667K9263j2027l2942m856Q003J5102
$$ -24055 12295 27215 -202 -14067 -10466 -14645 1022 30285 18258 -14684 -19540 -11537 3565
211C565K8118l303m5465j9701K6065K4143Q785j767k7248l0696J1472L8048J8052
$$ 3565 31683 28380 -17085 -36786 -10721 13422 22207 20440 -6808 -37504 -26032 12016 30068
224C0068r438k3583k8297k461L9815L5791j2234l5921k2238m89K6491L8313K313
$$ 30068 20630 -2953 -31250 -33711 6104 41895 29661 -6260 -28498 -28987 -2496 35817 38130
237C8130m0512l3341M068K7447K9719Q996k6848l8444p897K8474L5014J1714k0745
$$ 38130 -2382 -35723 -31655 -4208 25511 34507 7659 -30785 -38682 -10208 24806 36520 15775
250A5775l6669j7783K0598M1600J9119k2165l9250j7205J6252L1748K2644q216
$$ 15775 -20894 -38677 -18079 23521 42640 20475 -18775 -35980 -19728 12020 34664 26448
262B6448l6876k8623J2302L2636K1860P54k6395l6740l99L8723K7153m346j8506
$$ 26448 -10428 -39051 -26749 5887 27747 28501 2106 -34634 -35033 3690 30843 26497 7991
275G991k7190j4995K5488L7573J882k3965k1289j3017Q167L2782J9520k0310k9114
$$ 7991 -19199 -34194 -8706 28867 30749 6784 -14505 -27522 -19355 13427 32947 12637 -16477
288a6477q570P781J9052K3725j540l1284j9199J2020J8674J2660P111j6680k8916
$$ -16477 -25047 -17266 1786 25511 23971 -7313 -26512 -14492 4182 16842 23953 7273 -21643
301b1643o08K4370J3297N32o736k1067j4391J7470K3129Q27r314j1860j2952M047
$$ -21643 -22251 2119 15416 15948 9212 -11855 -26246 -8776 14353 15180 5866 -5994 -18946 -14899
315a4899K2947J1746r569j3918q257O50J2809J5363k294j5797j1206J495R311
$$ -14899 8048 19794 10225 -3693 -11950 -11300 1509 16872 14578 -1219 -12425 -10930 -1619
328a619J0884K923j0870j3206p45R109R323L798n295j1102l773P010R790M384
$$ -1619 9265 12188 1318 -11888 -12633 -3524 5799 9597 4302 -6800 -10573 -3563 6227 10611
342A0611m253r618m595M194P705L731k200p789o830K860P929L080j637m542n768
$$ 10611 6358 -3260 -7855 -3661 4044 7775 5575 -2214 -9044 -6184 1745 4825 3188 -1354 -7122
357g122J51P878N196k812l199k402j738L947O889j031n946k160J41N69M618J955
$$ -7122 -6971 907 6103 3291 92 -2310 -4048 -101 6788 5757 -189 -2349 -2208 -1639 2979 4934
373D934n548m694J986K118R82K655j264m517p94M067K022M01M91k194k032R32
$$ 4934 -614 -5308 -3322 -1204 -222 2433 1169 -3348 -4142 -75 1947 2348 2839 645 -1387 -455
389d55K659K20q49k10k319k040J713J912n67o57n79j224k68J667J623N89O37j067
$$ -455 2204 2424 1575 1365 -954 -2994 -1281 631 64 -593 -1172 -2396 -2664 -997 626 1215 1852 785
407G85k996Q90L351J674j27j709l935j850L636L695l71k167l787m113K660P109
$$ 785 -2211 -1321 2030 3704 3577 1868 -2067 -3917 -281 3414 3043 876 -2911 -7024 -4364 2745
423B745K475l303m179m223O98R056N370l332n681m280j746O651R598n83r701p954
$$ 2745 5220 1917 -2262 -6485 -5787 3269 8639 5307 -374 -4654 -6400 251 9849 9266 -435 -8389
439h389k63P099Q663Q51p381q810k697O726R439M302l611r719r077N324J6004
$$ -8389 -8652 -1553 7110 7961 580 -8230 -10927 -4201 5238 9540 5929 -3790 -12867 -7543 8461
454H461N475o822j0360q490L331J3679O711m351q749j0426j768J2901J1904j403
$$ 8461 13936 7114 -3246 -11736 -8405 5274 11985 7634 -1115 -11541 -13309 -408 11496 10093
468A0093r487j1652l808J2637J4164J140q769j1371o987Q844J6705L946r670j2800
$$ 10093 606 -11046 -14854 -2217 11947 13087 4318 -7053 -14040 -5196 11509 15455 5785 -7015
482g015o589P036J3400M551n985q815q366K60J2008J0703L25j1403j4153J005
$$ -7015 -13604 -6568 6832 11383 5398 -3417 -11783 -11523 485 11188 11513 110 -14043 -13038
496a3038J6772J0282l922j0047q830L51R030O464L32j641r670j0571P451J5349
$$ -13038 3734 14016 10094 47 -8783 -8432 598 7062 7394 5753 -3917 -14488 -7037 8312
510H312J734o955q660o317N510J2547K997n115n506n425q6R717P792l222r603
$$ 8312 10046 3091 -5569 -11886 -6376 6171 9168 4053 -1453 -6878 -6964 2753 10545 7323 -2280
525b280m622M167M466Q79J728r76q613n173Q154P405M20l985p924j465R235N709
$$ -2280 -6902 -2735 1731 2610 4338 3362 -5251 -10424 -2270 5135 5555 1570 -6354 -7819 1416 7125
541G125m950k800J631j556j804K509L537J368m932n469J627N819J344l115k423
$$ 7125 2175 -625 1006 -550 -2354 155 3692 5060 128 -5341 -3714 2105 3449 334 -2089
556b089j316J150L097M71o60o07p70j23J423J131N4p30m74q03J06K14O76R50j778
$$ -2089 -3405 -2255 842 1313 653 46 -724 -847 576 1707 1761 1031 557 -246 -140 74 750 1700 -78
575g8k537K57K581N61r51r48l01P77K06P7J791J261j915k039O06J500J513M14
$$ -78 -2615 -2358 223 784 -167 -1115 -1416 -639 -433 -356 1435 2696 781 -1258 -652 848 2361 2775
593B775k559l164R61K964K35o88j062j549p66J432K265R41n66k098j715J024L165
$$ 2775 216 -2948 -1987 977 1212 524 -538 -2087 -2853 -1421 844 1785 1219 -879 -2594 -1570 1595
610A595K907j262l194k940M2L313M069l7n149m656k83M337N421P90n551n184P5
$$ 1595 4502 3240 46 -2894 -2852 461 4530 4493 -656 -5312 -5595 -1258 4163 4953 -598 -5782 -5707
627e707M145N618K309l348o404l216L038Q085N523m722j0435m142N414Q539L695
$$ -5707 -1562 4056 6365 3017 -3387 -6603 -3565 4520 10043 5321 -5114 -9256 -3842 4697 8392
642H392m644q110m300K885O853N720j92p148p448j001R192R943o25r112p546j530
$$ 8392 3748 -4362 -8662 -5777 1076 6796 6604 -544 -7992 -8993 199 10142 9517 405 -7141 -8671
658h671P190R838K313q264j0292j844N313J0158M591o939j0071l806M016R554
$$ -8671 -1481 8357 10670 2406 -7886 -9730 -4417 5741 10332 3393 -6678 -10484 -6468 3086
672C086P712k852j0811q276K832J1669R376l379j2082p697K622R691P722k276
$$ 3086 10798 7946 -2865 -11141 -8309 3360 12736 9357 -2725 -10422 -7800 1891 9613 7337
686G337p649p054l078O648J1023L133q484q991l179O031J1241M427p634r728k555
$$ 7337 -312 -7366 -10444 -3796 7227 10360 1876 -7115 -10294 -4263 6978 11405 3771 -5957 -8512
701h512N114Q415M373l826q400n121J412Q626O057l505o588n252r03P128Q912
$$ -8512 -3398 5017 9390 5564 -2836 -7957 -6545 2081 8138 4633 -1955 -7207 -8110 -982 7930
716G930j128q008n055N07N384P085M84o290n564rM023M821J362l463n349k964
$$ 7930 6802 -1206 -6261 -5754 -370 6715 7199 909 -4655 -4664 -641 4180 5542 2079 -3270 -6234
732f234L090O253J809m168l479k251J784N732K459l939k797l01L53K757L400j745
$$ -6234 -3144 3109 4918 750 -2729 -4980 -3196 2536 4995 1056 -1741 -2042 -1689 1068 4468 2723
748B723m034p99O96J134K827k19l454k296J382K037J141l83j252j227M01K379
$$ 2723 -1311 -2110 -1414 -280 2547 2328 -1126 -3422 -2040 -3 1138 755 -497 -1724 -1323 1056
764A056J075r12j220P4n97R60J745p96k429K90R10m3k89K30j240m00J090P53l63
$$ 1056 2131 1219 -1 73 -524 436 2181 1385 -1044 -754 156 113 -176 54 -1186 -1586 -496 257 -106
783a06k41l14J55R41J036n43j007m16O53J061J74o36q73j166O65J195P1q22j287
$$ -106 -347 -661 -506 435 1471 928 -79 -495 158 1219 1393 757 -116 -1282 -617 578 649 -173 -1460
802a460l87M41J962R32j135j380k30R61K006M83p37j811j010J267J796N07j762
$$ -1460 -1847 -1406 556 1488 353 -1027 -1257 -296 1710 2193 1456 -355 -1365 -98 1698 2205 443
819D43j817j043P29K944N36j352k535n23Q84K421K020j180k691j660J877K576
$$ 443 -1374 -2417 -1688 1256 1792 440 -2095 -2618 -1734 687 2707 1527 -1164 -2824 -947 1629
835A629J806r50l203k312J134K980K064r87l219k769K25L564L096o84l142k587
$$ 1629 3435 2485 -718 -3030 -1896 1084 3148 2161 -1058 -3827 -3602 -38 3058 2374 -768 -3355
851c355k88L709L827K98l677l034m45K781L771J278l493m429j142K440M242J699
$$ -3355 -3643 66 3893 4191 514 -2520 -2965 -184 3587 4865 1372 -3057 -4199 -1759 2483 4182
867D182k659m907j802K729M471K284j938m476k425K224M437K624j324m314k823
$$ 4182 1523 -3384 -5186 -2457 2014 4298 2360 -2116 -4541 -2317 2120 4744 3420 -894 -3717
882c717P04M075L588j217m202k976j43K953M357P42m677l629N48K579L775J477
$$ -3717 -3013 1062 4650 3433 -769 -3745 -3888 -935 3422 4164 -513 -4142 -3594 -1015 2760 4237
898D237k871l866p22K207L688K154k341m435j837J943L503J519j597l045k184
$$ 4237 1366 -2500 -3222 -1015 2673 4827 2486 -1949 -3786 -1843 1660 3179 1582 -1463 -3647
913c647Q64L032K396n45k721k264K56K947L327m73l455j755R01J285K181J75j943
$$ -3647 -2783 249 2645 2100 -621 -2885 -2629 318 3645 3172 -283 -2038 -1137 148 2329 2504 561
930E61k369n21J038K731N09k088k022j07J102J996P23j218j464m6O81J166J797
$$ 561 -1808 -2329 -1291 1440 1949 -139 -2161 -2268 -1166 830 1553 335 -1129 -1175 -494 672 2469
947B469j109j646m61J94J088Q14q52j231j70j71M03J004L71j210o45K30J177Q73
$$ 2469 1360 -286 -747 -553 535 1349 497 -734 -904 -1075 -672 332 703 -507 -1152 -922 255 1128
965A128r41m97N29L02l27N59J21l37m09m81l03R66M38j432q95J249L97o37j36
$$ 1128 187 -310 219 521 194 753 874 537 128 -353 -656 310 748 -684 -1579 -330 67 -570 -706
984g06O89k06r7N60N32l31j52K99k08J11k27k43k40L69L1m18l69L49m97J88K77
$$ -706 -17 -223 -320 240 772 441 289 588 380 491 264 21 -219 150 181 -237 -606 -257 -754 -566 -289
1005b89N22n42k30j5P82N32K61r49l25N25M84j96pj20p59k75J56N86K93r62n71
$$ -289 233 -309 -539 -554 228 760 1021 72 -253 272 756 560 553 433 -326 -601 -445 141 434 -528 -1099
1026a099j73R31P47K9q25j62m3L72J493J57j057o16k99N71P23M85p76j361l23
$$ -1099 -1272 -341 406 435 -390 -552 -595 -223 1270 1427 370 -246 -545 26 749 1234 458 -903 -1226
1045a226M15J014M22m71j391l88O36J416Q42p00o62q15K75J353Q92p6j381j343
$$ -1226 -811 203 625 154 -1237 -1625 -989 427 1269 569 -93 -908 -633 720 1612 1536 155 -1188
1063a188K75J326J033l67j688j146qJ344J124J2q52j015n27J122J811R21j413
$$ -1188 -913 413 1446 1079 -609 -1755 -1763 -419 705 717 -135 -1150 -1677 -555 1256 2177 764
1080G64j768K00R64J131M30r61j426j008J026R22R31o37j739j077J084J538P37
$$ 764 -1004 -804 160 1291 1721 760 -666 -1674 -648 274 1205 568 -1171 -2248 -1164 374 1111
1097A111o9j508p89K82J495J206J6j600j345L58J295J085n08j446p32k85P66J226
$$ 1111 1042 -466 -1255 -973 522 1728 1744 144 -1201 -843 452 1537 1029 -417 -1149 -1434 -668 558
1115E58M78q80j873K17J344J619l2j302j076J23J364O35r9p11q32m28Q78L70M93
$$ 558 1036 156 -1717 -1500 -156 1463 1431 129 -947 -824 540 1175 1076 365 -467 -895 -17 353 846
1134H46p13j451j18O83J056K96n08p46l61J087P66K88n44q95R7L66J098k83n95
$$ 846 133 -1318 -1436 -753 303 599 91 -655 -1016 71 837 1125 581 -314 -217 149 1247 964 369
1153C69m43p09M39J62M44q6j364m28J194R27R1o02n20j81Q27P27L4m66n90m7L98
$$ 369 -74 -783 -344 -182 262 176 -1188 -1616 -422 505 596 -6 -526 -707 120 847 881 415 -175 -222 176
1174A76O10J85r08l68j021J136P08J7q39p86m51R71J199J18m53j026l9Q91R44
$$ 176 786 971 63 -305 -1326 -190 518 535 -304 -1090 -1541 -570 629 747 294 -732 -771 120 1064
1193A064K5o61n11p83P51O53N49q14j568m02Q19J566O82j355j132l37Q74J337
$$ 1064 1089 428 -83 -866 -115 538 1087 273 -1295 -1697 -878 688 1370 15 -1117 -1454 -580 757
1211G57Q82r59j543j95Q43J227R14o67k151p15M83J883J006o70k058j054J74K285
$$ 757 1639 680 -863 -1058 -215 1012 1926 1259 -892 -1607 -1124 759 1765 1095 -963 -2017 -1843 442
1229D42R24n91j153j377m9J894J889O9j665j789r0J555J685J91j499k084n64J335
$$ 442 1366 775 -378 -1755 -1804 90 1979 2048 383 -1406 -1496 59 1744 1935 436 -1648 -2212 -877
1247h77J890P38j191k139m97P76J999J248m95j864j183L92J987J499m11j661j980
$$ -877 1013 1751 560 -1579 -2076 -1300 699 1947 1452 -412 -1595 -1203 784 2283 1872 211 -1769
1264a769M84J202J699j1j709j574r6J140J813K82j171j762n00J223J531J165o52
$$ -1769 -1285 -83 1616 1605 -104 -1678 -1774 -634 1179 1461 290 -1472 -1972 -749 782 1947 1295
1281A295j631r60L51J625R26m91j340j174J34J070J177j0j285q26k13J029J194
$$ 1295 -336 -1296 -945 680 1606 1115 -225 -1399 -1265 -195 982 972 -313 -1139 -1352 -323 871
1298H71O04j223r87K03M32Q75P94q08j214l60R8J079P43l91j197p05O4N11P09
$$ 871 1475 252 -735 -532 -100 775 1569 761 -453 -813 -715 364 1107 716 -481 -1186 -1122 -611 98
1317I8L88m07r03j62Q78N62L23k79l96o15M99N21M92j41o04p43l71O52N23o7o39
$$ 98 486 79 -824 -986 -108 454 777 498 102 -513 -14 507 999 858 254 -489 -860 -208 315 248 -391
1338c91m24J81J19N63M10l86m6l95J87M82P56n03j99o18L7L55K98R3m35m76o08
$$ -391 -815 -634 -515 48 458 72 26 -369 -182 300 1056 553 354 -264 -227 128 426 519 84 -392 -1000
1359a000M62M32J43j73k32l21J80P98P3L35o05n63K29L37R15l91n34m21l70R66
$$ -1000 -538 -106 37 -136 -368 -689 -509 289 362 697 92 -471 -242 95 1010 619 85 -336 -706 260
1379B60J12p1q14k87O8L23J139m53l47n31J54J21Q65M79n10p50m88P33N96L3m18
$$ 260 372 301 -513 -800 -732 -409 730 277 -70 -601 -447 -326 539 1018 508 -242 -730 3 599 632 214
1400B14p97n14J95J157N46n29j023m75M67Q71Q83k38n91q61R6R52J189J06j278
$$ 214 -583 -1097 -902 255 801 272 -751 -1226 -759 112 995 757 166 -695 -599 353 1542 1648 370
1419C70j289O8Q68J347k23j138j252k97N92J618O37j096j383l91R92J506J141
$$ 370 -919 -851 17 1364 1141 3 -1249 -1546 -954 664 1301 205 -1178 -1569 -577 929 2070
1436B070j283j408o05L54J537J616n80k325j212M80J660J431j31k426j215O34
$$ 2070 787 -621 -1226 -872 665 2281 1701 -624 -1836 -1356 304 1735 1604 -822 -2037 -1403
1452a403J056J776K48j291j782n15J705J770Q25j582k058k76R42J617J071j393
$$ -1403 -347 1429 1677 386 -1396 -1911 -206 1564 2389 807 -1251 -1527 -585 1032 2103 710
1468G10j604j335Q73J514J665n76k267r11P19J578J302Q5j696j414n4J252J819
$$ 710 -894 -2229 -1356 158 1823 1247 -1020 -1931 -1212 366 1668 1753 57 -1357 -1411 -159 1660
1485A660O92j765k226J0J340J544O4r86j525n31N40J672Q59l41j654j082P35J431
$$ 1660 2352 587 -1639 -1629 -289 1255 1319 333 -1192 -1723 -1183 489 1348 1007 -647 -1729 -994 437
1503D37J477o14j758r87Q52R75P58m0r93j578L79Q92R40k03n44j133j78J118J016
$$ 437 1914 1300 -458 -1445 -593 382 1140 1100 107 -1471 -1092 -200 740 537 -7 -1140 -1318 -200 816
1522H16K24o78q93k83O91R21N06p26r82j06K45P93l53K1l04m79j61L68N22M72
$$ 816 1040 362 -531 -814 -123 798 1304 578 -404 -510 -265 528 175 196 -108 -587 -748 -380 142 614
1542F14p04n55L46P05M8l63M6j68M11p8j24K8Q6j86m34MK28N2k35J27K54k55m23
$$ 614 -90 -645 -299 406 454 91 137 -31 380 302 178 206 292 106 -328 -324 -96 -44 -279 -152 102 -153 -576
1565e76M41J68K81l83L10k45M7K93j0M07o09j1l26K89M37k80m56m38K75P8N09
$$ -576 -135 33 314 -69 241 -4 43 336 326 733 124 113 -213 76 513 233 -223 -661 -386 -308 201
1586B01j51J1l66m68P38M23M39n03m85j58L99K79K15j77o66o54N87M72K63J13
$$ 201 50 61 -305 -773 -35 388 827 324 -161 -319 80 359 574 397 -269 -923 -336 136 399 512
1606E12j067k75K45Q36N97k92q87j73L92Q73J10K99j202n32j86O04Q99K70q67
$$ 512 -555 -830 -585 251 848 556 -331 -504 -112 761 871 1170 -32 -564 -750 -146 753 1023 156
1625A56j045l87J080Q69J94j056j069K74R48P35L02q37o32m04P79P63Q60p95j032
$$ 156 -889 -1276 -196 673 867 -189 -1258 -984 -36 699 1001 164 -468 -872 -93 670 1530 735 -297
1644b97p10K14J658L17l94j544q90N32J115J167j55j191q71J02R28J094K85o17
$$ -297 -1007 -793 865 1182 788 -756 -1646 -1114 1 1168 1013 -178 -1049 -947 -19 1075 1360 743
1662G43j554n23J046J279L90r19j404m57O95J223M47n60r75o76M04J144N69K15
$$ 743 -811 -1334 -288 991 1381 462 -942 -1399 -704 519 966 406 -569 -1245 -841 303 872 1087
1680A087j098r60K38Q49J289j94q33j200k23J058Q30J38l45j371l58L31J072L71
$$ 1087 -11 -971 -733 116 1405 1211 378 -822 -1045 13 843 981 636 -735 -1093 -762 310 681
1698F81j08q46q68L22J007P08L65q19r96K2P73O94J43o65q78l38N49L73L94j8
$$ 681 573 -273 -1141 -819 188 896 1261 442 -554 -532 241 935 1078 413 -465 -803 -254 119 513 495
1718D95j046l11K11N69Q18r2o63o90J95M08P23M19n59n99j08K96K27K50k51p70
$$ 495 -551 -862 -651 -82 736 644 -19 -709 -514 -106 617 1036 477 -122 -230 66 293 543 292 -478
1738d78k27J85L05K70K09n29m55L02M77L31K08k82m78j2J03M64O27n65q19j57
$$ -478 -705 -520 -215 55 264 -265 -720 -418 59 390 598 316 -162 -174 -71 393 1020 455 -364 -521
1758e21J43M09J80j92l05k55N0L31K69j9j87j29J2N44K91j03j87o84L76j12M9
$$ -521 -378 31 211 19 -286 -541 -491 -160 109 90 -97 -226 -214 330 621 518 331 -353 23 -89 -40
1779d0J63K95j013O5K12L04K33k39n74P4M15L10j03M03n47j63J04K91L91j73Q0
$$ -40 123 418 -595 -530 -318 -14 219 -20 -594 -520 -105 205 102 505 -42 -205 -101 190 581 408 488
1800D88q51J54L29J86J04n60l81R2N74K5N00m57o41J3N85O10j98j17r92m4K67
$$ 488 -363 -209 120 306 410 -150 -531 -439 135 160 660 203 -438 -425 160 770 572 455 -537 -581 -314
1821c14O71M21m22n50m70J34P08J95P2r69m31N60N45L80K27o59p42j00J212L32
$$ -314 357 778 356 -194 -664 -530 178 373 445 -524 -955 -395 150 530 757 98 -644 -744 468 800
1841H00L8n52q46k50Q27N51J26k41j347j84M03R59N96m94q06q79M63J203N48J17
$$ 800 838 286 -560 -810 17 568 694 453 -894 -1078 -675 284 880 386 -420 -1299 -836 367 915 1032
1861A032j093q72N9J129R28k6p84j376j51O80J335K83q06j528m7O12J223Q90n70
$$ 1032 -61 -933 -874 255 1183 1157 373 -1003 -1154 -474 861 1144 338 -1190 -1237 -625 598 1488 918
1880I18j194j081N21J431P57K6j266j053kR24R38K43q20j441k11P11J691M3r31
$$ 918 -276 -1357 -836 595 1352 1378 112 -941 -943 -19 919 1162 342 -1099 -1310 -599 1092 1135 204
1899B04j126n01P51J412M83m29j087o28L70J034R21j34j353j198Q3J339Q61J54
$$ 204 -922 -1423 -672 740 1223 794 -293 -921 -551 483 1404 1270 -83 -1281 -1198 141 1002 1156
1917A156j320j022k73J066J350Q7p64j443J50P00J232N97j087q38o31N31J132
$$ 1156 -164 -1186 -1459 -393 957 1044 280 -1163 -1013 -313 919 1516 429 -409 -1040 -509 623
1934F23O27n09j365n40L12J137P10l18j240o61N23P89O98K0n26r15r1P43R19m1
$$ 623 1250 741 -624 -1164 -852 285 995 677 -563 -1224 -701 88 786 806 280 -635 -726 17 936 895
1954H95l81q17l62M95Q67O0o03m80m07K1N07M33M4o50l08L27P56L0l26m5l91K52
$$ 895 514 -303 -665 -170 697 757 154 -326 -733 -712 -205 228 272 -378 -686 -359 397 427 101 56 -335 -83
1976h3M94j6l9k95n41O4M33J54J6l51m74L66K45K77k1k13j32J4j2M65N3j02l54
$$ -83 411 395 356 61 -480 -416 17 171 187 -164 -638 -272 -27 250 229 16 -116 -102 -114 351 404 302 -52
1999e2L0M05l16M9M3o46L03l52O57J58k87k72J13J5J26K43j26j11L76q5k05q9
$$ -52 -22 383 67 116 159 -487 -184 -536 121 279 -8 -280 -167 -152 -26 217 91 -20 356 271 66 -23
2021b3J17K51k8j92j40n01N34l35O46l38l07l5J45N23r8j34m68J53M15l3J81j85
$$ -23 94 345 317 125 -15 -516 18 -317 329 -9 -316 -351 -206 317 219 85 -383 -230 185 152 333 148
2043A48k22M6M9N87p9m12m64k80j72J124L48n33o50j66K08N36M89J41p76j33m15
$$ 148 -74 -28 21 608 529 117 -347 -627 -799 325 673 140 -510 -676 -468 68 557 698 -78 -211 -626
2064f26R56P64k84m69j094J2P44O65J38o08j240j09P76J099k7m22q31o67O19J107
$$ -626 330 1094 810 341 -753 -741 3 668 806 198 -1042 -1151 -375 724 697 275 -556 -1223 -604 503
2084E03R06m69j325o01L19J433O93r14j035q81L84J307R52n15j410m95m6J092
$$ 503 1409 940 -385 -986 -667 766 1459 545 -490 -1371 -987 320 1272 757 -653 -1148 -1194 -102
2102a02J197Q4q95j219k36J079J048K12p09j167m20Q94Q66Q04r97j397k8K51J098
$$ -102 1095 1179 284 -935 -1171 -92 956 1168 459 -708 -1128 -234 632 1436 439 -958 -986 -735 363
2121C63K95j32r10q12L39J228O18Rj265n91K93P05J237o50p01q26j17Q79M41J6
$$ 363 658 526 -384 -1196 -857 371 989 998 -267 -858 -565 140 1377 727 26 -800 -917 -38 403 419
2141D19k93p16j06L55N59M58l78o65k42L09O75L72l53o92j91K34O32K05k12o18
$$ 419 126 -590 -696 -341 218 676 298 -367 -609 -300 375 747 394 -298 -489 -255 377 582 370 -248
2161b48r8l3M83Q9K15q44J04j25K93N09k4l31p0j4K42J79K10m82M7k40J23p3L01
$$ -248 -346 -379 104 193 408 -436 -332 -457 -164 345 321 -10 -80 -94 148 327 537 55 102 -138 -15 -88 213
2184B13l57J9O1l62M43J39L3l69J52K77Rk59Rk73K27k0L30j86j39K97j34l82k6
$$ 213 -144 -125 -64 -426 17 156 189 -180 -28 249 258 -1 8 -265 -38 -58 272 86 -53 244 110 -272 -298
2207b98K70KRJ87l00k08k3J57L84Q8j58j66J50J16kJ09k21l22k43M95J44J99k02
$$ -298 -28 -26 -17 170 -130 -338 -361 -204 180 268 110 -56 94 210 208 317 96 -226 -469 26 170 369 167
2230A67m66j1J8K51J47K5p2l52J05K25K76J70l63l78J57K63K32k08m32j33q8O89
$$ 167 -299 -310 -292 -41 106 131 59 -293 -188 37 313 483 120 -258 -101 162 394 186 -246 -379 -467 222
2252B22O9J43p93j12k37O95L63j51j64j17n89O93P56l3l54n53l24K66O21K34k84
$$ 222 291 434 -359 -471 -708 -13 350 199 35 -82 -671 22 778 745 391 -162 -486 -220 401 635 351
2273C51m25q29L12O54L31l2q56l01J52Q08M57Q5m13n99k5M43N88K04o36o72m65
$$ 351 -74 -903 -591 63 394 362 -494 -795 -643 165 622 707 294 -305 -330 113 701 905 269 -403 -868
2294h68P77L79L77n12p85j56K08Q75K36k19o04m08N16M47N91k53m91p12J71N88
$$ -868 -91 288 665 153 -632 -788 -580 295 531 312 -292 -700 -184 263 854 601 110 -602 -431 157
2314A57N13J2l44q91P8L25M10J54j41q95N6J09O94O22n50n37l45L25O41L15l11
$$ 157 670 682 338 -553 -475 -150 260 414 273 -622 -566 -457 237 859 309 -228 -573 -248 393 708 397
2335C97k52m12kL64L61k08j99m16j2N2O02J04j98o65O0J60N75L33m86j67m25J74
$$ 397 145 -267 -269 95 456 248 49 -367 -379 -327 275 379 181 -484 -424 -264 311 644 158 -9 -434 -260
2357b60M21NK49k98m53R7M59k4K42n64l18j81M04M51J94j85m07M0pM09pJ06m33
$$ -260 161 166 415 117 -336 -239 220 196 438 -126 -444 -625 -221 230 424 239 -168 -128 -135 274 267 373 -60
2380f0l23K03N96j97k96K37m85K06M4L23ok17m03J46M01L72l63m23J20N9p1M65
$$ -60 -383 -180 416 219 -77 160 -325 -119 -75 248 242 25 -378 -232 169 541 178 -245 -125 -66 -137 328
2402C28N7n41K39l32L84q7J36j87k07j14J03M52p3j31l55J52J31J04M80l75r7
$$ 328 385 -156 83 -249 135 48 184 -3 -210 -324 -221 231 158 27 -328 -176 -45 59 539 164 67
2423F7k81M43j82K40n4j5n90o7L98oP0j85m5j75O44NJ17n21j36K59J25k6M22l88
$$ 67 -214 229 47 287 233 218 -372 -439 -41 -47 23 -162 -207 -382 262 267 384 -137 -273 -14 111 85 507 119
2447A19k26j8r4L75pl4j93l9l70M01M9K90l24k96l8M63K48q3k8l80N5K73M9q8
$$ 119 -107 -125 -219 156 149 115 -78 -117 -487 -86 -37 253 -71 -367 -405 58 306 223 195 -185 -130 143 192 104
2471A04l9k83J79k76M66O6J96o87j34L1K06P52l61j08m75J0L23M32J5k24k17l49
$$ 104 65 -218 -39 -315 151 217 413 -274 -408 -377 -171 581 220 112 -363 -353 -30 402 417 193 -24 -373
2493c73N68J3M2k44j48m55L49J09L41J1m10l34ON98K97J21m59k89j6L60J32k2
$$ -373 195 208 250 6 -142 -597 -248 -139 202 213 -197 -531 -525 73 370 491 32 -257 -273 87 219 197
2515A97k64l45p4J73O27l5j72m08j73J09L83N45m04l60j09J31J70L22r5l63O2
$$ 197 -67 -412 -486 -313 314 279 107 -301 -474 -365 18 563 159 -201 -310 -179 -9 313 218 -145 -83
2536h3j33L14L14j85n94O5K14o9L20j96o3r4p8J79J27J7J66k81Q5K03q0m7K5j48
$$ -83 -216 98 412 227 -367 -302 -88 -157 163 -33 -96 -190 -268 -89 38 55 221 -60 25 228 148 101 126 -22
2560b2l63K61l5J86J34j34k87J08J23l3J74j14j48j6K82j27O1K4Q0j00j15K12
$$ -22 -385 -124 -159 27 161 27 -260 -152 -29 -62 112 -2 -150 -166 116 -11 50 74 154 54 -61 151
2582A51L5j80l17N06j92k41M58m11r1L60l36K00J80j43j99K10j77K99m8J46j27
$$ 151 186 6 -311 195 3 -238 220 -191 -282 78 -258 -58 122 -21 -220 -10 -187 112 64 210 83
2603H3Q2j49J86l03J99l42J49J7N2j44o5J64O4j87L42k75K80o6J88j77N0k39L18
$$ 83 165 16 202 -101 98 -244 -95 -78 -26 -170 -235 -71 -7 -194 148 -127 153 87 275 98 148 -91 227
2626B27J10k79P4o7k29m1Q2J41o8J74j34L08n00J38J92Lj09n7K88k54P8j40K19
$$ 227 337 58 132 65 -164 -205 -123 18 -50 124 -10 298 -202 -64 128 131 22 -35 253 -1 77 -63 156
2649A56k48O1k6J97k7Pk35MM26j26k87J51J9r6j24M13Mr6k18O5Pk7p0K0j94J65
$$ 156 -92 -31 -57 140 113 120 -115 -111 315 189 -98 53 72 -24 -148 265 269 173 -45 20 27 0 -70 -50 -244 -79
2675g9j07J86k2mj82j95K73K5L7P9r4O2O2J33K51o60O7j32J67J51J52J22m76j9
$$ -79 -186 0 -22 -26 -208 -403 -130 -105 -68 11 -83 -21 41 174 425 -235 -168 -300 -133 18 170 292 -184 -203
2699b03J14o5J56q3k0j93K19j22L76k08O1j29L2N3K91P5k36n77L76j27K2K63k25
$$ -203 -89 -154 2 -81 -101 -294 -75 -197 179 -29 32 -97 -65 -12 279 354 118 -459 -83 -210 -188 75 -150
2722a50p1j4J26J30q2r9j17j37M38N5K59l7j70j93j60M89K48m20l40o3J14J25
$$ -150 -221 -235 -109 21 -61 -160 -277 -414 24 79 338 301 131 -62 -222 267 515 95 -245 -308 -194 -69
2744f9K67nk98l38J14N19j05n7Q7k86J4J75K99o4m66J65k80N65m01L29q0j24k9
$$ -69 198 193 -105 -443 -329 190 85 28 115 -171 -157 18 317 253 -213 -48 -328 237 -164 165 85 -39 -68
2767f8j68K16M1J16l19k2M51k61K12K7k68o6K35J06k61L78k86q0k72K73M1j84
$$ -68 -236 -20 21 137 -182 -204 247 -14 198 225 -43 -109 126 232 -29 349 63 -17 -289 -16 25 -159
2789a59L2j28o6J56k2jm5NK81Q6J1j9O1j75R8p3R5KP4k48L3J8q0J46k55J84j08
$$ -159 -127 -255 -321 -165 -187 -188 -233 -228 53 139 150 131 192 17 115 42 137 139 213 -35 -2 16 -64 82 -173 11 -97
2816i7J82j98K06o6K09j83J30j61m8p9J60J64m8n7j86J33r3j47j89K23l5K98j12
$$ -97 85 -113 93 27 236 53 183 22 -26 -105 55 219 171 114 -72 61 -32 -179 -368 -145 -180 118 6
2839FJ98k23j69K40l57M89k26K71l59nj01N93j92j18l90J28j96P18K4l72Q2m65
$$ 6 204 -19 -188 52 -305 184 -42 229 -130 -135 -236 357 165 47 -343 -215 -411 307 331 -41 41 -424
2861d24K18K40JJ03j64n35N45P9L21k01k35j05J97K56L1K58r71n5L49j45O09j55
$$ -424 -206 34 35 138 -26 -561 -16 63 384 183 -52 -157 40 296 327 585 -386 -441 -92 -237 372 217
2883B17j84n63L67L22K77j86r2l79K1L83J84K13o70k99J2L52R4L67n09k40N1N8
$$ 217 33 -530 -163 159 436 250 158 -221 -200 183 367 580 -90 -389 -377 -25 69 436 -73 -313 -262 -204
2905b04N34J49m28l05j94J39N68M23m96m37j08j98P35K55k75n13k40K61L31K7
$$ -204 330 479 51 -254 -448 -309 259 682 186 -251 -359 -557 178 433 158 -355 -595 -334 -3 24
2925B4K39n98j23K27L72r8q5J39m36M3K94L24nK00p56j09L40J07K69l83k5m73
$$ 24 263 -335 -458 -231 141 43 -42 97 -339 -296 -2 322 317 517 -239 -348 -8 99 368 -15 -40 -513
2947e13J6P69l6l19n5r1K07K18J76j37j34l80K64J97j8J18k42k4j32R9J24K56
$$ -513 -497 272 236 -83 -138 -229 -22 196 372 235 101 -279 -15 182 164 282 40 16 -116 -17 107 363
2969C63k92k63L0K02K12j83k22J34k91K96j0L72l48j22m8K13J65K45l73j52K7
$$ 363 71 -192 -162 40 252 69 -153 -19 -310 -14 -24 348 0 -122 -170 43 208 453 80 -72 -45
2990d5J16r7J03p1k14Rj66J78M08j38p9l29K21L1K51q2J2k19P1K66k66mK1K9o5
$$ -45 71 -26 77 6 -208 -199 -365 -187 221 83 4 -325 -104 -73 178 96 108 -111 -40 226 -40 -44 -23 6 -59
3015e9j49K30k35L35q2P9R0j82L15l91l0K00l05L1J31J80m0k59n3o0K11L25j2
$$ -59 -208 22 -213 122 40 119 209 27 342 -49 -79 121 -184 -153 -22 158 118 -141 -194 -254 -43 282 270
3038B70l86j73J69p2J42m7J35J89j10PJ31j33O3k37r6K17j6P1m55N4J40n8M18
$$ 270 -116 -289 -120 -192 -50 -97 38 227 117 124 255 122 185 -52 -148 69 53 124 -331 -277 -137 -195 223
3061B23k97j83N56j93j31L06k78J50l92J35M6L4L29j30j13k40j01K28J62K71k95
$$ 223 -74 -257 299 106 -25 281 3 153 -239 -104 -58 -24 305 175 62 -178 -279 -51 111 382 87
3082H7O8j98k9M35k59Oj46J28j97L94j23k23PN0j18Q8J34qj29l87L73K09p6j06
$$ 87 155 -43 -72 363 104 110 -36 92 -105 289 166 -57 -50 0 -118 -30 104 96 -33 -420 -47 162 86 -20
3106b0k48R2J96o5L62O1n12K26j61K31jo6P5k92K0k19L10K88n1m10N0J78Oj09
$$ -20 -268 -176 20 -45 317 378 -134 92 -69 162 161 95 170 -122 -102 -321 -11 277 226 -184 -134 44 50 -59
3130e9p2R4j34J60K9K61J28l61l09K18J30j68J67lj81m0K19k93P4N7j63m2m5K94
$$ -59 -131 -37 -171 -11 18 279 407 46 -263 -45 85 -83 84 81 -100 -140 79 -214 -140 -83 -246 -288 -333 -39
3154c9K78j28o7J39l16K94q8P4o2m06L48L67n6k56o1j59q2K92n8n3j6j38k37P96
$$ -39 239 111 44 183 -133 161 73 147 85 -321 27 394 338 82 21 -138 -220 72 14 -39 -55 -193 -430 366
3178C66p9r6k81pL42k03j73L30l10P3pk98L74m8J33J8r3n7J97J17k04j35j17L92
$$ 366 287 191 -90 -97 245 42 -131 199 -111 -38 -45 -343 31 -17 116 134 41 -16 181 298 94 -41 -158 234
3202B34k08J5j67K53k15j72L22j88J90l47K37j02J36K09j1k42p0P0j70N68l02
$$ 234 26 41 -126 127 -88 -260 62 -126 64 -283 -46 -148 -12 197 186 -56 -126 -56 -226 342 40
3223D0j2k78M64l25J37J68j87j17M3j15N64j93k38j39O1K80k33q3p3K28j37J20
$$ 40 28 -250 214 -111 26 194 7 -110 -67 -182 382 189 -49 -188 -127 153 -80 -163 -236 -8 -145 -25
3245b5p6k0N9r7L01l30K09J94l94o7K36m2j63K21q9L7rJ33l88L19Q7m7k9O5J45
$$ -25 -101 -121 -62 -159 142 -188 21 215 -179 -246 -10 -52 -215 6 -83 -46 -55 78 -310 9 96 49 20 85 230
3270B30k14j05J93Q0k45J32j17l2j43J82l1K03k81P8J14Pj26J79l3k3J54k3k97
$$ 230 16 -89 104 184 -61 71 -46 -78 -221 -39 -70 133 -148 -70 44 51 -75 104 71 48 202 179 -118
3293a18J60j52j28M02J19k20N6r2J9l6j40L10p5k21p2j82R5K87J80k24J51j19
$$ -118 42 -110 -238 164 283 63 119 27 46 10 -130 180 105 -116 -188 -370 -275 12 192 -32 119 0
3315@J70k50K38k07NL2j23K42K94m08k05k4K04k25M50K1k82j4J24j73L82j79m5
$$ 0 170 -80 158 -49 -44 -12 -135 107 401 -7 -212 -236 -32 -257 193 214 -68 -82 42 -131 251 72 27
3338B7k98K02n4K0L65k49o5k16J74J23J02M1k51k97J64K28J29j20J15k55M0j09
$$ 27 -271 -69 -123 -103 262 13 -52 -268 -94 29 131 172 -79 -376 -212 16 145 25 140 -115 -75 -184
3360a84J1M09l99K27r0K21j47o5q2K9M0P4K51k80r3L18k47J30j26q1J33n3l06
$$ -184 -173 236 -163 64 -26 195 48 -17 -99 -70 -30 44 295 15 -78 240 -7 123 -3 -84 49 -4 -310
3383c10L79R9k2j57o4k23J14K05Q6k9k04n1J85K49n7j40r5J18l63N12j08Q0O9
$$ -310 69 168 146 -11 -75 -298 -184 21 107 78 -126 -177 8 257 200 60 -35 83 -280 232 124 204 273
3406B73l69J58j14M7O44p56%R0j60NL58J1m52J68j%M27N1l83j32j5J92K84kl12
$$ 273 -96 62 -52 -5 639 -117 -117 -27 -187 -182 176 187 -265 -97 -98 -98 329 380 -3 -135 -150 42 326 324 12
3431A2M2lJ46j82J07j08j78j13R7M41J64l13k19k85J33L04L24k6n97L03j49J07
$$ 12 54 51 197 15 122 14 -164 -277 -180 261 425 112 -107 -392 -259 45 369 343 -254 49 -100 7
3453GM33k47j73j87P6J97J39j18k92l61N2M02K30L63m68n81J90L92L28Ql77r8
$$ 7 440 193 20 -167 -91 106 245 127 -165 -526 -474 -72 158 521 53 -528 -338 54 382 390 13 -85
3475h5l49J56O91j09n57J08J5Q9L35k42J41k59k18j96N60J59J1l34j57L3L30L22
$$ -85 -434 -278 413 304 -253 -145 -130 -41 294 52 193 -66 -284 -480 80 239 250 -84 -241 -208 122 444
3497D44p1m98l30J26M04L26k5l29l10j00M7M60J80l00m33J7K72N88n9j12p95J52
$$ 444 373 -125 -455 -329 75 401 376 47 -263 -363 -316 144 324 24 -409 -392 -120 468 409 297 -498 -346
3519c46Q1K33M37j82l40j35k12M42N45J6o52l50q5L46M28J63l08m16J31L39K84
$$ -346 -265 -32 405 223 -117 -252 -464 -22 523 539 -113 -463 -548 -202 226 389 81 -335 -204 135 419
3540D19J5k51n81j67L72M59K79l92m68l1J53L76J09J50m76l66R4O07K85l33l54
$$ 419 434 183 -398 -565 -193 266 545 153 -315 -346 -193 183 292 442 -34 -400 -306 301 586 253 -101
3561a01m07L62K11J51o1k22j62k23M82O9l3k80J80k13K01L74j88J11l29l7MJ46
$$ -101 -508 -146 65 216 155 -67 -229 -452 30 99 66 -214 -34 -247 -46 328 140 251 -78 -115 -111 35
3583C5p4K82m11L13J66l81K28j16j65k9M1K14J08j07j35k50M35r6Q7p6j02k34
$$ 35 -39 243 -168 145 311 -70 158 42 -123 -152 -111 103 211 104 -31 -281 154 58 145 69 -33 -267
3605b67J2K06j4L2K29k85LJ89lJ06k55J11J16k01J34J67j95k33j22L41Pr1P4j04
$$ -267 -255 -49 -63 -31 198 -87 -84 105 102 208 -47 64 180 -21 113 280 85 -148 -270 71 78 -13 61 -43
3629d3k5l90M00J31j75K32k23J11k20K52j64L47l38m5j36J96J21J00R3l21O6N2
$$ -43 -68 -458 -58 73 -102 130 -93 18 -202 50 -114 233 -105 -150 -286 -90 31 131 224 -97 -31 21
3651B1K71r4j96j14M7j70L16JQ0j64k30J57J94J63%j42n59L54M9M41l75n2k39
$$ 21 292 198 2 -112 -65 -235 81 82 162 -2 -232 -75 119 282 282 140 -419 -65 -16 425 50 -2 -241
3674b41K98M4j01J84j89m5r7p0M11O8k70j33k98J73M48Q6j82q7j04j56N0N91l15
$$ -241 57 101 0 184 -5 -50 -147 -217 194 262 -8 -141 -439 -266 182 268 86 -1 -105 -261 -211 380 65
3697F5r7j14m32O21lL08j04n02k8L51P7L66m17l00l8j8M34J76j77j79l0J87R2
$$ 65 -32 -146 -578 43 40 348 244 -258 -286 65 142 508 91 -209 -247 -265 169 345 168 -11 -41 146 238
3720B38q7J28l06j94j75J69N07l38N6l26J92Q8M07j67J09o67K02Q8L85L92m95
$$ 238 151 279 -27 -221 -396 -227 280 -58 -2 -328 -136 -48 359 192 301 -366 -164 -76 309 701 206
3741B06o25Q0p1O37J95l43m04O4j12N59J96j86k00l39o9O55J8k15j6l08J18j07
$$ 206 -419 -339 -410 227 422 79 -325 -261 -373 186 382 196 -4 -343 -412 243 261 46 30 -278 -160 -267
3763b67O00K5l85l13L49J49o8K87l83j37r9o2L66pRj60k10K50L30r6J76o31k26
$$ -267 333 358 -27 -340 9 158 90 377 -6 -143 -242 -304 62 55 64 -96 -306 -56 274 178 354 -277 -503
3786e03M64J45L50l12j21l77J51J70K30J38j19l09J26J71k64q7Q9J29l77L47N9
$$ -503 -39 106 456 144 23 -354 -203 -33 197 335 216 -93 33 204 -60 -147 -58 71 -306 41 100
3807A00qM0l10o4K25J0J23l28j6M5J89K57q7k33oo9J26K4Q6N4L6l38K52p4j68
$$ 100 92 132 -178 -242 -17 -7 116 -212 -228 -183 6 263 176 -57 -63 -132 -6 18 104 158 194 -144 108 34 -134
3832a34J43J23j86q0JL34j42j17J18k90K01p5J80j21j27J98n2J43O1n3k25M1k8
$$ -134 9 132 -54 -134 -133 201 59 -58 60 -230 -29 -104 76 -45 -172 26 -26 117 178 125 -100 -59 -87
3855h7J5K17m55J24M5J55j26M98k10k9n1NK3m53L50n0N0l5Q5j04J40J01j41l0
$$ -87 -72 145 -310 -186 -141 14 -112 386 176 147 96 101 124 -329 21 -29 21 -14 71 -33 107 208 67 37
3879C7o6l27K91k11L55J3k69R7j06J70R0n0k44J81m38M19R7J29k30k8k74J04K84
$$ 37 -29 -356 -65 -276 79 92 -177 -80 -186 -16 74 24 -220 -39 -477 -58 39 168 -62 -90 -364 -260 24
3902B4j07J77o0k03n8O34p4j32k72K8m6R2L62j55n98J47J32K45L25l68Mn09M58
$$ 24 -83 94 34 -169 -227 407 333 201 -71 -43 -89 3 365 210 -388 -241 -109 136 461 93 97 -412 46
3925D6O3M96o03J73q8m21J60N7L73j97m12j17N27K44J4k68k69P4k21L79L51L6
$$ 46 109 605 2 175 87 -334 -174 -117 256 59 -353 -470 57 301 315 47 -222 -148 -369 10 361 397
3947C97n22l24K42L67J32j10m68R0J2K02K70j17l34L9k80O76l0%l62l49J57L48
$$ 397 -125 -449 -207 160 292 182 -286 -196 -184 18 288 171 -163 -124 -404 272 242 242 -120 -469 -312 36
3969C6K99q1l75k71J97o1P34k03j74n05O8K99L49o6j99l06k10N91J10P4k98N8
$$ 36 335 254 -121 -392 -195 -256 478 275 101 -404 -336 -37 312 246 47 -259 -469 122 232 306 8 66
3991F6o10K12M09J49j67j29j82L05m1L23k28r7m90K05M44L6jk86k12J37J22J40
$$ 66 -544 -332 77 226 59 -70 -252 53 12 335 107 10 -480 -275 169 205 204 -82 -294 -157 -35 105
4013A05mk3l01K27K0M03Mm97k9k61L90J98l72J57K30l36R1J84K2j89q2p2K09J55
$$ 105 101 78 -223 4 24 427 431 -66 -95 -356 34 232 -140 17 247 -89 2 186 208 19 -63 -135 74 229
4037B29j34K2j3l41n8L61K25k74pk75L28m2k01O36m39N6j93m2M27r5r4n0o5k48
$$ 229 95 117 104 -237 -295 66 291 17 10 -265 63 21 -180 456 17 73 -120 -162 265 170 76 26 -39 -287
4061b87K47K18k40J28Lk06L18j39r3k7L4r7mPK82j18l5l17J14K15R4J40J52p21
$$ -287 -40 178 -62 66 69 -137 181 42 -51 -78 -44 -141 -145 -138 144 26 -9 -326 -212 3 97 237 389 -332
4085c32L62l4K32n3j05k59K76K1N7P5n3l91j74K63K53j42J65K03m18j6j15M50
$$ -332 30 -4 228 175 70 -189 87 108 165 240 187 -204 -378 -115 138 -4 161 364 -54 -70 -185 265
4107B65j61j52j93k24M00M95j10j58o05L16J4N65q6l57l18L20n7O31l14N1n19
$$ 265 104 -48 -241 -465 -65 430 320 162 -443 -127 -113 452 366 9 -309 11 -46 585 271 322 -197
4128a97p8M1N62J72l53k45l39P4l1Q41n07O9J09n26M26M30n1l81j80k59L62J40
$$ -197 -275 -234 328 500 147 -98 -437 -363 -394 447 -60 9 118 -408 18 448 397 16 -164 -423 -61 79
4150G9J42k60j22k81J57L13L08N7q77m6K37L31K46J43m77j59l2N68J14j25m40
$$ 79 221 -39 -161 -442 -285 28 336 393 -484 -530 -293 38 284 427 -50 -209 -241 327 441 316 -124
4171a24J2k80M55K26K58o33N1j42L69K44l32j59l00Q3J33M19j48J39n22K02M1
$$ -124 -112 -392 63 289 547 -86 -35 -177 192 436 104 -55 -355 -272 -139 280 132 271 -251 -49 -8
4192hJ60K49j36m57k85L96j53M84j3k29l18L85R2L0Q8l79l07J75M89o5J79j16
$$ -8 152 401 265 -192 -477 -81 -234 250 237 8 -310 75 167 197 285 -94 -401 -226 263 198 377 261
4214B61l33p0N2Q2K77k50k34J02K23J11J88k84k92j28N30J00k59k73R7J45j5J9
$$ 261 -72 -142 -90 -8 269 19 -215 -113 110 221 409 125 -167 -295 235 335 76 -197 -100 45 30 49
4236D9J27j79k80J06R3L45p5n9j0l68K62j75K33K77o58K98mj54K84M9r1j41J36
$$ 49 176 -3 -283 -177 -84 261 186 127 117 -251 11 -164 69 346 -312 -14 -18 -172 112 161 70 -71 65
4259F5k16J82K7K61j81l36J31j69N63k80j90j41J13N78j54o0l35J09j59K30j10
$$ 65 -151 31 58 319 138 -198 -67 -236 327 47 -143 -284 -171 407 253 193 -142 -33 -192 38 -72
4280g2J50L3l69J91m3K48j6j12K7j58J78J46Kj22m30J80J12ln7J38q7M9%N4j98
$$ -72 78 111 -258 -67 -110 138 122 10 37 -121 57 203 205 83 -347 -167 -55 -58 -115 23 -64 -15 -15 39 -159
4305a59K65m6k93K38r3J12J51J73n08J40r3L46J0j02k31J75K2j62J61r6L1l62
$$ -159 106 60 -233 5 -88 24 175 348 -160 -20 -113 233 243 141 -90 85 107 -55 106 10 41 -321
4327c21K19P0M3j36K71j00j72r5N40k72j81N4J20j88Q8L99O7m67J7j10O0J66J89
$$ -321 -102 -32 11 -125 146 46 -126 -221 319 47 -134 -80 40 -148 -60 339 406 -61 -44 -154 -94 72 261
4350B61k07j1l12L11n7M1l1j03j2R3m8Q2k33p7L33j21M7J15j88k1J34k01J70J64
$$ 261 54 43 -269 42 -15 26 -5 -108 -120 -27 -75 7 -226 -303 30 -91 -44 71 -117 -138 -4 -205 -35 129
4374A29M1k09J26j40L17l12K57m79pJ59j01J01L51m08K12j92j32M65l68L05n7
$$ 129 170 -39 87 -53 264 -48 209 -270 -277 -118 -219 -118 233 -175 37 -155 -287 178 -190 115 58
4395E8j75J72j32L54l78N0r7M2K36o2O9k9k74R3m7P5K8j55M03m58K3L05K12l80
$$ 58 -117 55 -77 277 -101 -51 -148 -106 130 68 137 108 -166 -73 -120 -45 -17 -172 231 -227 -204 101 313 -67
4419f7K41pr2P9O3o4l27J61j1j38L55l28M17k93m0j06K8O8k34L73k65L49M8r3
$$ -67 174 167 75 154 217 153 -174 -13 -24 -162 193 -135 282 -11 -51 -157 -129 -61 -295 78 -187 162 210 117
4443A17k62P2R4j98l3J92J52n8l67J50K62K6N3o67K52j4M16l6K41m32j78m1O5
$$ 117 -145 -73 21 -177 -210 -18 134 76 -291 -141 121 147 200 -467 -215 -229 187 151 392 -40 -218 -259 -194
4466a94K19J29l16J92l6oJ34j51O4l43K64q3K41K11j81k93j0J24J60J60k64j44
$$ -194 25 154 -162 30 -6 -12 122 -29 35 -308 -44 -127 114 325 144 -149 -159 -35 125 285 21 -123
4488a23J57M2j03L02k23l78J39r6J57M78k58k80j54L03O7r7O1j97L27J1J08j07
$$ -123 34 76 -27 275 52 -326 -187 -283 -126 352 94 -186 -340 -37 30 -67 -6 -203 124 135 243 136
4510A36k36M8M7Q2L96n87K11k07J56j64LK05L7k3j47l7j48M61l14j04m1j07L13
$$ 136 -100 -52 -5 77 473 -114 97 -110 46 -118 -115 90 127 104 -43 -80 -228 233 -81 -185 -226 -333 -20
4533b0K48j64J30k83Q2j00K05K60m88J06n3k30K84N9k91j0L20q7L6J34N6j17L1
$$ -20 228 64 194 -89 -7 -107 98 358 -130 -24 -77 -307 -23 36 -255 -265 55 -32 4 138 194 77 108
4556A08K42l62m7k8j76L96K4j86l98M61j01P6J27k17k48L45J77k36N2j20J56L3
$$ 108 350 -12 -59 -87 -263 133 157 -29 -427 34 -67 9 136 -81 -329 16 193 -43 9 -111 45 78
4578G8n0r2n5O0J37R6k92K70m34K46j67r3J21L07q1j54K1J94j98J72M5j05j30
$$ 78 28 -64 -119 -59 78 174 -118 152 -282 -36 -203 -296 -175 132 51 -103 -82 112 -86 86 131 26 -104
4601a04J08j82L14R5l74k63K53J17K20j9ok70k90K49p7N46k74k25n9mN23q2k54
$$ -104 4 -178 136 231 -143 -406 -153 -36 184 165 159 -111 -401 -152 -229 317 43 -182 -241 -245 278 196 -58
4624e8Q4m64K97l0K43j8P3j15k20o0K62J05j30j08l06K55N10L1n24R8j45K52M0
$$ -58 26 -438 -141 -171 72 54 127 12 -208 -268 -6 99 -31 -139 -445 -190 320 351 -173 -75 -220 32 72
4647G2o7m3l90L51j10N03Q5m99j11k5J11K83P4k11l09L28m26N23N49p34J02m05
$$ 72 5 -38 -428 -77 -187 316 401 -98 -209 -234 -123 160 234 23 -286 42 -384 139 688 -46 56 -349
4669c49J33M23k2K93o16l31M32j61N11P4k34m16N3R7N83m53lj31oJ07K51r4l7
$$ -349 -216 207 185 478 -138 -469 -37 -198 313 387 153 -263 -210 -113 470 17 14 -117 -123 -16 235 141 104
4692A04j76j69J58J78R3k10j35k89K73K49L81l19j66k60J43M89J27k54Kl55J98
$$ 104 -72 -241 -83 95 188 -22 -157 -446 -173 76 457 138 -28 -288 -145 344 471 217 219 -136 62
4713F2k09K81M06p13R2j4K81r5K0Q9n59K23J26Q1K39l02n4k15J86L53N0m09J85
$$ 62 -147 134 540 -173 -81 -95 186 91 111 200 -359 -136 -10 71 310 8 -46 -261 -75 278 328 -81 104
4736A04l52M5J19M09k04p7k58L35k9J65M2r2m99M71k58J59J8Pj69k15K74K68j56
$$ 104 -248 -203 -84 325 121 44 -214 121 92 257 299 207 -292 179 -79 80 98 105 -64 -279 -5 263 107
4759A07J03k24l09M16j73K95r2j11q6N2J03j28J70m6p8k21K55J52n7m1j62j0j22
$$ 107 210 -14 -323 93 -80 215 123 12 -74 -22 81 -47 123 77 -1 -222 33 185 128 87 -75 -85 -207
4782b07O5J75j6p9J29k58J16M07k82J49l03Q4k77M37N3k44Qj3N1q2K37p6r3o1
$$ -207 -142 33 17 -62 67 -191 -75 332 50 199 -104 -20 -297 140 193 -51 -43 -56 -5 -87 150 74 -19 -80
4806h0r0J23P1o1q8R5J1j35K70k65J52j18j14L11j01J32Q4k78n6N4J55K7K35n42
$$ -80 -170 -47 24 -37 -125 -30 -19 -154 116 -149 3 -115 -229 82 -19 113 197 -81 -137 -83 72 99 334 -208
4830b08J12k69N31J75J42m23k42j09L27J55P2k03m35M23j48M36Jl06n38M31K26
$$ -208 -96 -365 166 341 483 60 -182 -291 36 191 263 60 -375 48 -100 336 337 31 -507 -76 150
4851A50k54L44l31J91n08L30K44L13l77l12K43l85N22K33j06l75l60J43J02N30
$$ 150 -104 240 -91 100 -408 -78 166 479 102 -210 33 -352 170 403 297 -78 -438 -295 -193 337
4871C37J8l50k44J66K1L06oRj40o47L05K32L45l23l74J87L9L62J27k89n27J81
$$ 337 355 5 -239 -73 -52 254 248 257 117 -530 -225 7 352 29 -345 -158 -119 243 370 81 -446 -265
4893b65Q3J55L77m10k41K34q0L11J04q6k60k6k47M37L6J06j58n22P9L29O2J51
$$ -265 -182 -27 350 -60 -301 -67 -147 164 268 182 -78 -104 -351 86 122 228 70 -452 -373 -44 18 169
4915A69l52J28l14N85n7K0K31m17j86j59O49J65k29n38L4Q7K03J76R4l22l85L76
$$ 169 -183 -55 -369 216 159 179 410 -7 -193 -352 297 462 233 -305 -271 -184 19 195 289 -33 -418 -42
4937d2J28J26ml14j20j64M67j8J49k51O1l61M78p4K54k0l08l03K43J34J65k11
$$ -42 86 212 208 -106 -226 -390 77 59 208 -43 18 -343 135 61 315 295 -13 -316 -73 61 226 15
4959A5j34qj7J60K44l14J26m83K81L6L43j20j54K1j12Q2J6K42j0k87k63M26O7
$$ 15 -119 -127 -144 16 260 -54 72 -411 -130 -94 249 129 -25 -4 -116 -34 -18 224 214 -73 -336 90 157
4982A57O5o1l16K18K4j53J18J67k35J50k49K21j63L95k64k87J2K86M03n65J44
$$ 157 222 161 -155 63 87 -66 52 219 -16 134 -115 106 -57 338 74 -213 -201 85 488 -77 67
5003F7N2j09j85k7L05J7k13l08N21j82L50m6j97q0O2j57K81l6j83J22q1J76k58
$$ 67 119 10 -175 -202 103 120 -93 -401 120 -62 288 242 45 -35 27 -130 151 115 -68 54 -27 149 -109
5026a09L61m75K67j34L3M9K8L98m50o8l7O4l0L92k98l8q9m8K21Q5j03J13l18Q7
$$ -109 252 -223 44 -90 -57 -8 20 418 -32 -100 -137 -73 -103 289 -9 -47 -136 -184 37 122 19 132 -186 -99
5050i9L98q1l07Ml9k51M29J41J57j90j73K6J39L85m86r7j43n3M31R9k0n09L99
$$ -99 299 218 -89 -85 -124 -375 54 195 352 162 -11 15 154 539 53 -44 -187 -240 191 290 270 -239 160
5073A60l29J4K35n6mJ2m88M78j7M79m14l25O8k4J61K42N2l28k3K19R0Q6j3k29
$$ 160 -169 -155 80 24 20 32 -456 22 5 484 70 -255 -187 -211 -50 192 244 -84 -107 112 202 288 275 46
5097D6j92j74K40R9J58Q3n44k01K71J57K96l92K60k26j92M82J33Q4o08p6r1O58
$$ 46 -146 -320 -80 19 177 260 -284 -485 -214 -57 239 -153 107 -119 -311 171 304 388 -220 -296 -387 271
5119B71qK5l54k81l4K0P81k88k44J6j97L51K19j10k86p9k26K95J20J4K45m38k64
$$ 271 263 288 -66 -347 -381 -361 420 132 -112 -96 -293 58 277 167 -119 -198 -424 -129 -9 5 250 -188 -452
5142d52L26J96J56j8q5n90J13O35p3p7j4k97j35J04L41j13R6m39l8M68Q4r8Q2
$$ -452 -126 70 226 208 123 -467 -354 281 208 131 117 -180 -315 -211 130 17 113 -326 -364 104 188 90 172
5165A72p06K45J04K96L96p8m44k95L80k3L57k40J2k93j47J49M18l0m19L0q3J90
$$ 172 -534 -289 -185 111 507 429 -15 -310 70 47 404 164 176 -117 -264 -115 303 273 -146 -116 -199 -9
5187il3P1j2j12j53O6R7M36r1l69m0J30Q3rJ62m40J31Q1K32N2j69j39r1K7L16
$$ -9 -42 29 17 -95 -248 -182 -85 351 260 -109 -149 -19 64 55 217 -223 -92 -11 221 273 104 -35 -126 -99 217
5212B17j65j33K51j04n34K85J54R2J67k99k27J01L65o2J06j90q4J04j33j48L32
$$ 217 52 -81 170 66 -468 -183 -29 63 230 -69 -296 -195 170 108 214 24 -60 44 -89 -237 95
5233I5k19p0j15L06K8R9j47n8j36K2J45J26L5k0l30K56L1J73L9k86q5J9k08M47
$$ 95 -124 -194 -309 -3 25 124 -23 -81 -217 -195 -50 76 111 91 -239 17 48 221 260 -26 -111 -92 -300 147
5257A47N2n0k07l43J64N82j25j35j62M3n9K98K0k11j4j63j89K16L04K18l98k23
$$ 147 199 149 -58 -401 -237 345 220 85 -77 -34 -93 205 225 14 0 -163 -352 -136 168 386 -12 -235
5279b35j68N8P00L4l13K5m56j14L06N94n6n60L5j55M52J59j58k04k59q7K38M53
$$ -235 -403 -345 355 389 76 101 -355 -469 -163 431 375 -185 -150 -305 147 306 148 -56 -315 -402 -164 289
5301B89J29l76m76J43N07M4J92k14l62NN5L87K52l83l84Q0J34M67j13K4o23m68
$$ 289 418 42 -434 -291 216 260 452 238 -124 -119 -64 323 575 192 -192 -112 22 489 376 400 -223 -691
5323f91M76J84M01q6n37o8L9O82R2k86l05j27n1O7M96J77k58n15R7K58M16j5j79
$$ -691 -215 -31 370 284 -253 -321 -282 400 492 206 -99 -226 -277 -210 286 463 205 -310 -213 45 461 446 267
5346B67l10k22K87M90j58m14k7m52L15M98J1Q4m40l58L72K71J50m00k04Q7j35
$$ 267 -43 -265 22 512 354 -60 -87 -539 -224 274 285 369 -71 -429 -57 214 364 -36 -240 -153 -288
5367b88L79L12j79m23j36K20K46k23M52l42l15o4Q6M52K3l3n93L87j26M90j94
$$ -288 91 403 224 -199 -335 -115 131 -92 360 18 -297 -361 -275 177 200 167 -426 -39 -165 325 131
5388A31qk97J92q9J36K4J46n57l0L07N0J94O7l97kL1O1N6L21l78R1j15J89m3Q3
$$ 131 123 -174 18 -71 65 89 235 -322 -352 -45 5 199 266 -131 -133 -102 -41 15 336 -42 49 -66 123 80 163
5413A63o9n76Q9M89P1J11l15l16J86J30k9K40j44m51L47m5l2J51K1k76M22l03
$$ 163 94 -482 -393 96 167 278 -37 -353 -167 -37 -66 174 30 -421 -74 -119 -151 0 21 -255 167 -136
5435a36J35L6O3j21n9n5L08j22J16l29L05j74oj83K32J44j95M7j57L01n9k00J53
$$ -136 -1 35 98 -23 -82 -137 171 49 165 -164 141 -33 -39 -222 10 154 -41 6 -151 150 91 -109 44
5458D4j08j45J20p5N07l36J9k32O9M6K40m4k41n5K35O1J15J90m11j00j30L4L13
$$ 44 -64 -209 -89 -164 343 7 26 -206 -137 -91 149 105 -136 -191 44 105 220 410 -1 -101 -231 -197 116
5481A16K32j78q1j77nM3O0o9Jq1n7L26Q2J52n35j34N9N36r5q3K17m11q8O7K59
$$ 116 348 170 89 -88 -93 -50 10 -59 -58 -139 -196 130 212 364 -171 -305 -246 290 195 112 329 -82 -170 -103 156
5506A56j57J22l00l6J27L92K51j99p68J83J7K47L0J75m67j80J84N58n4k01K1j69
$$ 156 -1 121 -179 -215 -88 304 555 356 -412 -229 -212 35 65 240 -227 -407 -223 335 281 80 101 -68
5528f8k49N9N89n3k71k96k4L85Pj07K5K5k45L13m0J36Qj71l23j9M16J82k78j99
$$ -68 -317 -258 331 278 7 -289 -313 72 79 -28 -3 22 -223 90 50 186 194 23 -300 -319 97 279 1 -198
5552a98l27M79R7M12j44j75o02K08L56k7L81l50n55L01L15J35k86J38k24l29L27
$$ -198 -525 -46 51 463 319 144 -458 -250 106 79 460 110 -445 -144 171 306 20 158 -66 -395 -68
5573f8L27J8m58J59l42L01k8K87k95J60r0m2K53l27J68p0j53K7J06L93j46L6m45
$$ -68 259 277 -181 -22 -364 -63 -91 196 -99 61 -29 -71 182 -145 23 -47 -200 -173 -67 326 180 216 -229
5596b29L2K90P3k9k01j25kO8K50N6r1k37J27j34K03k05J77lr8J83l3j32K38j47
$$ -229 -197 93 166 137 -64 -189 -191 -123 127 183 92 -145 -18 -152 51 -154 23 20 -78 105 72 -60 178 31
5620C1k4MQ3p2r9J23Oj00J36QRJ6o0k07J75K0k3J49k28r5m0M18q4j76j39J63o2
$$ 31 7 11 94 22 -77 46 52 -48 88 96 105 121 61 -146 29 49 26 175 -53 -148 -188 230 146 -30 -169 -6 -68
5647f8K1O0o0J57l73J63K13p5K20k57L9K1l04K99j17K54j95j2j5l04M3K29J91
$$ -68 -47 13 -47 110 -263 -100 113 38 258 1 40 61 -243 56 -61 193 -2 -14 -29 -333 -290 -61 130
5670A30j71q6J95j53J94M6k49j3j50J39L74m55Q7J28k62K11J62J1n9k3P6j96L06
$$ 130 -41 -127 68 -85 109 155 -94 -107 -257 -118 256 -199 -112 16 -246 -35 127 138 79 56 132 -64 242
5693B42J31j89j92q7q0J02J40R1r1j13J56m6l63O55m23J37l2L8r4J47j87P4j79
$$ 242 373 184 -8 -95 -175 -73 67 158 67 -46 110 64 -299 356 -67 70 38 76 -18 129 -58 16 -163
5716a63K07P5k15J22k23J17q3J69N1j96J97m56N04j09L23n73K9J83L6j08L69k96
$$ -163 44 119 -96 26 -197 -80 -163 6 57 -139 58 -398 106 -3 320 -253 -224 -41 -5 -113 256 -40
5738d0j2j62J83j38L07LN9n87J78K48Q2K80j88m32J5J22K4J90j83J87l59L45L3
$$ -40 -52 -214 -31 -169 138 141 200 -387 -209 39 121 401 213 -219 -204 -82 -58 132 -51 136 -223 122 155
5761A55J43j13j7n76L46K15o6m3O8l41Q7K17J68l43J04m4q8K03J26l04K39j67
$$ 155 298 185 168 -408 -62 153 87 44 112 -229 -142 75 243 -100 4 -40 -128 75 201 -103 136 -31
5783c1J53j07L4M2j99J80l65L68N1j02j25O4o4j23O04l44J08j32r5Q4r6M32m94
$$ -31 122 15 49 91 -108 72 -293 75 126 24 -101 -37 -101 -224 380 36 144 12 -83 1 -95 337 -157
5806a57K12j80P8J54J7N9k25n8k8J83K97n53J36O1k88M27R2l15k47J66n3L59o3
$$ -157 55 -125 -47 107 124 183 -42 -100 -128 55 352 -201 -65 -4 -292 135 227 -88 -335 -169 -222 137 74
5829G4K2k44K30Kj29K22j7j12r8J84l09L82l35K48j64K44p9k48L71M6m23J5J15
$$ 74 96 -148 82 84 -45 177 160 48 -50 134 -175 207 -128 120 -44 200 121 -127 244 290 -133 -118 -3
5852cK79j91p7P0r6j53Q4J93j31l41L95j73J92k24R7j78J08j3R3o2L13l37J85
$$ -3 276 85 8 78 -18 -171 -87 106 -25 -366 29 -144 48 -176 -79 -257 -149 -162 -69 -131 182 -155 30
5875C0m0J82jl12K66Q7j36r5J43m10K22K17j74J5R3m9J6Lj47J12l49K37J73J07
$$ 30 -10 172 171 -141 125 212 76 -19 124 -286 -64 153 -21 -6 87 38 54 57 -90 22 -327 -90 83 190
5899A90l56J63k01J03L5J80Kj52J43j4r2r7O2o7l5M8J56J95j94j15K17m19K48
$$ 190 -166 -3 -204 -101 -66 114 116 -36 107 93 1 -96 -34 -101 -136 -88 68 263 69 -46 171 -248 0
5922@j7j1K32j25j65k22L90KJ17p5j46j52J10L23k79M9j63j69M02n1R0R9l43k48
$$ 0 -17 -28 204 79 -86 -308 82 84 201 126 -20 -172 -62 261 -18 31 -132 -301 101 50 140 239 -104 -352
5946c52J76M38j83j30Pk42K84J43J70k93l49K38K53q9J10K64o33J19j99M04R0
$$ -352 -176 262 79 -51 -44 -286 -2 141 311 18 -331 -93 160 71 181 445 -188 -69 -268 136 226
5967B26k72J75l13M7K44j65K18j77L2m5k55N29j85j68j4P4K30k68K79R5k56q8
$$ 226 -46 129 -184 -137 107 -58 160 -17 15 -30 -285 244 59 -109 -123 -49 181 -87 192 287 31 -57
5989e7oJ43k66L87l20j3K03k4K17l46J28O6j82J0L81m71j78K04R3K32j31j9L9
$$ -57 -63 80 -186 201 -119 -132 71 47 264 -82 46 112 -70 -60 321 -150 -328 -124 -31 201 70 51 90
6012I0n95M07J61K11k12K7k47J68J69j40N6l41K88k47K09J61r1n4j9k18L45R8
$$ 90 -505 -98 63 274 62 89 -158 10 179 39 95 -246 42 -205 4 165 74 20 1 -217 128 226
6034B26j06l83J29pK68qj13K58l34J00o5K61j99K14m94J25J50k01J81k89J21L36
$$ 226 120 -263 -134 -141 127 119 6 264 -70 30 -35 226 27 241 -253 -128 22 -179 2 -287 -166 170
6056A70k09L49j09j25j48j2K77K1p9j13l18o5L55J60j18k59P0K25k24j70M49j05
$$ 170 -39 310 201 76 -72 -84 193 214 135 22 -296 -361 -6 154 36 -223 -153 72 -152 -322 127 22
6078B2J74l77oK38kQ7k54J15o5P6m7N5L8J13k04k82N40k17m5o1Q2M7Q5j19lj35
$$ 22 196 -181 -187 51 49 136 -118 -3 -68 8 -39 16 54 167 -37 -319 221 4 -41 -102 -20 27 112 -7 -10 -145
6104a45P3M67m61K13l10M62n93J93L5J74m34L28l3J55n02M23R8j11o7J94k42J63
$$ -145 -72 395 -66 147 -163 299 -294 -101 -66 108 -326 2 -31 124 -378 45 143 32 -35 159 -83 80
6126H0j82J49l89M69L5j20qj29J0J64Q4l06JK11j05R4N2M6m89K40J92k68J0L34
$$ 80 -102 47 -342 127 162 42 34 -95 -85 79 163 -143 -142 69 -36 58 110 156 -333 -93 99 -169 -159 175
6150A75j55j92J40P7P5K0k31Q7J07j49M11l12L4k47K23J94j90k10n3L2L41j72
$$ 175 20 -172 -32 45 120 140 -91 -4 103 -46 365 53 87 -160 63 257 67 -143 -196 -164 177 5
6172EK06j61q0m2J32k2J73j91l15O8J2N02j32l71Q1O2K54j65L02j36o9j79j8o9
$$ 5 211 50 -30 -72 60 38 211 20 -295 -227 -215 287 155 -216 -135 -73 181 16 318 182 113 -66 -84 -153
6196a53L42M4n74L37N1l2j7qk09J33j67J63J29K41j75j1k71K77K24l57J56k89
$$ -153 189 233 -341 -4 47 15 -2 -10 -219 -86 -253 -90 39 280 105 94 -177 100 324 -33 123 -166
6218a66L1J04J11K37j17k10q4j52J04M61m06J13j03q5L77n1m25J85n4nJ88j37
$$ -166 -135 -31 80 317 200 -10 -94 -246 -142 319 -87 26 -77 -162 215 164 -261 -76 -130 -135 53 -84
6240h4L76p3l38MK52J73l12M8k86K17J18J83j98k01K02j07j2M26j88o43O94l68
$$ -84 292 219 -119 -115 137 310 -2 46 -240 -23 95 278 80 -121 81 -26 -38 388 200 -443 251 -117
6262a17J64P4j21j03rm3M43K8k72j50J24o0j36L09J71l03j97P3R9L67m67M10m45
$$ -117 47 121 0 -103 -112 -155 288 316 44 -106 18 -42 -178 131 302 -1 -198 -125 -26 341 -126 284 -161
6285a61j17K98Q6p9K95o99M16R3nJ57k44j36R5q8K27j10P9r5k43jM40j42J21j61
$$ -161 -278 20 106 27 322 -377 39 132 127 284 40 -96 -1 -89 138 28 107 12 -231 -232 208 66 187 26
6309B6k68L92j23N7p3K32k34j58J32L38m71K59k88K83N6K1k73J53o3O3q6L40m83
$$ 26 -242 150 27 84 11 243 9 -149 -17 321 -150 109 -179 104 160 181 -92 61 -2 61 -25 315 -168
6332a68P9J52R2m8j93R0k35N1K81j36j00J78j79k36K42K56J3k39J38Nl14Q2K73
$$ -168 -89 63 155 107 -86 4 -231 -180 101 -35 -135 43 -136 -372 -130 126 139 -100 38 43 -271 -189 84
6355H4k23K68j86L04k7j96k6j99K06j47J90J55m58K96j24J49q7j68l3J57J23K8
$$ 84 -139 129 -57 247 220 24 -2 -201 5 -142 48 203 -255 41 -83 66 -21 -189 -222 -65 58 86
6377H6J73l11M0j52j49M33j4j35K00q2j81J28K6J03j7k80j4M09k18o9j5k27N0
$$ 86 259 -52 -12 -164 -313 120 106 -29 171 89 -92 36 62 165 148 -132 -146 263 45 -24 -39 -266 -216
6400b16J06M53k79J22j84j10Q7N2J1N5k6R4nn7o5p5j08l84N60N7O2j38j25K1L7
$$ -216 -110 343 64 186 2 -108 -21 31 42 97 71 165 160 103 38 -37 -145 -529 31 88 150 12 -113 -92 -55
6425e5j57J80L09m06M3k0K74J25j56k33J31l29L54R1J02k98k21o0N43q4l0m6k77
$$ -55 -212 -32 277 -129 -86 -106 168 293 137 -96 35 -294 60 151 253 -45 -266 -326 217 133 103 57 -220
6448b20J72R6K45j76k53j62K14J70Q1k4rm89J41J23J57Q3k75l1k1J86P3P5k91
$$ -220 -48 48 293 117 -136 -298 -84 86 167 143 134 -355 -214 -91 66 149 -126 -157 -178 8 81 156 -135
6471a35o1j38L23K1L67k68L3j05k51J75K83K6m67k83M62j23o9N16j47k44j79L37
$$ -135 -196 -334 -11 10 377 109 142 37 -214 -39 244 270 -197 -480 -18 -141 -210 306 159 -85 -264 73
6493G3J40m5k99J1j27L59j90N3K48l43K29k42J80K76j66l82m7L25q4K10l2l02
$$ 73 213 168 -131 -120 -247 112 -78 -25 223 -120 109 -133 47 323 157 -225 -272 53 -31 179 147 -155
6515a55j49J67J25J05P3L2j66k8j24K52P5m0l60K9J25J46r6J94l77m2R5K12p0
$$ -155 -304 -137 -12 93 166 198 32 4 -120 132 207 167 -193 -164 -39 107 11 205 -172 -214 -119 93 23
6538B3r9K31j29j32rK48J03j75k0j64J64O9p2pk27J27Q6j08Q9L22l09J61o34O82
$$ 23 -76 155 26 -106 -115 133 236 61 41 -123 41 110 38 31 -196 -69 17 -91 -2 320 11 172 -462 220
6562B20K28o1l40q7k11L3J39rJ00p9N1o4j13Q3L15l77l8Q6k67L08L5K55k18k04
$$ 220 448 387 47 -40 -251 -218 -79 -88 12 -67 -16 -80 -193 -110 205 -172 -210 -124 -391 -83 -48 207 -11 -215
6586b15K06K29l0K0l21m30M67O5J23l6j41p0q1L93p9R8j47j91P1K11J17k72n0
$$ -215 -9 220 190 210 -111 -541 -74 -9 114 78 -63 -133 -214 179 100 198 51 -140 -69 142 259 -13 -63
6609f3j75Q0J34N5L7j17k67N7R0K14J52O9p96K63O6J56L38n8j40k20k28L61K15
$$ -63 -238 -158 -24 31 68 -49 -316 -259 -169 45 197 266 -530 -267 -201 -45 293 235 95 -125 -353 8 223
6632B23k16N5l88J52K04P4o6p3l75J93K48L92j42m67J16L8J09j21K02m78M50l19
$$ 223 7 62 -326 -174 30 104 38 -35 -410 -217 31 423 281 -186 -70 -32 77 -44 158 -320 130 -189
6654a89K14q0J10n4K0j15k54L65J69k85L46m42J97N9R1Or3k53L6J81M44k80o6
$$ -189 25 -55 55 1 21 -94 -348 17 186 -99 247 -195 2 61 152 158 65 -188 -152 29 473 193 127
6677A27k45l0J7L24K20k73k08l10L88Q1L45m99m15J64K23J62K71q7r6l26k9K60
$$ 127 -118 -148 -131 193 413 140 -68 -378 10 91 436 -63 -478 -314 -91 71 342 255 159 -167 -196 64
6699F4j02L0j93q9R1K55k41O03k27m47J31L78rp0n1m8k01J38L39k28l1l85J67
$$ 64 -38 -8 -201 -290 -199 56 -185 418 191 -256 -125 253 244 174 123 75 -126 12 351 123 92 -293 -126
6722a26J05L41r6j27J33n93L82k3J36jQ0n07K39L22j70j72M2k9j21K08K3K6l29
$$ -126 -21 320 224 97 230 -363 19 -4 132 131 211 -296 -57 265 95 -77 -35 -64 -185 23 46 72 -257
6745b57N9K09R5k47J73P3J6j22pk16M74j61Q0n7J7j97K8K34k08k14J19K19Q5j29
$$ -257 -198 11 106 -141 32 105 121 -1 -8 -224 250 89 169 112 129 -68 -40 194 -14 -228 -109 110 195 66
6769F6o2k4N6Kn3j29J67N3j71J24M1K1j81l3oJ04K60k01N5l22J62J59m40L15N1
$$ 66 4 -20 36 38 -15 -144 23 76 -95 29 70 91 -90 -123 -129 -25 235 34 89 -233 -71 88 -352 -37 14
6794A4O2M7m78L2L95o9K10m01MJ89K01k57j06l2J38K03o9j21P2m1J16j06mJ37
$$ 14 76 123 -355 -323 72 3 213 -188 -184 5 206 -51 -157 -189 -51 152 83 -38 34 -7 109 3 -1 136
6818A36n3Lk37J68l15J14L30P5j27p5k37K60K63k85j7j72K18k10K65k7N2j45j09
$$ 136 83 86 -151 17 -298 -184 146 221 94 19 -218 42 305 20 3 -169 49 -161 104 77 129 -16 -125
6841a25J16m1K0M1q8J59l59Q1J94J63j8r3n6j50R2L26p7l72K00J75j58J65l68
$$ -125 -9 -50 -30 11 -77 82 -277 -196 -2 161 143 50 -6 -156 -64 262 185 -187 13 188 30 195 -173
6864a73N18m89k64K68L85o2k88Q6M6l5J34K11k53q7n1Q6K91m32K16k75Q6O9K10
$$ -173 345 -144 -408 -140 245 183 -105 -19 27 -8 126 337 84 -3 -54 32 323 -109 107 -168 -82 -13 197
6887A97p7o3k60O2J49p3R8K52j66k17l7J97n9qQ0j68kN2L21Nj54m41J15L06O8
$$ 197 120 57 -203 -141 8 -65 33 285 119 -98 -135 62 3 -5 75 -93 -95 -43 278 283 129 -312 -197 109 177
6912A77q6j12M7k45J27L82j77j76j13J71J18O9j55o4R1m7N5N2j66Ro4j60L19P7
$$ 177 91 -21 26 -219 -92 290 113 -63 -176 -5 113 182 27 -37 54 7 62 114 -52 -43 -107 -267 52 129
6936A29J90k98j33J50k03R2J36o4m5Op0J95k56K59l48K96r1K62m28L12j12K39
$$ 129 319 21 -112 38 -165 -73 63 -1 -46 -40 -110 85 -171 88 -260 36 -55 207 -221 91 -21 218
6958B18k02m0K31m21M02q9j51J68l14K88J47j95J37j81j21M34Q4m89m1K32K0k67
$$ 218 16 -24 207 -214 188 99 -52 116 -198 90 237 42 179 -2 -123 311 395 -94 -135 97 117 -150
6980a50J96R7j01o5k30J24J29K12m5k13k46M23l7k32L1R8k87M1M42j30j28O9J58
$$ -150 46 143 42 -23 -253 -129 0 212 167 -46 -292 131 94 -138 -107 -9 -296 -255 187 57 -71 -2 156
7003A56l29P6K12J4k46M6k26J83Q2R8ml4J66j16k25Q1Q1j24K71l04K56qj27P0
$$ 156 -173 -97 115 129 -117 -71 -297 -114 -32 66 62 28 194 78 -147 -66 15 -109 162 -142 114 106 -21 49
7027D9l3l4K3r6J18j75q6L44o6l9j72N13n64L28j29jL86j97l24J25k2K09N1o3
$$ 49 16 -18 5 -91 27 -148 -234 110 44 5 -167 346 -218 110 -19 -20 366 169 -155 -30 -52 157 208 145
7051A45k74k90L80oL09N5m08j79J43J99K15j66k20J14k6j93J08J41j20k00m3J17
$$ 145 -129 -419 -39 -45 264 319 -89 -268 -125 74 289 123 -97 17 -9 -202 -94 47 -73 -273 -316 -199
7073a99J06n0J85J13q6J08q1J64j02k24J19N1j73K76j54j19K7m5R5qJ76m24K98
$$ -199 -93 -143 42 155 69 177 96 260 158 -66 53 104 -69 207 53 -66 -39 -84 11 3 179 -245 53
7096E3j14Q0K79m10L1k3J01JR2K7k13N0P7j65L35j76k7k68M3n3J74k9K34k6j87
$$ 53 -61 19 298 -112 -81 -104 -3 -2 90 117 -96 -46 31 -134 201 25 -2 -270 -227 -280 -106 -135 99 73 -114
7121a14L16j28L27o99L10Nj85J62J84k38K1P4k2m2J11j85J07LN7J1J89l64J73
$$ -114 202 74 401 -298 12 17 -168 -6 178 -60 -39 35 13 -29 82 -103 4 7 64 75 264 -100 73
7144G3l90J84M21l52K90O5l34j81L5L97L6k17nJ06n00K78j41L46l52N13n33K30
$$ 73 -317 -133 288 -64 226 291 -43 -224 -189 208 244 27 22 128 -372 -94 -235 111 -241 272 -261 -31
7166c1J19l7j20K08l77O0K49k00N7J51R6k13k4L1l4l1j24J15O9J20L0j56J8q9
$$ -31 88 51 -69 139 -238 -178 71 -129 -72 79 175 -38 -62 -31 -65 -96 -220 -105 -36 84 114 -42 -24 -113
7190a13K97k91n0L25l13k01M20n23L98J87n7j50J68k21K4L38l35M5J83j59N5J29
$$ -113 184 -107 -157 168 -145 -346 74 -449 -51 136 79 -71 97 -124 -100 238 -97 -52 131 -28 27 156
7212A56J9l40K41k93L46o2k78J76K50m40q2L54r6j1o1O3J82n2o7j35j12J29J81
$$ 156 175 -165 76 -217 129 67 -211 -35 215 -225 -307 47 -49 -60 -121 -58 124 72 5 -130 -242 -113 68
7235F8l9L55q8m73J61l28K90K30k00n4j62M46l57P4J24k72M46k04J10j18j66j9
$$ 68 29 384 296 -177 -16 -344 -54 176 -24 -78 -240 206 -151 -77 47 -225 221 17 127 9 -157 -176
7257a76o0J70K25J58m38o8L37j88L8j5J71j58j49j35K42l9o0K27j47J11k12J85
$$ -176 -236 -66 159 317 -121 -189 148 -40 -2 -17 154 -4 -153 -288 -46 -85 -145 82 -65 46 -166 19
7279A9Q2l91P25k72j50%K2PN0k45J11l3j2l4N64o01J41M0pQ8k36J17J38k19P3
$$ 19 101 -290 435 163 13 13 35 42 92 -153 -42 -75 -87 -121 443 -158 -17 23 16 104 -132 -15 123 -96 -23
7304b3J06oJ36p2j73j66J34K29k71j21O2K72k90L93k15n1K42l22l5K79l04j4J90
$$ -23 83 77 213 141 -32 -198 -64 165 -106 -227 -165 107 -183 210 -5 -56 186 -136 -171 108 -196 -210 -20
7327b0J19n0Kn4j9L00n46L05K30k72j31p5K98l20J10L33j54j8K1m6p0Q6l6q1K47
$$ -20 99 49 51 -3 -22 278 -268 37 267 -5 -136 -211 87 -233 -123 210 56 38 59 13 -57 29 -7 -88 159
7352A59r0k55J74k6J99k47k41L99K14j31o4j72j5J17K57m44M19m53M92k10k29
$$ 159 69 -186 -12 -38 161 -86 -327 72 286 155 91 -81 -96 21 278 -166 253 -200 292 82 -147
7373a47R0K29J6k58J58q3n5J50n37L43K5J62J34j13M9k72L10j25k22K27j57J19
$$ -147 -57 172 188 -70 88 5 -50 100 -437 -94 -69 93 227 114 163 -109 201 76 -146 81 -76 43
7395D3rK6j72L8O9j36j22J12M21k50K85m80r3L40n3k2J01J98n25nJ45k06N54j39
$$ 43 34 60 -112 -74 -5 -141 -263 -151 270 20 305 -175 -268 72 19 -3 98 296 -229 -234 -89 -295 259 120
7419A20m20K28O3M9J24J00n83J75j5M5K69l12m8L4M01k85R2j16K1j38J18K01o3
$$ 120 -300 -72 -9 40 164 264 -319 -144 -159 -114 155 -157 -205 -171 230 -55 37 -79 -58 -196 -78 123 60
7442F0R4O5j78j18o6R2J93l05K13k52K13o9L27l23m0J13l80M02j6J63j90l09K54
$$ 60 154 219 41 -77 -143 -51 142 -163 50 -202 11 -58 269 -54 -94 19 -361 41 25 188 -2 -311 -57
7465e7q4L35r2l00j03K89j2J42R%k20J3M1J17j97K23l29J85j46K52J9Nj84J02
$$ -57 -141 194 102 -198 -301 -12 -24 118 127 127 -93 -80 -39 78 -119 104 -225 -40 -186 66 85 90 -94 8
7489HJ11m7j80M5K04k29P6K05q1O9p8O8r2M4j21Q4J59m84K69j66R4K35q7k5J0
$$ 8 119 72 -108 -63 141 -88 -12 193 112 181 103 171 79 123 2 86 245 -239 30 -136 -42 193 106 81 91
7514I1J7n4j79O1J25l94K72L78k67J39m03K39j45L14j66L0J14j45j31K51K9j91
$$ 91 108 54 -125 -64 61 -333 -61 317 50 189 -214 25 -120 194 28 58 172 27 -104 147 176 -15
7536a5P0n1L03m09J4J31J19m24j2J59L77j73j28N2j71J83J6p3N2k0J62l13L38
$$ -15 55 4 307 -102 -88 43 162 -262 -274 -115 262 89 -39 13 -158 25 41 -32 20 0 162 -151 187
7559A87m8m5k53j5O5n1J03k23J77Lj14J88k87J44J00pK81k35K49k38l51N74j9
$$ 187 139 94 -159 -174 -109 -160 -57 -280 -103 -100 -214 -26 -313 -169 -69 -76 205 -30 219 -19 -370 204 185
7582A85j22K42j21l10o9RJ44o5J43J56k90J61j01l19O55k20L5k26p5K01L07l13
$$ 185 63 305 184 -126 -195 -186 -42 -107 36 192 -98 63 -38 -357 298 78 113 -113 -188 13 320 7
7604Gm9j9K11j24K65j66j35Nn16P46k42J61k90J27j36J59QJ48j05j2j38j80J5
$$ 7 -42 -61 150 26 291 125 -10 -5 -521 225 -17 144 -146 -19 -155 4 12 160 55 43 -95 -275 -260
7627b60M39o4l29L87lk24O9P8N0k21r2N2K01J46j96j17K4k3K5K04m00K73j83K19
$$ -260 179 115 -214 173 170 -54 15 93 143 -78 -170 -118 83 229 33 -84 -60 -83 -58 146 -254 19 -164 55
7651E5OK2N9k45O5k67N33j01J2J59m78K31N5o5j86K62j75R8l3n7J28M0p5j74K47
$$ 55 61 83 142 -103 -38 -305 228 127 139 298 -180 51 106 41 -145 117 -58 40 7 -50 78 118 43 -131 116
7676A16l1Q8q8k04j19M09j4l4J5k60l44M21K29j95j54L99l35L5M31k21J26m56
$$ 116 85 173 85 -119 -238 171 157 123 138 -122 -466 -45 184 -11 -165 234 -101 -66 365 144 270 -186
7698a86q7L08q2L00l26K6J22j6j68K22j25k00K04j43K20L1%j99P2J05l60KL82
$$ -186 -273 35 -47 253 -73 -47 75 59 -109 113 -12 -212 -8 -151 69 100 100 -99 -27 78 -282 -280 102
7721A02j03J22j70J25p1O6K5j78PM5k92K46J42K20o72L18K43j25r8o2J66j03k2
$$ 102 -1 121 -49 76 5 71 96 -82 -75 -30 -322 -76 66 286 -386 -68 175 50 -48 -110 56 -47 -69
7744f9M3N3Q1p4m6j08J58N7o5j61m2jRN8K23m12o3L05P5r3J44Qj26J47N9m02N
$$ -69 -26 27 108 34 -12 -120 38 95 30 -131 -173 -174 -165 -107 116 -296 -359 -54 21 -72 72 80 -46 101 160 -242 -237
7771b37K35k50K34m4jJ34k9rj9j6M06l66O4K7k09K4K16l09K30n6J53l42j17J65
$$ -237 -2 -252 -18 -62 -63 71 42 33 14 -2 404 38 102 129 -80 -56 160 -149 81 25 178 -164 -281 -116
7795a16J74o9J80p8r0r4P6j35J39k80J91K0K14N2m48J26j3L28k26L90j73m26J85
$$ -116 58 -11 169 91 1 -93 -17 -152 -13 -293 -102 -82 132 184 -264 -138 -151 177 -49 341 168 -258 -73
7818g3OL51k25m4M9K9r3R4K0oj05r8p9J68K9j13K14k56q3K94k38K24k38N7k10
$$ -73 -67 284 59 15 64 93 0 94 114 108 3 -95 -174 -6 23 -90 124 -132 -215 79 -159 65 -173 -116 -326
7843c26N04K3j37n7m2K06j47K05r9r7m20L36j22O1K92k76K47k06M2L5M4K49k54
$$ -326 178 201 64 7 -35 171 24 229 130 33 -387 -51 -173 -112 180 -96 151 -55 -13 22 66 315 61
7866F1j85m7K6L41r3k90L02J15l70M18j21j14j1J29j22J06j06p3M7k09M19j81
$$ 61 -124 -171 -145 196 103 -187 115 230 -140 278 157 43 32 161 39 145 39 -34 13 -196 223 42
7888D2m3o1K86l62K45Q7j98K2j60L3J3J02o6J36P6p0j89J12J61j79J38l42J26
$$ 42 -1 -62 224 -138 107 194 -4 18 -142 -109 -96 6 -60 76 152 82 -107 5 166 -13 125 -217 -91
7911i1j55K66l35N86l28P6O0p3J11k61n0K85j47N0P1j51R1M5j01J02lQ1j00O0
$$ -91 -246 20 -315 271 -57 19 79 6 117 -144 -194 91 -56 -6 65 -86 5 50 -51 51 48 129 29 89
7935H9qm5m0J28m03L06l58L20M0p2J03l74j4L39o1j70M01m15M3mL77j18k08J85
$$ 89 81 36 -4 124 -279 27 -331 -11 29 -43 60 -314 -328 11 -50 -220 181 -234 -191 -195 182 64 -144 41
7959D1j70p8K21O4J67l21r3p0K88J68j96q0n5K18k53L10m9j0k15J77r6J19Q0O6
$$ 41 -129 -207 14 78 245 -76 -169 -239 49 217 21 -59 -114 104 -149 161 112 102 -113 64 -32 87 167 233
7983B33k41j23j1k5K6P7K54k61J45j6j29j65L27J53q5l24k3k2L58j60mk00J29
$$ 233 -8 -131 -142 -167 -141 -64 190 -71 74 58 -71 -236 91 244 159 -165 -188 -210 148 -12 -16 -216 -87
8006h7J11J42k25o5p8L13J30j65j32j78j3K39j10L28j54N3k56j33K78J20j20k37
$$ -87 24 166 -59 -124 -202 111 241 76 -56 -234 -247 -8 -118 210 56 109 -147 -280 -2 118 -2 -239
8028b39M6J79J93M3Q9l70j5j27P5J41K31l89J08L0r7J18J33M5j61KJ11p0l4n8
$$ -239 -193 -14 179 222 311 -59 -74 -201 -126 15 246 -143 -35 -5 -102 16 149 194 33 35 146 76 42 -16
8052a6Q9j52L6J43K79k59N8j30j80J73MM0j91r6K17ro7J31J05j5n2l32M8K46K5
$$ -16 73 -79 -43 100 379 120 178 48 -132 41 45 85 -106 -202 15 6 -61 70 175 160 108 -224 -176 70 95
8077I5jl18J02J9M20l09K48l49K48l35K43J66j86L6j30L71l10N5n8j43J56k30
$$ 95 94 -224 -122 -103 317 8 256 -93 155 -180 63 229 43 79 -51 320 10 65 7 -136 20 -210
8099b10J49l4J37j46k79K2M84k88L61r3j41O3l6K76j44j37j28J21K41j57m9l7
$$ -210 -61 -95 42 -104 -383 -361 123 -165 196 103 -38 25 -11 265 121 -16 -144 -23 218 61 12 -25
8121b5j57m6L88J30N9k67j14K14j88O9p9k7q2J90l01O11k9q2n12k9J55J89j7l12
$$ -25 -182 -228 160 290 349 82 -32 182 -6 63 -16 -43 -125 65 -236 375 346 264 -248 -277 -122 67 50 -262
8145b62L31m20N12l81J62J95K34m60K86j40j54J08R5J9k48k43M91J9j20k10K34
$$ -262 69 -351 161 -220 -58 137 371 -89 197 57 -97 11 106 125 -123 -366 125 144 24 -186 48
8166D8k49K66j95J71J67j67J26j22j99K35k43J81j75L40K69p54L60j94M06l94
$$ 48 -201 65 -130 41 208 41 167 45 -154 81 -162 19 -156 184 453 -301 59 -135 271 -123
8186a23K83k6P7l65Q9
$$ -123 160 134 211 -154 -65
8191f5
$$ Imaginary data points
##PAGE= N=2
##DATA TABLE= (X++(I..I)), XYDATA
0@%%%%%%%qQqJ6j6K4l2M0n6O6p5R7j20J44j76K08k41K82l30L85m49N18n94O81
$$ 0 0 0 0 0 0 0 0 -8 0 -8 8 -8 16 -16 24 -32 34 -41 56 -64 80 -96 112 -129 153 -177 208 -241 277 -317 364
31C64p78Q84j004J135j278J439j616J807k017K247k498K774l074L400l761M154
$$ 364 -414 470 -534 601 -677 762 -854 953 -1064 1183 -1315 1459 -1615 1785 -1976 2178
47B178m579N049n563O128o755P443q206R062j0024J1113j2358J3794j5476J7480
$$ 2178 -2401 2648 -2915 3213 -3542 3901 -4305 4757 -5267 5846 -6512 7282 -8194 9286
61I286j9911K2935k6814L1998l9320N0522o9973J13126l79446J77515O52365m38833
$$ 9286 -10625 12310 -14504 17494 -21826 28696 -41277 71849 -307597 -130082 522283 83450
73H3450j31275N9214k25849p6372M72846J47204k57272k12272j1850l29J50022
$$ 83450 -47825 11389 -214460 -290832 182014 329218 71946 -140326 -152176 -152505 -2483
84b483K56064L1350m04974k29263K67639K32475m8211M0500q7507l03202J8346
$$ -2483 253581 284931 -120043 -349306 -81667 150808 102597 143097 55590 -247612 -229266
95b29266L28088R9923p1709j34338j85678M5922K15431K2562Q705K9096k41222
$$ -229266 98822 198745 127036 -7302 -192980 -147058 68373 90935 99640 128736 -112486
106a12486j68794K67367K30159p9810j27793j17589p6810J41426K06108k060j74955
$$ -112486 -281280 -13913 216246 136436 8643 -108946 -185756 -44330 161778 159718 -15237
117a5237j25685N3136J01696R877N5820N3848j91215j60031J93619J76752q1951
$$ -15237 -140922 -87786 13910 23787 79607 133455 -57760 -217791 -24172 152580 70629
128G0629o1713k4707r7787L8120J71908J7966j24215o3174K5780L7101J9172L6625
$$ 70629 8916 -15791 -113578 -75458 96450 114416 -9799 -72973 -47193 -10092 9080 45705
140D5705K0019r2471p9224R4094Q3026n4528r562K1264q0380j5493J15675K2931
$$ 45705 65724 -26747 -105971 -11877 71149 16621 7059 28323 -52057 -67550 48125 71056
152G1056p5280j9648r73p533N0360L5214n0689m2315K1562K0792k041J2929J1352
$$ 71056 -4224 -23872 -24845 -32378 17982 53196 2507 -39808 -18246 2546 505 13434 24786
165B4786l1398l1586K8380L7336o357j4732j5315k0417K6135M1024k5578l4944
$$ 24786 -6612 -38198 -9818 27518 21161 6429 -8886 -29303 -3168 37856 12278 -22666
177b2666J8172L352j3834K7214J2577m0274j1537K9271O543l854P125j5375k0520
$$ -22666 -4494 -1142 -14976 12238 24815 -15459 -26996 2275 8818 4964 12089 -3286 -23806
190b3806J9254K7329q288j5553l102r597J773L1114R267l5685j7368J5389O852
$$ -23806 -4552 22777 14489 -1064 -4166 -13763 -11990 19124 28391 -7294 -24662 -9273 -2421
203b421P987J7373j6221l4236M878K3844J3309J0974j1106m0875q106L9964K5617
$$ -2421 5566 22939 6718 -27518 -22640 1204 14513 25487 14381 -26494 -34600 5364 30981
216C0981q601j6679k2466j6061K2653L8130L769k7890k5566j1401J3827L9470
$$ 30981 22380 5701 -16765 -32826 -10173 27957 31726 3836 -21730 -33131 -19304 20166
228B0166K1195k9165m0498n961K1187K9911K2680j4241m5584k0527K5282L5568
$$ 20166 41361 12196 -28302 -34263 -13076 16835 39515 25274 -20310 -40837 -15555 20013
240B0013J5249j1475l4490k7771J0328L8572K5093r789l3390k8160K151L4132
$$ 20013 35262 23787 -10703 -38474 -28146 10426 35519 25730 -7660 -35820 -33669 463
252D63L4774n66l5581l3719K402L2818L0077L882k4664l5188j1604K8367L5135
$$ 463 35237 34671 -910 -34629 -32227 591 30668 34550 9886 -25302 -36906 -8539 26596
265B6596O032j9512k9917k1846J5325M3121J6732k3734k7511j3922L537L1592
$$ 26596 32628 13116 -16801 -38647 -23322 19799 36531 12797 -14714 -28636 -25099 6493
277F493L0814j2534l5159j4908O347J8374K6536N786l0821k8405M623K1129J6902
$$ 6493 37307 24773 -10386 -25294 -18947 -573 25963 31749 928 -27477 -22854 -1725 15177
290A5177Q691j2939l1794j0320K4521K2792K171o842j7766j9734R636L1021R013
$$ 15177 23868 10929 -20865 -31185 -6664 16128 18299 11457 -6309 -26043 -16407 14614 23627
303B3627j2776j2706j3499l849K2196K0775q811j9220r155l110J0108K0536M052
$$ 23627 10851 -1855 -15354 -19203 2993 23768 14957 -4263 -13418 -16528 -6420 14116 18168
316A8168j8005j5323N79R086J3486Q608q388j7519n066R935J2383N858m020j3135
$$ 18168 163 -15160 -14581 -5495 7991 16599 8211 -9308 -14374 -4439 7944 13802 9782 -3353
330c353r801M979J2355O389l687r108r037P36J0566P922q77p696p867J20Q359
$$ -3353 -13154 -8175 4180 10569 6882 -2226 -11263 -10527 39 7961 7084 -612 -8479 -8359 0
345@P778K41n464o679k412N705P807J55n390n148l434K696P871K229o017m690
$$ 0 7778 8019 2555 -4124 -6536 -831 6976 7131 1741 -3407 -6841 -4145 3726 5955 -62 -4752
361d752l70J239M417N143k406o863m18L913K056L058N94o077l949L792L342p33
$$ -4752 -5122 -3883 534 5677 3271 -3592 -4010 -97 1959 5017 5611 -466 -4415 -623 2719 1986
377A986k98j508m422l62M691J547j461j112j321p91J984L702p52j119Kq51q22
$$ 1986 1688 180 -4242 -4604 87 1634 173 -939 -2260 -3051 -1067 2635 1883 764 766 -85 -907
394i07K395J698j551j800k29r69l51J991O87j084p01j533j365J462L930J111j619
$$ -907 1488 3186 1635 -165 -394 -1363 -1714 277 964 -120 -821 -2354 -3719 -2257 1673 2784 1165
411A165j830k203J160M257L321k113m037k390j068L571O077o94o494m256q64L265
$$ 1165 -665 -2868 -1708 2549 5870 3757 -280 -2670 -3738 -167 5910 5216 -1278 -5534 -6398 -3133
427c133P298K718o778o303m43L159P060O595m118j1000l977N456R042N362m492
$$ -3133 4165 6883 105 -6198 -6641 -3482 3578 10173 6055 -4945 -8922 -3466 5576 10938 6446
442F446r526o143K558Q479O796j615q237q542k764R858J3925K63j2137r270r12
$$ 6446 -3080 -9223 -6665 1814 8610 6995 -1242 -9784 -12548 -2690 11235 11498 -639 -9909 -10821
457a0821Q602J3117K370j0158r948l374M265J2951P919q504j3424o369L475J3790
$$ -10821 -2219 10898 13268 3110 -6838 -10212 -5947 7004 14923 6419 -7005 -13374 -9899 3891
471C891J0379o662j3485p311K053J1941J3925k216j5120r500J770J1655J2242
$$ 3891 14270 7608 -5877 -13188 -11135 806 14731 12515 -2605 -12105 -10335 1320 13562
484A3562j241j1904q571j902N674J1357N604p339j2882q198O949J7679N716j1356
$$ 13562 12321 417 -8154 -10056 -4382 6975 12579 5240 -7642 -15840 -8891 8788 14504 3148
498C148j1425l059O147J1258M605n449n032n930m534R684J4380l288j2519p136
$$ 3148 -8277 -11336 -5189 6069 10674 5225 193 -5737 -10271 -587 13793 10505 -2014 -9150
512i150m83Q145J0923j394j0414n416k59M160Q942M569o839r616p22P604O050
$$ -9150 -9633 -1488 9435 8041 -2373 -7789 -8048 -3888 5054 9623 2784 -6832 -7554 50 6100
527F100j132j524k142o392j663Q798O594m568o946m874J325R168M192p101m666
$$ 6100 4968 3444 1302 -5090 -6753 2045 8639 4071 -2875 -7749 -6424 2744 6936 -165 -4831
542d831L157J045j279K511L398o14m782l010L319O557n58m918k588M85J704K061
$$ -4831 -1674 -629 -1908 603 4001 3387 -1395 -4405 -1086 5471 4913 -5 -2593 -2108 -404 1657
558A657k77k467q86n8J52J790P61m37q76J26J43Q68R64L94K47j743j767Q28K620
$$ 1657 1380 -1087 -1973 -2031 -1879 -89 672 235 -641 -515 -372 496 1460 1854 2101 358 -1409 -581 2039
577B039K02k384j564K12Q93j43J0P05L38j838j156J277K881Q56l88k527j741K185
$$ 2039 2241 -143 -1707 -1495 -602 -745 -735 -30 308 -1530 -2686 -1409 1472 2328 1940 -587 -2328 -143
595a43L397m03k254p99q11n01J561K224j164k132j775m16J632L029J449k345l321
$$ -143 3254 2851 597 -202 -1013 -1514 47 2271 1107 -1025 -2800 -3216 -1584 1445 2894 549 -2772
612b772p61K248M268K212j842n156k768K985M921K811k745o398l759L077N291
$$ -2772 -3533 -1285 2983 5195 3353 -1803 -4571 -1586 3335 6146 3401 -2997 -6756 -3679 1612
627A612L281q92n511n558O47O141P017J045p233q632N50Q917P468o24p844p049
$$ 1612 4893 4001 -1510 -7068 -6421 -280 6737 7782 549 -8083 -7533 1384 8852 8228 384 -6665
643f665l61O198O847J432n430p589m056L879R532O317n233j0940m023M982Q950
$$ -6665 -7026 -828 6019 7451 2021 -5568 -9624 -5745 3787 10104 4871 -6069 -10092 -5110 3840
658C840O660k477j0701p162L643Q973P245p71j0495q844J601P925P580K502p464
$$ 3840 10500 8023 -2678 -9840 -6197 2776 10021 9250 -1245 -10089 -8488 -563 7017 9519 2055
673B055j1129k805Q098J1794L852q752j1818k521Q329J1153L319p072r580l162
$$ 2055 -9074 -11879 -3781 8013 11865 3113 -8705 -11226 -2897 8256 11575 4503 -5077 -8239
687h239L281P507Q208k518j1864p276K936Q773Q293p92j0731q229K995Q457P081
$$ -8239 -4958 2549 10757 8239 -3625 -10901 -7965 808 9101 8309 -2422 -10651 -7656 801 7882
702G882N4o846p624o75O041Q228K169o825q218j262L614O998N331n143r930k672
$$ 7882 7936 1090 -6534 -7209 -1168 7060 9229 2404 -5814 -7076 -3462 3536 8867 3724 -6206 -8878
718h878N213O691L505k518p613l047L528N790K971j126m618m380O91M605N083
$$ -8878 -3665 3026 6531 4013 -3600 -6647 -3119 2671 5642 4516 -102 -4482 -3791 814 5897
733E897q53o281l390Q20K767M515L81n172l302K037K013K037K139k655l792N59
$$ 5897 5044 -1237 -4627 -3807 -1040 3475 3856 -1316 -4618 -2581 -568 1469 3608 953 -2839 -2280
749b280K905J200J321j176l295j233K358K229j64j594j687o28Q12J613N22j425
$$ -2280 625 1825 3146 1970 -1325 -2558 -200 2029 1865 271 -1416 -2044 -1232 381 903 -522
765e22j180P34N46P40J198n08k012R24J490P0q27J09j061o06J288P11j348p13
$$ -522 -1702 -968 -422 318 1516 1008 -1004 -80 1410 1480 653 762 -299 -905 383 1094 -254 -967
783i67o3p4Q05R40p50j117J09J192J081k27n04o32l08R66J360l11j236j224J84
$$ -967 -1030 -1104 -299 641 -109 -1226 -1117 75 1156 929 425 -207 -515 451 1811 1500 264 -960 -776
802g76J001O73j94j823q92M81J258J139L1j340j390K71K034J888k04j787j745
$$ -776 225 898 704 -1119 -2011 -1530 -272 867 898 -442 -1832 -1561 473 2361 2157 370 -1375
819a375M67J496J429J48j904k776K56K121J878R6k276k529l25L019K437R8j834
$$ -1375 -908 588 2017 2165 261 -2515 -2259 -138 1740 1836 -440 -2969 -3294 -275 2162 2260 426
836D26k688o44K668L319P89k384l286j209K163L394J191k529m069j531K137L628
$$ 426 -2262 -2906 -238 3081 3870 1486 -1800 -3009 -846 2548 3739 1210 -2859 -4390 -2253 1375
852A375K076j784m113k104K620L378K710q22m276l087J606L987K956l55m014m577
$$ 1375 3451 1667 -2446 -4550 -1930 1448 4158 3336 -940 -4027 -2421 1566 4522 4167 153 -4424
868d424P59M067L681p78l526m041l26L534L951J307l760m131n41L155M343J646
$$ -4424 -3665 402 4083 3305 -221 -4262 -4588 -1054 2897 4204 444 -3687 -4228 -1073 3270 4916
884D916l072m239j596K479L694K465j881n042k551K179L994K140q48m262k888
$$ 4916 1844 -2395 -3991 -1512 2182 4647 2766 -2276 -4827 -2648 1346 3486 2638 -1624 -4512
899d512J359L701K476L93l117l687L37L619L379k90l284k756k73K180K673J110
$$ -4512 -3153 548 3024 3417 300 -3387 -3050 569 3948 3658 374 -2382 -2655 -475 2198 3308
915C308k534l527q19J792L079J690j928l331n50J990J955J310m52k281j532O79
$$ 3308 774 -2753 -3572 -1780 1299 2989 1061 -2270 -2820 -830 1125 2435 1983 -298 -1830 -1151
931a151J924J609pk612k076P74J843R71J36k213j365M37J373J520J11j049j823
$$ -1151 773 2382 2375 -237 -2313 -1539 304 1275 1411 -802 -2167 -1730 -357 1163 1274 225 -1598
948a598K86J738Q85M53j090j143P4O51J82M63k1j586r96J018J015o3q84m25L86
$$ -1598 -1312 426 1311 1764 674 -469 -395 256 438 901 880 -706 -1702 -684 331 268 -616 -1041 -655
967f55M28N6P12P4n36J69K42k58J049k55j133o93J051O83j384l58O30M2m54L79
$$ -655 -227 -171 541 615 79 248 490 232 1281 1026 -107 -800 251 934 -450 -808 -178 -136 -590 -211
987b11j10rO3J23K45P5K29m40j10O92M08l59m63N28j61o33K56K75p19p47J45N38
$$ -211 -321 -330 -267 -144 101 176 405 -35 -145 547 955 596 133 661 500 -133 123 398 -321 -1068 -923 -385
1009c85N56l54o79J13P61L13Mk26J63l62Q0O13R13q23p47n78L74N99M60n75j162
$$ -385 171 -183 -862 -749 12 325 329 103 266 -96 -16 597 1510 687 -60 -638 -264 335 795 220 -942
1030i42n2K75L09R67p5r76o82N13J214Q19j08j020j009L20J046P51k86r26j232
$$ -942 -994 -719 -410 557 482 -494 -1176 -663 551 1370 1262 242 -767 -447 599 1350 1064 138 -1094
1049a094l11J173P01Jq22r90j78P11J387P45o63j628n52J115J678P69j034j640
$$ -1094 -1405 -232 469 470 -352 -1342 -1520 -809 578 1323 660 -968 -1520 -405 1273 2042 1008 -632
1067f32m67N77J322N34m63j554q22r1J529J133k92j428j051M11J430J636q9j091
$$ -632 -1099 -522 800 1334 871 -683 -1505 -1596 -67 1066 774 -654 -1705 -1294 136 1772 1683 592
1085E92j789N35J148J259Q9j568j156l34J205J127j96n96j766m35Q89J431R77
$$ 592 -1197 -662 486 1745 1834 266 -890 -1224 -19 1108 912 316 -1450 -1885 -996 435 1412
1102A412j039j362n29J069J929K48p74j482j75N85N84R53m11j458j527P64J353
$$ 1412 373 -989 -1518 -449 1480 1728 954 -528 -703 -118 466 1419 1008 -450 -1977 -1213 140
1119A40R39l88j526j060Q88J322N94k17r74n75K72J380M78l40m90j040J00R61
$$ 140 1079 691 -835 -1895 -1007 315 909 692 -282 -857 -585 795 1273 933 443 -597 -497 464
1137D64M55n63q09q12P5Q64J026m12q31o79P34O87M33j30l88m74M8P04K81R9m70
$$ 464 919 356 -453 -1265 -1190 -326 700 288 -543 -1222 -488 199 632 502 114 -360 -312 392 673 772 302
1158C02q63j86Q58R73n23j212m43L99Q78L83l41p66q7K98Q87K73j55m50m72J23
$$ 302 -561 -747 111 1084 561 -651 -1094 -695 183 566 225 -541 -628 -330 557 830 675 225 -247 -124
1178a24O12P53n73q73q34L67Q25N56o10j089m37P75J025L55k09j003m08L20J165
$$ -124 488 1241 668 -205 -1039 -672 153 709 99 -990 -1427 -652 373 728 519 -484 -892 -572 593
1197E93P77k68j291o48O9J267J177l28j733j391P76J058J076j63j454j063NJ623
$$ 593 1370 1102 -189 -837 -768 499 1676 1348 -385 -1776 -1000 58 1134 971 -483 -1546 -1541 82
1215H2R75K05q98j665R8J440J395O01j804j579m72J128J737N77j571j707m98R45
$$ 82 1057 1262 364 -1301 -1203 237 1632 2233 429 -1150 -1622 -494 1243 1820 249 -1458 -1956 -1011
1233a011J618R60q88j769j157J215J998J277m26k135j288P73J452J514l78j744
$$ -1011 607 1567 679 -1090 -2247 -1032 966 2243 1817 -318 -1606 -833 619 2133 1755 11
1249A1k002K94J497J580L93j907j785k12J429J914P08j313j474o43Q88J838J016
$$ 11 -1991 -1697 -200 1380 1773 -134 -1919 -2131 -702 1212 1920 607 -867 -1510 -622 1216 2232
1266B232j068j795p42M51J690J030p21j524j540M97J656R97K46j816j178P4J195
$$ 2232 1164 -631 -1373 -922 768 1798 1077 -447 -1987 -1490 166 1163 1409 -407 -1585 -1511 -316
1283c16J720J64j083j335n11J370R23N96l51j889l76N29Q34Q91n03j079r21K49
$$ -316 1404 1568 485 -850 -1361 9 932 1528 1177 -712 -1088 -559 275 1166 663 -416 -1337 -1088
1301a088R70O69L54p53j230j4R55J317J89m25j506J0M26J035L3k49q22q06Q3O66
$$ -1088 -118 551 905 152 -1078 -1092 -137 1180 1369 944 -562 -552 -126 909 942 693 -129 -935 -852 -186
1321a86M67j46n48m46K21M23N55M46q00j33j88K45P31L62m17p77j52l0K61P09
$$ -186 281 135 -413 -859 -638 -215 340 786 -14 -147 -335 -90 641 1003 586 -191 -343 -373 -112 597
1341E97o12j12q55L41O6P96L10o82k47q8M23O34K45j53m29k13k10M99L64j16n85
$$ 597 -15 -127 -982 -641 -575 221 531 -151 -398 -486 -63 571 816 663 234 21 -189 310 674 558 -27
1362b7o62m5L42O92q3n39m81K9N61O71j74J94o93J19jP94N5j24o37o80M71M35
$$ -27 -689 -734 -392 300 217 -322 -803 -774 -213 458 284 478 -215 -96 -97 697 752 628 -9 -689 -218 217
1384B17M76l72o94n07L8O34Q48m33l32p10N30N30L74N9l38r63J97Q98M51k98m28
$$ 217 693 321 -373 -880 -842 -208 640 207 -125 -835 -305 225 599 658 320 -643 -446 452 903 605 177
1405A77j066P5N26P19J70n32j245k02O50J204M65m08j425n52J292Q30O53k90j342
$$ 177 -889 -814 -288 431 601 69 -1176 -1378 -728 476 941 533 -892 -1444 -152 678 1331 1041 -301
1424c01q47N64J046R44j06j451j571K78J406J409q2j565j565J90J493J552L33
$$ -301 -1148 -584 462 1406 1300 -151 -1722 -1444 -38 1371 1289 -276 -1841 -1651 -158 1394 1727
1441A727j047j854k16J237J642M81j264k011l93R61J595M98n76j445j490N68J914
$$ 1727 680 -1174 -1390 -153 1489 1970 706 -1305 -1698 -737 858 1356 780 -665 -2155 -1587 327
1458C27J374k73j873j548N08J716J787m07j243j852l8J330J912M64j412k446m43
$$ 327 1701 1428 -445 -1993 -1485 231 2018 1611 368 -1484 -1522 -192 1720 2184 772 -1674 -2117
1475b117J431J682O01j184j775o55N94J890J607n62k179j548J145K084J265r63
$$ -2117 -686 996 1597 413 -1362 -2017 -1423 467 2074 1512 -667 -2215 -1070 1014 2279 1316
1491A316j697q85J65J325J171L4j026j718m16J013J780K72j232j284n34J498J565
$$ 1316 -381 -1266 -1101 224 1395 1429 403 -1315 -1731 -718 1062 1334 102 -1182 -1716 -218 1347
1508A347N5p32r32q98N45J332P71o99p66j154M99R40Q40o13q31q79J0J058O54
$$ 1347 1402 670 -262 -1160 -615 717 1488 789 23 -1131 -632 308 1148 535 -296 -1175 -1165 -107 547
1527E47L35q30o83j75J376K82k37m91j11r5K51J84M48l82p28l93L34P86l23l14
$$ 547 882 52 -631 -806 570 852 615 124 13 -82 169 353 801 419 -309 -702 -368 418 95 -219
1547b19j75Q9K57R8K2Q1k0R4m7j18p5N31k29k70k25M82o46N8N73m98k20j11J19
$$ -219 -394 -305 -48 50 72 153 133 227 180 62 -13 518 289 19 -206 276 -370 -312 261 -237 -457 -568 -449
1570d49M1N02j62J92j85j04J32L85Ql0j74k82J81L27Q5k54j37n65j83N07K13l5
$$ -449 -408 94 -68 124 -61 -165 -33 352 360 330 156 -126 55 382 467 213 76 -489 -672 -165 48 13
1592A3l50k77%P46M83qm91o01L34J31M43J86o17m27l21N84P52r9p55m49n14J042
$$ 13 -337 -614 -614 132 615 607 116 -485 -151 -20 423 609 -8 -435 -756 -172 580 481 -274 -723 -1237 -195
1614a95N22Q6l17l53p07P32R70O25q31q26n42L34J127Q64o40j365p70M98J175
$$ -195 327 413 96 -257 -964 -232 738 1363 532 -294 -836 -502 625 1489 849 -516 -1286 -788 387
1633C87N20n33p22p66J01J274O90q1o08j160k18R59J482J26j366p45m95J376N93
$$ 387 907 374 -348 -1114 -1013 261 951 870 262 -898 -1116 -157 1325 1451 85 -660 -1155 221 814
1652H14K43o00j197o27L82J498M69n57j035n71M59R27J233j46j470j017L19J438
$$ 814 1057 457 -740 -1367 -985 513 982 425 -610 -1181 -722 205 1438 1292 -178 -1195 -876 562
1670E62O55j04j039q84l60P66J320k29m99r70m19N34J114M67m06r80o86L98J092
$$ 562 1217 1113 74 -810 -1170 -404 916 687 188 -782 -1201 -667 447 914 508 -472 -1158 -760 332
1689C32J227m34j203p70J77Q98O68k21o92m34o57K78J101M85n90p08k61J33J094
$$ 332 1559 1125 -78 -848 -671 227 895 674 -18 -452 -1109 -831 270 755 165 -543 -804 -671 423
1708D23N56j92p04l58j18Q89L73J43q06o79k65M52R83J14n58r82m07L98R04K03
$$ 423 979 787 83 -275 -393 496 869 1012 206 -473 -738 -286 697 811 253 -729 -1136 -738 166 369
1728C69Qo94n59L36R19L13j36m38n72K5L40N43O1p8j130p0M84N59N8j37n23m00
$$ 369 377 -317 -876 -540 379 692 556 118 -454 -429 -89 454 515 437 -693 -763 -279 280 338 201 -322 -722
1750g22L40O30J99Q9q1n63l11N60P20k94l29m10n21P50K55n6k53o52Q8L66K90
$$ -722 -382 248 447 536 455 -108 -419 141 861 567 238 -172 -693 57 312 256 3 -649 -561 -195 95
1771I5K15k89k96l13N14N02J73l03l44j95j04P21Q8l48j34l06j91L10K51R5o85
$$ 95 310 21 -275 -588 -74 428 601 298 -46 -241 -345 376 464 116 -18 -324 -515 -205 46 141 -544
1792e44k08P7L90O50K05l29l95m7J61K58L71k54n92oK47L41Jj06m87m58J09M47
$$ -544 -752 -675 -285 365 570 241 -154 -201 -40 218 589 335 -257 -263 -16 325 326 220 -267 -725 -616 -169
1814a69L50oo76j13r4J208Rj77k42n16J13M62Q28k30p89n22l19Q23N54k7l71q76
$$ -169 181 175 -501 -614 -708 500 509 332 90 -426 -313 149 977 747 -42 -564 -883 -60 494 467 96 -780
1836g80k84N68Q09N49n86o38k91R1J152M39J0r64q10J27N79J017q3j087p56l07
$$ -780 -1064 -496 313 862 276 -362 -653 -562 590 1029 1039 75 -735 -608 -29 988 905 -182 -938 -1245
1856a245P19J286L9n48q16p96J045J244O4k15j079n78L59R23J120m39j164j320
$$ -1245 -526 760 799 251 -565 -1361 -316 928 992 777 -302 -880 -521 402 1522 1083 -81 -1401
1874a401L84J176Q66k7p09j609j82J272J394l5p32j456k58R67J108O70o61j314
$$ -1401 -1017 159 1025 998 289 -1320 -1502 -230 1164 1129 397 -1059 -1317 -350 758 1428 767 -547
1892e47q07O39J347Q57l80j423j328K43J550J048m30q31j123k31J290J344o1m93
$$ -547 -1354 -715 632 1489 1109 -314 -1642 -1399 151 1199 769 -62 -1185 -1416 -126 1218 1157 664
1910F64j383m15P59J625K12o49j519n89O51J063P91k59j232j003J42J642N91l88
$$ 664 -719 -1134 -375 1250 1462 813 -706 -1295 -644 419 1210 951 -281 -1284 -1142 500 1091 703
1928G03j099o58K72P57J205j82p01j081j91P66J159L39q31j417r5M72P72N14p34
$$ 703 -396 -1054 -782 -25 1180 998 297 -784 -975 -209 950 1289 458 -959 -1054 -582 190 704 -30
1947c0m12n02J28R38Q61o96k91r88L57R61L68nn24p88L5O44L67K54q67j04l80
$$ -30 -442 -944 -816 122 983 287 -4 -992 -635 326 694 689 165 -623 -588 56 423 677 -190 -294 -674
1968f74M12N94p6m41l62J40L95M97J6l12k70j26L33J58L92m38q54M43J0L20J0
$$ -674 -262 332 256 -185 -547 -407 -12 485 501 189 -81 -207 126 284 676 238 -616 -173 -163 157 167
1989A67j16l78P2k21K53M81l40p7j41L9M53L55l66r7K99k36mJ33J5m58L6q7K1
$$ 167 51 -327 -255 -476 -223 258 -82 -159 -300 -261 192 547 181 84 383 147 143 276 291 -167 -131 -218 -197
2012a97J57l8L0k19J56j28j01N07OL35m57k20M20k9J9p5k6k73j80J52L02R7l41
$$ -197 -40 -78 -48 -267 -111 -239 -340 167 173 508 51 -169 251 222 241 166 140 -133 -313 -161 141 238 -103
2035a03o7l99K30O98k58J00n51J82k19N91M24k9l47n36n14Q63O40j83l74j160
$$ -103 -170 -569 -339 359 101 201 -350 -168 -387 204 628 599 252 -284 -798 65 705 522 148 -1012
2055a012K74N87O48J6m24p49r9M92R89J97l35q94m86M61R47N17k88j149o72N32
$$ -1012 -738 -151 497 513 89 -660 -759 -267 722 919 584 -310 -796 -335 612 1129 841 -308 -980 -448
2075d48R16N59k38j267p72K29P85J463Qj106j426L65J216P12L03q70j229n10J161
$$ -448 468 1027 789 -478 -1250 -1021 -236 1227 1235 129 -1297 -932 284 996 1299 429 -800 -1310 -149
2094a49J255J43q15j140l68N82J336L79n48j548m60K81J280Q87l61j232p59L96
$$ -149 1106 1249 434 -706 -1074 -492 844 1223 675 -873 -1333 -1052 228 1115 754 -478 -1237 -841
2112h41J544P02m66p21r33j19Q33J079L8q90j152q5N50J047L54p30j307j18Q24
$$ -841 703 1405 939 218 -715 -834 -1 1078 1116 226 -926 -1011 -461 586 940 210 -1097 -1215 -391
2131c91J084M47o50o92o29O74J004O23j026p74k48o2O82N94m10l93n49J14O12
$$ -391 693 1140 490 -202 -831 -157 847 1470 444 -330 -578 -640 42 636 226 -167 -716 -602 10
2150A0N01k7o84l60J54Q33M3N6m17j43j23J17M33m7l99m51p2L13K22L3j89k15
$$ 10 511 484 -200 -560 -406 427 470 526 109 -34 -157 -40 393 346 -53 -504 -576 -263 -41 -8 -197 -412
2172d12m1K22M56k22L1P9j00m5J71J93l01L03k92J30l73K95jj29m22J81k5M22
$$ -412 -453 -231 225 3 34 113 13 -32 139 332 31 334 42 172 -201 94 93 -36 -458 -277 -302 120
2194A20j98M2J19p4RK99l04J50k57K68j84j14K54o4J46k11p1J72n9J29k74L2j62
$$ 120 -78 -36 83 9 18 317 13 163 -94 174 -10 -124 130 66 212 1 -70 102 43 172 -102 -70 -232
2217b32Nj16J79K58K54p7l52j59O55r5J63k91m91j2L46K33k07k79k00J26K49J00
$$ -232 -227 -343 -164 94 348 271 -81 -240 415 320 483 192 -299 -311 35 268 61 -218 -418 -292 -43 57
2239E7J47m16l44J96J72Q50K12o10n47p3K93O18K49n02l45l99J77L35O12n31p24
$$ 57 204 -212 -556 -360 -188 662 874 264 -283 -356 -63 555 804 302 -43 -442 -265 70 682 151 -573
2260e73j27K67L81P19l10m74m28K7O17N66O8p56m55J6J63Q30J03p43l31m79J84
$$ -573 -700 -433 -52 667 357 -117 -545 -518 99 665 733 -23 -478 -462 -299 531 634 -109 -440 -919 -735
2281g35J074K65p56l36m44N86O92L31l20o21l75K37N52N23o3o05q03J46P83L45
$$ -735 339 604 -152 -488 -932 -346 346 677 357 -264 -639 -402 150 673 610 5 -798 -652 131 476
2301D76N1m02p06k28M12J127j37l07q34R8J51Q38K04j7j118k78L97L80M32j68
$$ 476 527 125 -581 -809 -397 730 593 286 -548 -450 -299 539 743 726 -392 -670 -273 107 539 371
2321C71k69p36L2M64O74j91m58m48NP23P4L03l10o64j58M09P09J82L6r94m32M13
$$ 371 102 -634 -602 -138 536 345 -113 -561 -556 167 241 544 234 -430 -588 -179 530 712 748 -246 -678 -265
2343b65K91L19J81o58m64m4O26J08L25p86Q8l58O65J17L57Jm55l43K20O64k8j53
$$ -265 26 345 526 -132 -596 -640 -14 94 419 -367 -279 -637 28 145 502 503 48 -295 -75 589 561 408
2365D08o34j28j21P16J31k98m21J84l77M34M0L78m10o1J88L4K36j03j01l84J62
$$ 408 -226 -354 -475 241 372 74 -347 -163 -540 -106 -66 312 -98 -159 29 63 299 196 95 -289 -127
2386a27M0J28L19k97k71j18l2N09R3k45l22J44lJ85M4J11l50K3O2K23l5L86l01
$$ -127 -87 41 360 63 -208 -326 -358 151 244 -1 -323 -179 -182 3 47 158 -192 -169 -107 116 81 467 166
2409A66k71J34J80Q3m53J31k28R4j67O25l35L4l35M69r9L9J81p5q8j85N1J6M20
$$ 166 -105 29 209 292 -161 -30 -258 -164 -331 294 -41 -7 -342 127 28 67 248 173 85 -100 -49 -33 387
2432C87k14l22L29l2oJ45l60P8n06M96j08Q9M42l21k64j04N90Q0j84k88k55L70
$$ 387 173 -149 180 148 142 287 -73 5 -501 -5 -113 -24 418 97 -167 -271 319 399 215 -73 -328 42
2454D2r4K60N1on28l5l8L10L16k63r9j74k04N89N2K2j27JjJ97J13J24k08n32o9
$$ 42 -52 208 259 253 -275 -310 -348 -38 278 15 -84 -258 -462 127 179 201 74 75 74 271 384 508 300 -232 -301
2479c01K15J76L10l18j65L5j08L73k03J4j19k31J75K98N5N7l03N0m14L05M79j37
$$ -301 -86 90 400 82 -83 -48 -156 217 14 28 -91 -322 -147 151 206 263 -40 10 -404 -99 380 243
2501B43o7l66j77K20J58L62k62l63l43N49J12K71j74k50j00m3L15L39l1N3p05
$$ 243 176 -190 -367 -147 11 373 111 -252 -595 -46 66 337 163 -87 -187 -230 85 424 393 446 -259
2522b59K40K14K01k92q5k73j86J02K26J79R8l37OR0L45J52j45l90o5K80Q4J0j14
$$ -259 -19 195 396 104 19 -254 -440 -338 -112 67 165 -172 -166 -76 269 421 276 -114 -179 101 185 195 81
2545H1l46K77j57O1J29R0j94l54J62K54K12n3j82Q0j97J40K05o4M8l1q2qo5QM1
$$ 81 -265 12 -145 -84 45 135 -59 -413 -251 3 215 162 -20 60 -137 3 208 144 192 161 79 71 6 14 55
2570E5k01N0j7K86j63n9k4l5P4J8L74l1l13j61K83n3LO7j86mk0J39J04k22K16
$$ 55 -146 -96 -113 173 10 -49 -73 -108 -34 -16 358 327 14 -147 136 83 86 153 -33 -37 -57 82 186 -36 180
2595A80l90J49J49n7j41K9j30L10k92M41pn58K28R2RK11L9l34o1j58K95l53J44
$$ 180 -210 -61 88 31 -110 -81 -211 99 -193 248 241 -317 -89 3 12 223 262 -72 -133 -291 4 -349 -205
2618b05L33J0k11J77j73J24J66j54J29l3L4K0l6K7k29l01L84j29l3J31J42k53
$$ -205 128 138 -73 104 -69 55 221 67 196 163 197 217 181 208 -21 -322 62 -67 -100 31 173 -80
2640h0p9K93k12k26K30K04j16J94j89k64M16r7j08L08l60j36L91r2j52Kj5L26
$$ -80 -159 134 -78 -304 -74 130 14 208 19 -245 171 74 -34 274 -86 -222 169 77 -75 -73 -88 238
2662B38l41K69j27j93n4%M63o5J37l76K5j52L27j50M23o09j2J67O1L38m44j45
$$ 238 -103 166 39 -154 -208 -208 255 190 327 -49 -24 -176 151 1 424 -185 -197 -30 31 369 -75 -220
2684b20nNK96Q0J16k31m77L49Q4M68l47k51O6j39L06L20om03k82K13Q0K29k7l19
$$ -220 -225 -220 76 156 272 41 -436 -87 -3 465 118 -133 -67 -206 100 420 414 11 -271 -58 22 251 224 -95
2708i5j49j08K98Kj70L97m65Q0J24K72K85l83j43j15j55M69L42m18m4n79M11K7
$$ -95 -244 -352 -54 -52 -222 175 -290 -210 -86 186 471 88 -55 -170 -325 144 486 68 24 -555 -144 -117
2730a17J57K88l72M7N0L2R3J09l22j3J84p3M01k57k27k98j81M75Q5J25k56J09
$$ -117 40 328 -44 3 53 85 178 287 -35 -48 136 63 464 207 -20 -318 -499 -24 61 186 -70 39
2752C9n11J64L48Q7l8l22J86q2M13o8j27j32l22M95jK45j59k57k24J0K66%n3J94
$$ 39 -472 -308 40 127 89 -233 -47 -129 284 216 89 -43 -365 130 129 374 215 -42 -266 -256 10 10 -43 151
2776A51l83J75Q8J6n6L4M3j73K33J40o7K24l34j41k70M74k22J08o9o0k07J35k07
$$ 151 -232 -57 31 47 -9 25 68 -105 128 268 201 425 91 -50 -320 154 -68 40 -29 -89 -296 -161 -368
2799c68K85m8Q5Q0j75J62R5l2j23K49k24K75k63K78k81l09M30k41j59L11kj15
$$ -368 -83 -131 -46 34 -141 21 116 84 -39 210 -14 261 -2 276 -5 -314 116 -125 -284 27 25 -90
2821i0j07P9j34J88P1P6k90L17j07J81J76k56k8j41J04k47j10K94M3n04O02l03
$$ -90 -197 -118 -252 -64 7 83 -207 110 3 184 360 104 76 -65 39 -208 -318 -24 19 -485 117 -186
2843a86J40J35j41j60J61J55J18L3k87j01O5J38N0k7k32j57M1K74L09J6m03j45
$$ -186 -46 89 -52 -212 -51 104 222 255 -32 -133 -68 70 120 93 -139 -296 -255 19 328 344 -59 -204
2865b04k61K44L04Q4J49m08J64j01P3K71L1m40l59L35J36K11m42j21Q7oM25L34
$$ -204 -465 -221 83 167 316 -92 72 -29 44 315 346 -94 -453 -118 18 229 -213 -334 -247 -253 172 506
2887E06m89k28k73K74L49J25K54m52l07J18K36J01L39q20j72J18M11Q4k0j34m14
$$ 506 17 -211 -484 -210 139 264 518 66 -241 -123 113 214 553 -267 -439 -321 90 174 154 20 -394
2908c94M4K81K90J41l34m49N3L62K10J31n20q7j7J78M96j26k54j97j96L73j32
$$ -394 -350 -69 221 362 28 -421 -368 -6 204 335 -185 -272 -289 -111 385 259 5 -192 -388 -15 -147
2929a47L70k76n4m18M04M13j04k11jj30k72M49K20J82m37j16j05O83j45J6m28
$$ -147 223 -53 -107 -525 -121 292 188 -23 -24 -154 -426 23 243 425 -12 -128 -233 450 305 321 -107
2950a07l62K04L55L0q2k24k88K29K07K40j95L95n34O5r5K66J57k4l06k39L46j76
$$ -107 -469 -265 90 120 38 -186 -474 -245 -38 202 7 402 -132 -67 -162 104 261 237 -69 -308 38 -138
2972a38N61l23k47O7j80M23j52m1K95l14q5j8O47l15k73L5j5J09j0J40k66o9Q0
$$ -138 423 100 -147 -80 -260 163 11 -30 265 -49 -134 -152 495 180 -93 -58 -73 36 26 166 -100 -169 -89
2995h9J48j17K40j02k54pl9L99k14O0rQ9j22k04M44j19j76j4J91k75K70O7k72
$$ -89 59 -58 182 80 -174 -181 -220 179 -35 25 16 105 -17 -221 223 104 -72 -86 105 -170 100 167 -105
3018a05K01j10q4mL46n11L00J30j56L5Q1n3P5L0k72L13l4%l60K59jj21k15J55
$$ -105 96 -14 -98 -102 244 -267 33 163 7 42 123 70 145 175 -97 216 182 182 -178 81 80 -41 -256 -101
3042a01N7q5O2j4o1J81RJ4k50l6J40J34Q1n5k35o5M99r0k6j64j56P9L1K80n9j89
$$ -101 -44 -129 -67 -81 -142 39 48 62 -188 -224 -84 50 131 76 -159 -224 275 185 159 -5 -161 -82 -51 229 170 -19
3068a9l45L24j54L33L7j09j40J48K9k3J33j78N1k65J91JJ66l52kJ99J3l24M93
$$ -19 -364 -40 -194 139 176 67 -73 75 104 81 214 36 87 -178 13 14 180 -172 -174 25 38 -286 207
3091B07ro7k61J56l6K78j57j26q4J02K38J52k9k81l84K9J24pL08j91k10J17K27
$$ 207 198 131 -130 26 -10 268 111 -15 -99 3 241 393 364 83 -301 -272 -148 -155 153 -38 -248 -131 96
3114I6j59K48L9k82J07q0M1L6j14K1R5l40M49P7j19j14j93k42L93PL22l78j92
$$ 96 -63 185 224 -58 49 -31 10 46 -68 -47 48 -292 157 234 115 1 -192 -434 -41 -34 288 -90 -282
3137b82L18l43N32l04j62K94k40J03K25P7j09L5k07q1k07N21k15J01m31K90OL19
$$ -282 36 -307 225 -79 -241 53 -187 -84 141 218 109 144 -63 -144 -351 170 -45 56 -375 -85 -79 240
3159B40K41l43j74j25L61K30l33J8P1l12K98j62J76j09om96M6L66j62K10k36Q
$$ 240 481 138 -36 -161 200 430 97 115 186 -126 172 10 186 77 71 -425 -379 -13 -175 35 -201 -193
3181a93L58r4j30J05k8k95J53J50K65k15K32m21j22J85K12j83q8M3OJ91k04RL88
$$ -193 165 71 -59 46 18 -277 -124 26 291 76 308 -113 -235 -50 162 -21 -109 -66 -60 131 -73 -64 324
$$ [...]
8191A02
##END NTUPLES=NMR FID
##END=
