##TITLE=1H_DE-80H_X3
 200.13MHz, d2o
 8 sc
 
 19ns.26.2.2025
##JCAMPDX= 6.0         $$ Bruker NMR JCAMP-DX V2.0
##DATA TYPE= NMR FID
##DATA CLASS= NTUPLES
##ORIGIN= UXNMR, Bruker Analytische Messtechnik GmbH
##OWNER= pz
$$ XWIN-NMR		Version 3.5
$$ Fri Feb 28 16:07:52 2025 Russian Standard Time (UT+4h)  new_Human@DPX200
##.OBSERVE FREQUENCY= 200.1313
##.OBSERVE NUCLEUS= ^1H
##.DELAY= (6, 6)
##.ACQUISITION MODE= SIMULTANEOUS
##.ACQUISITION SCHEME= undefined
##.AVERAGES= 8
##.DIGITISER RES= 18
##SPECTROMETER/DATA SYSTEM= spect
##.PULSE SEQUENCE= zg30
##.SOLVENT NAME= DMSO
##.SHIFT REFERENCE= (INTERNAL, DMSO, 0, 14.3821)
##AUDIT TRAIL= $$ (NUMBER, WHEN, WHO, WHERE, WHAT)
$$ ##TITLE= Audit trail, XWIN-NMR		Version 3.5
$$ ##JCAMPDX= 5.01
$$ ##ORIGIN= Bruker BioSpin GmbH
$$ ##OWNER= new_Human
$$ C:/Bruker/XWIN-NMR/data/yarkov/nmr/H-C/1/audita.txt
$$ ##AUDIT TRAIL=  $$ (NUMBER, WHEN, WHO, WHERE, WHAT)
(   1,<2025-02-28 16:03:24.10 +0400>,<new_Human>,<DPX200>,
      <created by zg, POWCHK disabled, PULCHK disabled
       configuration hash MD5:
       00 E9 B6 7A A2 85 ED C7 34 08 36 98 17 FE 4E 26
       data hash MD5: 16K
       05 66 81 10 EE 1C B6 E3 A7 C1 24 76 98 B0 DD A6>)
$$ ##END=
$$ 
$$ hash MD5
$$ 45 C2 6D FE 73 9F CC 03 86 60 53 C7 1E 46 82 1D
##$RELAX= 
##$RELAX= 
##$RELAX= 
##$RELAX= 
##$RELAX= 
##$RELAX= 
$$ Bruker specific parameters
$$ --------------------------
##$DU= <C:/Bruker/XWIN-NMR>
##$EXPNO= 1
##$NAME= <H-C>
##$PROCNO= 1
##$TYPE= <nmr>
##$USER= <yarkov>
##$AMP= (0..31)
100 100 100 100 100 100 100 100 100 100 100 100 100 100 100 100 100 100 
100 100 100 100 100 100 100 100 100 100 100 100 100 100 
##$AQSEQ= 0
##$AQ_mod= 1
##$AUNM= <au_zg>
##$AUTOPOS= <>
##$BF1= 200.13
##$BF2= 200.13
##$BF3= 200.13
##$BF4= 200.13
##$BF5= 200.13
##$BF6= 200.13
##$BF7= 200.13
##$BF8= 200.13
##$BYTORDA= 1
##$CFDGTYP= 0
##$CFRGTYP= 5
##$CHEMSTR= <none>
##$CNST= (0..31)
1 1 145 1 1 1 1 1 1 1 1 1 1 1 1 1 1 1 1 1 1 1 1 1 1 1 1 1 1 1 1 1 
##$CPDPRG= <>
##$CPDPRG1= <>
##$CPDPRG2= <>
##$CPDPRG3= <>
##$CPDPRG4= <mlev>
##$CPDPRG5= <mlev>
##$CPDPRG6= <mlev>
##$CPDPRG7= <mlev>
##$CPDPRG8= <mlev>
##$CPDPRGB= <>
##$CPDPRGT= <>
##$D= (0..31)
0 0.7 0 0 0 0 0 0 0 0 0 0.03 0 0 0 0 0 0 0 0 0 0 0 0 0 0 0 0 0 0 0 0 
##$DATE= 1740744203
##$DBL= (0..7)
120 120 120 120 120 120 120 120 
##$DBP= (0..7)
150 150 150 150 150 150 150 150 
##$DBP07= 0
##$DBPNAM0= <>
##$DBPNAM1= <>
##$DBPNAM2= <>
##$DBPNAM3= <>
##$DBPNAM4= <>
##$DBPNAM5= <>
##$DBPNAM6= <>
##$DBPNAM7= <>
##$DBPOAL= (0..7)
0.5 0.5 0.5 0.5 0.5 0.5 0.5 0.5 
##$DBPOFFS= (0..7)
0 0 0 0 0 0 0 0 
##$DE= 6
##$DECBNUC= <off>
##$DECIM= 32
##$DECNUC= <off>
##$DECSTAT= 4
##$DIGMOD= 1
##$DIGTYP= 9
##$DL= (0..7)
0 120 120 120 120 120 120 120 
##$DP= (0..7)
150 150 150 150 150 150 150 150 
##$DP07= 0
##$DPNAME0= <>
##$DPNAME1= <>
##$DPNAME2= <>
##$DPNAME3= <>
##$DPNAME4= <>
##$DPNAME5= <>
##$DPNAME6= <>
##$DPNAME7= <>
##$DPOAL= (0..7)
0.5 0.5 0.5 0.5 0.5 0.5 0.5 0.5 
##$DPOFFS= (0..7)
0 0 0 0 0 0 0 0 
##$DQDMODE= 0
##$DR= 18
$$ [...]
##$SUBNAM0= <"">
##$SUBNAM1= <"">
##$SUBNAM2= <"">
##$SUBNAM3= <"">
##$SUBNAM4= <"">
##$SUBNAM5= <"">
##$SUBNAM6= <"">
##$SUBNAM7= <"">
##$SUBNAM8= <"">
##$SUBNAM9= <"">
##$SW= 18.0517328524113
##$SWIBOX= (0..15)
0 0 2 0 0 0 0 0 0 0 0 0 0 0 0 0 
##$SW_h= 3612.71676300578
##$TD= 16384
##$TD0= 1
##$TE= 0
##$TE2= 300
##$TE3= 300
##$TEG= 300
##$TL= (0..7)
0 120 120 120 120 120 120 120 
##$TP= (0..7)
150 150 150 150 150 150 150 150 
##$TP07= 0
##$TPNAME0= <>
##$TPNAME1= <>
##$TPNAME2= <>
##$TPNAME3= <>
##$TPNAME4= <>
##$TPNAME5= <>
##$TPNAME6= <>
##$TPNAME7= <>
##$TPOAL= (0..7)
0.5 0.5 0.5 0.5 0.5 0.5 0.5 0.5 
##$TPOFFS= (0..7)
0 0 0 0 0 0 0 0 
##$TUNHIN= 0
##$TUNHOUT= 0
##$TUNXOUT= 0
##$USERA1= <user>
##$USERA2= <user>
##$USERA3= <user>
##$USERA4= <user>
##$USERA5= <user>
##$V9= 5
##$VALIST= <valist>
##$VCLIST= <CCCCCCCCCCCCCCC>
##$VD= 0
##$VDLIST= <DDDDDDDDDDDDDDD>
##$VPLIST= <PPPPPPPPPPPPPPP>
##$VTLIST= <TTTTTTTTTTTTTTT>
##$WBST= 1024
##$WBSW= 4
##$XGAIN= (0..3)
0 0 0 0 
##$XL= 0
##$YL= 0
##$YMAX_a= 174127
##$YMIN_a= -147033
##$ZGOPTNS= <>
##$ZL1= 120
##$ZL2= 120
##$ZL3= 120
##$ZL4= 120
##$ABSF1= 10
##$ABSF2= 0
##$ABSG= 5
##$ABSL= 3
##$ALPHA= 0
##$AQORDER= 0
##$ASSFAC= 0
##$ASSFACI= 0
##$ASSFACX= 0
##$ASSWID= 0
##$AUNMP= <proc_1d>
##$AZFE= 0.1
##$AZFW= 0.1
##$BCFW= 1
##$BC_mod= 2
##$BYTORDP= 1
##$COROFFS= 0
##$CY= -3
##$DATMOD= 1
##$DC= 2
##$DFILT= <>
##$DTYPP= 0
##$F1P= 0
##$F2P= 0
##$FCOR= 0.5
##$FTSIZE= 0
##$FT_mod= 4
##$GAMMA= 1
##$GB= 0.15
##$INTBC= 1
##$INTSCL= 1
##$ISEN= 128
##$LB= 0.25
##$LEV0= 0
##$LPBIN= 0
##$MAXI= 10000
##$MC2= 0
##$MEAN= 0
##$ME_mod= 0
##$MI= 1.114404
##$NCOEF= 0
##$NC_proc= 0
##$NLEV= 6
##$NOISF1= 3.799351
##$NOISF2= 2.8
##$NSP= 1
##$NTH_PI= 0
##$NZP= 0
##$OFFSET= 14.38212
##$PC= 1
##$PHC0= -1274.966
##$PHC1= 22.39221
##$PH_mod= 1
##$PKNL= yes
##$PPARMOD= 0
##$PSCAL= 0
##$PSIGN= 0
##$REVERSE= no
##$SF= 200.129724274929
##$SI= 16384
##$SIGF1= 3
##$SIGF2= 2
##$SINO= 400
##$SIOLD= 16384
##$SREGLST= <1H.CDCl3>
##$SSB= 0
##$STSI= 0
##$STSR= 0
##$SW_p= 3205.1282051282
##$SYMM= 0
##$S_DEV= 0
##$TDeff= 0
##$TDoff= 0
##$TI= <>
##$TILT= no
##$TM1= 0
##$TM2= 0
##$TOPLEV= 0
##$USERP1= <user>
##$USERP2= <user>
##$USERP3= <user>
##$USERP4= <user>
##$USERP5= <user>
##$WDW= 1
##$XDIM= 8192
##$YMAX_p= 0
##$YMIN_p= 0
$$ End of Bruker specific parameters
$$ ---------------------------------
##NTUPLES= NMR FID
##VAR_NAME=  TIME,          FID/REAL,        FID/IMAG
##SYMBOL=    X,             R,               I
##VAR_TYPE=  INDEPENDENT,   DEPENDENT,       DEPENDENT
##VAR_FORM=  AFFN,          ASDF,            ASDF
##VAR_DIM=   8192,          8192,            8192
##UNITS=     SECONDS,       ARBITRARY UNITS, ARBITRARY UNITS
##FACTOR=    0.0002768,     1,               1
##FIRST=     0,             0,               0
##LAST=      2.2672688,     0,               0
##MIN=       0,             -147033,         0
##MAX=       2.2672688,     174127,          0
$$ Real data points
##PAGE= N=1
##DATA TABLE= (X++(R..R)), XYDATA
$$ plain form
0 0 0 0 0 0 0 0 0 0 0 0 8 -8 8 -16 16 -24 27 -32 40 -49 64 -74 88 -104 128 -147 172 -200 232 -265 304 -348
32 -348 397 -451 510 -574 646 -725 812 -907 1011 -1125 1248 -1382 1530 -1690 1865 -2057
48 -2057 2265 -2494 2744 -3021 3325 -3665 4042 -4463 4940 -5480 6103 -6828 7683 -8711
62 -8711 9975 -11574 13674 -16573 20891 -28162 43891 -147033 11780 -15422 -55030 93846
74 93846 28416 125655 -50101 98478 -75141 45274 -96155 -52496 24467 -70819 20631
85 20631 59187 21266 40702 20325 -51545 22595 -68809 -28213 24408 43934 -44231 53305
97 53305 41185 -69308 41724 -35471 25301 -46136 -1733 16149 12612 -39832 47664 32934
109 32934 -74890 44729 -25701 -13040 -759 49949 -20597 62495 -25426 -51017 45566 -88079
$$ packed form
0@%%%%%%%%%%Qj6J6k4L2m0N1n9P2q9J13j38J62j92K32k75L19l72M32m97N69o52
32c48P45q48R61j084J220j371J537j719J918k136K373k630K912l220L555l922
48b057M322m759N238n765O346o990P707q505R403j0420J1583j2931J4511j6394
62h711J8686k1549K5248l0247L7464m9053P2053j90924J58813k7202l9608J48876
74I3846o5430R7239j75756J48579j73619J20415j41429M3659P6963r5286R1450
85B0631L8556l7921J9436k0377p1870P4140r1404M0596N2621J9526q8165R7536
97E3305j2120j10493J11032p7195O0772p1437M4403J7882l537n2444Q7496j4730
109C2934j07824J19619p0430J2661J2281N0708p0546Q3092q7921k5591R6583j33645
$$ plain form
121 -88079 6599 5000 16217 -2178 36561 14091 24451 -5624 -35186 29294 -47998 -49505
133 -49505 41860 8136 -36352 91476 -15154 5708 -17043 -26727 -16001 -29563 20587 -7734
145 -7734 73992 -29816 61192 -1249 -27206 7716 -69496 -6064 -27292 -9480 -2644 81021
157 81021 -5362 29797 55446 -37675 -27629 -13656 -27432 -33668 20035 -14337 49990 -7966
169 -7966 14838 35894 -31574 -12111 -2764 -14046 -30964 45652 -20494 23247 33388 -27277
181 -27277 15548 -1382 -33379 -13042 14642 -24455 12748 12462 10061 10563 -10067 9747 2451
194 2451 -26701 8233 23196 -28872 10965 13972 -27417 -141 7284 -19387 11355 2132 -1404
207 -1404 21515 5949 2640 6501 -8279 -21864 -109 -28590 14220 9464 -9393 38360 3644
$$ packed form
121h8079R4678j599J1217j8395L8739k2470J0360l0075k9562O4480p7292j507
133d9505R1365l3724m4488J27828j06630K0862k2751r684J0726j3562N0150k8321
145g734Q1726j03808R1008o2441k5957L4922p7212O3432k1228J7812O836Q3665
157H1021q6383L5159K5649r3121J0046J3973j3776o236N3703l4372O4327n7956
169g966K2804K1056o7468J9463R347j1282j6918P6616o6146M3741J0141o0665
181b7277M2825j6930l1997K0337K7684l9097L7203k86k401N02k0630J9814p296
194B451k9152L4934J4963n2068L9837L007m1389K7276P425k6671L0742r223l536
207a404K2919j5566l309L861j4780j3585K1755k8481M2810m756j8857M7753l4716
$$ plain form
220 3644 -18047 4551 5807 -42846 12764 6231 -16412 22448 9125 13922 6693 2474 -13016
233 -13016 -9657 -33089 -8203 568 -8124 33271 13900 10983 17555 779 -21945 6675 -15462
246 -15462 -25916 9413 -10991 -2492 9901 15160 6248 7050 -919 111 -9805 -12934 18876 -7572
260 -7572 -1578 15044 -10684 -15558 8795 -6392 -8578 22028 -5709 -175 10751 -4548 -349
273 -349 6066 -1914 -7625 -3332 -10002 5922 -1252 7885 18320 -10832 -3794 484 -13225 -8747
287 -8747 16611 -2372 -1379 14678 -5950 1661 2667 3606 -5070 -3671 -4887 -8253 -3592 1775 13797
302 13797 -5301 10071 2226 -14341 4083 6028 -1556 3405 12616 -15031 -3503 -536 -9911
315 -9911 356 -612 3582 -3293 5069 5896 9284 2933 6196 1905 -19592 -2647 -8402 -9519 4261
$$ packed form
220C644k1691K2598J256m8653N5610o533k2643L8860j3323M797p229m219j5490
233a3016L359k3432K4886Q771q692M1395j9371k917O572j6776k2724K8620k2137
246a5462j0454L5329k0404Q499J2393N259q912Q02p969J030r916l129L1810k6448
260g572N994J6622k5728m874K4353j5187k186L0606k7737N534J0926j5299M199
273c49O415p980n711M293o670J5924p174R137J0435k9152P038M278j3709M478
287h747K5358j8983R93J6057k0628P611J006R39q676J399j216l366M661N367J2022
302A3797j9098J5372p845j6567J8424J945p584M961R211k7647J1528K967r375
315i911J0267r68M194o875Q362Q27L388o351L263m291k1497J6945n755j117J3780
$$ plain form
330 4261 10562 -1848 3810 11392 -7240 4214 2991 -2105 -6438 -459 -835 -7145 4672 3645
344 3645 1801 -2831 5622 -5760 -7501 6562 -699 909 4499 3755 -7452 1110 2248 -3572 2208
359 2208 981 201 -5991 2339 546 -3503 2122 2845 -2775 -3917 7252 -2699 868 8842 434
374 434 -4674 -812 -243 -10605 2515 2202 -3659 306 4942 954 -2242 9099 -2085 -864 598
389 598 244 -4542 -1337 2767 -5467 2332 -1817 1800 -4905 3982 3429 -2455 5438 2216 -172 -5241
405 -5241 7991 -8603 -3266 2819 -2976 -1956 1695 5707 -7167 6032 -507 1632 -2488 3074
419 3074 951 -5482 6488 -2749 -60 -2040 3846 -8220 1046 1883 -6990 4460 3726 2745 -533
434 -533 6459 -3868 -1474 -1247 877 -1551 -5861 2933 -1755 -3698 4097 7203 -5604 4641 2932
$$ packed form
330D261O301j2410N658P582j8632J1454j223n096m333N979l76o310J1817j027
344C645j844m632Q453j1382j741J4063p261J608L590p44j1207Q562J138n820N780
359B208j227p80o192Q330j793m049N625P23n620j142J1169r951L567P974q408
374D34n108L862N69j0362J3120l13n861L965M636l988l196J1341j1184J221J462
389E98l54m786L205M104q234P799m149L617o705Q887n53n884P893l222k388n069
405e241J3232j6594N337O085n795J020L651M012j2874J3199o539K139m120N562
419C074k123o433J1970r237K689j980N886j2066R266Q37q873J1450p34r81l278
434e33O992j0327K394K27K124k428m310Q794m688j943P795L106j2807J0245j709
$$ plain form
449 2932 -6631 1239 3092 -4609 2380 1406 -5450 669 20 595 -264 5477 -2617 648 -5078 4074
465 4074 -1750 -5631 10894 -5234 741 628 6862 -8511 4990 1969 -7586 2456 -8508 3349
479 3349 -5388 6215 2822 6827 -1196 2624 -218 -6920 6709 -8813 186 -1663 -1217 -8481 12454
494 12454 -792 -2214 12313 -4664 -567 -3725 5135 -6397 4653 -3470 2703 -4349 -6532 8329
508 8329 -5157 3633 2073 4439 -7891 8538 -5353 840 6028 -8292 3295 -4186 -11 -6309
522 -6309 9428 -1509 2680 763 -2024 2401 -9546 5853 3875 -4982 -295 7350 -8802 1212
536 1212 5382 -584 -2682 2972 -4840 -2141 3711 -7096 11225 -4694 1621 -592 173 -897 873
551 873 3148 -2040 6292 -12564 5831 -1035 -7184 2321 6925 -7167 822 8298 -4622 6070
$$ packed form
449B932r563P870J853p701O989r74o856O119o49N75q59N741q094L265n726R152
465D074n824l881J6525j6128N975j13O234j5373J3501l021r555J0042j0964J1857
479C349q737J1603l393M005q023L820k842o702J3629j5522Q999j849M46p264K0935
494A2454j3246j422J4527j6977M097l158Q860j1532J1050q123O173p052k183J4861
508H329j3486Q790j560K366j2330J6429j3891O193N188j4320J1587p481M175o298
522f309J5737j0937M189j917k787M425j1947J5399j978q857M687P645j6152J0014
536A212M170n966k098N654p812K699N852j0807J8321j5919O315k213P65j070J770
551H73K275n188Q332j8856J8395o866o149R505M604j4092P989P476j2920J0692
$$ plain form
565 6070 -2284 6047 -6048 -2863 -4128 1525 -5517 205 10255 -8338 9899 -3370 1771 1059
579 1059 559 -5165 3850 -1347 -9829 9904 -4279 1915 -713 5068 -4330 235 -2037 2379 2674
594 2674 -8795 12740 -4954 -3288 2322 3327 -6595 2297 3385 -7090 5447 -4060 1010 3392
608 3392 -2318 -890 4526 -4152 735 1521 -189 2173 -2795 113 1723 -2682 -6235 10060 -6018
623 -6018 -2495 8031 -2454 -458 1760 1511 -2415 960 -3784 3668 -2410 -2623 4865 -1173 -2831
638 -2831 3877 -1092 -3235 5744 -6484 2997 3010 -3103 1054 5655 -4631 -3243 5709 -7022 1588
653 1588 -890 1377 348 -1072 1272 3549 -1947 -2139 7328 -7451 605 2053 -2585 -205 2953
668 2953 -2425 -132 2608 -6620 4893 -793 -299 2631 645 172 -8 -1262 -360 2319 -7268 3762
$$ packed form
565F070q354Q331j2095L185j265N653p042N722J0050j8593J8237j3269N141p12
579A059n00n724R015n197q482J9733j4183O194k628N781r398M565k272M416K95
594B674j1469K1535j7694J666N610J005r922Q892J088j0475J2537r507N070K382
608C392n710J428N416q678M887P86j710K362m968K908J610m405l553J6295j6078
623f018L523J0526j0485J996K218k49l926L375m744P452o078k13P488o038j658
638b831O708m969k143Q979j2228R481J3o113M157M601j0286J388Q952j2731Q610
653A588k478K267j029j420K344K277n496j92R467j4779Q056J448m638K380L158
668B953n378K293K740r228J1513n686M94K930j986m73j80j254R02K679r587J1030
$$ plain form
684 3762 712 -6239 4248 3646 -2778 2688 3620 -5236 1473 -1254 -2178 2906 -2002 -5 1898 -2371
700 -2371 304 2646 -1932 1467 1078 -4243 2902 -37 -4073 5226 118 -3628 2871 437 -3716
715 -3716 2306 967 -793 1238 -2649 1037 -1483 -2182 3167 1330 -2070 3537 425 -3627 4608
730 4608 -2305 -1597 2150 -3582 -2858 2329 -665 -68 5585 -968 1126 -261 -2082 1398 -1853 -1401
746 -1401 2250 -2152 -3271 4903 -1573 -782 4731 -1492 -1652 1816 -1602 -1170 3138 -1917 1055 351
762 351 -2577 642 -1044 349 1420 -240 -301 2369 -2615 97 3813 -3717 561 1604 -3216 -597
778 -597 2175 -827 950 1680 -1630 968 -2006 -563 1693 -1442 575 1777 -2004 99 2933 -2937
794 -2937 1832 1506 -3924 936 376 -2349 737 2363 -1955 1271 558 -1082 1474 -1156 1577 219
$$ packed form
684C762l050o951J0487o02o424N466R32q856O709k727r24N084m908J997J903m269
700b371K675K342m578L399l89n321P145k939m036R299n108l746O499k434m153
715c716O022j339j760K031l887L686k520o99N349j837l400N607l112m052Q235
730D608o913P08L747n732P24N187k994N97N653o553K094j387j821L480l251M52
746a401L651m402j119Q174o476P91N513o223j60L468l418M32M308n055K972p04
762C51k928L219j686J393J071j660o1K670m984K712L716p530M278J043m820K619
778e97K772l002J777P30l310K598k974J443K256l135K017J202l781K103K834n870
794b937M769l26n430M860n60k725L086J626m318L226p13j640K556k630K733j358
$$ plain form
810 219 -1708 323 123 -2616 798 1715 -2812 2455 546 -1299 1918 628 -845 570 -122 -2125
826 -2125 452 -1527 515 588 -583 2268 -360 -907 1437 90 -2477 2342 -519 -2530 2571 -560
842 -560 -706 1573 181 -1395 744 -832 -673 781 -1015 1459 -35 -235 1586 -367 -1061 1312
858 1312 -985 -1893 1925 -1160 -816 1755 -310 -440 1232 164 -503 490 -659 113 -664 -205 1188
875 1188 -1165 206 1029 -1214 -259 1702 -1218 -340 1892 -1763 93 934 -738 59 757 -204 -296
892 -296 321 -804 804 -967 335 780 -1461 365 660 -600 71 2352 -1507 345 684 -1642 -107
909 -107 135 -67 -934 1024 -837 595 97 946 840 -985 1163 -1213 -744 -248 827 -1430 934
926 934 699 -1658 1213 -86 294 -104 1021 -758 -140 -216 -119 438 -746 1269 -834 -703 278 162
$$ packed form
810B19j927K031k00k739L414R17m527N267j909j845L217j290j473J415o92k003
826b125K577j979K042P3j171K851k628n47K344j347k567M819k861k011N101l131
842e60j46K279j392j576K139j576J59J454j796K474j494k00J821j953o94K373
858A312k297r08L818l085L44K571k065j30J672j068o67R93j149P72p77M59J393
875A188k353J371Q23k243R55J961k920Q78K232l655J856Q41j672P97O98r61r2
892b96O17j125J608j771J302M45k241J826K95j260O71K281l859J852L39k326J535
909a07K42k02q67J958j861J432m98Q49j06j825K148k376M69M96J075k257K364
926I34k35k357K871j299L80l98J125j779O18p6R7N57j184K015k103J31R81j16
$$ plain form
944 162 -684 1359 641 -1153 813 -256 -1002 404 633 -878 223 108 -337 -158 879 387 -191 -159
962 -159 -104 -711 -900 1338 -349 321 610 190 -825 442 274 -748 587 -657 -165 -920 773 -146
980 -146 541 617 406 -500 -396 1071 -1550 1027 -36 -182 -1322 764 -503 -761 1775 -425 832
997 832 -704 1273 -1142 420 223 -636 -71 -1030 486 -1211 1408 -22 855 101 387 -486 -766 750
1015 750 -1008 179 -193 743 -1311 1059 499 -327 274 219 -198 -1472 1069 -665 329 241 743 -444
1033 -444 -58 325 -682 455 -293 210 -686 582 -522 2 532 172 -408 104 578 -948 448 441 37
1052 37 -675 431 -287 -479 -373 841 -151 -416 1137 -252 -54 -130 770 -1379 836 -429 -483 801
1070 801 -569 456 -312 1040 -1310 681 -232 -226 -49 45 1162 -1101 814 -34 33 -1254 884 -315
$$ packed form
944A62q46K043p18j794J966j069p46J406K29j511J101j15m45J79J037m92n78L2
962a59N5o07j89K238j687O70K89m20j015J267j68j022J335j244M92p55J693r19
980a46O87P6k11r06J04J467k621K577j063j46j140K086j267k58K536k200J257
997H32j536J977k415J562j97q59N65r59J516j697K619j430Q77p54K86q73k80J516
1015G50j758J187l72R36k054K370n60q26O01n5m17j274K541j734R94q8N02j187
1033d44L86L83j007J137p48N03q96J268j104N24N30l60n80N12M74j526J396pm04
1052C7p12J106p18j92J06J214r92k65J553j389J98p6R00k149K215j265n4J284
1070H01j370J025p68J352k350J991r13OJ77R4J117k263J915q48O7j287K138j199
$$ plain form
1088 -315 -964 812 -16 372 -303 1125 -668 368 -488 11 -102 -592 524 -521 670 -54 160 -149
1106 -149 628 -1019 -102 1053 -901 99 895 -211 -887 889 -366 -129 -172 58 226 -615 351 622
1124 622 -116 -357 785 -720 -336 405 -385 174 536 -441 186 380 -773 50 328 -108 -382 455 -54
1143 -54 -78 -235 693 309 -946 561 26 -775 -16 1130 -782 266 264 -739 207 -235 311 179 475
1162 475 -570 626 -424 -187 446 -845 542 -688 -384 420 631 -528 1096 705 -1360 562 -272
1179 -272 -676 -201 388 -225 107 49 203 460 -431 729 -178 -534 6 -218 -400 557 235 -464 865 -480
1199 -480 -492 654 -128 -195 328 14 -371 -68 -124 381 -13 -312 801 -440 -589 885 -153 -468 700
1218 700 -402 -745 575 -430 70 776 -116 33 277 -289 -262 217 -381 336 -429 -155 632 -615 286
$$ packed form
1088c15o49J776q28L88o75J428j793J036q56M99j13m90J116j045J191p24K14l09
1106a49P77j647R17J155j954J000P96j106o76J776j255K37m3K30J68q41R66K71
1124F22p38k41J142j505L84P41p90N59L62r77O27J94j153Q23K78m36k74Q37n09
1143e4k4j57R28l84j255J507n35q01P59J146j912J048kj003R46m42N46j32K96
1162D75j045J196j050K37O33j291J387j230L04Q04K11j159J624l91k065J922q34
1179b72m04M75N89o13L32n8J54K57q91J160r07l56N40k24j82R57l22o99J329j345
1199d80j2J146p82o7N23l14l85L03n6N05l94k99J113j241j49J474j038l15J168
1218G00j102l43J320j005N00P06q92J49K44n66K7M79n98P17p65K74P87j247R01
$$ plain form
1237 286 710 -260 -455 654 -549 -355 700 -316 236 0 -187 -47 -131 -188 373 -78 -85 553 -522 269
1257 269 363 -512 77 394 -951 -41 719 -768 547 481 -257 22 45 -177 -38 -59 -208 526 -557 189
1277 189 546 -579 309 256 -529 13 311 -661 360 308 -481 452 63 -247 34 69 -135 103 -163 194
1297 194 134 -632 581 -46 -540 502 143 -485 357 290 -606 521 -145 -323 320 -307 32 165 -26 60
1317 60 298 -314 252 -9 -592 589 -237 -303 598 45 -481 527 -24 -595 432 -262 -102 70 16 145
1337 145 120 -5 201 32 -493 375 -414 -267 469 -236 15 480 -114 -278 505 -352 -90 310 -292 22
1357 22 -42 -44 176 11 -120 385 -371 -207 531 -370 24 517 -314 -228 392 -440 -68 418 -282 124 123 -162
1379 -162 54 43 -39 121 -178 -146 237 -357 171 455 -321 170 191 -404 -77 288 -273 131 222 -258 145 -126
$$ packed form
1237B86M24r70j95J109j203J94J055j016N52k36j87J40q4n7N61m51pO38j075P91
1257B69R4q75N89L17j345R10P60j487J315o6p38K79K3k22J39k1j49P34j083P46
1277A89L57j125Q88n3p85N42K98r72J021n2p89R33l89l10K81L5k04K38k66L57
1297A94o0p66J213o27m94J042l59o28Q42o7q96J127o66j78O43o27L39J33j91Q6
1317F0K38o12N66k61n83J181q26o6R01n53n26J008n51n71J027o94J60J72n4J29
1337A45k5j25K06j69n25Q68p89J47P36p05K51M65n94j64P83q57K62M00o02L14
1357B2o4kK20j65j31N05p56J64P38r01L94M93q31Q6O20q32L72M86p00M06jk85
1379a62K16j1q2J60k99L2L83n94N28K84p76M91K1n95L27L65n61M04R1m80M03k71
$$ plain form
1401 -126 98 117 -72 56 67 -290 53 368 -471 402 37 -484 123 93 -252 201 445 -362 339 -118 -163
1422 -163 30 -173 54 -95 -80 -34 280 -257 451 156 -329 226 -186 -305 39 214 -301 349 47 -115 134
1443 134 -86 106 -87 39 -39 -34 -235 288 12 -168 403 -206 -225 200 -44 -181 335 -48 -175 130 -132
1464 -132 -69 132 -37 126 5 -113 171 -103 -46 197 -117 -285 256 -191 -111 392 -68 -19 133 -3 -236
1485 -236 135 -104 4 0 20 139 -155 120 21 -44 -112 220 -274 -5 229 -191 144 65 -28 -224 181 -239 25
1508 25 50 -24 169 -118 205 -62 -20 -105 194 -301 13 226 -288 204 88 -12 -115 220 -232 -9 84 -147
1530 -147 113 -38 159 -63 44 -29 -22 -122 83 74 -196 178 29 -101 63 103 -157 -11 41 -69 -8 47 57
1553 57 -13 0 45 -21 -109 105 -26 -32 125 59 -132 167 -19 -180 148 -20 -71 18 168 -153 91 35 -14 -15 -112
$$ packed form
1401a26K24J9j89J28J1l57L43L15q39Q73l65n21O07l0l45M53K44q07P01m57m5
1422a63J93k03K27j49J5M6L14n37P08k95m85N55m12j19L44J75n15O50l02j62K49
1443A34k20J92j93J26p8Nk01N23k76j80N71o09j9M25k44j37N16l83j27L05k62
1464a32O3K01j69J63j21j18K84k74N7K43l14j68N41m47Q0N03m60M9J52j36k33
1485b36L71k39J08mK0J19k94K75r9o5o8L32m94K69K34m20L35p9r3j96M05m20K64
1508B5K5p4J93k87L23k67M2q5K99m95L14K13n14M92j16j00j03L35m52K23R3k31
1530a47K60j51J97k22J07p3Pj00K05rk70L74j49j30J64M0k60J46N2j10O1N5J0
1553E7p0J3M5o6q8K14j31oJ57o6j91K99j86j61L28j68n1Q9J50l21K44n6m9jr7
$$ plain form
1578 -112 108 -170 63 79 117 -83 110 -7 -210 85 -119 9 -40 99 -77 95 64 -35 55 -24 0 -213 90
1601 90 -44 -24 88 160 -47 -85 168 -155 -11 57 60 -111 36 25 -76 65 -18 54 -59 -4 -33 -7 31 46 8
1626 8 -21 15 -134 -16 81 -33 -3 113 -28 -103 80 24 -120 26 40 -77 -70 101 37 -20 102 -4 -48 -75 28
1651 28 -54 31 57 -21 33 -21 4 -49 92 -39 -42 28 5 -45 -24 126 -77 -24 -13 -1 -116 39 142 -59 55 19
1677 19 -8 -141 72 -25 -55 76 -56 32 14 86 -31 71 -4 -98 5 -49 25 -35 101 28 -39 7 29 -26 -74 109
1703 109 -37 -68 44 18 -49 33 54 -70 1 -18 -17 -7 32 29 -36 19 -21 -51 2 42 -51 7 99 -74 10 68 -25 -40 20
1732 20 5 -56 37 8 33 -13 23 20 -63 8 29 -37 -29 75 -46 21 52 -55 -10 33 -32 -46 79 -34 7 33 11 1 -50
1761 -50 58 -47 -29 1 33 -49 32 71 -66 47 -14 -22 -7 17 -20 12 31 -28 37 -23 28 -19 -24 36 -12 -36 37 41 -83
$$ packed form
1578a12K20k78K33J6L8k00J93j17k03K95k04J28m9J39j76J72l1r9R0p9K4k13L03
1601I0j34K0J12P2k07l8K53l23J44O8Lj71J47j1j01J41q3P2j13N5k9K6L8J5l8
1626Hk9L6j49J18R7j14L0J16j41p5J83n6j44J46J4j17PJ71o4n7J22j06m4k7J03
1651B8q2Q5K6p8N4n4K5n3J41j31lP0k3n0K1J50k03N3J1J2j15J55J03k01J14l6
1677A9k7j33K13r7l0J31j32Q8j8P2j17J02p5r4J03n4P4o0J36p3o7M6K2n5m8J83
1703A09j46l1J12k6o7Q2K1j24P1j9JJ0L9lo5N5m0l0N3M0r3N8R2j73Q4N8r3j5O0
1732B0j5o1R3k9K5m6L6lq3P1K1o6QJ04j21O7L1j07M5M3o5j4J25j13M1K6k2j0n1
1761e0J08j05J8L0L2q2Q1L9j37J13o1qJ5K4l7L2J9n9O5o0N1m7nO0m8k4P3Mj24
$$ plain form
1790 -83 63 5 -85 13 9 -38 7 60 -37 22 -6 -12 13 -37 23 -16 1 13 -4 -10 40 9 -48 60 -35 -44 36 18 -11 14 27
1821 27 -33 0 8 39 -8 -6 46 -51 -20 21 -5 -43 61 -33 -37 52 -45 9 38 -3 -39 13 -39 -24 16 -11 28 -20 12 24 -33
1852 -33 5 43 -32 -32 54 -55 4 40 8 -2 12 -4 -19 12 -8 31 -12 13 8 -27 21 9 -24 14 24 -54 10 28 -48 13 14
1883 14 -33 -20 0 -18 4 -9 12 20 -35 5 4 -17 27 23 -27 20 36 -36 32 24 -30 20 5 -34 -4 19 -18 13 -2 -5 -7 -18 36
1916 36 -16 1 15 -10 -37 24 1 -45 35 -28 0 -4 15 -10 8 18 -16 -1 -35 21 -18 7 30 -13 -3 23 6 -24 41 -20 -17
1947 -17 21 -15 -6 9 -3 -22 9 -17 -3 -24 -3 3 -26 4 -1 -22 -15 27 -22 -4 32 -13 8 6 -16 -3 7 0 -6 -12 -3 16 -11 15 9
1982 9 -35 11 11 -21 3 22 -25 15 9 -21 -1 -6 -14 -8 12 -14 1 -14 -10 12 -28 15 -26 -21 -8 0 -29 4 31 -38 28 -2 -8 3 8 3
2018 3 -1 15 5 14 -25 25 -19 -1 18 -17 -13 13 5 -22 34 -8 -8 7 -5 3 -8 16 -14 8 -18 4 -9 -11 24 -20 -18 -2 -18 -14 17
$$ packed form
1790h3J46n8r0R8mm7M5N3r7N9k8oK5n0O0l9J7J2j7oN0l1n7J08r5rQ0j8k9K5J3
1821B7o0L3QL1m7KN2r7L1M1k6l8J04r4mQ9r7N4K9m1l6N2n2J5M0k7L9m8L2J2n7
1852c3L8L8p5%Q6j09N9L6l2j0J4j6j5L1k0L9m3K5nl5M8j2l3L8J0p8O4J8p6O1J
1883A4m7J3K0j8K2j3K1Qn5M0jk1M4mn0M7J6p2O8qn4N0j5l9L0K3l7L1j5lkj1N4
1916C6n2J7J4k5k7O1k3m6Q0o3K8mJ9k5J8J0l4J5l4N6l9K5K3m3J0K6j7l0O5o1L
1947a7L8l6RJ5j2j9L1k6J4k1K1Ok9L0nk1PM2m9J8L6m5K1kk2J3J0pooRJ9k7K6o
1982Im4M6%l2K4J9m7M0ol0K0nqOK0k6J5j5MK2m0M3m1NJ3Qk9L3K7o9O6l0oJ1Nn
2018CmJ6j0Rl9N0m4J8J9l5MK6qk7N6m2%J5j2Qj1K4l0K2k6K2j3kL5m4KJ6j6ML1
$$ plain form
2053 17 -8 -22 8 -18 -19 4 -5 1 5 13 6 10 -3 9 -18 1 11 -19 8 16 -10 1 24 -25 -12 4 -22 13 0 1 -1 -14 2 -3 -14 2
2089 2 28 -37 31 -5 -17 -3 5 -22 -16 16 -30 7 -7 -1 0 9 -6 -1 -7 2 4 -8 28 3 -10 24 9 -5 7 9 -17 8 1 -7 8 -2 -8
2126 -8 -8 2 1 4 -3 31 -1 -8 17 -4 -11 20 -3 -8 18 -6 -19 27 -2 -5 8 -5 -13 4 14 9 5 5 9 -8 -3 32 -8 2 12 -2 -8 6
2164 6 13 -15 1 -11 -6 -22 -3 -10 -9 6 -2 1 -8 5 -22 -2 8 -20 -4 9 0 5 21 -20 -1 7 0 -6 -6 13 -3 -2 -7 8 -18 9 6 -17 15
2203 15 14 -2 12 15 -15 1 3 -18 -3 2 6 -12 4 6 -12 -3 1 -12 -12 16 2 -10 9 -7 -7 -5 3 -5 15 15 -4 6 4 15 -2 -2 -3 -5 -2 0
2243 0 5 -18 7 -8 -17 -1 -2 -17 5 9 -16 6 -3 -3 -16 10 -8 -8 14 -9 -5 -3 2 -13 -9 2 -10 -6 -3 0 -11 14 -7 -3 1 6 -3 0 13 -7
2283 -7 2 7 2 -7 6 18 -10 2 0 -10 -17 0 -13 -8 4 -16 -13 -4 10 -6 2 -10 -9 2 0 6 -9 3 -6 -21 0 14 -15 -18 8 -15 -10 6 -5
2322 -5 -1 9 19 -9 0 0 -6 -1 8 0 -3 7 -5 -10 -8 8 -12 -8 3 -26 -11 10 -5 -12 11 -8 -21 1 -5 -8 -26 8 -3 -4 -1 -5 3 0 10 -33
$$ packed form
2053A7k5j4L0k6jK3rOMQpMj3J2k7J9J0l0K7Qk6J1K3m9J3J6k6L5j3Jkj3J6nj1J6
2089BK6o5O8l6j2J4Qk7OL2m6L7j4OJRj5NoRKj2L6k5j3L4j5j4J2Kk6K5pqJ5j0o
2126h%J0jLpL4l2pK5k1pL1k3nK6k4j3M6k9lJ3j3qJ7J0nm%Mj7NL5m0J0J0j4oJ4
2164FPk8J6j2Nj6J9pJJ5qLrJ3k7K0J0k8J6J3rNJ6m1J9Qpo%J9j6JnJ5k6K7lk3L2
2203A5jj6J4Ll0J6Kk1J5NMj8J6Kj8RMj3%K8j4j2J9j6%KQqK0%j9J0kJ1j7%jkLK
2243@Nk3K5j5rJ6jj5K2Mk5K2r%j3K6j8%K2k3MKNj5MJ1j2MLLj1K5k1MMNrLJ3k0
2283gRNnrJ3J2k8J2kj0pJ7j3NJ2k0LRJ4j6Qj2JJ1kOj5J2rj5K1J4k9lK6k3NJ6j1
2322eMJ0J0k8R%oNRqlJ0j2nKJ6k0MJ1k9J5K1j5pK3j9j3K2olj8L4j1jLmQlJ0m3
$$ plain form
2362 -33 7 13 -15 5 6 -10 -10 15 -21 -13 0 8 -20 -4 15 -6 -3 -2 -4 -21 -2 -1 -24 12 -7 -20 -17 4 -18 4 4 -10 1 -12 0 -11
2398 -11 -7 17 -14 -1 21 4 -20 25 1 -22 16 2 -32 -2 5 -21 11 -1 -21 3 -13 2 -4 -8 5 -3 -29 16 6 -19 25 -28 -20
2431 -20 8 1 -13 4 7 -27 3 -9 2 -12 1 2 -9 13 5 5 -11 30 -23 -1 27 -20 -1 9 -2 -12 20 -19 -7 12 -7 -1 -22
2464 -22 1 6 -6 -7 2 -35 -12 34 -36 -8 16 -11 -14 22 -7 -22 12 -6 -10 -8 3 0 -20 15 7 -17 21 15 -24 17 37 -28 20 11 -14
2499 -14 -8 6 -17 -21 10 -17 -5 -23 16 -6 -14 5 -10 -31 -1 5 -40 20 1 -35 11 10 -11 -8 29 -37 14 -13 -3 -10 -3 22 -27 4
2533 4 0 0 -36 19 7 -33 23 -16 -20 -2 21 -16 -2 5 -18 -4 -12 16 -13 -1 11 -19 -26 13 -13 -32 38 -29 -46 25 -18 -16 20 -2
2567 -2 -24 7 -5 -10 10 -6 20 -24 -9 3 -19 -7 29 -12 -30 26 -26 -16 22 -7 -7 7 -3 -35 4 0 12 -26 -1 9 -36 4
2599 4 8 -15 -15 36 -47 -13 19 -25 11 14 10 -25 25 -5 12 8 -8 12 -19 19 3 -12 2 23 -28 -3 27 -38 10 18 -10 -13 17 -16
$$ packed form
2362c3M0Ok8K0Jj6%K5l6QJ3Qk8J6J9k1LJkj7J9Jk3L6j9j3LK1k2K2%j4J1j3J2j1
2398a1MK4l1J3K2j7k4M5k4k3L8j4l4L0Pk6L2j2k0K4j6J5omJ3qk6M5j0k5M4n3Q
2431b0K8pj4J7Ll4L0j2J1j4J3Jj1K2q%j6M1n3K2K8m7J9J0j1j0L2l9J2J9j9Ok1
2464b2K3Nj2jRl7K3M6p0K8K4k7lL6k9j5L4j8mKJ1lk0L5qk4L8ol9M1K0o5M8rk5
2499a4OJ4k3mL1k7J2j8L9k2qJ9j5k1L0Om5O0j9l6M6jk1LL7o6N1k7J0pPK5m9L1
2533Dm%l6N5j2m0N6l9mJ8K3l7J4Pk3J4qK8k9J2J2l0pL9k6j9P0o7j7P1m3KL6k2
2567bk2L1j2nK0j6K6m4J5J2k2J2L6m1j8N6n2J0L8k9%J4j0l2L9mJ2l8K5J0m5M0
2599DMk3%N1q3L4L2m4L6Lml5N0l0J7mj6K0l1L8j6j5J4K1n1K5L0o5M8Qk8lL0l3
$$ plain form
2633 -16 -21 9 -17 1 -9 4 -12 -12 24 -15 -29 -4 8 -43 11 23 -40 15 14 -19 -2 16 -4 -15 9 17 8 -13 32 -12 -28 16 -1
2666 -1 -22 12 27 -51 24 13 -21 14 -7 -18 -17 9 -42 0 -2 8 -5 -15 23 -38 -3 19 -2 -28 29 13 -34 30 4 5 -1 16 -13
2699 -13 -1 9 -17 0 -14 18 -29 0 14 -18 -6 31 -9 -29 42 -19 -22 27 -9 -29 -2 5 -28 7 2 8 -18 -5 -1 -24 -5 3 -16
2732 -16 -12 26 -21 -18 21 -5 0 20 -4 -10 5 12 -17 -3 7 -4 -35 8 3 -25 10 7 -24 -10 30 -33 -12 23 -20 -6 9 0 -22 19
2766 19 -12 -12 2 -2 -3 -28 21 2 -17 2 15 -27 -8 32 -25 12 25 -1 -3 18 13 -18 30 -5 -4 -9 16 -5 -9 25 -24 -16 -1 7 -28
2801 -28 12 11 -26 4 10 -3 -20 25 2 -11 -9 6 -4 -15 35 -8 -15 11 2 -15 9 14 -22 23 15 -19 3 13 -12 -5 22 -15 -18 6 10
2836 10 -11 -5 26 -16 -4 7 2 -23 4 7 -19 1 -8 -6 -4 -1 -8 7 13 -6 6 8 12 -23 4 10 -20 -11 22 -1 -25 35 -12 -11 11 4 -10 5
2874 5 7 -17 9 3 6 -4 12 9 -21 13 -1 -5 -6 19 -20 -16 23 -14 -10 12 14 -15 -1 9 -10 14 3 -1 -17 23 6 -11 8 16 -3 0 31
$$ packed form
2633a6nL0k6J8j0J3j6%L6l9j4K5J2n1N4J2o3N5jl3J7J8k0j1K4Qrk1M5m4j6M4j7
2666ak1L4J5p8P5j1l4L5k1j1JK6n1M2kJ0j3j0L8o1L5K2k1k6N7j6m7O4k6JoJ7k9
2699a3J2J0k6J7j4L2m7K9J4l2J2L7m0k0P1o1lM9l6k0K7Pl3L5nOk6J3Mk3J9Qj9
2732a6ML8m7LL9k6NK0k4oJ5Pk9J4J0j1l1M3nk8L5ll1J4M0o3K1L5m3J4J5rk2M1
2766A9l1%J4mjk5M9j9j9J9J3m2J9M0n7L7J3k6kK1nl1M8l5JnK5k1mL4m9QJ5Ql5
2801b8M0jl7L0Oj3j7M5k3j3KJ5j0j1N0m3pK6rj7K4Nl6M5ql4K2J0k5PK7l7lK4M
2836A0k1OL1m2J2J1nk5K7Lk6K0rKKLpJ5Oj9J2KMl5K7Ol0RL3k3k4O0m7JK2pj4J5
2874EKk4K6oLj0J6ll0L4j4mjK5l9ML9l7MK2Kk9J4J0j9K4j1mj6M0j7j7J9Qj9LL1
$$ plain form
2911 31 -16 4 10 -2 -6 3 6 -15 19 -7 -15 -1 -2 1 -20 7 -4 -23 2 14 -5 -8 23 -24 6 5 -6 -12 13 0 -18 20 -3 6 4 17
2947 17 -8 6 15 -11 0 7 12 -20 11 10 -10 10 10 -3 -19 9 -18 -13 -2 -3 -5 -15 18 -18 -3 1 -2 -15 12 0 -25 8 4 -14 14 13
2983 13 -15 0 15 3 9 12 2 -13 -3 17 -1 7 15 0 -13 12 -4 1 18 6 -11 1 1 -17 -1 3 -2 -10 -17 -2 -23 5 -1 -15 -15 -2
3019 -2 -13 -26 25 -19 -5 2 -1 -11 4 10 -5 13 -1 -1 -5 7 -9 -18 5 -9 2 -7 16 -31 -6 18 -16 -5 7 -4 -17 11 -8 -15 -10
3054 -10 -1 -11 0 12 -2 -10 2 -5 -22 3 19 -13 6 20 -16 -1 4 -2 -7 13 1 5 7 6 14 -6 21 -2 -13 4 -2 -15 11 16 -16 6
3090 6 2 -9 -21 17 -17 -17 13 -10 9 0 7 -5 0 10 -17 -10 7 5 -20 22 -11 -11 14 6 10 -6 19 -13 7 16 12 -4 7 8 -2 2 12 -2
3128 -2 -2 19 0 -15 10 2 -11 -10 12 -30 3 7 -16 2 2 -3 -15 6 4 -2 -1 6 -10 -11 22 -8 -9 7 2 -11 -1 9 -10 15 1 -14 -2
3165 -2 7 1 -12 4 11 -16 -1 9 -10 -8 21 -17 -6 9 -5 -10 -10 1 -11 3 3 2 -8 1 -9 -16 9 -13 -7 9 21 -9 9 20 -14 1
$$ packed form
2911C1m7K0Oj2mRLk1L4k6qJ4jLk1K7j1j9K5J2j9lL1m7L0jj1oK5j3j8L8k3RkJ3
2947A7k5J4Rk6J1PNl2L1jk0K0%j3j6K8k7NJ1jkj0L3l6J5Mlj3K7j2k5L3mj8K8j
2983A3k8J5J5j2OLj0j5J0K0j8QQj5j3K5j6NJ7j2j7J2%j8J6MnqpJ5k1K8oj4%J3
3019bj1j3N1m4J4Plj0J5Oj5J8j4%mJ2j6rK3j4J1rK3m7K5K4l4J1J2j1j3K8j9pN
3054a0Rj0J1J2j4qJ2pj7K5J6l2J9J4l6J5NonK0j2MKjQk0K7k3j1J7oj3K6Nl2K2
3090Fmj1j2L8l4%L0k3J9rPj2NJ0k7PJ7kk5M2l3%K5qMj6K5l2K0Rmj6J1Jj0MJ0j4
3128b%K1j9j5K5qj3JK2m2L3Mk3J8%nj2K1koJPj6jL3l0jJ6nj3J0J0j9K5j4j5J2
3165bRoj3J6Pk7J5J0j9KK9l8J1J5j4n%J1j2J4%jj0Rj0pK5k2OJ6J2l0J8J1l4J5
$$ plain form
3201 1 5 12 -12 24 2 -3 7 1 2 -13 13 -5 0 9 7 -4 5 9 -10 4 3 -1 6 16 -2 -7 9 -4 -6 -3 17 -12 -4 10 -9 -7 -1 10 -13 19
3241 19 21 -1 11 25 9 5 11 -1 0 2 -2 -6 2 7 -13 8 2 -7 -4 4 1 -13 1 2 -6 -3 4 -3 -15 12 -8 3 13 4 -7 7 13 -9 -1 13 -11
3282 -11 -6 18 4 -9 17 0 -1 7 18 -10 9 11 -8 5 1 7 1 7 8 -5 3 6 -8 -14 12 -3 -16 -5 9 -2 1 11 -6 19 16 -2 10
3319 10 1 12 -9 12 9 -2 7 13 1 -4 29 -1 -2 11 5 3 15 4 -3 10 -6 -5 -1 8 -2 -6 17 -3 -7 6 -3 -8 -11 7 -3 -6 3 -6 -9 10 16
3360 16 -16 10 3 6 6 12 -5 3 7 20 0 5 11 1 10 0 -6 -5 5 0 -9 21 9 3 10 9 5 0 4 4 4 5 15 -15 22 7 -11 -4 7 8 -8 7
3402 7 -5 7 9 -2 7 6 17 -5 16 15 1 8 9 17 -4 11 3 2 5 5 0 2 11 -24 -4 15 -5 -19 1 11 -11 8 8 -4 -11 10 -6 -7 6
3441 6 4 -5 -3 7 -5 3 4 -8 -7 4 0 1 19 2 -6 3 9 -4 -9 10 0 5 13 8 -8 1 10 -12 -6 -6 -16 -1 -1 -1 -14 11 2 0 -8 0 -15 -1 8 -2
3485 -2 5 4 8 -4 10 5 14 0 -3 9 3 6 1 1 13 -7 3 10 9 -8 6 5 5 3 4 5 -5 14 -9 -14 -11 -5 -1 -8 7 -17 -1 -7 -2 -8 -2 7 -8 1 -5
$$ packed form
3201AMPk4L6k2nJ0oJj5K6j8NRkj1RMj9J4jmPJ0j8nJ6j3kLK0k9QJ4j9KOJ1k3L2
3241A9Kk2J2J4j6mOj2JKmmQNk0K1orLQlj4J4JqLPpj2K7k0J1J0rj1J4Ok2QJ4k4
3282a1NK4j4j3K6j7jQJ1k8J9Kj9J3mOoOJj3QLj4oK6j5j3J1J4j1LJ0j7K5lj8J2
3319A0rJ1k1K1lj1ROj2nL3l0jJ3okJ2j1pJ3j6JMRj0mK3k0mJ3rnlJ8j0lRrlJ9O
3360A6l2K6pL%Oj7QMJ3k0NOj0Rj0oJJ0nrL0j2oPjmnM%%JJ0l0L7j5j8PJ1Jj6J5
3402Gj2J2Kj1RjJ1k2K1jj4PJQk1J5qjL%nKRl5K0J9k0j4K0J0k2J9%j2pK1j6jJ3
3441FkrKJ0j2QJj2JJ1mJJ8j7qROj3nJ9j0NQnj6RRk2O%j0J5%%j3K5rkqQj5J4Rj0
3485bPjMj2J4nRj4lJ2oLn%J2k0J0Pjj7J4j%kJJj0J9k3nLOMpJ5k4J6oNoORj5Ro
$$ plain form
3530 -5 -2 2 10 -1 6 6 7 9 2 6 -2 -5 3 -3 6 6 4 -10 17 -3 -9 2 -5 -4 0 10 -2 10 8 -2 -3 7 -6 -2 -5 0 -2 -1 3 -8 -6 9 -10 4 7 15
3576 15 -7 11 15 4 5 10 12 0 7 1 2 12 6 0 7 16 -5 3 9 -19 -14 3 -1 -4 6 -6 -1 14 1 0 6 10 -11 0 9 4 -10 2 5 -4 6 -2 9
3619 9 4 5 6 -7 8 2 -2 7 18 6 11 20 -11 4 16 -2 -9 10 3 -6 1 -3 -12 -4 -4 -17 -5 1 2 -5 -9 8 11 6 -4 2 -3 -1 -6 -9 7 1 -1 5 5 -11
3665 -11 8 6 -7 1 4 0 -4 18 4 -1 2 10 8 -8 0 2 -6 9 -8 -11 -8 -5 4 -2 -7 -7 -6 -5 3 -10 6 11 -5 -6 7 -1 -4 9 0 11 5 11 4 -1 9 -12
3711 -12 3 2 -1 -9 8 -3 -7 2 -3 -9 -12 -10 -1 1 -8 -6 -6 -10 -2 -4 5 -7 -3 -4 2 -10 -1 8 2 -14 3 -9 1 2 11 6 5 2 -3 4 11 -2 -2 15 -1 -3 -7 -3
3759 -3 -3 3 0 -9 2 11 0 -8 -7 -5 -7 2 12 10 0 3 1 -2 11 -4 -7 -1 1 -7 1 10 -6 -7 -8 0 -1 1 15 11 13 -2 -2 -3 11 -3 5 -2 6 -6 -8 -5 -13 -10 -5
3808 -5 -7 -11 -8 -8 -7 -5 -7 2 -5 3 -2 -3 -4 -7 -1 2 -2 -2 -2 11 -4 -6 2 0 -3 10 7 7 -4 -1 -2 -16 0 -2 -4 5 -8 -1 7 -4 -3 3 -5 -7 -1 -3 -18 -3 -3 -6 -2
3859 -2 -9 -4 -8 -2 2 -12 2 6 4 -2 12 4 3 14 -3 -2 4 5 6 5 24 -6 -3 1 -8 1 -6 -9 -16 -2 -9 -12 0 -9 -7 -7 -2 8 -15 -3 -7 -6 -2 -11 -4 -6 2 3 -4
$$ packed form
3530eLMQj1P%JKpMqlQoR%kj4K7k0oJ1pJMJ0j2J2kj0jJ0j3MlNkJMj1KJ5j9J4LQ
3576A5k2J8Mj1JNKj2PoJJ0ooPRk1QOk8NJ7mlJ0j2NJ5j3jOMk1J1Rnj4J2LrJ0qJ1
3619InJJj3J5omRJ1j2NRl1J5J2j8pJ9prPmrQ%j3J2OJpmJ7Lnj0OnKnlJ6okO%j6
3665a1J9kj3QLmmK2j4nLQkj6QKqJ5j7lLLRon%JJQj3J6Nj6jJ3qlJ3rJ1oOpnJ0k1
3711a2J5jlqJ7j1mRnolKRKrK%mQkRj2MjOj2RRoj6J7j2J0JRnjlnPPj3%J7j6kmM
3759c%OlrJ1Rj1qJKkRJ0kj0LklJ3j5lOKqQRj6jjQjKJ4mKj5%jJ4j4QpQj2kLqLN
3808ekmL%JKkRpQnjjlOLm%%J3j5kQklJ3l%j1Ljj4J6kkRj3PQj1JOqkOkj5J5%lM
3859bpNmOMj4J4MkoJ4qjJ1j7JOJJjJ9l0LMrRplpJ4plJ2rK%NJ0k3J2mJMrPkQJp
$$ plain form
3908 -4 2 3 -4 1 11 8 4 11 7 6 -4 8 1 6 5 7 4 6 7 -5 0 -10 -5 -12 0 -3 -14 -5 -14 14 0 -6 0 -2 6 4 -1 -6 -14 8 2 -5 -2 5 1 8 2 -3 -1 -7 -9
3959 -9 -6 1 -4 -2 -4 -8 1 -2 3 8 4 -4 11 -8 -13 3 -12 -3 -6 -14 -15 5 -7 -13 -9 -10 0 -5 -6 -7 -6 5 4 0 19 6 7 10 -3 0 0 13 -3 5 4 -10 8
4006 8 7 2 5 -10 8 -2 0 2 4 -7 3 0 -13 9 -7 -14 1 -9 -12 -7 -1 -7 3 -16 2 -5 -2 1 0 0 -3 9 -3 16 4 -7 6 6 -3 4 8 -6
4048 -6 -4 -1 1 -5 1 12 -18 7 -11 -8 -9 0 -7 0 14 -13 3 5 -10 -6 -2 8 0 -5 11 0 1 4 -1 1 0 -3 0 0 14 -13 2 8 -1 4 5 2 -5 -4 -2 -13
4094 -13 -6 -3 -3 -10 -5 -1 -2 -6 2 -15 2 -5 4 2 -1 -5 -6 1 -1 5 3 -3 -7 -3 2 -8 -6 2 4 6 -1 13 -3 6 6 5 8 0 2 6 17 9 0 2 1 2 -2 7 -12 0 -1 -15
4146 -15 7 7 -3 -5 -1 -6 -5 2 4 3 1 0 3 -11 10 9 7 5 -5 -8 4 8 3 6 16 -3 -5 -4 -5 -12 13 15 5 6 2 10 -3 4 2 -6 -6 -5 -9 -2 -8 -9 -1 -9 -8
4195 -8 -6 4 -5 -6 -1 5 0 -3 1 8 -1 12 13 -1 14 12 1 7 6 2 8 0 1 -4 5 -2 3 -5 -5 -7 -1 3 -1 -16 4 -7 0 0 -11 -1 -7 -15 -12 -8 -9 -7 -11 8 4 1
4245 1 -5 7 2 5 2 5 0 15 4 10 2 3 0 5 -8 2 2 0 -3 -12 -10 -5 -8 -6 -6 3 8 3 -10 1 -2 1 -4 4 0 -1 11 1 1 0 2 -7 2 2 -11 1 5 -5 -12
$$ packed form
3908dOJpNJ0lmPmjj0J2pNjKlKJj2Nj0NpJ2lj1RrK8j4oOkQknnqK2opLPmPonKok
3959iLPnKkmRlNNmqJ5j9nJ6j5RlqjK0j2oMjJ0njjJJ1jmJ9j3JLj3L%J3j6Qjj4J8
4006HjnLj5J8j0KKKj1J0lj3K2j6pJ5j0lNOoJ0j9J8pLLj%lJ2j2J9j2j1J3%rPMj4
4048fKLKoOJ1l0K5j8LjRpPJ4k7J6Kj5MMJ0qnJ6j1JLnKjlL%J4k7J5OrNJlpJKj1
4094a3PL%pNMjmQj7J7pRklmjPkOkomMNj0KQKKpJ4j6R%jLqKMJ1qrKjJmRj9J2jj4
4146a5K2%j0kMnJPKjkjLj4K1jkkj0lJ2MnLJ0j9kJjpK5Kj0JmQj3Pkq%JmPojQqJ
4195hKJ0rjNOnlMPrJ3Jj4J5kj1OjmOqJnRpNq%kOMmj5K0j1P%j1J0oqLMjKmJ9ml
4245AoJ2nLlLnJ5j1OqJlNj3J0%klrKNlK%RNnj3J1lLnQmjJ2j0%jKrR%j3J2Mj0p
$$ plain form
4294 -12 -3 5 -1 8 10 3 6 14 3 -3 -5 7 -3 -8 -3 -14 1 4 -12 -13 -3 -2 -14 -8 -3 -16 -5 0 -6 1 4 -3 11 23 1 -7 3 8 1 7 -4 10 -5
4337 -5 -2 2 4 6 -1 1 -3 5 -8 -2 0 0 6 8 -2 7 -14 9 -3 7 -9 -9 -2 -5 -5 -13 -4 -9 -8 8 -6 -4 3 0 1 1 -1 12 5 6 3 4 3 -1 5 3 -3 -2 2 7 -7
4388 -7 -9 -3 -4 -6 -9 -6 0 -5 -7 -6 -18 -4 -6 -2 1 -1 7 -1 -2 -5 7 -10 4 0 -2 0 -9 4 -3 -7 -5 2 1 5 7 -1 6 7 3 -4 7 3 -1 -7 -11 -10 1 -6 -12 -3 -7 -7 -10
4441 -10 -15 -2 -11 3 0 1 1 2 6 -4 0 5 1 10 3 5 -1 -8 5 0 2 1 -8 1 7 6 0 4 11 0 6 -3 -2 -5 3 -7 -4 -8 -6 -8 -7 -8 -11 -16 -9 -8 -8 -13 -5 -4 -8 -6 -1 0
4495 0 -1 -6 3 -3 3 -3 3 0 -2 3 -5 -1 -5 1 -18 -1 2 -4 0 2 -7 3 -1 0 -1 -1 -7 9 -6 -8 -15 -8 3 -6 -11 -7 -11 -10 -5 0 -4 -5 12 -5 2 3 5 2 -2 9 5 1
4547 1 -3 -8 12 -2 7 -7 0 -2 -9 -8 -9 -1 0 -11 1 -3 -5 -6 -9 8 -5 2 -4 -2 1 -11 9 -21 -5 -6 -6 -3 -8 -8 -2 7 2 0 18 2 3 11 6 -2 -6 7 14
4594 14 -4 -5 3 -2 -2 -10 -8 -6 -5 -11 -12 -2 1 -15 -16 -2 -12 -4 -2 -5 -2 -6 0 -8 -9 -2 10 -7 -4 -5 0 12 -5 -12 -8 5 -11 -3 -2 -2 -2 7 -1 -1 5 -5 -6 3
4642 3 -1 3 -2 -2 -1 3 -5 -13 -13 -11 -8 -19 -4 -5 -1 0 -7 -13 -13 -1 -5 4 13 -2 2 1 1 -5 4 -5 4 -3 1 -3 -7 7 -1 1 -6 -2 -8 -3 -2 -1 -4 -4 -6 10 3 -4 -12 -4 5 4 -7
$$ packed form
4294a2RQoRKpLQj1okJ2j0nNj1J5Lj6jJ0Jj2ONj3J1NoPLpJ4J2k2qJ0NpOj1J4j5
4337eLMKKpKmQj3OK%OKj0Rk1K3j2J0j6%Pl%qRnJJ6j4KPlJ%kJ3pJlJjmOkoJMNj4
4388gkOjklLOnkJj2J4kMLkQqjlJ2j7J4mkKrJ3pmKPjMKqPJmpJ1mmomJJ1poRm%l
4441a0nJ3rJ4lJ%JMj0MNmRpKopJ3nKjrROjoMPj1OrJlQj0LmKkJjlnPJ%nQJmKNJ
4495@jnRoOoOlkNqMmOj9J7LoMKrJ0mJj%oJ6j5kpPJ1rnMmJNNmjJ7j7PJKlmJ1mm
4547AmnK0j4Rj4PkpJjQJj1J2mkjlJ7j3PoKLj2K0l0J6j%Ln%ORnkJ8j6JQnqmJ3P
4594A4j8jQn%qKKJojJ0Lj6jJ4j0QKlLmOqjPJ2j7LjNJ2j7pMJ3j6QJ%%Rq%Oj0jR
4642CmMn%JMqq%KLj1J5jMJpo%J2mRRj5Mj%oRrRpMmmJ4qKpMoNJJl%kJ6ppqQRjj1
$$ plain form
4697 -7 -6 -5 -9 0 3 1 3 -1 2 2 4 3 6 -4 -3 11 9 12 9 -1 -3 8 -3 10 -1 -4 6 -6 -5 7 0 -5 -3 12 -8 -11 7 -1 0 -6 2 -1 -1 8 -4 -4 -4
4744 -4 3 5 7 1 -6 -6 2 4 -13 11 20 -3 21 4 3 14 15 13 7 8 9 1 4 4 -2 2 -13 -4 -2 4 -16 -8 -13 -3 -5 2 -13 -10 1 -4 -1 -1 0 1 8 4 1 -4 0 1
4794 1 -4 5 -10 -5 1 3 2 4 10 9 3 7 0 4 3 6 -16 0 -5 -15 -2 -8 4 -5 6 -10 -2 -12 -4 -10 -1 -4 -1 2 3 2 -5 4 -4 0 10 9 -6 7 4 6 2 -13
4842 -13 2 2 -1 1 1 13 10 8 -3 4 -1 0 -2 -10 5 1 -1 2 -7 -3 -10 -9 -6 -6 -9 -3 4 -6 -1 -5 0 1 8 4 6 12 8 13 2 9 4 7 13 8 0 4 8 1 6 -5 5 -4
4894 -4 -2 -5 3 -2 -11 -5 -14 -8 2 4 -2 2 -2 -8 -5 -6 -2 -6 2 5 1 -2 -1 2 -4 9 1 10 -1 7 5 9 15 9 10 13 8 5 8 20 2 6 3 -14 -7 -16 -6 -2 0 5 -1 -6 -11 6
4948 6 -1 6 -2 -3 7 -1 -6 1 -6 -17 -2 0 10 -3 16 5 -4 -3 -3 -9 -4 10 -3 -13 -1 -3 -5 -5 3 -8 0 4 -10 -1 -8 -8 -10 -8 -10 -16 -10 -11 -12 -14 2 -7 -3
4995 -3 -8 -4 -9 4 2 4 4 1 2 6 6 -3 -1 -5 2 1 4 -2 11 -3 4 -9 2 -12 -8 1 0 4 -5 -4 -8 0 0 -14 -2 -15 7 2 -5 -2 -3 -8 -6 -2 -6 -5 1 0 -6 -4 3
5046 3 5 0 9 3 11 4 1 -3 -5 2 -5 8 -1 -6 -16 -3 2 -11 -4 -4 -1 -8 0 -8 -2 -5 -2 -7 -3 -6 -7 7 -1 5 -3 -1 -7 -9 -6 2 -1 -7 -3 -5 7 -1 -4 6 11 9 1 1 4 -2
$$ packed form
4697gJJmRLkKmL%KjLj0JJ4kLlj0kJ1j1J3j1lJ0j2JJ2pnKJ5k0lJ8qJoQl%Rj2%%
4744dPKKop%QKj7K4Rk3K4j7jJ1JkoJJqL%oMj5RKOk0QnJ0kPj5LJ1nL%JJPmlnMJ
4794AnRj5NOKjKOjoMpMjLk2J6nj0J3oJ2rJ1j6Qj0QoRlLLJjpRqMJ0jj5J3lKmj5
4842a3J5%lK%J2lkj1PnJkqJ5mkLrMpJL%lOPj0NmNJPmKOmNj1PnLOnqMMpNj1J0r
4894dKlQnrOrOJ0KoMmoLjMmQLmlJLoJ3qRj1QkMOoJLnlLJ2j8Mlj7PrJ0MKNonnJ7
4948FpPqjJ0qnPpj1J5KJ0j3J9j1rJ%oNJ4j3j0J2kk%Qj1QMj4Rp%kKkoOjjkJ6rM
4995cnMnJ3kK%lJM%rKmPjLoJ3j4Pj3J1j4MRjMrJmQ%j4J2j3K2npLjnKMmJOjoKP
5046CKnRoQplmkPpJ3rnj0J3Nj3P%LpQqOlLnMljJ4qOqKokLQloMkJ2qlJ0Nkq%Lo
$$ plain form
5100 -2 10 -3 6 -7 4 -3 -2 -6 -3 13 -2 -2 -6 -10 -4 -17 -9 -7 -5 1 -7 -7 -1 7 7 2 2 -1 4 10 0 3 14 8 -1 1 3 -2 -2 17 7 5 -2 -1 5 4 2 -9 -7
5149 -7 5 -2 1 -5 -1 -4 4 -8 -4 4 -7 -9 -11 6 -3 -8 1 7 -6 4 -8 1 5 5 -5 -4 4 4 11 -1 7 -2 2 -2 -5 -2 -10 -7 -5 1 -9 -8 0 -3 -12 0 1 -13 -4
5198 -4 1 0 -4 5 -1 -8 -1 3 -3 -8 2 7 3 -8 3 8 0 -1 6 6 6 12 6 2 0 12 -5 -2 -3 -3 11 -3 -7 1 -1 1 0 2 -4 1 2 -11 -4 3 0 -1 -4 -4 -7 3 1 0
5250 0 4 -1 5 -2 3 4 -3 2 1 -6 6 2 6 2 7 2 7 18 5 -3 4 2 1 5 -8 -8 -7 3 -1 -6 1 7 -10 3 -1 -9 -4 -7 0 -7 6 6 3 3 3 2 7 -7 6 -6
5300 -6 9 4 0 -5 4 5 13 7 2 4 11 7 3 11 -5 -5 -2 1 6 -7 -4 -15 -13 -9 -4 -15 -3 -10 -7 -9 5 -5 -4 0 7 -2 4 -3 1 11 8 1 11 -6 3 12 4 -3 -7 2
5350 2 -11 -8 -1 4 -6 -1 -3 -5 3 5 -12 -4 -1 -11 -1 18 -2 3 0 -15 -10 -1 0 -8 1 0 2 -3 -3 4 -5 3 7 15 6 6 5 -3 0 7 10 -2 -9 -2 3 1 1 -6 -1 -9 -13 2
5402 2 -14 -12 -4 -3 5 -7 -7 1 -7 2 -6 -21 -7 -8 2 -6 -4 1 -7 2 -2 6 4 6 3 3 3 0 8 3 -4 9 9 9 12 3 -4 7 7 7 -10 -6 2 -1 2 -18 -13 -8 0 -13 -8
5453 -8 4 -4 7 -1 -1 6 4 17 8 -9 8 9 7 8 4 7 5 1 -2 -4 3 -2 0 -2 3 3 -6 6 11 -3 0 -7 4 -11 0 -14 0 1 -13 -8 -9 -10 -10 -14 -8 -6 -8 -14
$$ packed form
5100bJ2j3Rj3J1pJmLJ6j5%mmOj3QKKOq%OQ%n%lNOj0LJ1orKKn%J9j0kpJOjkj1K
5149gJ2pLoMlQj2MQj1kkJ7rnROj3J0j2RM%j0JQ%Pj2QrMmlLqLKOj0JQlrJ2Jj4R
5198dNjmRopPMonJ0Nmj1J1NqjP%%OomkJ2j7Lj%J4j4mQkKjKoNJj3PPljl%lJ0kj
5250@MnOpNJpNjpJ2mMmNnNJ1j3qPkjMj3%JJ0mnPOj7J3mqNlPpJ3%l%%jNj4J3j2
5300fJ5nmnRJQonKPmmQj6%LLNj3Lj1KMNj1J2pLkJ4j0JMPrOpMJ0lpJ0j7RRqpmR
5350Bj3LPNj0NkkQKj7QLj0J0J9k0Nlj5NRJqRjKn%PrQMQr%jqLPLj2pPNk%pNqmJ5
5402Bj6KQJQj2%QqRqj5J4jJ0qKNqRmQkKl%%lQnpJ3%%LrpJ1%%j7MQlLk0NNQj3N
5453hJ2qJ1q%PkJ3rj7J7JkJmLkmlkPnKkN%rJ2Nj4LpJ1j5J1j4J4Jj4Njj%mOKko
$$ plain form
5501 -14 10 3 9 -9 5 3 -4 10 6 7 8 16 8 8 2 -2 0 -4 -7 3 1 0 13 -5 5 -5 6 -5 5 2 0 -1 -7 -6 -11 8 -1 -2 0 -9 7 -3 -1 -1 -1
5546 -1 4 3 6 3 10 6 9 13 -2 2 5 8 -2 -2 4 9 -1 -1 3 0 6 4 -9 -1 -8 3 0 -2 -1 -3 5 -6 6 5 9 -3 11 -3 12 -3 10 2 2 9 -4 1 -10
5593 -10 2 10 8 -2 -2 6 0 4 -4 12 0 -3 -3 -6 -10 1 -4 4 -1 -12 -5 -15 -19 -1 -9 -13 -6 2 -7 2 -8 0 4 -1 5 3 1 -3 -3 7 -1 5 -5 0 3 -7 1 5
5641 5 1 2 -2 -9 14 -3 -3 12 5 -1 -4 -3 -4 3 -3 0 -8 -8 -2 -7 -6 -10 -15 -12 -7 -9 -5 2 -4 -1 0 8 -4 4 -3 12 0 1 10 4 4 13 8 5 4 -5 0 -12 0 0 -3 -8 -3
5694 -3 -6 -12 -10 0 8 -3 -6 5 -12 -15 -6 -14 -1 -11 -1 -2 -7 -3 -5 -2 1 3 6 14 13 9 -1 5 15 10 5 5 1 13 2 5 3 5 -4 -3 -2 -6 -7 -15 -2 -2 5 1 -7
5743 -7 -5 6 9 -10 -10 -4 -6 -12 9 -6 -10 -6 1 -3 1 5 -1 2 0 -4 -1 6 11 3 3 3 12 0 -3 10 2 -2 6 -11 -5 -3 -19 -8 3 -8 -13 -4 -3 7 -6 7 -1
5790 -1 -6 -7 -4 -13 -3 2 1 6 10 14 -3 -2 8 10 13 10 6 -3 -6 5 -4 3 -8 -6 -2 10 -3 6 7 0 -12 -5 -9 -12 -2 -15 -3 -5 -6 -2 0 -11 -1 -2 -3 -4 -10 4
5838 4 -3 -1 -2 11 7 8 4 9 10 8 13 -5 -10 -1 6 -8 0 6 -5 -4 1 0 5 -5 5 -7 -2 -3 -1 2 -2 -4 4 -3 -2 9 12 -5 1 6 -1 6 5 14 -3 2 0 6 -3 3 3
$$ packed form
5501a4K4pOj8J4kpJ4mJJQq%omKmlJ0kjJ3j8J0j0J1j1J0lkjoJnJ9rjKrJ6j0K%%
5546aNjLlPmLMj5MLLj0%ONj0%MlOkj3QpJ1lkJkQj1J2jMj2J4j4J5j5J3q%Pj3Nj1
5593a0J2Qkj0%QoMqJ6j2l%lmJ1nQnj1Pj0mJ8qmPQrRj0QMnOkkm%J0qOj0NLj0QM
5641EmJmpK3j7%J5polJjPoLq%OnJmnLNkMPoLJQj2QpJ5j2JRo%RnljrNj2J2%lnN
5694cloKJ0Qj1lJ1j7lRqJ3j0J0jnMkLLKLQjmj0OJ0nn%mJ2j1LkKrJJmjqJ3%Pmq
5743gKJ1Lj9%OkoK1j5mMPmMMoLkmLPNq%%Rj2lJ3qmQj7OKj6J1J1j1nRJJ0j3J3q
5790anjLrJ0NjNMMj7JJ0KLlmrlJ1rPj1KMJ2j3RJpj2PmlJ0j3J2kjMKj1J0jjjoJ4
5838DpKjJ3mJmNJkNj8nRPj4QOj1JNjNj0J0j2NjKLmkQpJJ1Lj7ONpPjRj7NkOrO%
$$ plain form
5889 3 8 11 3 4 16 10 1 7 7 8 3 7 -1 -2 -8 -6 -5 -9 2 0 -3 -2 4 -1 -4 -5 -13 -4 -8 0 2 2 -2 -2 3 -7 -12 2 -5 1 5 9 0 13 6 4 12 5 0 4 7 4 3 7 6 11
5945 11 -3 -7 -3 -3 -8 -5 -5 -5 -10 -9 -4 2 -1 -2 2 6 4 11 5 2 10 -3 7 9 5 7 12 4 6 13 -2 -6 14 5 14 6 9 12 2 -4 5 8 3 10 3 8 -2 0 -1 0 4 0 -6
5998 -6 -2 -12 6 8 -7 6 9 8 2 18 9 -4 7 2 9 10 8 12 9 14 8 7 3 5 4 2 -2 -6 -1 3 -7 -6 6 -5 -4 3 -14 0 -2 1 -7 -5 -5 -8 0 -12 2
6045 2 1 3 8 -5 1 2 -7 5 6 8 6 8 2 0 6 7 4 4 7 -2 4 4 5 -10 3 1 9 1 -10 1 -19 0 -3 0 6 5 -6 -3 -3 -1 4 7 11 -7 -7 14 -3 3 9
6094 9 -3 8 -2 4 8 3 3 20 6 -2 0 5 14 3 10 1 -4 0 5 1 4 4 11 5 -3 0 -3 7 4 -5 -8 4 -9 -1 8 9 10 -1 -1 4 7 2 9 -2 7 6 4 8 -9
6143 -9 4 -6 9 9 10 2 -1 5 11 -4 4 -11 -8 -2 -5 3 -6 4 -1 1 6 -2 -8 -3 -3 5 3 -3 0 19 9 6 7 8 6 10 12 20 5 7 16 11 9 7 8 1 -7 -5 -1 8 5 -3
6195 -3 -8 -13 -5 -3 -3 4 3 -2 -3 -4 -4 0 -10 0 4 2 2 9 -11 -2 0 1 10 9 13 4 4 7 0 22 14 6 6 8 7 3 11 12 12 5 13 2 1 -2 -6 0 -3 -11 -9 -1 -10 -10 -11 4 -10
6250 -10 -4 3 -4 -5 1 1 -6 -3 9 8 14 6 5 4 -2 0 2 9 -1 -5 7 8 2 6 11 10 5 6 2 4 2 -7 -3 -5 -2 -10 -2 -11 -14 -3 -4 -10 -5 3 -5 -7 -16 -8 -1 2 3 12 5 11 11 9
$$ packed form
5889CNLqJJ2orO%JnMqjoKJmJ1klJOnljqRmQK%m%Nj0nJ4pOMMrJ3pkQpnMLljMjN
5945A1j4mM%nL%%nJNOljMMkPolQj3J0KmKNqKPj5mK0rRqLLj0oRLnPpNj0KjJMmo
5998fMj0J8Kj5J3LjoJ6rj3J1nPJkMlNojmKjkmmNMj0JJ2j1JPj7J4kLqK%lQj2J4
6045BjKNj3OJrJ2JKkKokOJl%LrO%Jj5J3kQqj1J1k0J9lLOjj1L%KNLMj8%K1j7OO
6094Ij2J1j0OMn%J7j4qKNRj1PrnMNmL%PoqLlJ0lrlJ2j3QRJJj1%NLnPj1RjkMj7
6143iJ3j0J5%JqlOOj5Qj5LOlQrJ0nKNqoN%QkoLJ9j0lJJkMKQj5KRnkkJpqKMRlq
6195cnnQK%Pjnjj%Mj0J0Mk%Pk0RKJRjMr%LpK2qq%KjmQJ%pQj1jlmOlqKQr%jJ5j4
6250a0OPpjO%pLJ2jOqjjoKKPj0mJ2JoMNjnJmKkrMkLqQrlJ1joNQqkrQPLJRpO%k
$$ plain form
6306 9 16 9 2 11 9 2 8 -2 10 0 4 12 6 4 4 13 0 -2 1 1 5 0 -2 1 1 2 4 1 -1 3 0 2 5 12 11 7 9 0 2 16 13 11 6 8 0 -1 10 13 6 4 -6 2 -5 -2
6360 -2 -6 -1 -3 -12 5 -7 2 3 1 -2 -6 -6 -3 -11 5 -1 -5 -7 -2 5 6 1 3 -9 -2 8 7 7 0 12 -3 7 3 14 7 7 4 4 7 10 8 -9 6 3 1 4 8 -15 -14
6409 -14 -13 -20 -9 -16 -12 -11 -11 -2 -14 -11 5 4 -9 -2 -1 -7 -9 2 0 5 -7 -3 -5 1 5 -2 -7 0 -2 7 2 0 -7 -2 -8 7 0 -6 -5 0 1 -5 -9 -13 1 -19 -12 -12 -11 -12 -10
6460 -10 -8 -12 -5 -1 -4 6 6 5 4 5 -9 -1 -1 4 -6 -2 7 8 -3 10 3 -8 8 13 -8 5 8 -2 -1 1 -10 -5 2 -3 4 3 5 0 6 -12 -5 -19 -10 -6 -4 0 -6
6507 -6 0 -5 2 0 -1 2 5 4 4 7 8 0 8 7 13 10 10 3 6 5 -6 -6 -4 -9 -11 -12 -10 0 -10 -4 5 2 0 3 -12 -5 -10 -6 -9 -1 -8 -8 1 -5 -7 0 -6 -7 -1 -8 1 -13 9 -14
6561 -14 -11 7 -5 9 8 -5 4 6 -10 -5 5 -2 -3 -3 -5 -4 -13 -7 -14 -17 -13 -9 -12 -9 -11 -2 4 3 7 2 -1 -9 -5 7 8 2 4 8 -1 6 -1 1 2 -4 2 -8 -1 6 2 -2 7 -4
6613 -4 -1 17 -6 -6 -3 -5 2 1 -12 -8 -5 -14 -6 -5 1 1 4 4 5 -7 -1 -4 1 0 8 7 10 7 5 3 9 2 9 4 -9 8 -5 5 6 2 -5 -5 1 8 -11 3 0 -3 1 -2 0
6664 0 -4 1 0 -14 -7 -10 -10 4 -12 -2 -8 -11 -16 -2 -3 12 1 10 3 7 6 2 6 10 7 0 -2 5 -5 11 4 8 -2 0 -1 -5 -3 -3 -4 -3 0 -7 -6 -7 -8 -16 0 0 -10
$$ packed form
6306IPppRkpOj0J2j0MQok%Rj3kL%MnkL%JKlkMlKLPjmKrKJ4lknKqjJ1Lpkj0QpL
6360bmNkrJ7j2RJklm%LqJ6omkNPJnKj2PJ0j%pJ2j5J0mJ1p%l%LLkj7J5lkLMk3J
6409a4JpJ1pMJ%Rj2LJ6jj3PJokJ1kNj2MkOMpnPkRnkpNoJ5poJNJommJ4k0P%JjK
6460a0KmPMlJ0%jjJj4Q%Nj0MRJj1J3pj1J6Nk1J3Lj0JKj1NPnPjKnOj8Pj4RMKMo
6507fOnPkjLLj%LJqQjOl%pLjj1%KnkjKJ0j0ORlkLj5PnMlQp%RokPojOpRj4K2k3
6561a4LJ8j2J4jj3RKj6NJ0pj%kJrOplMMlLkROjMnlqMJ2JoKMrPpKJoOj0PPmmRj1
6613dLJ8k3%LkPjj3MLrQJO%L%Jj2OlNjQjLlkkOpPnj3J7j3J0Jmp%OPj9J4llMlK
6664@mNjj4Pl%J4j6J0olnJ4jJ5j1RpMjmMMlpkPj0J6pMj0KjmK%jJLpJjjqJ6%j0
$$ plain form
6713 -10 1 -13 -1 1 -7 -3 0 -2 1 2 1 -8 1 14 2 4 -1 2 9 -3 6 11 14 1 -7 6 5 -2 -10 -14 -5 -4 -20 -14 -8 -15 -3 -3 3 3 -2 3 5 2 8 4 9 0 -1 11
6763 11 3 8 1 1 8 10 13 14 1 14 2 13 6 2 6 7 9 11 8 -2 10 7 1 4 0 3 1 -6 -6 1 -7 0 -5 3 3 7 -3 5 8 6 2 9 3 5 13 1 1 10 3 16 2
6814 2 9 1 0 5 -4 0 3 2 -6 -3 3 -4 -5 -4 -2 2 -9 3 -8 -13 -2 -8 -7 -4 -2 -5 -2 7 1 -4 -3 10 1 -2 4 6 18 10 13 10 14 13 14 4 10 11 8 -1 -4 -4 -2 3 -8
6867 -8 -15 1 -7 -4 0 -8 -7 -6 1 -4 -2 5 -2 1 2 0 -7 -6 5 1 4 2 1 3 -1 4 8 -1 5 4 -4 11 7 -7 5 8 10 8 -1 9 0 -3 10 -6 -2 5 -5 -4 -4 3 0 -1
6919 -1 12 7 -2 3 -2 4 -5 -2 10 10 7 7 8 13 9 8 9 3 4 11 1 9 2 8 9 4 8 5 -4 15 3 7 6 11 5 -4 -9 -7 3 -6 6 3 -5 -5 -5 -10 -6 -9 -3 9 -4 5
6971 5 12 7 4 9 3 2 2 7 9 1 -1 7 -2 -6 5 11 3 -5 -9 0 0 -10 -6 4 9 -6 7 0 6 3 6 0 3 3 6 -4 -2 2 -1 -14 -5 1 6 0 2 12 12 11 12 7 8 2 12
7024 12 8 16 -1 5 6 4 8 -4 -5 2 4 -6 -9 -9 6 0 2 5 6 5 0 5 5 -3 3 1 -6 -3 3 -1 -6 3 -3 5 -3 -6 -1 12 -7 5 7 -6 9 5 1 7 7 3 7 10 7
7075 7 -12 -4 -3 -7 -2 -2 -8 -6 -1 -9 -2 -9 -9 2 1 -1 2 -2 1 -1 8 6 -8 13 1 8 -1 -6 3 5 7 -1 2 6 3 3 0 -1 -1 6 -3 5 12 8 1 5 4 -8 -8 -6 -2 -2 1 -7 -9
$$ packed form
6713a0J1j4J2KqMLkLJjrRJ3j2KnLPj2RNLj3qJ3jpqmRJj6OOpJ2%O%nNKlOmNrjJ2
6763A1qNp%PKLJj3J3j2J1pmMJKKlj0J2loLmLkp%PqPnQ%Mj0QLkmPoKQj2%RpJ3j4
6814BPqjNrMLjqLOpjJKMj1J2j1nJ1oJLKlLRonJJ3rlOKJ2qLlMjJj0OJlrl%KNj1
6867hpJ6qLMqJJPnKPpLJkpJJ1mLkjKmNMrOjqJ5mj4J2LKkrJ0rlJ3j6MPj0J%Plj
6919aJ3nrNnOrLJ2%l%JNmjJoJPj0QpOJnMlrJ9j2MjNornKJ0rJ2lq%%nMlOJ2j3R
6971EPnlNoj%NKqkQrmJ1OqqmR%j0MJ0Nj5J3pOlLoL%Lj0KMlj3RONoKJ0%jJnJoJ0
7024A2mQj7OJkMj2jPKj0l%J5oKLJjnN%qOkpLOmnRoQqlNJ3j9J2Kj3J5mmO%mMLl
7075Gj9QJmN%oKNqPp%J1jkLmLkRkj4K1j2PrnRKKqLMl%lj%PrQPmpMjj2%KM%Lqk
$$ plain form
7130 -9 -3 -10 -3 -3 -5 0 -5 -6 0 10 17 8 7 15 8 8 10 12 2 1 2 4 -2 -2 -6 -2 -3 5 -2 3 -1 0 -3 -2 -1 -3 9 -7 -11 0 -3 7 1 1 -8 3 10 -8 7 0 3 1
7182 1 2 5 -1 11 3 4 17 19 10 16 2 15 5 9 8 13 7 -10 7 -3 11 6 1 -8 -9 -8 -6 -9 -4 -9 -14 2 -6 -2 -7 -4 -1 6 5 -9 -11 3 7 -2 4 3 8 -1 8
7231 8 9 6 4 8 9 7 9 -1 0 1 11 6 6 8 5 2 3 5 3 2 -14 -3 -13 -12 -11 -4 0 -8 2 -3 -1 -3 0 0 -8 10 -6 5 -9 7 7 10 -4 10 3 0 4 5
7279 5 -2 -2 -4 1 4 1 -2 6 5 6 -1 2 2 -11 -10 -1 -7 -18 -4 3 -9 -20 -3 -4 2 -7 3 0 -1 5 3 7 22 4 8 8 5 7 7 6 12 1 -4 15 -2 0 -4 -4 3
7328 3 2 5 0 5 2 3 -7 -8 14 -7 0 -2 -4 0 -9 -9 4 -3 -5 -2 -7 0 -3 4 1 -1 -3 19 -1 9 7 1 9 7 7 7 0 11 -5 -3 -13 -3 3 3 -6 -16 -1 -2
7376 -2 -6 -2 -11 -7 1 -18 -7 3 -4 0 -9 -2 -8 -2 -2 -2 -7 -4 -5 6 8 10 2 1 9 11 6 7 6 2 10 3 5 8 -1 2 -2 9 6 -4 -9 -6 -1 2 3 -3 -5 -15 -1 -6 0 -6 -3
7429 -3 -3 4 17 -4 11 5 1 5 6 9 9 -7 7 7 -3 1 6 0 7 5 2 3 6 8 -5 2 1 -7 4 -10 -2 -1 -3 -3 3 1 4 -13 -1 -7 -5 -9 -9 -2 -7 6 10 3 -1
7478 -1 0 7 10 8 6 6 -1 -1 2 13 0 0 7 3 5 9 5 1 0 -1 -14 -6 10 -2 -5 -4 5 -7 3 -8 0 0 5 -9 -8 -2 -2 -2 -6 1 0 9 8 6 9 5 8 2 4 11 9 11
$$ packed form
7130iOpP%kNnjOJ0PrjQp%KKj0jJKo%mMjQpNmJlJJkJ2j6mJ1lJ0o%rJ1Pj8J5pLk
7182AJLoJ2qJJ3KrOj4J3j0MjNoj7J7j0J4nnrjJKlNnnJ6qMnLLPjj4kJ4MrOjNrR
7231HJlkMJkKj0JJJ0n%KllJKkjj6J1j0JJPMqJ0nKkL%qJ8j6J1j4J6%Lj4J4plMJ
7279Ep%kNLllQjJpL%j3JRoj1J4Pj2j1J7jOrJ0ljOkMJ5j8M%lK%jOj1nJ9j7Km%P
7328CjLnNlJj0jK2k1PkkMr%J3pkLnPlPlkkK2k0J0koQk%%pJ1j6Kj0J0O%rj0J5j
7376bmMrMQj9J1J0pMrPoO%%nLjJ1KKqjQKnJjmQpKLrLmJ1lj0nLNLJokj0J4nOoL
7429c%PJ3k1J5omMJL%j6J4%j0MNoPklJLKj3PjqJ1j4QJk%OkLj7J2oKm%PnJ3Mpm
7478aJPLkk%p%LJ1j3%PmKMmmjjj3QJ6j2lJRj2J0j1Q%Nj4JO%%mPjRjkLmLoKPkK
$$ plain form
7530 11 11 13 17 4 8 -2 7 1 3 -1 -7 0 -4 4 -6 1 -10 4 -8 4 7 4 9 -2 2 -2 -2 5 9 6 -2 8 5 6 4 6 0 1 -1 5 -3 5 7 5 1 12 0 -2 -2
7579 -2 -4 4 2 -8 -12 -6 -15 -8 -15 -10 -16 -12 -9 -1 2 -9 -12 -2 -1 6 13 -2 4 4 4 3 4 3 2 8 16 -3 8 14 7 3 6 7 9 6 9 6 6 14 -2 -4 -5 -5 -7 4 -4 -5 -7
7632 -7 4 -8 -4 -13 -12 -1 -11 -10 -4 -4 6 -7 5 9 7 1 10 3 13 9 9 10 14 -4 8 6 6 2 4 -4 -3 9 -10 -8 2 -5 1 -3 -5 -3 6 -8 -13 2 -7 4
7678 4 -10 -4 -2 2 -15 8 2 -5 3 6 -5 1 9 13 6 9 12 0 4 7 3 5 10 -5 7 2 9 -3 4 -4 5 -10 -10 -2 -2 -10 -6 -14 -1 -2 1 6 13 10 0 -6 8 18
7726 18 5 11 6 1 8 2 9 3 10 9 4 15 4 20 11 19 15 -4 10 13 4 7 10 1 4 -5 3 -1 -3 9 -7 -13 -5 -15 0 6 6 6 7 5 -7 23 6 20 -1
7771 -1 11 6 18 9 9 6 14 2 6 20 3 4 -1 5 8 0 8 9 5 7 3 8 2 3 2 -10 -1 0 -4 0 -1 -7 -2 -4 1 2 4 -7 6 2 1 8 -3 7 14 12 15 14 19 18 21
7822 21 9 1 13 14 1 7 4 4 11 3 11 3 2 1 6 4 9 1 3 -1 0 6 -2 -6 -6 -3 -7 0 2 9 3 0 1 13 7 6 -1 12 5 6 3 10 5 12 5 5 5 7 0 -1 7 1 -3 -2 -7
7877 -7 -2 2 -6 -2 4 6 7 -4 0 9 -4 -1 1 -8 3 2 -4 9 -1 9 4 -4 5 8 6 4 6 10 14 19 10 7 8 3 10 6 2 4 -5 -6 -4 -17 -2 -1 7 9 -1 -4 0 -1 -9 -7
$$ packed form
7530A1%KMj3Mj0RoKmoPmQj0Pj1J4j2J2LlNj1Mm%PMlqJ0lJkKoJkOqQKkmJ1j2k%
7579bkQkj0mOrPpNoMLQLj1lJ0JPPj5O%%jJjjOQj9J1OpmLJKlLl%Qj6kj%kJ1qjk
7632gJ1j2MrJJ1j0JO%J0j3J2MkoRpJ0m%JMj8J2k%mKqJJ2j9KJ0pOmkKRj4nJ5rJ1
7678Dj4OKMj7K3opQLj1OQMpLLj2MLmKNj5J2nPj2PqRj5%Q%qMqJ3jLNPlj0oJ4J0
7726A8j3OnnPoPoPjnJ1j1J6rQmj9J4LrLLrLrQmkJ2j6oQj0J5O%%Jkj2L0j7J4k1
7771aJ2nJ2r%lQj2MJ4j7JnOLqQJmKmNoJjj2RJmMjoNkNJKj1J3mjPj1J0PkLjNjL
7822B1j2qJ2Jj3Ol%PqQqjjNkNqKmJOqm%LmPKPolJJ2ojpJ3pJlPnPp%%KpjQomJn
7877gNMqMOKJj1MRj3LKrJ1joJ3j0J0nqRLkkKMMNrlJnPmmKrjKj3J5JQKj0lMjqK
$$ plain form
7929 -7 4 -5 -1 -7 13 -3 10 6 8 9 9 5 12 6 9 6 9 14 1 9 10 10 15 -5 11 7 2 6 0 3 1 -2 -7 5 4 1 0 -6 -9 11 -1 2 -11 -11 -8 3 -5 7
7977 7 -6 -2 6 2 10 7 8 12 6 15 7 3 14 13 5 11 7 6 10 11 1 2 1 3 -2 -8 0 3 0 2 -6 1 15 2 2 -4 -9 -9 -13 -3 -7 -5 -3 3 5 5 4 17 4 18 5
8028 5 10 11 -5 7 22 14 10 11 9 2 12 4 2 5 -2 6 4 0 -12 -14 -5 -2 -4 2 -5 8 -5 -6 -6 6 -4 3 8 3 3 0 -1 9 12 7 11 6 12 3 11 4 -3 2 -3 -2 11
8079 11 6 18 5 -2 4 9 0 -2 3 -2 -1 -3 -12 -1 -6 -9 -8 -5 -7 -3 5 -2 3 5 -4 10 15 -3 13 8 2 15 -3 8 -2 2 6 7 5 2 4 -5 1 4 2 1 -4 -8 -2 0
8129 0 4 2 -9 -4 -9 -5 -14 -18 2 8 -7 -3 0 -3 -3 8 4 -7 2 4 5 -2 0 -5 9 4 6 -1 17 5 7 -1 0 -1 -6 -3 6 -4 -3 -3 -4 0 1 8 -5 1 -10 -12 1
8178 1 -9 -6 -5 1 3 -3 8 1 -3 -4 -2 5 -3
$$ packed form
7929gJ1rMoK0j6J3mKJ%mPoLlLNj3QJ%Nk0J6mnMoLklnJ2jljolK0j2Lj3%LJ1qJ2
7977Gj3MQmQlJMoRqmJ1jqOmjMJj0JjKnoQLlKqPJ4j3%on%mJ0mKKOK%jJ3j3J4j3
8028ENJj6J2J5qmJkpJ0qkLpQkmj2kRLkOpJ3j3j%J2j0PNn%ljJ0LnMnOrQppNnJJ3
8079A1nJ2j3pONrkNnJkrJ1nlJLkMQpNKrJ4Nj8J6noJ3j8J1j0MMJklKrOLkjnmOK
8129@Mkj1NnMrmK0Oj5MLl%J1mj1RKJpKnJ4nKpJ8j2KqJjnLRj0J%jMJPj3Oj1kJ3
8178Aj0LJOKoJ1pmjKPq
8191c
$$ Imaginary data points
##PAGE= N=2
##DATA TABLE= (X++(I..I)), XYDATA
$$ plain form
0 0 0 0 0 0 0 0 0 0 0 0 0 0 0 7 -8 8 -8 8 -8 8 -12 15 -16 16 -16 20 -22 24 -27 28 -28 30 -36 36 -36 40 -41 42 -46
39 -46 46 -46 50 -50 50 -52 54 -54 57 -57 61 -63 68 -77 86 -101 120 -148 185 -236 308 -410
61 -410 553 -765 1082 -1575 2386 -3821 6731 -14321 60978 174127 -63396 156195 15434
74 15434 73601 -72103 -12772 -37739 -68565 952 -99731 101501 -26119 33464 77110
85 77110 17424 -16916 6001 -75428 -2745 -16487 -30168 63266 36812 -12489 -13588 69688
97 69688 -97683 17728 -1703 -11384 1712 -24158 48044 -1270 -8269 -1522 61928 -89502
109 -89502 21544 16601 -26711 20813 32692 -1859 -13414 14413 -100121 57452 -40747 -8704
121 -8704 59675 8481 15496 8370 19268 -24079 -2780 -56214 18745 -15504 -38250 48691 46972
$$ packed form
0@%%%%%%%%%%%%%Pj5J6j6J6j6J6k0K7l1L2l2L6m2M6n1N5n6N8o6P2p2P6q1Q3q8
39d6R2r2R6j00J00j02J06j08J11j14J18j24J31j45J63j87K21k68L33m21N44p18
61d10R63j318J847k657L961o207J0552k1052P5299J13149k37523K19591j40761
74A5434N8167j45704N9331k4967l0826O9517j00683K01232j27620N9583M3646
85G7110n9686l4340K2917q1429P2683j3742j3681R3434k6454m9301j099Q3276
97F9688j67371J15411j9431r681J3096k5870P2202m9314o999O747O3450j51430
109h9502J11046m943m3312M7524J1879l4551j1555K7827j14534J57573r8199L2043
121h704O8379n1194P015p126J0898m3347K1299n3434P4959l4249k2746Q6941j719
$$ plain form
134 46972 -42893 55274 9843 -62408 9268 -46025 19933 -16237 46539 8101 44985 -7145
146 -7145 -22327 25763 -86672 17019 -51412 2734 21991 14855 28413 58996 16805 -40743
158 -40743 39500 -63991 -47930 -5986 837 -14572 40264 16178 23138 18537 -31662 33987
170 33987 -43484 -22339 3533 4430 -16819 39300 14571 -18040 41797 -41989 -7593 3720
182 3720 -28529 -9711 29496 -3359 4313 28335 -4400 5734 -15617 -2253 3526 -19612 -1109
195 -1109 29250 -22074 -7784 23876 -24385 -6580 20394 -9817 5610 17883 -7832 16141
207 16141 840 -11412 -5965 -9405 -22292 4490 -1266 7063 33458 -15476 22866 3244 -31936
220 -31936 -5097 9867 -26289 1905 35381 -18695 20297 11685 -3405 -4627 -12542 -17707 -13236
$$ packed form
134D6972q9865R8167m5431p2251P1676n5293O5958l6170O2776l8438L6884n2130
146g145j5182M8090j12435J03691o8431N4146J9257p136J3558L0583m2191n7548
158d0743Q0243j03491J6061M1944O823j5409N4836k4086O960m601n0199O5649
170C3987p7471K1145K5872Q97k1249N6119k4729l2611N9837q3786L4396J1313
182C720l2249J8818L9207l2855P672K4022l2735J0134k1351J3364N779k3138J8503
195a109L0359n1324J4290L1660m8261J7805K6974l0211J5427J2273k5715K3973
207A6141j5301j2252N447l440j2887K6782n756Q329K6395m8934L8342j9622l5180
220c1936K6839J4964l6156K8194L3476n4076L8992q612j5090j222p915n165M471
$$ plain form
233 -13236 -10372 -1854 30306 3228 29662 16246 -11084 -363 -12343 -27978 -6062 2626 -23998
246 -23998 19106 9037 -256 17769 12006 1324 -5760 -4652 -9780 -3495 -11629 16653 3526
259 3526 -12882 13372 -7736 -16218 9459 8076 -9657 19663 2758 -12518 11367 -5671 -5587
272 -5587 3184 -2132 -9832 -122 -1497 6203 9278 -496 13419 -13060 -13687 4115 -5962 -3629
286 -3629 17237 7426 -10452 12931 -5141 -6861 3497 -2363 -4558 -7472 840 -4237 4740 5755
300 5755 13129 -1936 -3357 6260 -16605 2918 9199 -1760 -3131 6605 -11843 -12126 9111 -6545
314 -6545 4576 5353 4953 1278 2836 7206 1360 -805 -7350 -2052 -19632 -4526 5873 -3166 11332
329 11332 12720 1377 -3807 9440 -7982 -4490 4250 -6470 -4701 -1932 4462 -4414 5117 5868
$$ packed form
233a3236K864Q518L2160k7078K6434j3416k7330J0721j1980j5635K1916Q688k6624
246b3998M3104j0069r293J8025n763j0682p084J108n128O285q134K8282j3127
259C526j6408K6254k1108q482K5677j383j7733K9320j6905j5276K3885j7038Q4
272e587Q771n316p700R710j375P700L075r774J3915k6479o27J7802j0077K333
286c629K0866r811j7878K3383j8072j720J0358n860k195k914Q312n077Q977J015
300E755P374j5065j421R617k2865J9523O281j0959j371R736j8448k83K1237j5656
314f545J1121P77m00l675J558M370n846k165o545N298j7580J5106J0399r039J4498
329A1332J388j1343n184J3247j7422L492Q740j0720J769K769O394q876R531P51
$$ plain form
343 5868 -735 -3195 451 -378 -8875 8821 3190 -1557 2915 1056 -6371 -2936 5998 -4197 1257
358 1257 1177 -953 -3724 432 4581 -3679 2274 2748 -1287 -3807 6059 1645 -4033 6981 -2458 -7625
374 -7625 -3202 1784 -5868 1590 8583 -3148 1792 4313 2524 -4459 4958 -658 -6833 1406 -2101
389 -2101 -1882 -3108 5457 -3529 1202 2120 -27 547 135 7572 -5098 3243 199 -2455 -5989 3067
405 3067 -1707 -8497 8573 -2172 881 1118 6622 -5311 1040 4106 -3826 1069 -2341 4448 -7645
420 -7645 4743 -447 -3256 -166 954 -2020 -3536 8642 -5818 4754 5359 650 -2699 1378
434 1378 -2576 -6232 1756 -1454 1321 -5069 3658 2365 -1847 3669 7077 -4820 -2053 5002 -7787
449 -7787 -666 4395 -3145 -1262 4099 -5659 1001 2371 1104 -82 2975 -1420 -3446 -196 -893
$$ packed form
343E868o603k460L646q29q497J7696n631m747M472j859p427L435Q934j0195N454
358A257q0k130k771M156M149q260N953M74m035k520R866m414n678J1014r439n167
374g625M423M986p652P458O993j1731M940K521j789o983R417n616o175Q239l507
389b101K19j226Q565q986M731R18k147N74m12P437j2670Q341l044k654l534R056
405C067m774o790J7070j0745L053K37N504j1933O351L066p932M895l410O789j2093
420g645J2388n190k809L090J120k974j516J2178j4460J0572O05m709l349M077
434A378l954l656P988l210K775o390Q727j293m212N516L408j1897K767P055j2789
449g787P121N061p540J883N361r758O660J370j267j186L057m395k026L250o97
$$ plain form
464 -893 5376 -8198 10015 -1375 -4341 3148 1833 -3313 -4797 8595 -11939 3921 -3325 2897
478 2897 3041 2537 7291 -1228 407 -6834 2875 -10477 5474 -3729 -3139 3996 -369 -1054 6506 9058
494 9058 -11266 11388 -5693 -5278 -1797 2616 -1672 -1564 3295 -4715 3770 -8907 11192 -1081
508 -1081 205 3444 858 -5111 356 3753 -8824 10202 -9785 1227 -177 -392 -512 5126 4982
523 4982 -5938 4475 -6850 3624 -6136 2738 7152 -5387 -2418 6675 -4461 -3868 8760 -2781
537 -2781 -3064 -204 540 -5519 8226 -4767 6024 1792 -6648 4670 -4027 3021 -2814 5240 -5247
552 -5247 3496 -7316 -1439 7817 -8664 4601 6244 -1894 -5149 11856 -5919 1126 -708 -1505
566 -1505 -2253 -7532 2598 -385 3896 -3494 13744 -6786 1989 2748 -6341 3863 -3812 -1462 -2172
$$ packed form
464h93O269j3574J8213j1390k966P489j315n146j484J3392k0534J5860p246O222
478B897J44n04M754q519J635p241R709j3352J5951r203N90P135m365o85P560K552
494I058k0324K2654j7081M15L481M413m288J08M859q010Q485j2677K0099j2273
508a081J286L239k586n969N467L397j2577J9026j9987J1012j404k15j20N638j44
523D982j0920J0413j1325J0474r760Q874M414j2539K969R093j1136N93J2628j1541
537b781k83K860P44o059J3745j2993J0791m232q440J1318q697P048n835Q054j0487
552e247Q743j0812N877R256j6481J3265J643q138l255J7005j7775P045j834p97
566a505p48n279J0130k983M281p390J7238k0530Q775P59r089J0204p675K350p10
$$ plain form
581 -2172 5461 -10855 9318 1676 -3246 2927 178 -254 -4918 4166 -2531 6735 -8986 7112
595 7112 1523 -9607 5124 1299 -2741 -3001 7953 -7649 3170 1234 -2578 5067 -2190 -1983
609 -1983 3521 -1439 -2836 4406 -2321 1626 -2679 -796 1175 -510 -4939 7043 1707 -8122 10276
624 10276 -1939 -3010 1297 1062 -3229 -98 -1178 683 2073 -4634 5313 57 -3380 2026 2010
639 2010 -5258 5056 -2061 -1822 6466 -4432 38 3063 -2016 -6983 6886 -3521 -1526 4249
653 4249 -991 2654 -2106 1851 1179 -172 -5015 5800 -3768 -4264 6011 -3073 95 2047 -47
668 -47 -3142 4385 -4560 1972 3951 -3564 3390 -851 -737 -1585 -388 -1829 2533 -4069 258 5722
684 5722 -5971 3451 5333 -3137 -894 3609 -5351 -1538 2345 -3045 3194 -113 -1465 2523 -1246
$$ packed form
581b172P633j6316K0173p642m922O173k749m32m664R084o697R266j5721J6098
595G112n589j1130J4731l825m040k60J0954j5602J0819j936l812P645p257K07
609a983N504m960j397P242o727L947m305J883J971j685m429J1982n336r829J8398
624A0276j2215j071M307k35m291L131j080J861J390o707R947n256l437N406j6
639B010p268J0314p117K39Q288j0898M470L025n079m967J3869j0407J995N775
653D249n240L645m760L957o72j351m843J0815r568m96J0275r084L168J952k094
668d7l095P527q945O532J979p515O954m241J14q48J197j441M362o602M327N464
684E722j1693R422J882q470K243M503q960L813L883n390O239l307j352L988l769
$$ plain form
699 -1246 -819 3032 -1292 -963 1961 -3588 742 2924 -4300 3302 2352 -5103 1696 1905 -3579 1016
715 1016 2813 -2449 772 -1635 -307 1210 -1906 3219 2117 -2379 780 1848 -4968 2352 372
730 372 -4354 2838 -1717 -2152 3493 2339 -1082 4410 -697 -2996 526 -3217 953 -395 -1633 2042
746 2042 141 -3087 4359 1567 -3319 4183 -1008 -3500 1513 -39 -1997 2927 -586 -1579 1725
761 1725 -2862 732 738 69 1683 -97 -919 1284 -869 -2011 3992 -2590 -1938 3008 -2454 -773 3040
778 3040 194 -743 1794 -2023 -402 -159 -1348 2573 -608 -352 1801 -1162 -1222 2957 -1799 -1109 2773
795 2773 -3960 -57 2185 -1619 466 2843 -1258 -664 1864 -2014 1065 -438 -211 821 -2331 73
811 73 686 -1250 138 3070 -2001 743 2287 -2404 1205 585 -1581 -515 277 -1977 401 501 -84
$$ packed form
699a246M27L851m324L29K924n549M330K182p224P602r50p455O799K09n484M595
715A016J797n262L221k407J328J517l116N125j102m496L159J068o816P320j980
730C72m726P192m555m35N645j154l421N492n107k299L522l743M170j348j238L675
746B042j901l228P446k792m886P502n191k492N013j552j958M924l513r93L304
761A725m587L594Oo69J614j780q22K203k153j142O003o582O52M946n462J681L813
778C040k846r37K537l817J621K43j189L921l181K56K153k963o0M179m756O90L882
795B773o733L903K242l804K085K377m101N94K528l878L079j503K27J032l152K404
811G3O13j936J388K932n071K744J544m691L609o20k166J066P92k254K378J00n85
$$ plain form
828 -84 2035 -826 1399 55 -1779 762 456 -2271 899 1451 -3157 2207 937 -1738 1309 251
844 251 -1666 116 449 -1131 1453 -311 602 848 -1143 1009 -315 -1586 572 118 -2069 1791
860 1791 533 -1477 2035 225 -972 843 303 -1155 198 -326 -386 196 -462 1261 -531 -555 1302
877 1302 -801 -672 1547 -359 -1345 1909 -943 -1015 1663 -728 -223 638 -73 -791 423 -517 263 121
895 121 -600 1386 -1234 101 1094 -235 -372 1661 -852 -1553 1437 -1762 -100 629 279 -587 824
912 824 290 -265 1070 -327 957 -1739 269 -553 -1155 523 702 -191 -308 1821 -1879 830 612
929 612 -384 46 139 -231 -1049 622 -512 834 -664 583 -60 -1133 779 435 -175 510 1017 -1677
947 -1677 188 265 -1031 322 900 -706 -162 598 -333 74 561 388 -804 -253 -310 -98 -594 1352 416
$$ packed form
828h4K119k861K225j344j834K541l06k727L170N52m608N364j270k675L047j058
844B51j917J782L33j580K584j764R13K46j991K152j324j271K158m54k187L860
860A791j258k010L512j810j197J815n40j458J353n24o0N82o58J723j792k4J857
877A302k103J29K219j906r86L254k852p2K678k391N05Q61p11p18J214r40P80j42
895A21p21J986k620J335R93j329j37K033k513p01K990l199J662P29l50q66J411
912H24n34n55J335j397J284k696K008q22o02J678J79q93j17K129l700K709k18
929F12r96M30R3l70q18J671j134J346j498J247o43j073J912l44o10O85N07k694
947a677J865P7j296J353N78j606N44P60r31M07M87j73j192N51n7K12m96J946r36
$$ plain form
966 416 -517 699 -348 -608 -271 835 -1091 402 -262 -276 -35 542 826 -249 837 -525 -212 -1056
984 -1056 1158 -984 23 793 -909 -332 36 1184 -1288 2057 -249 -107 -302 -9 -53 -1109 1211
1001 1211 -1383 430 -801 825 -157 784 953 -485 437 -917 39 -1353 1024 -548 7 343 411
1018 411 -371 -35 1410 -1214 324 -325 68 -1274 916 466 -339 805 -52 -26 -881 743 -788 338
1036 338 -41 -26 -238 142 309 -467 857 -154 -215 -361 748 -767 52 626 -256 -611 53 240 -592
1055 -592 201 518 544 -920 1040 -197 -472 -137 399 -648 -243 943 -1225 1318 -503 274 -121 425
1073 425 -503 -450 966 -980 757 -397 1184 -944 -60 399 -596 -518 51 966 -1395 1221 177 174
1091 174 -309 460 -259 -673 272 -678 600 -762 755 -152 289 261 -282 -22 66 -233 -712 1448 -630
$$ packed form
966D16r33J216j047k60L37J106j926J493o64j4K41N77K84j075J086j362L13q44
984a056K214k142J007P70j702N77L68J148k472L345k306J42j95K93m4j056K320
1001A211k594J813j231J626r82R41J69j438R22j354R56j392K377j572N55L36O8
1018D11p82L36J445k624J538o49L93j342K190m50q05J144q57K6q55J624j531J126
1036C38l79J5k12L80J67p76J324j011o1j46J109j515Q19N74q82l55O64J87q32
1055e92P93L17K6j464J960j237k75L35N36j047M05J186k168K543j821P77l95N46
1073D25r28N3J416j946J737j154J581k128Q84M59r95P8N69R15k361K616j044l
1091A74m83P69p19m14R45r50J278j362J517r07M41k8n43K60Q8k99m79K160k078
$$ plain form
1110 -630 -297 841 -99 -1060 618 244 -651 358 -144 480 -435 238 608 -152 -639 421 -225 -762 753
1129 753 -126 -21 512 -295 -302 522 -666 -121 538 -61 -343 317 222 -321 69 182 490 -1094 191 427
1149 427 -659 6 1052 -316 -625 826 -861 280 165 228 237 127 -401 -109 254 -864 782 -717
1167 -717 214 94 -441 808 578 -231 -5 870 -1751 -54 354 -780 164 541 186 -144 393 -105 444
1186 444 -481 119 81 -871 147 84 -67 406 556 -638 400 14 -873 724 110 -402 247 67 -400
1205 -400 -4 146 211 198 -468 442 -17 -845 758 192 -781 435 22 -872 633 238 -260 839 -182
1224 -182 -372 127 -237 -415 309 -138 36 139 -424 792 -285 -106 726 -320 -636 399 29 -707 871
1243 871 -110 -199 181 -331 32 -10 -14 254 202 -350 471 -290 -223 514 -551 -209 413 -506 -342 1092 -442
$$ packed form
1110f30L33J138r40r61J678l74q95J009n02O24r15O73L70p60m87J060o46n37J515
1129G53q79J05N33q07pQ24j188N45O59n99k82O60r5n43L90J13L08j584J285K36
1149D27j086O65J046j368l09J451j687J141j15O3Rj10n28K92L63j118J646j499
1167g17R31j20n35J249k30q09K26Q75k621J697M08j134R44L77l55l30N37m98N49
1186D44r25O00l8r52J018o3j51M73J50j194J038l86q87J597o14n12O49j80m67
1205d00L96J50O5j3o66R10m59q28J603n66r73J216m13q94J505l95m98J099j021
1224a82j90M99l64j78P24m47J74J03n63J216j077J79Q32j046l16J035l70p36J578
1243H71r81q9L80n12L63m2mK68n2n52Q21p61O7P37j065L42O22r19J64J434j534
$$ plain form
1264 -442 -7 755 -565 -157 22 -118 -130 173 -178 404 -102 -285 764 -538 -83 414 -465 -161 477
1283 477 -347 4 679 -552 178 231 -433 8 119 -99 -5 28 -71 282 -521 232 392 -692 371 325 -502
1304 -502 50 478 -622 115 275 -612 399 -89 -88 295 -17 -28 181 -191 -143 294 -585 383 239 -505 533
1325 533 174 -566 194 299 -750 337 142 -293 316 19 135 25 -24 -69 53 -490 141 80 -452 645
1345 645 -17 -149 389 -47 -463 328 -54 -423 449 -224 -91 146 -26 147 65 -177 190 -66 -394 593
1365 593 -109 -254 513 -229 -438 388 -120 -293 556 -156 -127 239 -196 -6 84 -66 20 -64 -204 265 -93
1386 -93 -69 531 -329 -160 253 -368 -144 379 -90 -90 355 -289 22 73 -55 195 -151 1 24 -123 -81 452
1408 452 -320 -14 347 -590 148 252 -106 38 470 -381 -78 127 -443 171 -142 86 4 9 19 273 -76
$$ packed form
1264d42M35P62j320M08J79j40j2L03l51N82n06j83J049j302M55M97q79L04O38
1283D77q24L51O75j231P30N3o64M41J11k18R4L3r9L53q03P53J60j084J063m6q27
1304e02N52M28j100P37J60q87J011m88JL83l12j1K09l72M8M37q79R68j44p44J038
1325E33l59p40P60J05j049J087j95m35O09k97J16j10m9m5J22n43O31o1n32J097
1345F45o62j32N38m36m16P91l82l69Q72o73J33K37j72J73q2k42L67k56l28R87
1365E93p02j45P67p42k09Q26n08j73Q49p12K9L66m35J90R0j50Q6q4j40M69l58
1386i3K4O00q60J69M13o21K24N23m69%M45o44L11N1j28K50l46J52K3j47M2N33
1408D52p72L06L61r37P38J04l58J44M32q51L03K05n70O14l13K28q2NJ0K54l49
$$ plain form
1429 -76 22 307 -616 89 -52 -262 103 343 -130 83 276 -359 156 -93 40 -39 -43 12 -32 -60 148 230 -306
1452 -306 279 -62 -350 214 100 -213 216 77 -332 123 -4 -113 173 12 -16 55 -182 92 -23 -157 147
1473 147 -42 -274 205 122 -232 409 -32 -187 71 -29 -215 71 78 -108 158 -61 172 -135 17 76 -87
1494 -87 -69 111 -32 -189 385 -186 21 76 -86 -186 90 4 -150 271 -131 173 -132 52 -13 -143 -45 58
1516 58 -40 -200 418 -238 84 161 -109 -111 87 -29 -189 268 -157 123 29 54 -9 -69 31 -65 -17 2 164 -182
1540 -182 87 112 -149 19 92 -134 -86 111 -60 3 39 32 -48 -34 7 -9 -107 71 57 -82 78 54 -131 21 87
1565 87 -243 128 56 -77 20 133 -80 -69 146 -119 52 -108 120 -51 6 165 11 -48 -85 77 -265 94
1587 94 -3 -17 62 43 15 -50 110 -147 22 -81 -25 -137 39 113 -77 120 55 -26 -196 137 -84 -76 118 15
$$ packed form
1429g6R8K85r23P05j41k10L65K40m73K13J93o35N15k49J33p9mN5m4k8K08Q2n36
1452c06N85l41k88N64j14l13M29j39m09M55j27j09K86j61k8P1k37K74j15j34L04
1473A47j89k32M79q3l54O41m41j55K58j00j86K86Pj86K66k19K33l07J52N9j63
1494h7J8J80j43j57N74n71K07N5j62j00K76q6j54M21m02L04l05J84o5j30R8J03
1516E8r8j60O18o56L22P7k70kJ98j16j60M57m25K80r4K5o3o0J00r6M8J9J62l46
1540a82K69K5k61J68P3k26M8J97j71O3L6pq0J4M1j6r8J78j4j39J60k4j85J52O6
1565H7l30L71p2j33R7J13k13J1K15k65J71j60K28j71N7J59j54n9l7J62l42L59
1587I4r7j4P9j9k8o5J60k57J69j03N6j12J76P4j90J97o5q1j70L33k21QJ94j03
$$ plain form
1611 15 -62 -39 122 -102 59 21 -2 -23 -30 43 3 56 19 10 -66 3 -64 -32 129 -15 -48 68 -39 -138 30 45 -129
1638 -129 -18 64 -58 -45 88 54 -92 35 -22 -82 -43 32 33 -5 101 -42 13 -21 0 -26 51 30 -96 59 -4 -14
1664 -14 -36 105 -45 -80 38 -7 -17 -3 177 -79 -28 7 -55 -100 -2 82 -106 106 -33 2 19 29 -25 -37 36 -145
1690 -145 15 13 45 9 45 62 -77 14 11 5 -70 82 24 -95 69 36 -30 0 57 -63 -36 19 -12 6 3 19 -58 -12 2
1719 2 -58 9 37 -27 -38 88 -45 -64 64 -44 -57 12 23 -39 28 34 5 -7 -34 36 -51 -11 32 -2 -7 68 -17 -38 67
1748 67 -70 -23 41 -6 -59 73 10 -62 47 -20 -22 -69 9 -12 -44 27 26 -15 -36 63 -78 -15 23 -48 13 15 2 -19 47 -31
1778 -31 12 0 -9 12 -40 58 3 -10 18 47 -68 10 47 -114 25 44 -25 -5 56 -18 -19 21 -52 8 -30 14 12 -19 22 -8
1808 -8 -10 0 31 -56 29 7 -58 58 24 -14 8 30 -31 3 30 6 15 -30 48 -31 -29 44 5 -33 37 9 -56 64 -10 -15 45 -24
$$ packed form
1611A5p7K3J61k24J61l8k3k1pP3m0N3l7rp6O9o7L2J61j44l3J16j07r9J68J5j74
1638a29J11Q2j22J3J33l4j46J27n7o0L9P5Jl8J06j43N5l4K1k6P7k1j26J55o3j0
1664a4k2J41j50l5J18m5j0J4J80k56N1L5o2m5R8Q4j88K12j39L5J7J0n4j2P3j81
1690a45J60kL2l6L6J7j39R1lop5J52n8j19J64l3o6L0N7j20K7N5l1J8lJ6p7M6J4
1719Bo0O7K8o4j1J26j33j9J28j08j3O9J1o2O7Ok9j2k7P0q7M0M3l4nP5q5k1J05
1748F7j37M7O4m7n3J32o3p2J09o7km7P8k1l2P1jm1k1R9j41O3L8p1O1Kj3k1O6p8
1778c1M3j2rK1n2R8n5j3K8K9j15P8L7j61J39J9o9K0O1p4jM0p3O0l8M4kl1M1l0
1808hkJ0L1q7Q5k2o5J16l4l8K2K2o1L4K7k4Rm5P8p9KP3l9l8P0k8o5J20p4nO0o9
$$ plain form
1840 -24 -47 -10 2 -32 41 -5 9 -17 -18 21 -46 -27 8 -21 -70 48 -13 -18 54 -7 -15 1 4 -20 26 12 14 7 -14 29 -20 16 35
1873 35 -14 5 35 -42 -14 52 -34 11 29 -33 -25 0 -5 4 10 -18 6 -32 -13 26 -27 -5 16 -32 -9 38 -32 -5 34 -39 2 14
1905 14 -17 1 33 9 2 18 5 18 -19 35 21 -12 22 0 -27 -1 34 -35 23 -8 -30 15 -4 -5 -9 1 -29 -7 -26 12 15 -16
1937 -16 43 -21 -9 20 6 -45 17 3 -48 51 -13 -2 14 29 -14 18 3 2 9 -10 30 -7 -1 14 -15 -8 16 -13 -27 23 -18 -20 15
1970 15 -17 -21 -12 -13 -7 -2 -5 4 -17 0 11 -22 3 24 -21 8 25 0 -7 33 -24 -4 23 -15 1 7 16 -3 -1 -6 22 -16 -5 1 -32 7 0
2007 0 -12 -1 28 -46 7 -3 -23 -16 -18 -5 -37 17 -9 6 -24 2 -5 -35 25 -20 -10 15 19 -21 19 13 -25 25 -12 1 10 14 1 -3 -15
2042 -15 -3 3 -27 17 -8 -9 5 -3 -10 13 8 -28 9 -11 -14 15 0 -4 1 2 0 -14 -5 -2 -7 0 19 -20 11 32 -7 -11 20 -19 -17 19 -13 10
2080 10 15 -2 0 -10 9 6 12 9 11 -9 -8 7 -40 0 1 -27 -36 15 -21 -11 17 -13 -12 -20 -1 -8 -1 9 1 -9 0 15 -12 24 16 -4 21 4
$$ packed form
1840b4k3L7J2l4P3m6J4k6jL9o7J9L5k9m9J18o1nP2o1qJ6Lk4M6j4Kpk1M3m9L6J9
1873C5m9J9L0p7K8O6q6M5J8o2QK5nROk8K4l8J9L9n3K2K1m8K3M7p0K7L9p3M1J2
1905A4l1J8L2k4pJ6j3J3l7N4j4l3L4k2k7K6L5o9N8l1k2M5j9jmJ0l0K2j9L8Ll1
1937a6N9o4J2K9j4n1O2j4n1R9o4J1J6J5m3L2j5jPj9M0l7OJ5k9PK4k9j4N0m1kL5
1970A5l2mRjONlRk1J7J1l3K5K1m5K9J7k5pM0n7K0K7l8J6ORj9KnK8l8J1Ol3L9p
2007@j2J1K9p4N3j0k0PkJ3l2N4k6J5l0K6pl0O0m5J0K5Mm0M0ol8N0l7J3RMj3mj2
2042a5J2Ol0M4k5jJ4qpK3nl6L7k0lK9j5mNJkj4RLnPJ9l9L1K1l9mL1l9KL6l2K3
2080A0Nj7Kj0J9lOlKk0JJ5m7M0Jk8rN1l6J0K8l0JqJ9pPJ0qj0RJ5k7L6qk0K5j7
$$ plain form
2118 4 -20 -1 14 4 15 11 2 -3 17 6 7 5 12 1 -28 12 -9 -20 3 -15 -27 -8 5 -29 5 -3 -16 -6 -12 -7 -2 8 -6 2 7 -1 8 0
2156 0 29 -3 -2 28 2 3 13 26 -14 13 4 7 -1 1 2 -11 6 -8 -6 -13 4 -15 -10 -3 -29 -1 2 -12 -7 -1 -5 -24 -5 -15 5 -8 6 -1 -8
2195 -8 9 12 -4 3 31 -11 14 28 4 17 15 1 -16 21 2 2 6 1 -4 1 5 -14 2 4 -6 -18 4 0 -23 11 0 -19 -5 9 -17 -11 12
2232 12 -20 -3 -12 1 0 2 -3 1 4 11 5 -3 14 7 -4 11 7 -4 2 28 0 5 7 -20 -7 12 7 -12 -2 -13 1 -9 -9 -2 -6 4 -28 -7 2 2
2272 2 -11 11 7 -6 11 6 9 -6 19 -9 -24 4 17 4 4 20 -6 4 11 12 3 5 14 -14 11 -8 3 12 9 -7 -3 10 -12 -13 0 -19 -15 -20
2310 -20 -1 -18 -9 3 -7 -10 16 4 -9 19 7 -9 6 2 -5 -1 10 -8 18 16 4 3 6 10 -11 14 9 -9 -12 12 -8 -1 20 -2 -11 -1 -7
2347 -7 -17 6 -2 -8 -9 -8 -5 -8 15 0 -9 -5 12 -14 2 23 -12 3 13 0 -6 23 2 5 27 4 -6 -1 21 2 -1 4 1 -19 -6 7 -14 3
2385 3 8 -17 -19 2 -11 -14 8 -21 -12 -5 -2 -11 -9 8 -11 -3 9 9 -18 17 18 -26 23 20 -8 12 21 -11 2 33 -11 13 3 13 0 -2 20 -16
$$ packed form
2118Dk4J9J5j0J1mrnK0j1JkPj1k9M0k1j1K3j8j2J9J3l4L4qj3J0oNNJ0j4QNqRq
2156@K9l2JL0k6JJ0J3m0K7rLqKJj3J7j4KpJ7j9NPk6K8Lj4NOmj9J9j0K0j3J4pp
2195hJ7Lj6PK8m2K5J4k4J3kj4j7L7j9%MnnNMj9J6Kj0j2K2mk3L4j1j9J4J4k6OK3
2232A2l2J7rJ3jKnMLPoqJ7pj1J5mj1OK6k8NKk7J3J9nj9J0j1J4j0%PmJ0l2K1R%
2272Bj3K2mj3J7nLj5K5k8j5K8J3j3%J6k6J0PJrKRk8K5j9J1Rlj6MJ3k2jJ3j9Mn
2310b0J9j7RJ2j0lK6j2j3K8j2j6J5mpMJ1j8K6kj2jLMk1K5nj8lK4k0PK1k2rJ0o
2347gj0K3qojJLlK3j5rMJ7k6J6K1l5J5J0j3oK9k1LK2k3j0NK2j9lNlk0J3J3k1J7
2385CNk5kK1j3lK2k9RPLrKJ7j9QJ2%k7L5Jm4M9lk8K0Rl2J3L1m4K4j0J0j3kK2l6
$$ plain form
2423 -16 -1 1 8 -26 16 0 -26 17 -9 -16 -2 15 -26 -8 1 -6 -7 -10 17 -20 1 14 9 -5 15 12 -11 56 -8 -3 31 12 -12 19 5
2458 5 -17 28 -3 11 5 15 10 -9 0 15 -6 -21 34 -22 -20 32 -10 -18 8 -10 -27 10 -2 -6 -7 -10 -3 -11 15 11 -16 5 13 -6 1 42 -18
2495 -18 3 23 -11 -2 13 5 -12 12 -13 5 -4 -1 12 -28 18 -7 -25 -4 32 -34 -3 29 -44 8 15 -8 -17 13 -27 -17 12 -20 8
2528 8 -20 18 -6 -17 19 11 -6 15 34 -40 25 9 -13 10 33 4 -15 23 -13 -13 -1 2 -12 -26 11 -20 -22 22 11 -42 12 8 -55
2561 -55 26 9 -13 11 -5 -34 -13 8 -12 10 -9 12 -3 -11 30 -12 -6 19 7 -17 24 -6 -21 46 17 2 3 -2 -30 7 19 1
2593 1 -3 -26 16 -34 -3 15 -21 -21 11 -27 -35 40 -27 -14 7 -1 -27 8 -3 -26 15 -13 6 -10 16 17 -8 9 17 -11 -27 45 -18 -7
2627 -7 31 -11 -10 19 3 -21 13 -6 3 -9 1 -9 -35 4 -3 -34 -10 22 -40 -13 26 -35 -7 17 -20 -16 11 -6 -12 11 2 13 -10 9
2661 9 23 -24 20 16 -8 3 21 -32 5 34 -42 16 7 -15 -12 20 -8 -8 16 -22 -9 -32 9 -17 -24 24 -12 -21 -11 19 -53 11 3 -38
$$ packed form
2423a6J5KPl4M2j6k6M3k6pJ4J7m1J8RpjlK7l7K1J3nj4K0lk3O7o4NL4j9k4L1j4
2458Ek2M5l1J4oJ0nj9RJ5k1j5N5n6KN2m2qK6j8j7L7j2mjlPqK6mk7K1Qj9PM1o0
2495a8K1K0l4RJ5qj7K4k5J8rLJ3m0M6k5j8K1L6o6L1L2p3N2Pk3rL0m0J0K9l2K8
2528Hk8L8k4j1L6qj7K1J9p4O5j6k2K3K3k9j9L8l6%J2Lj4j4L7l1kM4j1n3N4mo3
2561e5Q1j7k2K4j6k9K1K1k0K2j9K1j5qM1m2OK5j2k4M1l0j5O7k9j5Jnk8L7J2j8
2593Amk3M2n0L1J8l6%L2l8qP5o7J3K1qk6L5j1k3M1k8J9j6K6Jk5J7Qk8j6P2o3J1
2627gL8m2JK9j6k4L4j9Rj2J0j0k6L9pl1K4L2o2K7L9o1K8K4l7MK7j7oK3rJ1k3J9
2661IJ4m7M4mk4J1J8n3L7K9p6N8rk2LL2k8%K4l8J3k3M1k6pM8l6rJ0L0p2O4qm1
$$ plain form
2695 -38 -12 8 -3 -18 7 -12 0 -1 20 -10 1 48 -8 5 27 14 -28 31 11 -34 29 2 -19 -8 15 -22 -3 11 -16 -13 -27
2726 -27 -6 -26 0 20 -14 -14 18 -2 -26 30 2 -23 11 2 -24 -1 22 -1 0 10 -4 -16 13 31 -12 5 26 -11 -31 17 -4 -19
2758 -19 29 -27 -12 13 3 -8 1 -4 -28 -4 -18 -2 -21 5 17 -25 -9 8 -10 -11 26 -10 -21 29 -8 3 13 25 -16 14 13 -2
2790 -2 8 14 23 -25 32 -6 -18 2 6 -7 9 42 -27 7 3 -14 -5 10 -1 -27 2 -1 9 -10 14 -1 -22 2 -9 -15 2 15 -11 7
2824 7 17 -22 16 21 7 -8 32 7 -3 27 14 10 8 28 -4 2 15 3 -9 14 11 -21 2 11 -15 -3 9 -3 -7 12 -12 -4 -9 5 -27
2859 -27 -11 20 -13 -4 4 1 -16 25 18 -28 27 13 -3 8 26 -3 1 28 10 14 2 20 -8 9 7 -5 7 4 5 -31 20 -14 -19 -1 0 -22
2895 -22 1 11 -25 -5 1 -3 -20 3 4 -12 0 2 1 0 22 9 0 23 4 4 15 12 0 13 12 -2 12 11 6 -5 11 4 -24 3 -4 -14 -22 17
2933 17 -15 -16 5 -9 -16 -1 2 -26 10 -10 -26 -1 13 3 -4 13 -7 -3 18 20 -2 3 30 -11 6 16 7 -1 18 0 -2 14 10 13 -10 18
$$ packed form
2695c8K6K0j1j5K5j9J2jK1l0J1M7n6J3K2j3m2N9k0m5O3k7k1J1K3l7J9J4k7Lj4
2726b7K1k0K6K0l4%L2k0k4N6k8k5L4rk6K3K3k3JJ0j4j2K9J8m3J7K1l7k0M8k1j5
2758a9M8n6J5K5j0j1Rnk4K4j4J6j9K6J2m2J6J7j8jL7l6j1N0l7J1J0J2m1L0jj5
2790bJ0ORm8N7l8j2K0Mj3J6L3o9L4mj7RJ5j1k6K9lJ0j9K4j5k1K4j1oJ7J3k6J8
2824GJ0l9L8Nj4j5M0k5j0L0j3mkK0l2OJ3j2j2K3ll2K3Rk6J2J2j2mJ9k4QnJ4l2
2859b7J6L1l3RQlj7M1pm6N5j4j6J1J8k9MK7j8Mj2J8k8J7kj2J2lJl6N1l4nJ8Jk2
2895b2K3J0l6K0Omj7K3Jj6J2KjjK2j3rK3j9%J1lj2J3jj4J4jnj1J6pk8K7pj0qL9
2933A7l2jK1j4pJ5Lk8L6k0j6K5J4j0pJ7k0MK1Kk2NK7m1J7J0rqJ9j8kJ6mLk3K8
$$ plain form
2969 18 -1 -7 17 3 -13 -9 0 -26 5 0 -30 0 25 -17 -22 14 -7 -9 1 -12 -19 2 25 -3 10 15 9 -5 6 23 -4 17 17 -2 5 11
3005 11 -1 0 25 5 -6 4 7 -13 -7 17 -12 -16 7 2 -17 16 -5 -11 14 -3 -10 -2 8 -27 2 1 -13 0 -3 16 -6 16 11 -4 10 19
3041 19 8 -12 34 7 0 4 6 -3 0 24 -15 10 0 -14 -9 1 -5 -27 1 -10 -21 -15 4 -16 -5 6 -18 -11 7 -3 -17 1 -11 -13 14
3076 14 12 14 -3 3 5 -1 10 17 1 13 21 -9 -1 15 -8 5 13 9 -14 3 0 -12 7 -4 -10 -10 9 -22 -7 -6 1 -13 -7 14 -17 6 0 -9 -14 9
3116 9 7 0 16 -5 6 -4 28 7 8 18 13 -14 10 17 -10 28 9 2 18 14 0 -2 18 -22 -4 5 9 -9 1 5 -17 -5 -2 -8 -19 4 -3 -20
3154 -20 5 -5 -13 8 18 -7 -3 10 -1 1 9 9 0 17 19 2 12 11 5 3 17 1 -19 20 -14 0 0 14 -21 -3 4 -14 4 -10 16 -22
3190 -22 3 -6 -15 -15 -3 -14 -19 20 -7 -3 21 1 -10 5 8 -13 8 7 7 -2 28 9 -9 11 13 10 -5 12 -19 -3 11 -12 -7 -7 -3 -15 6
3227 6 -1 -18 -3 -13 -16 -29 9 0 -15 3 5 -16 -4 22 -11 2 12 -6 -11 16 -2 -11 17 2 -2 -6 11 0 4 17 -4 7 6 15 -10 2
$$ packed form
2969A8j9oK4j4j6MRk6L1nl0L0K5m2nL6k1kJ0j3pK1K3k8J3Noj4J1J7k7K1%j9PO
3005A1j2JK5k0j1J0Lk0OK4k9mK3nj9L3k1oK5j7pQJ0l5K9jj4J3lJ9k2K2nj5J4R
3041A9j1k0M6k7pMKrLK4l9K5j0j4NJ0ok2K8j1j1OJ9k0J1J1k4PJ8j0j4J8j2kK7
3076A4kKj7OKoJ1Pj6J2Ql0QJ6k3J3Qmk3J7lj2J9j1o%J9l1J5JPj4OK1l1K3ornK3
3116IkpJ6k1J1j0L2k1JJ0nk7K4Pk7L8j9pJ6mj4kK0m0J8RMj8J0Mk2J2Loj1K3pj7
3154b0K5j0qK1J0k5MJ3j1KQ%rJ7Kj7J0jokJ4j6k0L9l4J4%J4l5J8Pj8J8j4K6l8
3190b2K5rr%J2j1nL9k7MK4k0j1J5Lk1K1j%rL0j9j8K0Klj5J7l1J6J4k3N%Mj2K1
3227Fpj7J5j0lj3L8rj5J8Kk1J2K6l3J3J0j8nK7j8rK8j5mmJ7j1MJ3k1J1jRk5J2
$$ plain form
3263 2 11 -10 1 -5 -4 -13 13 -3 -12 3 -6 -12 -12 9 -10 -9 0 1 1 13 8 -21 19 10 3 7 7 8 -3 22 4 4 13 -1 -1 10 13 2 -1 -5 -4 -12 -1 -7
3307 -7 -15 -7 -8 -12 -6 -5 -15 -14 5 -21 -15 -12 3 -28 1 -3 -13 -7 6 -5 -1 20 1 -5 14 14 -1 4 -1 -5 4 8 3 5 3 9 -20 4 0 -8 -12 -7 -13 -18 1
3352 1 -7 -13 -4 -6 -27 -1 2 -13 -6 -3 -7 -12 -20 -5 -8 -1 -5 -5 0 4 4 -4 7 -1 -8 7 14 -12 24 0 4 1 2 16 -14 -2 2 -14 -8 7 -18 -4 -3 -15
3396 -15 -8 -10 -5 -12 -1 -23 -11 0 -10 -4 -4 0 -4 9 -4 -7 13 5 10 -6 -5 7 -4 11 2 5 -2 8 -3 -2 6 -1 2 3 10 -1 -4 -5 -9 -5 -12 -15 -28 -5
3440 -5 -16 -17 -15 -5 -6 -11 -2 -14 -1 1 -7 0 0 3 2 6 8 15 3 16 7 -3 7 12 3 5 10 -5 4 -2 -8 3 6 -2 -5 4 -7 -15 -18 -3 -16 -13 5 -14 -5 8
3486 8 -5 -12 -1 -1 -5 0 3 -2 3 -11 -3 8 5 11 -4 2 11 11 4 9 -6 -2 0 -10 -6 -3 5 -15 7 -12 -4 -6 -7 -17 -4 -5 -14 0 -6 10 -15 -2 -8 -18
3530 -18 -5 -5 -9 -8 6 -17 -7 0 -5 3 0 11 1 1 6 16 -7 11 14 -9 2 4 0 -2 7 -7 6 1 -6 -14 -4 -6 -18 5 -7 -4 -6 3 -6 -11 6 -9
3572 -9 -12 7 -15 -1 4 -2 -9 -2 1 6 -4 4 11 7 8 14 -1 10 23 2 -4 16 7 -5 7 -6 1 1 2 -4 -5 -5 -10 -1 -7 -8 -11 -15 1 -14 -17 -7 -14 -10 -4 -12
$$ packed form
3263BRk1J1oJrK6j6rJ5ro%K1j9JRJ%J2nk9M0rpM%Jj1K5j8%Rj4%J1Lj1lmJqJ1o
3307gqQjmOJj0JJ9k6OLJ5l1K9mj0OJ3j1MK1j9oJ9%j5NnmRMnKkOk9K4mqmNonJ9
3352AqoRkk1K6Lj5PLmnqJ5lPm%NM%qJ1qpJ5Pk6L6k4MlJJ4l0J2Mj6OJ5k5J4Jj2
3396a5PkNpJ1k2J2J1j0O%MmJ3j3lK0qNj6JJ2j1J5rLpJ0j1JQpLJPj1ljmMplj3K3
3440ej1jKJ0jnRj2J3KqP%LjMKPj2J3rj0J0NrKNj5RooJ1LqlRj1qlJ5j3LJ8j9RJ3
3486Hj3pJ1%mNLnNj4QJ1lOj5OR%pNj5MKj0MLQk0K2j9Qkjj0J3jrJ4oJ6k5J3oj0
3530a8J3%mJJ4k3J0PnQlJ1j0%NJ0k3J8Lk3J1KmkRj4J3npqJ0kj2K3j2LkRrnJ7j5
3572ilJ9k2J4NopPLNj0QPmJOj5J1J3k1oK0rj2J2j3P%Joj%nRojlmJ6j5lJ0pMOq
$$ plain form
3618 -12 -15 5 3 0 6 -3 -3 -6 7 12 9 21 0 8 1 11 -3 -3 17 -14 -7 0 0 -1 6 3 -13 -8 -5 -5 -3 5 -3 -7 -8 -8 7 6 11 -2 5 2 -12 8 9 5 3
3665 3 9 1 4 18 14 2 15 17 7 16 9 10 16 8 7 -8 6 -1 3 -3 1 -8 -2 0 -11 -6 -7 -3 4 -11 5 -12 -5 -6 -3 -11 15 -3 -7 -4 -4 -4 -5 5 -5 -4 5
3712 5 3 5 7 23 0 15 14 1 11 8 -5 -2 10 -8 -10 2 1 -17 -12 -1 -10 -5 2 1 -15 -7 1 -17 4 4 0 -2 7 6 -2 18 6 8 1 10 -6 4 12
3755 12 -3 12 4 1 -3 9 3 -8 19 -3 5 7 10 -12 -10 5 -9 -10 -1 4 -14 3 -15 -14 -11 -8 -10 -2 3 -7 2 10 -3 4 16 14 0 4 8 9 9 7 0 7
3799 7 17 3 4 3 16 1 2 6 -1 2 2 2 -12 2 8 -1 -2 -9 -14 -7 10 -3 -9 -4 -2 -8 -4 0 -6 6 3 -6 1 19 -7 -4 10 12 8 18 11 5 11 3 3 8 7 13
3847 13 11 2 18 -8 14 0 -10 4 1 -9 -3 8 0 -4 -3 6 -18 -4 9 2 0 -2 -4 -6 10 5 8 -1 3 9 7 11 4 11 7 5 8 15 2 -2 11 12 -1 8 7
3892 7 -4 3 3 -1 -14 -4 -7 -3 -9 -16 -14 0 -1 -4 -2 -2 -8 1 7 7 -4 -3 19 9 0 7 8 -1 12 15 9 12 8 7 8 10 6 8 22 1 -1 7 10 -14 0 3 -14 13
3940 13 0 -8 -11 -5 1 -5 -6 -7 -6 -14 8 5 -9 4 1 5 11 5 1 0 15 6 2 17 12 -2 14 9 -7 4 10 -2 6 -3 -8 -1 0 7 -2 -3 -14 -9 -6 -10 -3 -16 -3
$$ packed form
3618a2lK0klOr%lJ3NlJ2k1QpJ0j4%K0l1PP%jPlj6NL%KQqmj%J5jNj3Plj4K0Jmk
3665COqLJ4mj2J3Kj0RpJOqjj5J4pMoMrOKj1NjMPj5J6j7PjLqK6j8mL%%jJ0j0JR
3712EkKKJ6k3J5jj3J0lj3LJ2j8kJ2jj8NJ1rNPjj6QQj8K1%mkRjqK0j2KpRj6J0Q
3755A2j5J5qlmJ2oj1K7k2QKLk2KJ5j4jRNj8J7j8JLLkQNj0RQj3PJ2kj4MMJ%kpP
3799GJ0j4JjJ3j5JMpL%%j4J4OrjpnPJ7j3oNKoMMoJ2lrPJ8k6LJ4KmJ0poOq%NjO
3847A3krJ6k6K2j4j0J4lj0OJ1qmJRk4J4J3pkkkkJ6nLrMOkMpPmkLPj3mJ3Jj3Rj
3892Gj1P%mj3J0lMopKJ4jlK%oRO%j1JK2j0rPJrJ3LoLmjJKmKJ4k1kQLk4J4Lj7K7
3940A3j3qlOOojjJqK2lj4J3lMOomjJ5rmJ5nj4J6nj6J1Oj2QrnPJPrjj1NLmPj3J3
$$ plain form
3987 -3 -1 3 1 -5 -8 -14 -2 -15 -3 -5 14 -6 10 3 -7 12 0 6 -4 4 2 1 17 2 9 8 5 0 -6 -6 -3 -4 11 -5 4 0 -16 -18 -4 -11 -9 -11 -8 0 -7
4032 -7 -3 -11 -7 4 -7 -7 3 10 -12 9 -1 9 14 3 1 2 11 10 3 5 1 -7 2 -1 0 1 5 -9 -4 -2 -6 -4 4 -12 -5 -16 -15 -13 -18 3 -11 -7 -2 1 -8 -2 -12
4079 -12 -9 6 0 2 6 5 4 2 8 8 4 9 10 7 17 12 1 -6 1 -12 -5 -5 1 -8 0 13 -24 4 -9 -6 -6 -8 -11 -14 -6 -2 -3 -2 -1 -15 -22 1 -1 -7 5 -3 -2 10
4127 10 13 -9 5 3 5 8 14 14 5 7 5 2 -9 -2 -8 -10 10 -4 -6 1 5 -19 -1 -1 -3 -5 -2 -5 -16 -4 -19 -21 -13 0 2 -3 4 -14 -7 -4 1 -2 6 2 -5 5 9
4174 9 16 6 9 -2 3 3 1 2 -5 -10 -4 3 -7 -10 -9 -5 -10 9 5 -5 -3 -7 -5 -3 -17 -8 -5 -10 4 -13 -15 3 0 -12 2 4 -2 4 0 -3 -5 2 0 0 11 21 2
4221 2 5 16 4 9 1 2 1 2 -7 -5 -1 0 -22 -12 -12 -12 -14 -3 -7 -4 -6 -7 -19 -8 -5 5 -1 6 -4 3 3 2 2 4 3 -6 2 2 -4 5 4 2 2 -3 19 4 0 -7 -2 -7
4271 -7 4 -6 -20 -11 -9 -8 0 2 -6 -4 -18 -13 -11 -5 -3 -13 -3 -7 -8 0 -13 7 0 7 -7 -2 5 4 4 5 3 -12 0 -1 12 2 -4 -13 0 6 -5 4 -1 -1 -3 -5
4317 -5 -2 -17 -8 -10 -4 -6 -3 -6 -5 -9 -2 -12 -11 -11 -5 -2 7 -6 0 -4 3 -6 -2 -1 4 3 11 4 -3 10 0 0 3 -6 -2 -10 4 -3 -3 4 -13 -5 -8 -14 -19 3 -4 -6 -12 -4 -8 -15 5
$$ packed form
3987cKMkoloJ2j3J2kJ9k0J6pj0J9j2Oj0QkjJ6j5Pjlno%LjJ5j6Rmj6kJ4pKkLQp
4032gMqMJ1j1%J0Pk2K1j0J0Nj1kJRjpKmqRlJJMj4NKmKQj6Pj1JKnK1j4MNLrOj0
4079a2LJ5oKMjjkO%mNJlJ0nj1pPj3P%OrQJ3l7K8j3L%kllQMjJJj4pK3koJ2qJJ2
4127A0Lk2J4kKLO%rKklj1PokK0j4kPMk4J8%kkLlj1J2j5kQJ3KnPj8PLNlQmpJ0M
4174IPj0Lj1N%kJpnOPj0lJMnJ9mj0KmKKj4RLnJ4j7kJ8lj2J4KoOmlkPk%J1J0j9
4221BLJ1j2NqJjJrKMJk2J0%%kJ1mLkjj2J1LJ0oPj0P%j%KjrQ%oRjk%nK2j5mpNn
4271gJ1j0j4RKJQKqKj4NKOKj0J0mjQj3K0pPj4NPj%Jkj5J2jJ3j0orJ3Oj1Rn%kk
4317eLj5RkOkLlJmPj0J%OLRj3OmPrMJNjQppJ3j0%LrMqJ4p%Pj7QlonK2pkoQmpK0
$$ plain form
4370 5 -3 0 3 -1 -1 -2 1 6 -1 9 8 2 9 7 13 8 0 7 10 12 -3 1 9 0 -2 3 7 -10 0 -2 -2 -11 1 -6 -1 -3 -10 0 -13 -3 -5 -1 -6 -11 1 2 9 5 1 2 -2 6
4422 6 3 -6 -6 -3 4 -2 -5 -10 3 3 -2 2 1 -1 0 4 -5 -3 -14 2 -5 -3 -7 -12 -17 -16 -9 -8 1 -12 -11 -6 -14 -4 -3 -12 -3 -5 -6 -2 -5 2 6 7 7 5 -1 4 5 -3 4 0 7 12 6 7
4478 7 -12 0 -1 -9 -1 -4 -3 -14 -8 -9 -14 -3 -9 -11 -5 -1 -12 -12 -6 -3 -6 -11 -3 5 -2 6 9 3 -4 7 -2 11 8 -1 14 9 9 6 5 -4 -3 -5 8 -8 2 5 -6 -2 1
4527 1 -11 -6 -9 -1 -6 -6 -11 -7 12 -4 -11 1 -8 4 2 3 9 2 -15 4 8 0 10 -1 3 3 -1 -1 9 3 -2 2 -1 6 10 -1 -14 2 0 7 -1 -12 -7 -18 -21 -10
4573 -10 -8 -9 -9 -12 -4 -16 3 2 0 2 6 6 12 12 4 5 9 1 9 2 -2 2 18 -2 7 13 1 5 4 3 1 4 3 4 4 8 -3 -3 3 -5 -2 -9 2 -7 -7 5 -16 -3 -9 -13
4623 -13 -1 3 -4 1 -3 7 8 1 12 5 4 13 13 1 12 17 6 8 9 2 12 6 10 9 -4 -1 -7 -14 9 -4 -4 -2 -7 -10 -8 -8 -7 -8 -7 -12 -1 -12 -11 -2 -4 1 1 -1
4671 -1 2 10 6 8 -6 -7 7 8 9 19 1 11 2 10 2 5 10 0 -7 -1 4 -17 -12 -6 -13 -7 -4 -12 -2 -5 1 -8 -4 -6 -10 -3 -14 -17 5 4 3 2 7 4 1 -1 -3 5 10 6 -1
4722 -1 3 2 10 -6 7 -4 4 3 -1 -7 -10 -5 -5 2 -9 -11 -14 0 -16 -6 -10 -14 -13 -10 -4 -3 -7 -15 -4 1 -7 -3 6 6 11 9 8 -1 7 5 5 12 3 0 -5 -1 11 15 9 8 8 -1
$$ packed form
4370EqLLm%jLNpJ0joPkOnqPLKj5MQrkNMj7J0k%rJ2pNkpJ0j3J0kMnnJ2JPmmJmQ
4422Flr%LPolnJ3%nMjkJMrKj1J6pKmnnJPJRj3JNqJ0JrRkjMlPMJ%koNJqPmPNoJ
4478Gj9J2jqQlJj1OjnJ1okOMj1%OLlnQQpQLopJ1rJ3lrJ5n%ljrJkJ3j6J0Lj1ML
4527Aj2NlQn%nMJ9j6pJ2rJ2kJOpj7J9MqJ0j1M%m%J0onMlPMj1j3J6kPqj1Nj1lJ1
4573a0Kj%lQj2J9jkKM%O%qJMqQpmMJ6k0ROj2MjjkLjJ%Mj1%OqLpJ1r%J2k1J3om
4623a3J2MpNmJ0JpJ1pjR%j2J1Nj1KJpJ0oMjj3LopK3j3%KnlK%JjJnJ1j1JRkN%k
4671aLQmKj4jJ4JJJ0j8J0rQqLNj0pONk1NOpOLqJ0lOrMkmPj1lK2jjjNllkkQNmp
4722aMjQj6J3j1QjmolN%Pj1klJ4j6J0mmJLOJmqJ1NqMR%NkjrQk%PrlnMJ2Moj%r
$$ plain form
4774 -1 -1 -2 -5 -2 -3 -5 7 -3 -9 -6 -10 -6 -10 -12 5 2 0 5 -9 12 -7 4 3 -1 14 11 -2 -3 0 -3 6 14 5 -1 9 -7 5 -2 -1 11 9 7 -1 0 -5 -8 -14 -18
4822 -18 -16 -15 -10 -6 -9 1 -7 -3 2 -4 -3 -3 -5 6 -3 11 1 12 10 3 3 12 21 1 4 7 3 -4 25 15 3 3 -6 -1 -2 2 0 -5 -2 -8 -8 -13 -12 -9 -7 -2 -18 7 0
4871 0 2 -2 7 -10 0 4 8 2 9 -2 8 8 1 10 0 5 4 4 15 5 5 8 0 0 5 7 -1 -9 5 0 1 3 5 -4 1 -21 1 -12 -12 -4 -8 0 -8 -9 -3 8 -1 -3 6
4920 6 -2 6 10 5 10 19 19 2 10 13 5 9 -1 5 1 12 7 2 -5 -4 3 5 11 0 11 6 0 -3 -2 -5 -3 -1 -1 0 -10 1 -9 -5 0 -4 3 -2 7 2 1 3 10 -4 13 12 7
4971 7 10 0 3 3 13 6 15 5 -5 3 2 -5 -8 -6 5 3 -14 2 4 -12 -7 -6 3 -3 -1 -17 7 -2 -4 -4 8 -1 14 -5 0 -3 4 2 -4 6 -4 13 0 12
5015 12 9 16 13 14 7 4 0 5 5 3 1 6 7 -1 -8 -13 -8 2 -9 -1 -20 -7 5 -9 -4 -2 5 1 -5 -1 10 0 7 7 -4 8 9 3 6 17 6 10 8 -7 3 10
5061 10 11 5 14 15 -1 8 1 -2 -12 0 9 -12 -8 -5 -9 -12 -7 -5 1 4 -12 1 -1 -5 -4 -11 3 0 1 12 9 14 8 9 7 6 3 8 15 10 1 9 3 2 8 8 -9 16 6
5110 6 -4 13 7 5 2 -9 9 -1 -4 -11 2 -6 3 -6 -3 3 -5 4 -2 0 5 3 12 2 -1 4 8 7 -2 15 10 10 10 18 13 6 7 8 5 10 3 -2 4 0 3 -2 -4 -1 5 10 -6 -1
$$ packed form
4774a%jlLjkJ2j0oLmMmkJ7lkNj4K1j9J1jmJ5lj3jLlRQroJ0j6J2pJJ2kkqJnlom
4822a8KJNMlJ0qMNoJ%kJ1rJ4j0J1kp%RRk0LLmpK9j0j2%rNjMknLo%nJLKNj6K5p
4871@KmRj7J0MMoPj1J0%pRj0Nj%J1j0%Lq%NKqqJ4nJKKrNk2K2j3%QmQqjOJ1rkR
4920FqQMnNR%j7QLqMj0OmJ1nnpJPKOj1J1nolJlKK%Jj0J1j0MNmPnRnjKPj4J7jn
4971GLj0L%J0pRj0j0QjplKJ1kj7J6Kj6NJRoKj6K4rk%J2rJ5j9NlPkoJ0j0J7j3J2
5015A2lPlJplmN%kkNJqpnNJ0j1Qj9J3J2j4NKPmoMJ1j0P%j1J2JoLJ1j1Mkj5J0P
5061A0JoRJj6Rplj0J2Rk1MLmlNKOLj6J3kmJpJ4lJJ1lNoJkjlNPnrQojO%j7K5j0
5110Fj0J7oklj1J8j0lpJ3qRrLOqRoKNkRj0lNMjrJ7n%%QnpJJlNpnOmLnkLONj6N
$$ plain form
5162 -1 -2 4 -11 -7 -11 -7 10 5 -1 5 -4 -2 10 4 5 14 11 2 16 12 7 3 7 8 4 13 4 16 7 8 0 2 0 -1 -1 5 -8 -7 0 0 -2 0 -9 3 1 2 -6 -1 7 1 -7 0 2 3
5216 3 10 10 1 11 5 6 -2 7 14 13 7 -4 1 7 3 12 14 5 7 -7 3 15 -9 2 -5 -3 6 4 -8 0 -5 -8 -8 -2 0 -10 2 -2 -1 4 6 1 3 5 11 15 12 8 11 5 2
5267 2 2 3 8 12 -4 -1 10 -6 6 8 -1 2 8 -7 -1 5 -1 -10 -10 -8 -4 -1 0 4 -1 -5 -11 0 -12 -7 -6 -3 -2 -1 3 4 10 7 11 17 18 10 10 7 10 0 4 -2 10 3 -2 7
5319 7 -5 -8 1 4 -14 -2 -8 -4 -12 -5 -5 1 -5 -4 -9 3 -2 3 -1 -6 -6 -4 -3 4 4 8 -1 13 12 17 18 10 19 2 7 17 6 5 -10 18 8 12 6 8 4 9 2 2 6 -6
5369 -6 3 -6 8 -4 9 -10 8 -6 -5 4 -4 9 1 2 2 -1 -6 2 2 9 -13 4 5 6 6 -1 4 12 2 -9 5 1 -5 2 3 0 -5 -4 -1 -6 -8 -7 -16 -15 3 6 -5
5416 -5 -13 1 -10 -6 3 3 3 -3 3 3 8 8 8 8 -5 -1 15 11 8 8 -4 10 13 0 2 3 5 -11 -3 5 -6 0 -3 3 -1 -3 -15 -5 -10 1 -8 -7 -4 -5 -1 -7 5 -1
5464 -1 -3 0 16 6 -7 7 3 -2 6 2 7 7 15 11 13 1 6 12 -1 12 6 5 6 -8 8 -4 -1 0 -5 -10 -3 -3 -12 -8 -2 -7 -8 -20 -2 -4 8 -1 -8 4 -1 -4 -3
5511 -3 8 19 3 9 -1 3 2 -5 4 11 13 12 -1 6 13 0 4 -2 -9 -9 -2 -5 -14 -3 -11 -8 -10 -9 -12 -2 -7 -4 -8 5 2 3 -6 1 1 5 -3 1 -2 4 5 5 9 5 6 5 3 10
$$ packed form
5162ajOj5MmMJ7noOrKJ2oJRlrJ4mnmMJmRrJ2rJqKkj%Oj3JP%kKrJ2kJqNQoqPKJ
5216CP%rJ0oJqRPjoj1NOmRKrKj4J0J2k4J1pKRkj2Qnl%OKj0J2mJNKnKKOMlmLol
5267B%JNMj6LJ1j6J2KrLOj5OOor%KMLJMnmoJ1j2NJLJJMJOlMOJq%lLj0MoJ2pnR
5319Gj2lRLj8J2oMqP%OoJnJ2nNmn%KJP%MrJ4jNJqRj7NJ0j1jj5K8j0MoKmNp%Mj2
5369fRrJ4j2J3j9J8j4JRqJ3qJ%lnQ%Pk2J7JJ%pNQj0j1J4moPJlnJLnkJrJJ8Lj1
5416eqJ4j1MR%%oO%N%%%j3MJ6ml%j2J4Lj3KJKj6QQj1OlOmkj2J0nJ1rJLjMoJ2o
5464akLJ6j0j3J4mnQmN%QmKj2NOj3J3ojJj4J6j2LJnnP%rMOnjj2J8kJ2rpJ2nlJ
5511cJ1J1j6Oj0MjpRPKjj3PPj3Mop%PlrJ1qLkJlJ0nLmJ3lJrP%MqMlOJ%MmJjkP
$$ plain form
5563 10 -2 8 -2 9 -2 -6 -6 -3 2 -5 -5 -1 -17 -5 -14 -9 -11 -7 -11 -11 -17 -13 -10 -9 -8 -3 -6 -3 6 3 4 -2 12 -2 -2 10 8 8 4 -1 4 13 16 11 -4 6 -5
5610 -5 -1 -11 -5 5 -6 -7 -12 3 -8 -5 -7 3 1 -2 -6 -8 3 5 -2 -8 -13 1 -5 -4 -3 -7 5 2 1 -3 -2 2 4 6 1 3 5 4 2 -4 0 3 -4 0 1 1 -6 -2 -1 -4 -8 -2
5662 -2 -2 -20 -8 -20 -13 -7 -3 -9 1 -6 -9 -9 -7 -2 2 5 9 0 -11 -11 5 8 8 14 -2 11 2 4 14 -2 12 2 3 -2 1 0 -1 -2 -4 -9 -9 -8 -2 -18 -9 -5 -16
5709 -16 -8 -4 -1 -14 -13 -8 -6 -10 -14 -11 -15 -6 2 6 -2 7 15 6 0 -4 8 -3 1 2 4 3 3 11 0 -5 -6 -8 -3 -7 -2 -6 -7 -14 -4 -9 -10 -1 -8 -7 1 -6 -6 -9 -11 -14 -1 -5 -3 -3
5763 -3 9 -1 10 5 3 9 5 6 7 -4 4 5 -5 -2 -4 6 -2 -3 5 -9 -3 -7 -15 -7 0 2 -8 -14 -20 -5 -15 -5 -16 1 -10 -9 -4 -2 -10 -3 -3 -6 5 2 11 6
5809 6 6 12 18 7 11 -3 5 6 1 -4 -3 -5 -12 3 -15 -5 -9 -9 -9 1 -3 -3 -2 -5 -14 -5 6 -8 -1 -11 0 -2 -16 -2 1 6 3 2 12 9 8 3 8 3 3 2 14
5856 14 4 3 17 -2 -2 -2 -2 -4 2 -1 6 -6 -4 -7 -2 -20 -16 -1 -10 -9 -12 -4 -7 0 -14 -1 4 -4 11 8 4 1 -4 1 -1 12 3 11 9 9 2 8 9 7 1 -2 1 0 -2 -2
5906 -2 7 -2 5 -2 10 2 -7 1 1 -4 -13 -10 -3 -5 -14 -9 -2 -3 -4 -10 1 3 -7 -7 4 2 3 0 -2 13 0 8 10 11 6 7 9 9 7 -2 -9 -1 8 2 1 0 7 2 -15 -7 -11 -11 -7 -11
$$ packed form
5563A0j2J0j0J1j1m%LNp%Mj6J2rNkMm%oMLJJNlLRlJoJ4j4%J2k%mnNRLnj5J0j1
5610eMj0OJ0j1jnJ5j1LkJ0klmkJ1KponJ4oJJmJ2ljmJMKKnKKjkoMLpMJ%pMJlmO
5662b%j8J2j2POMoJ0pl%KNMLMrj1%J6L%Oj6J3rKJ0j6J4j0JnLjjjkn%JOj6RMj1
5709a6QMLj3JNKmmLmRQMqRQromJ2j1MJKj%Qj1njkNmNmjpJ0njRpJQp%lklJ3mK%
5763cJ2j0J1nkOmJJj1QJj0LkJ0qjQj4OmqQPKj0ooJ5j0J0j1J7j1JNKqP%lJ1lRn
5809F%OOj1Mj4QJnnJkpJ5j8J0m%%J0m%JlrRJ1j4Pj0J1kj4J4LNljJ0ljnNn%jJ2
5856A4j0jJ4j9%%%kOlPj2KlNj8MJ5rJlQlPj4J3NqJ5lmlnNkJ3rQk%pOJkolLjk%
5906bRrPpJ2qrQ%nrLPkrNPjjoJ1Kj0%J1kJlkJ5j3QKJnJK%krpQRojjPnj7Qm%Mm
$$ plain form
5960 -11 10 -5 7 -11 -10 -4 -8 -7 -2 -16 3 13 6 12 -4 12 3 11 12 6 13 3 9 1 19 3 10 -2 6 -2 9 -8 -8 -6 -10 -5 -4 2 -11 -5 -12 -7 -5 -5
6004 -5 0 -6 -6 -10 -9 -10 -5 7 -2 -5 -1 -2 -2 1 0 -3 -6 4 4 5 4 17 10 3 -1 4 -2 4 9 3 -5 -6 -7 1 -5 -2 -3 -15 -3 -7 -12 -6 -11 -5 -7 -1 -6 2 -1 10 1 14 -2
6057 -2 5 8 11 3 -5 6 -1 0 4 7 0 6 0 8 8 5 0 6 -1 -5 -6 2 6 -18 -7 -15 -7 -10 -14 -6 -8 -12 -5 -7 -17 -11 -12 -1 3 -11 3 1 2 6 2 4 -2 8 2 21 6
6108 6 4 11 12 6 10 -1 1 -4 16 4 -8 -11 -4 -7 1 7 -4 1 -2 -2 1 5 -8 -8 -10 -7 -13 1 -1 0 8 2 -4 -6 7 2 16 8 1 5 -4 1 1 2 1 -2 16 7 -3 0
6158 0 -7 1 1 -11 -1 0 -8 -7 -10 -5 3 -12 3 2 -11 7 2 0 -6 2 -7 -2 2 1 3 2 0 -8 -1 13 -4 0 10 10 14 5 5 8 -5 6 4 7 -6 7 5 -8 -8
6205 -8 -1 -9 -9 -3 -8 3 -11 -10 -7 -13 -18 3 -6 -3 1 -10 9 4 3 5 7 5 7 11 12 17 -2 -6 6 10 7 18 3 6 -1 1 3 -2 3 -3 -1 -1 1 3 0 -12 -10 -8 -13 -2
6255 -2 -4 -4 -10 -8 -1 -6 5 -9 -5 -10 -2 2 6 10 2 9 13 7 -3 1 0 2 1 4 6 6 4 -2 2 -4 -4 -5 -2 6 -1 -6 -8 -17 -10 0 -13 -8 -6 -12 -12 -5 -5 -2 -2 -4 3 -2 -1 -10 6
6310 6 -5 1 9 6 8 11 1 0 2 13 4 3 3 -4 0 4 7 -11 -7 -14 0 3 2 -3 -2 -13 -6 -20 -11 -2 -8 -4 2 -8 1 -2 3 4 4 -8 -5 -9 -4 3 0 7 7 6 6 14 7 1
$$ packed form
5960a1K1j5J2j8JOmJNj4J9J0pOj6J6rQJoPj0OqJ8j6Pj2QqJ1j7%KmNJOj3OpNK%
6004eNo%mJjNJ2rlMj%LjllJ0%JjJ3ppmNoONoqjjQoLjj2J2mnOnOkOnQlJ1rJ3j6
6057bPLLqqJ1pJMLpOoQ%lnOpmjQMk4J1qQlmQkmPkj0OjJ1Mj4J4kJMmKoJ0oJ9j5
6108FkPJoMj1KnK0j2j2lPlQOj1Nl%LMj3%kLoJ4kJQookJ3nJ4qpMrN%JjlJ8rj0L
6158@pQ%j2J0JqJlNQj5J5jj3J8nkoQrNMjKjkqPJ4j7MJ0%Mr%Lj3J1kLj3J3kj3%
6205hPq%OnJ1j4JLonK1rLMj1J9njKKkKMJNj9mJ2MlJ1j5LpKKnNoK%KKlj2KKnJ1
6255bk%oKPnJ1j4MnQMMMqPMoj0MjKjLK%koMo%jLQpnkrPJ0j3NKo%P%L%kPnJrJ6
6310Fj1OQlKLj0jKJ1rj%pMMLj8MpJ4LjnJj1Pj4RRoMOj0RlNJ%j2LmNPlP%j%Qpo
$$ plain form
6362 1 1 9 2 6 5 -5 0 -12 9 -2 -11 0 -11 -8 -1 -4 -6 -2 1 -1 -1 -6 -6 0 10 -8 -9 -4 2 8 10 14 -2 -1 8 5 11 15 6 2 0 6 3 10 14 3 3 0 -7 1 7
6413 7 -4 -13 0 -2 -6 -12 -4 -8 4 1 -10 -10 -11 -9 -9 -7 -5 -2 -5 2 -9 -5 5 5 0 3 7 10 -4 10 2 -3 -2 2 -2 -1 9 3 4 -15 -2 0 -7 -11 -5 -8 1 -6 -10 -6
6463 -6 3 -12 -10 -14 -11 -1 -16 -2 2 -7 -10 -4 -3 -8 0 -15 3 5 2 5 6 5 7 4 10 -2 3 10 2 5 -3 -4 -4 8 0 5 -6 -5 -6 -6 -10 -9 -5 -1 -13 -9 -9 -2 -8 -4 -3
6514 -3 -13 -7 5 0 6 -3 2 -1 1 5 3 2 4 8 1 1 12 4 -2 -1 2 -4 1 -1 -10 -1 -9 -8 -8 -6 -1 -7 -13 -8 -14 -17 -10 -9 -4 -9 -10 2 -6 0 7 -6 -1 9 -2 -14 1 3
6566 3 -5 6 -3 14 -5 4 -2 2 -4 -4 -2 -4 -8 -17 -16 -15 -11 -7 -10 -5 -10 -15 -3 -3 -18 -12 -2 -12 -16 -7 -1 -6 -9 -14 1 0 -3 5 7 2 -4 -2 -1 7 4 -5 -1 -3 -4 5 4 0 -16
6619 -16 -7 -17 -7 -5 -7 -13 -3 -10 -4 -10 -3 -14 -7 -15 -15 -7 -2 -12 -7 2 -11 -3 -10 -9 -11 -12 -9 -12 2 3 2 3 -1 -1 -1 6 -4 4 2 1 -6 -1 6 2 -9 -8 -3 -19 -10 -10
6669 -10 0 0 -13 -7 -6 -1 -11 -5 -12 -2 -11 -6 -10 3 1 -7 -4 4 -1 0 -5 -2 -2 3 6 -3 6 0 8 -6 6 -7 1 5 8 -10 -1 3 -2 3 5 -12 -5 -16 -9 -9 -10 -9 -11
6718 -11 -5 -1 -3 3 3 -4 -10 0 -9 -6 3 2 5 1 10 5 6 4 5 -1 -3 -2 1 11 10 -2 2 6 -1 -4 -1 -3 -4 -10 -14 -11 1 -12 -4 -6 -6 -17 -1 -12 -3 -18 -5 -7 -8 4
$$ packed form
6362A%QpMjj0Nj2K1j1rJ1j1LPlkMLk%n%OJ0j8jNOOKMj6JRlOMrmkOlPMj1%lpQO
6413Gj1rJ3kmoQmJ2lj1%jK%KKLlPj1MJ0%nLMLj4J4qnJMmJJ0oJj9J3KpmOlRpmM
6463fRj5KmLJ0j5J4MrlOJnQj5J8KlLJjKlOj2NPqLqj%J2qNj1Jj%mJMMj2M%PoMJ
6514cj0OJ2nOrNlKMkjKMp%J1qoJLoNkrRqJ%KNooNolPJNnjJ2qOPj3NJ0j1j2J5K
6566CqJ1rJ7j9RoMo%KkmrJJMMlNnnJ2%j5OJ0j0mROnlnJ5jlQKnoKJQlrMkjRjmj6
6619a6Rj0J0KkoJ0pOoPj1Pq%QNj0NRj3QpJkjLlJ4JjJm%%Pj0QkjpNPmj1JNj6R%
6669a0J0%j3OJNj0OpJ0rNmJ3kqLQnJnL%NLrRoQj4J2j3QMLj8RMnNKj7Pj1P%jJk
6718a1OMkO%poJ0rLRjLmRnJkJokJLJ0jj2MMplLkjomLJ2j3Qk%j1J6j1Rj5J3kjJ2
$$ plain form
6768 4 -3 -1 -7 -5 -4 10 7 10 8 15 -4 13 3 -8 -4 5 -11 -8 6 -1 -4 -4 -6 -5 -9 1 7 -9 -10 -4 0 -10 -8 -3 -4 -9 -11 -11 9 -1 -9 2 -9 -5 5 -2
6814 -2 5 -2 -1 -2 12 14 14 15 11 -7 8 -3 -1 3 -8 1 -7 3 1 4 -14 -5 -4 -2 -21 -2 -7 -11 -11 -4 -6 -7 -3 -6 -2 3 -2 10 -3 0 3 -4 -4 -7 -3 1 10 8 2 2
6864 2 9 -6 1 1 1 4 4 3 -11 -6 -6 -2 4 -7 -10 6 -5 -4 -8 -10 -20 -7 -6 -3 -5 -11 -10 -1 14 -7 14 6 8 5 9 8 0 10 7 5 10 -4 2 6 7 15 -2 2
6912 2 -4 4 -5 -8 1 -2 3 2 -9 -11 -6 4 -10 -15 -6 -9 -3 1 -7 -9 -15 -13 -6 -1 -3 -1 3 1 -4 -3 -2 5 7 10 6 9 10 -6 12 7 -9 -1 -8 -1 -4 -3 -15 -15 -5 -6 -9 -5 -8
6965 -8 -6 -10 -3 -7 -3 -15 2 4 -3 -9 -1 -1 0 -1 -2 -1 -11 -3 -15 -1 2 -7 4 -6 0 -2 0 -6 3 0 -2 4 8 -7 -4 -6 -1 -2 -18 0 -4 -7 -12 -5 -5 -11 -9 3 -2 -7
7015 -7 -10 -8 -5 -7 -9 -2 9 -3 -9 6 8 -1 -8 7 1 3 1 1 5 6 6 1 6 1 8 6 -3 3 11 -4 5 -17 -13 -9 -11 0 -13 -13 -13 4 -9 -6 3 -6 -13 -4 -4 2 5 3 4
7066 4 -10 1 3 -10 3 8 0 3 4 4 1 3 5 -3 -8 3 -2 2 -7 -4 -13 -10 -2 -14 -11 -14 -13 -1 -13 4 0 -8 -2 -16 1 -8 -5 7 -9 4 -5 -8 7 17 9
7111 9 6 1 4 5 -3 4 2 -11 -1 1 0 0 -2 -10 -11 2 -3 -9 2 -14 1 -13 -7 -13 -1 -2 -6 -3 5 -4 0 1 5 -2 -7 5 -6 12 -3 1 7 -3 -7 7 7 4 12
$$ packed form
6768DpKoKJJ4lLkPj9J7j0j1MRj6LJ4pl%kJmJ0Oj6jOMj0KNjnk%K0j0qJ1j1MJ0p
6814bPpJjJ4K%Jmj8J5j1KMj1RqJ0kLj8RJKj9J9nm%PkjMlMNnJ2j3LLp%lMMRko%
6864BPj5P%%L%jj4N%MOj1lJ6j1Jmkj0J3JLkoJRJ5k1K1qKlMjqJ0lkNj4OMJQj7M
6912BoQrlRlNjj1kNJ0j4nRlOMqkoKPNkKMknJJPKLmLJj6J8nj6QpPlJj2%J0jlMl
6965hKmPmMj2J7KpoQ%JjjJj0Qj2J4LrJ1j0OkKoRlkOMj5LkNjj6J8mlnP%oKJ2nn
7015glKLkkPJ1j2oJ5KrpJ5oKk%MJ%nNnPkrOQj5Rk2MMkJ1j3%%J7j3LRrpR%OLkJ
7066Dj4J1Kj3J3NqLJ%lKKqnJ1nMrLrLQj2LlJJ2j2J7mqOj4J7rLJ2j6J3rlJ5J0q
7111IlnLJqPkj3J0Kj%kqjJ3noJ1j6J5j4OoJ2jmLQrMJMpnJ2j1J8j5MOj0mJ4%lQ
$$ plain form
7158 12 -1 3 8 4 0 -1 -19 -1 8 -1 -10 -6 -6 -9 -8 -11 0 -10 4 -8 -6 -1 0 -1 -4 -2 -3 -1 -10 -19 6 0 -5 -2 -4 0 4 -4 2 -3 2 -1 8 6 -1 3 0 -2 -2 1 3 -9
7210 -9 14 4 5 2 -4 -2 -7 -15 -9 -12 -15 -7 -8 -13 -11 0 -6 1 0 -6 -16 2 2 8 5 -1 0 7 3 10 6 13 8 7 0 -3 -1 0 -2 9 -3 -4 -2 -12 -2 -3 -9 -1 -14 -2
7260 -2 -9 -11 0 4 -8 -6 -7 -6 -2 -1 0 -12 3 0 -4 -8 -2 9 5 13 1 16 0 18 0 6 5 4 0 -6 -15 1 -4 -4 -4 -10 -6 -13 -2 -8 -7 -3 -6 -9 -12 0 -9 -3
7308 -3 -11 2 0 -3 6 3 -1 5 2 9 3 8 6 2 1 3 6 10 0 -6 -5 -3 -1 -7 -1 5 2 -7 -6 -4 -13 -12 -3 -4 -5 -2 -5 -5 -11 -10 -17 -13 4 4 -3 -6 -2 -4 -2 4 -2 2 1 8 2 14 0
7365 0 -4 7 2 2 5 4 7 10 -1 -9 -7 -2 -8 -1 -2 -3 -4 -5 -8 -12 -8 -9 -4 -15 -26 -8 0 -7 -26 -6 -6 5 -6 -8 5 6 -6 6 3 2 9 -7 -1 -5 3 -10 10
7412 10 -4 7 -1 -4 -1 0 -1 -8 -14 -6 -12 -2 -8 -7 -7 -13 -1 -6 -4 -13 -3 -16 -5 -10 -11 -3 -11 -1 4 10 0 -2 0 -3 7 9 7 -2 13 3 -4 9 2 -2 11 -2
7458 -2 0 -7 -15 -13 -10 -10 -12 -11 -13 0 -12 -14 -4 -2 -13 -8 -1 6 -4 3 -2 -6 -10 -4 -10 -3 -2 -2 -8 4 -5 3 10 2 -10 1 9 1 2 0 -5 -2 6 -5 3 -5 2 -2 -15 0
7508 0 -5 -7 -3 -20 -15 -17 -9 -6 -3 -1 -5 -10 -5 -11 -6 -8 -2 0 -2 10 2 -6 -12 -8 -10 0 2 -8 -1 -8 -4 -3 -6 -1 1 -4 -6 -4 -7 0 5 -8 -11 -12 -3 -8 -17 -13 -2 -16 -7 -5 -6 1
$$ packed form
7158A2j3MNmmjj8J8RrrM%lJlJ1j0J4j2KNJjlKjKrrK5onLkMMqOnNlRkpMlk%LKj2
7210iK3j0JloKnqOllQjnKJ1oPjoj0J8%OloJPmPmPnjplKJkJ1j2jKj0J0joQj3J2
7260bpkJ1Mj2KjJMJJj2J5lmmOJ1mQj2J5j6J8j8OjjmorJ6n%%oMpJ1oJMlllJ2rO
7308cqJ3klRlmOlPoNkmjKLMj0oJKKoOOlrJKrJRjjLl%oJpMJ7%plMkKOoMjPoJ2j4
7365@mJ1n%LjLLj1qKNoPjjjjlmMjNj1j1J8Qpj9K0%J1j1kJ3Jj2J2ljPj6OmQj3K0
7412A0j4J1qlLJjpoQoJ0oJ%oJ2nKrJ0j3J1njQqJ0NOj0kKlJ0KkrJ5j0pJ3pmJ3j3
7458bKpqKL%kJkJ3j2kJ0Kj1NPPj0PnmmOoPJ%oJ2rQPqj2J1QqJknLQj1QqPmj3J5
7508@nkMj7NkQLLKmnNoNkOKkJ2qqoMkJ0Kj0PpMJlNKnkKlPNj3ljRnrMJ1j4RKjP
$$ plain form
7562 1 -5 -19 -6 -2 2 1 -3 3 3 6 1 12 6 10 7 2 -1 3 6 2 -1 2 1 -1 0 2 -9 -11 -3 2 -1 -5 -6 -10 -7 -7 -1 -2 -7 8 -5 -4 -10 -3 3 -14 -4 -6 -5 2 -1 10
7614 10 10 -6 -1 -5 -3 5 1 13 -2 1 1 -1 0 5 -2 -14 -10 1 -4 -7 -7 -2 -2 -21 -15 -11 -8 -8 1 -3 -2 1 6 -2 -9 -17 -9 0 -1 -4 -7 0 -2 -4 2 0 2 6 14 3 -6 15
7666 15 -1 -10 -8 -2 -4 -12 -3 -5 -9 -13 -3 -5 5 -4 -1 -12 -7 0 3 -3 -2 -2 1 4 -7 -4 2 10 2 0 -2 -4 4 1 6 -2 -12 -5 -5 9 4 -6 4 5 -6 7 4 -3 3
7715 3 2 -3 -3 -7 -8 -1 -15 -4 -8 2 -6 -4 2 4 -9 9 7 -2 2 6 4 -8 5 6 5 -1 6 11 15 8 2 -6 1 -3 4 5 4 -8 -6 -3 -1 -2 -1 -1 4 -9 3 -7 -5 -2
7765 -2 -10 -6 -7 4 -5 -9 -7 -3 -8 -6 -8 4 2 0 10 8 1 3 6 3 10 3 0 11 3 -3 5 5 10 7 5 2 -2 -7 -13 -2 -5 -10 -7 -9 1 -3 -2 1 -5 5 -6 2 1 -1 -5 4 -6
7818 -6 9 6 0 -3 -1 6 2 13 1 1 5 5 7 5 5 8 7 12 -2 4 -3 2 -7 -1 -5 -3 0 -4 -11 -21 -10 -1 7 -15 -2 -6 -10 5 9 -3 4 10 6 4 4 -2 -2 -10 4 7
7868 7 -1 6 3 3 -2 5 10 -5 10 -4 -3 4 -3 0 -4 1 -1 -6 -11 -11 -4 -3 -3 -8 -3 0 -6 7 -8 3 -1 3 -3 -1 -2 -4 8 9 1 20 -2 0 11 1 4 11 12 1 5
7917 5 7 -5 -2 1 -3 1 -1 -10 -4 -6 -11 0 6 0 -8 -6 -1 2 -5 -4 -7 -11 -6 4 7 -2 -3 -4 -5 18 7 -1 4 10 4 12 3 6 3 7 4 -3 13 -2 14 13 1 -7 -14 -7 1 -4
$$ packed form
7562Aoj4J3MMjmO%LnJ1oMlnlMLmlLjkJKj1kQNlmjmL%OjnJ5j3JoPOj7J0kJPlJ1
7614A0%j6NmKQmJ2j5L%kJNpj2MJ1nl%N%j9OML%RmJLNqpqQRjllPkkOkKMQj1rK1
7666A5j6rKOkqRkmmJ0kJ0rLj1NPLoJ%LLj1LOQqkkkQlNqj0P%J4nj0J0Jj1J3lpO
7715Cjn%mjPj4J1mJ0qKOKj3J8krMMkj2J3JjoPNMpoqPmPJjj2KLKjJ%Nj3J2j0KL
7765bqMjJ1rmKMnKkJ2kkJ0kpKLlPplJ1qoQ%NlklmnoJ1lnLkJ0mJLoJ0j1QjkmRj0
7818fJ5lolKPmJ1j2%M%Kk%LjNj4OpNrOmKLmpj0J1RQk2J3mmJ5Mj2POmk%o%qJ4L
7868GqPl%nPNj5J5j4JPpLmNknn%PJ%nNLoJ3j5J1mMoKjkJ2JqJ9k2KJ1j0LPJj1M
7917EKj2LLmMkrOknJ1OoqKNLpJlmNJ0LrjjjK3j1qNOoQrLlMlpJ6j5J6jj2qpPQn
$$ plain form
7969 -4 -1 -5 -2 -4 -2 -9 2 -2 -3 -9 -11 7 5 0 6 -1 -9 -5 4 4 2 1 9 9 13 4 8 14 11 1 7 7 11 8 11 -2 -11 -2 -6 0 -5 -2 0 -6 -3 -6 4 -9 -5 -5 2 2 7 -3
8023 -3 -10 6 13 -11 5 0 2 -1 -1 3 8 6 9 4 -3 6 1 2 15 9 0 1 3 -10 2 1 7 5 -3 -6 7 -4 -6 -3 -6 -8 -3 -2 -4 -4 -5 -3 0 7 -3 5 -3 9 4 7 10
8074 10 15 5 17 5 1 8 15 11 -3 -4 -3 3 -7 2 -3 -2 -10 -15 2 -4 10 6 -12 -3 3 1 -4 -1 -1 -10 -2 -2 -8 5 3 -2 -1 -2 4 -2 1 -1 5 14 10 8 19 3 5
8123 5 13 4 9 18 3 7 -5 -9 8 -1 -8 -3 1 -6 -10 -9 -5 -5 -11 -6 -1 -5 -2 -7 12 -2 -1 -1 9 9 13 10 -9 4 0 8 0 1 3 13 5 12 -2 2 14 -3 -4 2 1
8172 1 4 4 -5 4 -2 0 -4 7 -1 -9 -9 -18 4 0 -14 -3 -6 -16 -9
$$ packed form
7969dLmLkKpJ1mjokJ8knOpqMR%kjQ%MrMOlj0O%MlLj3rRmOnLKoLlJ0j3M%P%Nj0
8023cpJ6Pk4J6nKl%MNkLnpRnJJ3orJKj3J2jOkqlJ3j1kLlkNJk%jKLPj0QqJ2nLL
8074A0Nj0J2j2mPPmj4jJOj0RnJqnJ7oJ4mj8ROknL%rQ%oJ3knJjOoLkORmkJ1j6K
8123EQrNRj5Mj2mJ7rpNMpmJM%oNNmLnJ9j4J%J0%Mlj9J3mQqJKJ0qPj4MJ2j7jOj
8172AL%rRoKmJ1qq%rK2mj4J1lj0P
8191i
##END NTUPLES=NMR FID
##END=
