##TITLE=1H_IG-total
 200.13MHz, CDCl3
 8 sc
 
 19ns.26.2.2025
##JCAMPDX= 6.0         $$ Bruker NMR JCAMP-DX V2.0
##DATA TYPE= NMR FID
##DATA CLASS= NTUPLES
##ORIGIN= UXNMR, Bruker Analytische Messtechnik GmbH
##OWNER= pz
$$ XWIN-NMR		Version 3.5
$$ Wed Feb 26 14:32:14 2025 Russian Standard Time (UT+4h)  new_Human@DPX200
##.OBSERVE FREQUENCY= 200.1313
##.OBSERVE NUCLEUS= ^1H
##.DELAY= (6, 6)
##.ACQUISITION MODE= SIMULTANEOUS
##.ACQUISITION SCHEME= undefined
##.AVERAGES= 8
##.DIGITISER RES= 18
##SPECTROMETER/DATA SYSTEM= spect
##.PULSE SEQUENCE= zg30
##.SOLVENT NAME= CDCl3
##.SHIFT REFERENCE= (INTERNAL, CDCl3, 0, 14.3821)
##AUDIT TRAIL= $$ (NUMBER, WHEN, WHO, WHERE, WHAT)
$$ ##TITLE= Audit trail, XWIN-NMR		Version 3.5
$$ ##JCAMPDX= 5.01
$$ ##ORIGIN= Bruker BioSpin GmbH
$$ ##OWNER= new_Human
$$ C:/Bruker/XWIN-NMR/data/yarkov/nmr/H-C/1/audita.txt
$$ ##AUDIT TRAIL=  $$ (NUMBER, WHEN, WHO, WHERE, WHAT)
(   1,<2025-02-26 14:26:25.81 +0400>,<new_Human>,<DPX200>,
      <created by zg, POWCHK disabled, PULCHK disabled
       configuration hash MD5:
       00 E9 B6 7A A2 85 ED C7 34 08 36 98 17 FE 4E 26
       data hash MD5: 16K
       EB A4 17 2B CC 42 AD 71 7E 78 EF 00 EC 64 6B 38>)
$$ ##END=
$$ 
$$ hash MD5
$$ 91 FA 9A A5 30 23 DF 3F 04 FD D5 1C A0 74 B0 6C
##$RELAX= 
##$RELAX= 
##$RELAX= 
##$RELAX= 
##$RELAX= 
##$RELAX= 
$$ Bruker specific parameters
$$ --------------------------
##$DU= <C:/Bruker/XWIN-NMR>
##$EXPNO= 1
##$NAME= <H-C>
##$PROCNO= 1
##$TYPE= <nmr>
##$USER= <yarkov>
##$AMP= (0..31)
100 100 100 100 100 100 100 100 100 100 100 100 100 100 100 100 100 100 
100 100 100 100 100 100 100 100 100 100 100 100 100 100 
##$AQSEQ= 0
##$AQ_mod= 1
##$AUNM= <au_zg>
##$AUTOPOS= <>
##$BF1= 200.13
##$BF2= 200.13
##$BF3= 200.13
##$BF4= 200.13
##$BF5= 200.13
##$BF6= 200.13
##$BF7= 200.13
##$BF8= 200.13
##$BYTORDA= 1
##$CFDGTYP= 0
##$CFRGTYP= 5
##$CHEMSTR= <none>
##$CNST= (0..31)
1 1 145 1 1 1 1 1 1 1 1 1 1 1 1 1 1 1 1 1 1 1 1 1 1 1 1 1 1 1 1 1 
##$CPDPRG= <>
##$CPDPRG1= <>
##$CPDPRG2= <>
##$CPDPRG3= <>
##$CPDPRG4= <mlev>
##$CPDPRG5= <mlev>
##$CPDPRG6= <mlev>
##$CPDPRG7= <mlev>
##$CPDPRG8= <mlev>
##$CPDPRGB= <>
##$CPDPRGT= <>
##$D= (0..31)
0 0.7 0 0 0 0 0 0 0 0 0 0.03 0 0 0 0 0 0 0 0 0 0 0 0 0 0 0 0 0 0 0 0 
##$DATE= 1740565585
##$DBL= (0..7)
120 120 120 120 120 120 120 120 
##$DBP= (0..7)
150 150 150 150 150 150 150 150 
##$DBP07= 0
##$DBPNAM0= <>
##$DBPNAM1= <>
##$DBPNAM2= <>
##$DBPNAM3= <>
##$DBPNAM4= <>
##$DBPNAM5= <>
##$DBPNAM6= <>
##$DBPNAM7= <>
##$DBPOAL= (0..7)
0.5 0.5 0.5 0.5 0.5 0.5 0.5 0.5 
##$DBPOFFS= (0..7)
0 0 0 0 0 0 0 0 
##$DE= 6
##$DECBNUC= <off>
##$DECIM= 32
##$DECNUC= <off>
##$DECSTAT= 4
##$DIGMOD= 1
##$DIGTYP= 9
##$DL= (0..7)
0 120 120 120 120 120 120 120 
##$DP= (0..7)
150 150 150 150 150 150 150 150 
##$DP07= 0
##$DPNAME0= <>
##$DPNAME1= <>
##$DPNAME2= <>
##$DPNAME3= <>
##$DPNAME4= <>
##$DPNAME5= <>
##$DPNAME6= <>
##$DPNAME7= <>
##$DPOAL= (0..7)
0.5 0.5 0.5 0.5 0.5 0.5 0.5 0.5 
##$DPOFFS= (0..7)
0 0 0 0 0 0 0 0 
##$DQDMODE= 0
##$DR= 18
$$ [...]
##$SUBNAM0= <"">
##$SUBNAM1= <"">
##$SUBNAM2= <"">
##$SUBNAM3= <"">
##$SUBNAM4= <"">
##$SUBNAM5= <"">
##$SUBNAM6= <"">
##$SUBNAM7= <"">
##$SUBNAM8= <"">
##$SUBNAM9= <"">
##$SW= 18.0517328524113
##$SWIBOX= (0..15)
0 0 2 0 0 0 0 0 0 0 0 0 0 0 0 0 
##$SW_h= 3612.71676300578
##$TD= 16384
##$TD0= 1
##$TE= 0
##$TE2= 300
##$TE3= 300
##$TEG= 300
##$TL= (0..7)
0 120 120 120 120 120 120 120 
##$TP= (0..7)
150 150 150 150 150 150 150 150 
##$TP07= 0
##$TPNAME0= <>
##$TPNAME1= <>
##$TPNAME2= <>
##$TPNAME3= <>
##$TPNAME4= <>
##$TPNAME5= <>
##$TPNAME6= <>
##$TPNAME7= <>
##$TPOAL= (0..7)
0.5 0.5 0.5 0.5 0.5 0.5 0.5 0.5 
##$TPOFFS= (0..7)
0 0 0 0 0 0 0 0 
##$TUNHIN= 0
##$TUNHOUT= 0
##$TUNXOUT= 0
##$USERA1= <user>
##$USERA2= <user>
##$USERA3= <user>
##$USERA4= <user>
##$USERA5= <user>
##$V9= 5
##$VALIST= <valist>
##$VCLIST= <CCCCCCCCCCCCCCC>
##$VD= 0
##$VDLIST= <DDDDDDDDDDDDDDD>
##$VPLIST= <PPPPPPPPPPPPPPP>
##$VTLIST= <TTTTTTTTTTTTTTT>
##$WBST= 1024
##$WBSW= 4
##$XGAIN= (0..3)
0 0 0 0 
##$XL= 0
##$YL= 0
##$YMAX_a= 161845
##$YMIN_a= -165947
##$ZGOPTNS= <>
##$ZL1= 120
##$ZL2= 120
##$ZL3= 120
##$ZL4= 120
##$ABSF1= 10
##$ABSF2= 0
##$ABSG= 5
##$ABSL= 3
##$ALPHA= 0
##$AQORDER= 0
##$ASSFAC= 0
##$ASSFACI= 0
##$ASSFACX= 0
##$ASSWID= 0
##$AUNMP= <proc_1d>
##$AZFE= 0.1
##$AZFW= 0.1
##$BCFW= 1
##$BC_mod= 2
##$BYTORDP= 1
##$COROFFS= 0
##$CY= -3
##$DATMOD= 1
##$DC= 2
##$DFILT= <>
##$DTYPP= 0
##$F1P= 0
##$F2P= 0
##$FCOR= 0.5
##$FTSIZE= 0
##$FT_mod= 4
##$GAMMA= 1
##$GB= 0.15
##$INTBC= 1
##$INTSCL= 1
##$ISEN= 128
##$LB= 0.25
##$LEV0= 0
##$LPBIN= 0
##$MAXI= 10000
##$MC2= 0
##$MEAN= 0
##$ME_mod= 0
##$MI= 1.114404
##$NCOEF= 0
##$NC_proc= 0
##$NLEV= 6
##$NOISF1= 3.799351
##$NOISF2= 2.8
##$NSP= 1
##$NTH_PI= 0
##$NZP= 0
##$OFFSET= 14.38212
##$PC= 1
##$PHC0= -1264.719
##$PHC1= 9.992252
##$PH_mod= 1
##$PKNL= yes
##$PPARMOD= 0
##$PSCAL= 0
##$PSIGN= 0
##$REVERSE= no
##$SF= 200.129724274929
##$SI= 16384
##$SIGF1= 3
##$SIGF2= 2
##$SINO= 400
##$SIOLD= 16384
##$SREGLST= <1H.CDCl3>
##$SSB= 0
##$STSI= 0
##$STSR= 0
##$SW_p= 3205.1282051282
##$SYMM= 0
##$S_DEV= 0
##$TDeff= 0
##$TDoff= 0
##$TI= <>
##$TILT= no
##$TM1= 0
##$TM2= 0
##$TOPLEV= 0
##$USERP1= <user>
##$USERP2= <user>
##$USERP3= <user>
##$USERP4= <user>
##$USERP5= <user>
##$WDW= 1
##$XDIM= 8192
##$YMAX_p= 0
##$YMIN_p= 0
$$ End of Bruker specific parameters
$$ ---------------------------------
##NTUPLES= NMR FID
##VAR_NAME=  TIME,          FID/REAL,        FID/IMAG
##SYMBOL=    X,             R,               I
##VAR_TYPE=  INDEPENDENT,   DEPENDENT,       DEPENDENT
##VAR_FORM=  AFFN,          ASDF,            ASDF
##VAR_DIM=   8192,          8192,            8192
##UNITS=     SECONDS,       ARBITRARY UNITS, ARBITRARY UNITS
##FACTOR=    0.0002768,     1,               1
##FIRST=     0,             0,               0
##LAST=      2.2672688,     0,               0
##MIN=       0,             -165947,         0
##MAX=       2.2672688,     161845,          0
$$ Real data points
##PAGE= N=1
##DATA TABLE= (X++(R..R)), XYDATA
0@%%%%%%%%%%%%%qJ6j6J6j6K4l2L4m2N1n9P2q8J02j18J36j52J70j95K26k58K90
35A53l23L63m10M58n11N69o32P03p80Q62r52J053j162J282j411J551j711J887
53I89k080K296k540K818l136L500l929M443n066N843o844Q192j0113J3088j8361
68a0900L0505j09903m5042J45331p1038o0200O4787Q0734o6325j7134J07787N1425
80A00027j16500m8129J05433N6183r6601m0795P0508K145r7444R738J06829q992
92D2402j17953M843J15559J6219p3689K6427Q3401k9684p0220O5813R8727n4994
104A06851j05375L5441P8197m7195p4026L8693L1883q9098o0110Q2876N6491q9243
116c4615o6988P2373N5005n6459j7034Q1356J3457q9560o276J04781J7709j01002
$$ plain form
0 0 0 0 0 0 0 0 0 0 0 0 0 0 0 -8 8 -8 8 -8 16 -16 18 -24 27 -32 40 -48 54 -64 72 -80 90 -105 121 -137 153
35 153 -170 193 -217 241 -270 299 -333 370 -410 452 -500 553 -609 673 -738 813 -898 989
53 989 -1091 1205 -1335 1483 -1653 1847 -2082 2361 -2705 3138 -3706 4486 -5627 7461 -10900
68 -10900 19605 -90298 -135340 9991 -61047 -121247 -56460 24274 -42051 -59185 48602 100027
80 100027 -16473 -64602 40831 97014 413 -40382 30126 32271 -65173 -55435 51394 42402
92 42402 -75551 -70708 44851 61070 -12619 13808 97209 67525 -2695 63118 161845 106851
104 106851 1476 36917 115114 67919 -6107 32586 64469 -24629 -84739 -1863 54628 -34615
116 -34615 -101603 -29230 25775 -30684 -47718 33638 47095 -42465 -48741 56040 73749 -27253
128b7253l0030O8390k404p6518Q247O5349m0199r3297L0679R7345j6553p8508
140i4752K4534P2725j9487l8848O2873O2927n8356o0025O6719P3018m8563n9117
152a6352L9661L0526n8893k5531O8549J9003q6611l4735P8714L9443n8271j7812
164b2309O1293Q781n5347J8680Q2618q015q4227M90P3928m132o7382L053M1461
177D8892m0171o3277L6638O0780m6291p4605L0067O1726k5042l8969M1565L3969
189B5282n1900k8925O9284M4454o1608m7009M7162L1833m6282j9587M5818j437
201G085o8400o382P1642J2613o5896j3472N6489R762l9321J8266N5002j9105n6081
214c7798K7370P0097j2028n8058J0443M2128k2537l6273L4019L3311n0894m9187
$$ plain form
128 -27253 -57283 11107 8703 -67815 -59568 5781 -34418 -127715 -97036 309 -16244 -94752
140 -94752 -70218 2507 -16980 -55828 7045 69972 11616 -48409 18310 91328 42765 -16352
152 -16352 23309 53835 -5058 -30589 37960 56963 -29648 -64383 14331 53774 -4497 -22309
164 -22309 38984 47765 -7582 11098 93716 85701 1474 1964 75892 71760 4378 7431 48892
177 48892 8721 -54556 -17918 42862 -3429 -78034 -47967 13759 -11283 -50252 -8687 25282
189 25282 -26618 -55543 13741 58195 -3413 -50422 -3260 28573 -17709 -37296 8522 7085
201 7085 -61315 -67697 3945 16558 -49338 -62810 -6321 3441 -35880 -17614 37388 18283 -37798
214 -37798 -10428 59669 47641 -10417 26 42154 19617 -16656 17363 50674 -220 -49407
226d9407M3374N0020l4619m0772L1376K6984l5202j1188N4884J7402n9921k3575
238c0644N6520K6157m6632j9903L5345k074m6912O689N2561j1231o3966r97N4815
251I728K278m2124P019L5200j9944l5243L3538M8374k8521n0104K2031M4453j7021
264I664l0037K3650J9356l8844k2603M6133K9637m4170l3625L4379K6245k7838
276h053j0033L5315K065m5024q08N4309J0272m8647j2359L8243M949l1305Q656
289b420L3777j9829m4771J7802M8846j1636m4653O999L1638j4318k3800K6657
301D292K5017l5835l3201L3872L7014k5315l0125K1101J7863k5382p596L7929
313A9634R758m4051j5876M1854J9931l1829j3208K5472L1k9439Q447L8008q872
$$ plain form
226 -49407 -6033 43987 9368 -31404 -28 26956 -8246 -19434 35450 52852 -7069 -30644
238 -30644 25876 52033 5401 -14502 20843 18769 -28143 -21454 31107 19876 -44090 -45087 9728
251 9728 12006 -30118 -23099 12101 -7843 -43086 -9548 38826 10305 -39799 -17768 26685 9664
264 9664 -20373 3277 22633 -16211 -38814 7319 36956 -7214 -40839 -6460 19785 -8053
276 -8053 -18086 17229 19294 -25730 -26538 27771 38043 -10604 -22963 15280 20229 -11076 -2420
289 -2420 31357 11528 -33243 -15441 33405 21769 -22884 -15885 15753 1435 -22365 4292
301 4292 29309 -6526 -39727 -5855 31159 5844 -24281 -3180 14683 -10699 -18295 19634
313 19634 29392 -14659 -30535 11319 31250 -579 -13787 11685 11716 -17723 -9276 28732 19860
326A9860m4489J741M0366J726k9773M889K3936j4919k3954K5166L3311k2879l6396
339b1415J6689L1341j3931k2230J6429J1359l0367j5822L3990J8798l5261k4532
351c4952K5890J8120k1071o336K5632l03l2365K496M0489N452l5841p201K7895
364G905K184k2283P143K2246j7221l1836J4476L3960j0221l1075O751K2654r016
377d333j2578K2509J8020k4347j8804K8198K6582j8216j9621J5435J0079j9923
389C001n123K5088J721l4684j0947K8942J0596k4017p217J8899j546j9582J0818
402d051K9255p720l0853M785K9249j440k1720M087J3266j6464j8772J7790J9008
415A6420k2289k7182J2507J9857j1751j2938J4853P974j9957n073K9040J4291
$$ plain form
326 19860 -24629 -22888 17478 19204 -10569 -5680 18256 3337 -20617 4549 37860 14981 -21415
339 -21415 -4726 26615 12684 -9546 6883 18242 -12125 -27947 6043 24841 -10420 -34952
351 -34952 -9062 9058 -12013 -18349 7283 6980 -25385 -22889 17600 23052 -12789 -19990 7905
364 7905 10089 -12194 -5051 17195 -26 -31862 -17386 16574 6353 -24722 -17971 4683 -4333
377 -4333 -16911 5598 23618 -729 -19533 8665 35247 17031 -2590 12845 22924 3001
389 3001 -2122 22966 24687 -9997 -20944 7998 18594 -5423 -12640 6259 4713 -14869 -4051
402 -4051 25204 17484 -13369 -8584 20665 19225 -2495 1592 14858 -1606 -20378 -2588 16420
415 16420 -5869 -33051 -20544 -687 -12438 -25376 -10523 -2549 -22506 -27579 1461 15752
427A5752k2626j2134K0643J1315j4412k040J6560n270k5154K020K5966o44k6341
440a6365l914J8624L86j2191J0309J7474j1189j7312J6474K6250o662j8933P235
453A0186J3876r712r326J4920P028k3641j5975J7633J3572j6970j3867J0691M378
466B793j4275R35K1409J405k2898k857K3706P633j5830k947J1870n208j5536P214
480b586J6515j1544k4941J997J7414l825j4433M673R123j0540p918J8388J6545
493H868j2452j3677J3197J5564o256n953J0737K209j6768m027J8519N309j9931
506d661j0059J2807N351j0392J125J3165l635j5144O875K2321J030j6210P78J4167
520A7518j078q838P603R152j3764j6057R469J4275j0184j6528L251O742q772m868
$$ plain form
427 15752 -6874 -19008 1635 12950 -1462 -3502 13058 7788 -17366 -15346 10620 9976 -16365
440 -16365 -20279 -1655 -1269 -13460 -3151 14323 3134 -14178 2296 28546 21884 2951 10186
453 10186 24062 14350 5024 19944 26972 3331 -12644 4989 18561 1591 -12276 -1585 2793
466 2793 -11482 -10547 10862 12267 -10631 -13488 10218 17851 2021 -926 10944 5736 -9800 -2586
480 -2586 13929 2385 -22556 -20559 -3145 -6970 -21403 -16730 -7607 -18147 -26065 -7677 8868
493 8868 -3584 -17261 -4064 11500 5244 -709 10028 12237 -4531 -8558 9961 15270 -4661
506 -4661 -14720 -1913 3438 -6954 -5829 7336 3701 -11443 -4568 17753 18783 2573 3351 17518
520 17518 16440 7602 15205 24357 10593 -5464 4005 18280 8096 -8432 -5181 1561 -7211 -12079
534a2079J2886N143j5867p265J7019J1830j0064o773R138K269j0459J258J3533
547A0569l232j9603l756J4251J848j3043k165P810m452r027R389J4944o104j3951
561a6522O581J6090m98p460N896O389r219o155J2887Q935j3537j2578P930Q284
575G023p579m794Q301P07j2487k48J6862N340j3074m151J1959M397p125K200R361
590A6692n630j3759L675J3707l647j5467j684P639l536p323N986O545r927r593
604a6322J0315J2857n487r139N350O380n707k279J0111K460j3755o536J1283O259
618E790r856o098N983K28q262K632J2038j597j3066P16J3957L146p785J350P555
633F731l579o756P766J0368p374j2530L835R721l650p256M001L230q747m268J1270
$$ plain form
534 -12079 807 5950 -9917 -17182 -163 11667 1603 -5170 3968 6237 -4222 -2964 10569
547 10569 7337 -12266 -16022 -1771 77 -12966 -15131 -7321 -11773 -20800 -11411 3533 -2571 -16522
561 -16522 -9941 6149 5651 -1809 4087 10476 1257 -4898 7989 16924 3387 -9191 -1261 7023
575 7023 -556 -5350 2951 3658 -8829 -9077 7785 13125 51 -4100 7859 12256 5131 7331 16692
590 16692 11062 -2697 978 14685 11038 -4429 -6113 1526 -2010 -9333 -3347 3198 -6729 -16322
604 -16322 -6007 6850 1363 -7776 -2426 3954 -1753 -4032 6079 8539 -5216 -11752 -469 5790
618 5790 -4066 -10164 -4181 -3953 -12215 -9583 2455 858 -12208 -11492 2465 5611 -2174 -824 6731
633 6731 3152 -3604 4162 14530 7156 -5374 -1539 8182 4532 -2724 1277 4507 -4240 -8508 2762
648B762P269r742p647Q034P172m696j790P176m00j0308j69J1865J604j2151m569
663e590P085Q95o693J453O310n127r800M604J1617j832r609J308P169k033l887
678d130O387N031q540p331P980Q479n965p547L632L157n728j149Q509J259j0656
693f612l235J0398N252o610k496N882J0n910L277R252k589j0782K92R249M71o790
709i41M55M059m398n159O290P293o014q737L845P686k096m184L626K111o381k274
725d819Q540M318q177n869N436M143m267j428M820j241p712Q15R290J100q415
740c466k123O009Q97m044K353M916m284o892M184Q456k175p383R93M728k133k783
756b747M751K950o731m853O388O042m394n028K953K289l812k93O092L78p798k162
$$ plain form
648 2762 10031 289 -7358 676 7848 3152 1362 8538 8138 -2170 -2339 9526 11130 -1021 -5590
663 -5590 1495 2390 -4303 -2850 3460 -1667 -11467 -6863 4754 2922 -6687 -5379 1790 -243 -4130
678 -4130 2257 7288 -1252 -8583 -603 7876 1911 -5636 -2004 1153 -4575 -5724 2785 4044 -6612
693 -6612 -9847 551 5803 -807 -3303 2579 2589 -3321 -44 9208 6619 -4163 -3871 5378 5849 -941
709 -941 -486 3573 -825 -5984 306 7599 1585 -7152 -3307 4379 2283 -1901 1725 3836 -2545 -4819
725 -4819 3721 8039 -138 -6007 -571 3572 -695 -2123 2697 1456 -6256 -5441 3849 4949 -3466
740 -3466 -5589 420 1317 -2727 -374 4542 258 -6634 -2450 6006 3831 -3552 -2559 2169 36 -2747
756 -2747 2004 4954 -1777 -6630 -242 5800 1406 -3622 -669 1620 -2192 -2485 3607 3985 -3813 -5975
772e975P236L339m976k179L484m02l976K480O070k292p554M99O731N09m662K98
788a370K750k889l202M651M906m456o023K953N495j454k848K643J468m392j213
803b981O344K975n941m076M022L026l010j075L152j084n337Q00O561O37n993j437
819c417M365R36k637J520L253k867m706K821N730j525n370J40K987j412k069K755
835E04J705m745l445M265M457k790l601J944K110j935qM215M62n169j511N126
851A584K482l707k101K160j81k935J275M082j521n363K93N146R66l040L13K440
867A893j330j936L428L734k938m620J674L958j084k738R12P23l180j322L955K142
883C271m136l168K791K834j505q66K231j14l262M55M630P81m382j861K718Q21
$$ plain form
772 -5975 1261 4600 -376 -2555 929 527 -3449 -969 5101 2809 -4745 -4246 2485 2994 -1668 -1370
788 -1370 1380 -1509 -4711 -60 4846 390 -5633 -2680 2815 1361 -1487 1156 2624 -1768 -2981
803 -2981 3363 6338 397 -3679 343 3369 359 -716 2436 1352 -3985 -3185 3376 4013 -1980 -3417
819 -3417 948 1884 -753 767 4020 1153 -3553 -732 4998 3473 -1897 -1757 1230 -182 -2251 504
835 504 2209 -2536 -5981 -1716 2741 -49 -3650 -1706 404 -1531 -1539 2676 3138 -2031 -3542 1584
851 1584 4066 359 -1742 418 237 -2698 -1423 2659 1138 -4225 -3932 1214 2180 -860 -547 1893
867 1893 563 -1373 2055 5789 2851 -1769 -95 3863 2779 41 953 1676 -1504 -2826 1129 3271
883 3271 -865 -4033 -1242 1592 87 -779 1452 1338 -1924 -1469 3161 3942 -440 -2301 417 1238
899A238k205Q0J691k141l549J573M249o86l912P7K884R6j080K135J843k717k354
916b778L186L557j979l255Q44J533j565p09K412K09l902j391L768K370k366j642
932a708J854Q40j366J079L054o94l742o6L685P63k739q76J157j053j820J602K256
949B226k203l562R56L194r7j847O40J080j447n59L015J859k806k591J827K174
965A859j228j445Q19l48k451j7L076N36l249j258K467J423j073K51J660p29k000
982a707J431L281l36l033l52J950Kj237P06P92k135j912J991K575j267k438N78
999a111J730k88k44J640M55k275q53K632J718j896j846P67N32j166mJ430p55k773
1017b307k48K609Q45j862o92J188P7o96J281J768j234k354P45K411j04j777j63
$$ plain form
899 1238 -967 -887 804 -1337 -4886 -3313 936 250 -3662 -3585 -701 -605 -1685 450 2293 -424 -2778
916 -2778 408 3965 1986 -1269 -425 1108 -457 -1166 1246 1455 -2447 -3838 -70 2300 -66 -1708
932 -1708 146 986 -380 699 3753 3059 -683 -749 2936 3699 960 84 1241 188 -1632 -30 2226
949 2226 23 -3539 -2583 611 514 -1333 -693 387 -1060 -1619 1396 3255 449 -2142 -315 1859
965 1859 631 -814 5 -343 -2794 -2811 265 801 -2448 -3706 -1239 184 -889 -638 1022 293 -1707
982 -1707 -276 3005 2669 -364 -716 1234 1236 -1 705 1497 -638 -2550 -559 2016 749 -1689 -1111
999 -1111 619 331 87 1727 2182 -93 -946 1686 3404 1508 -338 429 961 -205 -209 1221 466 -2307
1017 -2307 -2555 54 899 -963 -1655 -467 -390 -1086 195 1963 729 -1625 -880 1531 1427 -350 -513
1034e13N62r90o66J600J047j998j826J394J965m92r40P06L85j039K39K191N90
1051B215k098j121J601J126r12n70N55n69j424N55J911k58k175m33J596O00o80
1068h1K91P09q75j017J306J795p75j926Q9J136j98o14N36Q2j567p72J606J266
1086I91j224j382O11R11l10O5J023j77j532p1J863P21j398q59O69K35n84L77Q89
1105H18p48j608L13J738K42j210k67O59j23k87R93Q59j072j349P73J507j93j055
1123a0j5K78o18j23J127L80j462r73J074J114m94o10L68J0p05L28J372Mj542n03
1143a000J164O02o25j95L54n03p72P13J294m58j487m4J094K19m71K34K70q09n32
1162i52J106J075p76j235K91Q67j18k64M72j1j037k64J288P32j025r03M81N27
$$ plain form
1034 -513 49 -941 -1607 -7 1040 -958 -2784 -1390 575 83 -857 -151 234 -805 -566 1625 2215
1051 2215 117 -1004 597 1723 811 241 796 227 -1197 -642 1269 1011 -1164 -1597 -1 599 -81
1068 -81 210 919 44 -973 333 2128 1353 -573 -484 652 454 -160 376 458 -1109 -1881 -275 991
1086 991 -233 -1615 -1004 -93 -403 -338 685 508 -1024 -1095 768 1489 91 -768 -99 136 -448 -71 818
1105 818 70 -1538 -1225 513 755 -455 -722 -63 -186 -473 520 1379 307 -1042 -269 1238 1045 -10
1123 -10 -25 253 -365 -488 639 1019 -443 -1416 -342 772 278 -332 36 46 -659 -331 1041 1045 -497 -1000
1143 -1000 164 766 141 -54 300 -203 -975 -262 1032 574 -913 -957 137 356 -115 119 389 -420 -952
1162 -952 154 1229 453 -782 -491 376 258 -6 466 455 -582 -846 442 1174 149 -754 -273 254
1180B54l04O6O08l78j160J30J387L29j076n11N66J31l10M70O09p37j101N26J303
1199H02q1r92j23M10k65j86P81L73j079q45Q61J087l75p15K00K18l81J63R82P1
1219I06j220m74J042O79n96m38K62j56n63L70R65l11j263j23J050L43n11qL15
1238B69m28m31Q19R04o38j158J87Q50n3m49J64rp65k30J027N85r35q03N27O61
1258I4j85n1M83j78q04J84J191K52j005m73N41J95l38J79L77o21q74M39J090o7
1278D29q83q3N52J2q4N90L56p69o21P50Q79m00p84O0K08l66m8O05n1j022l86Q81
1300a75O09m90l72L11O9k92L88P86k51j009l8Q86K28n84j99J54l68l80N38N82
1320C93o02r00K63Q02N5l03K16J82l98k8Q90M82p27o58M01N25k37k65J53k21o55
$$ plain form
1180 254 -50 16 624 246 -914 -784 603 932 -144 -655 -89 42 -268 202 811 74 -1027 -501 802
1199 802 721 -271 -394 16 -249 -435 346 719 -360 -1205 -344 743 368 -347 -147 71 -310 -147 835 906
1219 906 -314 -788 254 933 337 -101 161 5 -558 -188 777 466 -797 -920 130 473 -38 -46 269
1238 269 -159 -590 229 1133 495 -663 -476 374 321 -128 36 27 -738 -968 59 644 -291 -1094 -567 94
1258 94 -91 -142 341 163 -641 -457 734 986 -19 -492 49 244 -94 85 462 -159 -1033 -594 496 429
1278 429 -454 -537 15 27 -57 533 889 120 -501 249 1128 728 -56 4 212 -154 -202 403 352 -670 -1056 -175
1300 -175 434 -56 -428 -117 -48 -340 48 834 583 -426 -464 422 650 66 -133 21 -347 -727 -189 393
1320 393 -209 -1109 -846 -44 11 -292 -76 106 -292 -320 570 1052 325 -333 68 593 356 91 244 23 -632
1341f32Q4Q67J46q37l59N70L91j55J33L67l10n32M23Q50j01p97j73L63n2k78K10
1362A78J08o90n48N41O91l06o23J29L57o9Q3N52N0p07k04P61M81n05m74J42J1
1383d2k98J24M11k88q11pP51K68l98r0L10l1j05N28N44l82o82J87O57Om34p5%
1406A43l81j46N24K91o48n69L73N72p4j56J94Jl44J62P47J49o78l86M07K59k53
1427A87j08R1l77n05K36O38j02o88j15M58J68p4K45J97l65k93N33O03k43o10p
1448a31K69j07j02K15o0o16k58N95M45l52l97J90K49l7K02M13j21n89K0O76K61
1469G65m70k96J29n3j99K35K98m13o14J25O10O1l47j2J59j24oN10L17m85m88L11
1491A3M94j21l23Kj04l48K6N35M4o42l31M34L82j34p7J65j02k68K96N92m7o10
$$ plain form
1341 -632 -548 319 465 -372 -731 -161 230 75 208 575 265 -267 156 1006 905 108 -65 298 246 -32 178
1362 178 286 -404 -952 -411 280 -26 -649 -520 -163 -232 -149 403 453 -254 -458 303 784 279 -195 -53 -42
1383 -42 -340 -216 195 -93 -904 -911 -160 108 -290 -380 -70 -101 -206 322 866 484 -198 -11 646 652 218 143 143
1406 143 -238 -384 140 431 -217 -786 -413 159 85 -71 123 124 -220 -58 689 838 160 -226 181 440 187
1427 187 79 170 -207 -712 -476 162 60 -628 -743 -285 -117 -191 54 251 -114 -407 126 729 486 -124 -131
1448 -131 138 31 -71 144 84 -532 -790 -195 250 -102 -499 -309 -60 -97 105 518 397 -192 -172 504 765
1469 765 295 -1 128 75 -124 111 409 -4 -618 -493 117 178 -169 -181 -22 -146 -152 358 675 190 -298 13
1491 13 507 386 63 65 -39 -387 -361 174 218 -424 -755 -321 61 -73 -150 15 -87 -355 -59 533 486 -124
1513a24j40M16J45k00K1P0l84l21L93M93k33n55L0L70L1k1K50K7m21j33N63L88
1535F65l79m23J30J74j30M1K32j93n64j8N91J79m14k38J93O3p1K50L00l02m90
1556d04K04N60L7m06q6R5j07p1L49J65m61m13K96M51q2k52L7M2j97R9M64Q2n26
1579a24k49L78L06j52j47P8j34k41K05M54j00n54j00L91J51j57J2O6k48k01L71
1600EM09k43m50L7L15J2o1J41j4l70j07M53K89l31l54J14J75m0M1J98j56m19L9
1623c17M95J44l50k24J57P9l9J76J85k59l74J85M62K9l51q5Q2n6m5K72R6l86l11
1646d35K50L73n6k11J2J8j03R9L78L2m33j91L10K63j33j43Oj28j72J65L08j20
1668H9m38q0L23J55p4nM9j51q5L22L10j70l70J3K53N3p1L2p7k89p5L24K08k78
$$ plain form
1513 -124 -264 152 297 97 118 188 -196 -517 -124 369 136 -419 -389 -19 12 -9 241 268 -153 -286 277 665
1535 665 286 -137 -7 167 37 78 310 117 -447 -465 126 305 -109 -347 -154 -91 -162 88 388 86 -404
1556 -404 -200 360 397 -9 -95 0 -107 -178 171 336 -125 -538 -242 209 127 -125 -88 -46 -243 -144 320 402 -124
1579 -124 -373 5 311 159 12 90 -44 -285 -80 374 274 -280 -380 11 162 5 17 83 -165 -366 5
1600 5 414 171 -279 -242 73 85 24 165 151 -219 -326 127 416 85 -269 -155 20 -20 21 219 63 -356 -317
1623 -317 178 322 -28 -252 -95 -16 -55 121 306 47 -327 -142 320 349 -2 -87 -5 -61 -106 166 262 -124 -435
1646 -435 -185 188 132 -79 -67 -49 -152 -53 325 357 -76 -267 43 306 173 30 36 -92 -264 -99 209 89
1668 89 -349 -429 -106 49 -25 -30 19 -132 -217 105 415 245 -125 -112 141 194 123 155 78 -211 -286 38 246 -32
1692c2l01P7K13L7N4J21o8k42P8M17J37k85k06N8O6l9N1M4k58l25R6L60K5k76
1716a98j16J12N9P9K10R5k56j80K29L31n0k31p7j3q1M1J74m2l65j98K20K64n4
1739d7j17Nnj2K01K97l6k95o6K70J95r0j49o3j37j00J59J49k02l47j7K70J11m3
1763f9K1J3q2L8L12K13j69k64M1J72No3k6j48k49nK53P7k60k35R4J70O2P5P9r2
1789c7j33J55L40O8k53j42O8N4k5K9m6k53k38J27K63l5k27o4J12P6J13K00O0j86
1813B6q3K38K62n6j96o4l1p1M5J01j27l07j29K14J79p1q8J7J3K8K09K17q5k47
1837fJ6K29J04j07r8p4j47m1J34P4k20k74K6J97P3j7J5Qp9J05K91J44j74j71Q4
1862I2J40j6l3m0j79k06N3K09Qk37j47J01J38P0Q4N5j22p5J93K73j0k07q4N4K8
$$ plain form
1692 -32 -333 -256 -43 -6 48 169 101 -141 -63 354 491 206 0 58 124 85 136 180 -78 -403 -307 53 78 -198
1716 -198 -314 -202 -143 -64 146 241 -15 -195 34 365 315 84 7 -6 -87 -46 128 86 -279 -477 -257 7 -47
1739 -47 -164 -159 -164 -176 25 322 286 -9 -75 195 390 300 151 88 -49 -149 10 159 -43 -390 -407 -137 -26 -69
1763 -69 -48 -35 -117 -79 233 446 277 13 54 226 231 168 142 -6 -255 -260 -7 70 -190 -425 -331 -161 -99 -24 55 -37
1789 -37 -170 -15 325 393 140 -2 66 120 95 124 78 -175 -413 -286 -23 -58 -285 -349 -237 -161 -48 152 212 26
1813 26 -57 181 443 387 191 127 96 25 70 171 44 -263 -392 -178 1 -70 -158 -141 -128 -100 109 326 241 -6
1837 -6 10 239 343 236 138 64 -83 -124 10 84 -136 -410 -384 -187 -114 -131 -116 -108 -187 -82 209 353 179 8 92
1862 92 232 216 183 143 -36 -242 -189 20 28 -209 -356 -255 -117 -47 37 92 -30 -105 88 361 351 144 60 114 142
1887A42j3L8o6k54j45J44J73p6j73j8N1M6J25J63pj93j0K38J78q0j32n9m2k8O7
1912F9O7j63k68l9K01Q9p1o2ojP9K08J38j24j76O5J92M9p3p5r7j12K6J53J9k15
1938a27j83P8J53N2mjo8m3J34K33M7j63j20R1R4K9k0o8j69j22J12J58n6j97j08
1963b68Q9R9P0N9k0j33k6J94J79m4j62n7L1M6L7L9j03k10m2J50J26q3j36k3K4
1988a64Q1J31R9r9j63M2K03J22q3j20o0rM9J02K6j88j56K4J72N5p4p8l6j5R0J68
2014A19M2j51j21P0J55N3n1o8j05m5P8J54nk01j25O8J39M8j0o8r2j1J33J54j2
2039A48j74p5P8J15M3j3q7j24j7J23J20m0j73o3O1Q4P1kq0j40PJ57J26o4j47m3
2065a09N6P9P8J3r3j40J3J62R9q6j21m4K7N6J04Nj22j44M8J70O8p9j01l9K0Q7
$$ plain form
1887 142 129 167 101 -153 -298 -154 19 -57 -230 -248 -197 -151 -26 137 130 -63 -73 165 343 263 131 72 30 2 69
1912 69 136 -27 -295 -334 -133 -44 -115 -177 -183 -184 -105 103 241 117 -59 6 198 247 174 99 2 -110 -84 69 88 -127
1938 -127 -310 -232 -79 -27 -31 -32 -100 -143 -9 224 271 108 -12 79 173 202 182 114 -55 -177 -65 93 37 -160 -268
1963 -268 -179 -80 -10 49 29 -104 -130 64 243 199 37 -20 11 57 94 133 30 -180 -222 -72 54 -29 -165 -188 -164
1988 -164 -83 48 147 48 -115 -73 130 252 169 49 -11 -20 29 131 157 -31 -187 -163 9 64 -10 -88 -124 -139 -49 119
2014 119 161 10 -111 -41 114 167 116 48 -57 -102 -24 130 125 -76 -201 -133 6 54 44 -24 -116 -127 6 160 148
2039 148 -26 -101 -23 92 135 122 35 -89 -106 17 137 97 -76 -139 -78 6 77 75 -5 -145 -138 19 145 81 -66 -109
2065 -109 -53 26 104 117 24 -116 -103 59 158 72 -49 -93 -66 -10 94 99 -23 -167 -119 51 119 40 -61 -100 -80 7
2091GJ22Rj45j13O0J59M3n8j05o6j0Q3J01%j67j14P0J31M2j4o9q4J5J23J45j7
2117A48j57q5R7J11L2l3r4j21j9J05J14o8j69o3P7J03N0K5n9r6J9J63J32o5j32
2142A5o2M5O1N7j2j22j52rJ62P6p9j33k8N0Q3J20L1j01j16Q7J83Q2q2j02m5lM8
2169E4Q7k8j75j29K6J35N2o7q2m3K5J29J52J6j37q6R6J56K9n7j00r7l4Q5R1p1
2195B7j76r0O7J05N4oo0o8L2J69J36k4j26m7O9J01N1k9j33j23j8J11O8j06j55
2220a71o8O4Q9Q3K5q1q3Q4J81J04m8j02m8J5Q3O0m8j60j37J9J12M4q6j08m8N0
2246a75J31J10qj02m6J15J65N6m8j07p1J0P8M9q3j66r4K3J07L7n4q7n3L9J49J28
2272A03k0r7m2R5J28N8l0j29q8lR6M9j10j54q4N2Q8M7j5p7l9O7J59J12l8p9l1
$$ plain form
2091 7 129 138 -7 -120 -60 99 142 84 -21 -87 -97 -14 87 87 -80 -194 -124 7 49 35 -34 -118 -103 20 165 148
2117 148 -9 -94 3 114 146 113 19 -102 -121 -16 98 30 -139 -202 -125 -22 28 53 -6 -102 -83 80 212 147 15
2142 15 -47 -2 59 116 104 -18 -170 -179 -17 59 -20 -153 -181 -131 -48 72 103 2 -114 -27 156 238 156 54 9 6 54
2169 54 141 113 -62 -191 -165 -30 22 -45 -127 -170 -145 -16 136 152 15 -71 25 181 210 153 53 -44 -78 7 98 27
2195 27 -149 -239 -172 -67 -13 -19 -79 -147 -115 54 190 166 40 -7 62 163 214 185 52 -71 -89 22 90 -16 -171
2220 -171 -239 -175 -86 -3 22 -59 -142 -58 123 227 179 77 29 44 127 187 139 -21 -158 -139 -27 17 -69 -177 -225 -175
2246 -175 -44 66 58 -44 -90 25 190 246 198 91 20 30 108 157 74 -92 -186 -163 -56 -19 -73 -160 -213 -174 -25 103
2272 103 83 -14 -56 39 167 225 195 66 -22 -25 71 120 10 -144 -228 -176 -88 -41 -56 -133 -172 -105 54 166 128 49 18
2299A8M5R7N2l6j42j08J3Q3M1r6j28o3M2R7O8j8p4l1P0J50R0m5p7l9M9Q2M5o2
2327A23j41r4J7R1J5o9j07m8O0J07Q2qq3k6Q0J43O3m9r5m1K4O6L5p1j33r9L7P6
2355d5M1o3p3l4L8J17J07k8q1m1O6J18N8m4r6o2J3Q0M8o6j27q2L3R1K8l5o1m1
2383a41M7J14R1rq2l4O2Q2L1k7j02r7J8P7O3q0j22m7J8J01M9j7q6m1N9J34O8n1
2411G8q4qL4P9M1l2j12p6J4R2M3o1r6m1K2Q9P3%j08n9O8J14O1m5p2n3J3R1P2n3
2441H4j20q2M6Q1K2m7p5n7L3J02Q3k9r3l8O5R5L8l1p0o8K4R2N6m7j23l9M3P5L3
2470E3k4p9p1L8J10N4m2q4l4M8P8M1j0r3p7M3R6M5p2r3l0K3Q1O0k2j02n3N2J02
2499C8L7l8p4l2L6P3N8k8r0m3L7P5L9m2p1n9K4Q4N8l3r0m5K9R2L7l9p3n5M1Q5
$$ plain form
2299 18 63 160 212 176 34 -74 -61 22 63 -33 -161 -224 -182 -85 -17 -35 -109 -140 -70 80 170 125 48 9 58 140 185 123
2327 123 -18 -112 -95 -4 11 -58 -165 -213 -153 -46 36 28 -55 -81 -1 142 205 156 61 20 44 110 145 74 -59 -158 -121 -45
2355 -45 -4 -67 -140 -174 -136 -19 88 60 -21 -62 4 122 180 136 40 -22 -9 71 119 53 -74 -156 -123 -32 -4 -39 -100 -141
2383 -141 -94 20 111 102 20 -14 48 130 161 134 32 -65 -47 30 93 13 -109 -156 -138 -37 12 -5 -91 -132 -73 61 129 78
2411 78 -6 -14 20 99 140 108 -4 -80 -66 26 69 8 -88 -129 -107 -18 55 55 -53 -112 -44 70 131 86 14 -39 -26 65 137 84
2441 84 -36 -118 -72 9 31 -16 -91 -148 -115 -13 70 41 -52 -90 -25 70 108 77 7 -61 -37 55 111 64 -59 -98 -55 20 53
2470 53 29 -50 -121 -83 27 81 39 -45 -79 -31 47 88 78 -15 -92 -49 47 92 20 -73 -103 -80 1 61 39 -63 -116 -64 38
2499 38 75 37 -37 -69 -33 40 98 70 -20 -63 -26 49 88 46 -25 -84 -60 24 82 49 -41 -86 -57 35 72 33 -40 -95 -54 31
2529C1L9k9p9m3M4O9M6l4p3m3J2R3M0m1p2l7L5O5M3k1p0n6K4Q8N6m1o9l4L5P9
2559E7L7l4o0o8L4O2M8m3p4m6K9O2M7k7o5l3J3P8M7k0p2l6L7O9N2k8o8m9J0P5
2589C4M0l8q4m6L3N5N4j9o8l1L6P5L5j8n7l3OO7M1k6q1n2L7N6K7l6n8l9QN7O0
2620C5j5o4k6L3P3L7j2n4m4RP3M3j5j06k5jP8J7k3n8m9K1P7O2l6p5j7L6P2M1j8
2651F9n4o6J4O9M3n5p2m2K2N1L6k3n3m6J9R6M8k5n2k7K8O1M0j1o9o8L5P8K1l2
2681C5p2m3K1M4M7lq1l2M4P5L1j8n6l2K1N9M6l4p5m1J9O4J2k2n6m3J2O4M9l9n2
2712e6k0M2O3L3kn1m2K4M6M2l2o6l5K5M5L0j3n2o6K4O6M3k7n2k1K4N5M0ko0n0
2743d5L5M9K7l3n9k9J1L2L5qo6m0L6O1M2j2m8k4J3N5M9j8o5m8K8O4J4l0m0l9J6
$$ plain form
2529 31 70 41 -38 -81 -37 32 78 44 -29 -72 -60 33 73 32 -40 -77 -42 23 66 45 -25 -81 -57 31 87 46 -23 -57 -22 57
2559 57 94 60 0 -68 -34 28 76 33 -41 -87 -58 4 51 24 -41 -74 -61 17 64 44 -28 -64 -27 42 94 66 -2 -51 -41 34
2589 34 74 36 -48 -94 -61 -6 48 29 -39 -70 -34 41 76 58 1 -32 -26 41 82 56 -25 -77 -40 16 43 7 -51 -90 -82 -25 35
2620 35 20 -44 -70 -37 36 73 61 7 -37 -28 45 88 73 -33 -58 -59 19 36 13 -45 -94 -73 4 66 30 -45 -62 -26 46 87 69
2651 69 15 -51 -37 32 75 20 -52 -94 -72 -21 15 -8 -61 -107 -88 8 56 31 -21 -48 -20 41 81 70 1 -67 -32 46 67 35
2681 35 -37 -80 -59 -15 32 29 -52 -84 -40 35 66 48 -8 -40 -19 40 86 52 -23 -64 -45 19 31 9 -47 -90 -78 -14 35 -4 -56
2712 -56 -76 -34 29 62 60 9 -33 -9 37 79 47 -19 -54 -29 16 46 33 -19 -85 -61 5 48 21 -31 -52 -28 27 67 65 5 -45
2743 -45 -10 39 66 33 -26 -55 -44 -12 23 15 -51 -91 -55 6 48 36 -12 -36 -23 32 81 63 -2 -50 -22 42 56 26 -14 -53 -37
2774c7M3L7k7n9j5J8M6K5om5k9J7N1L3on4k4jM8K2j2m5m4J5N4K4nm8k6J0N4M5
2806E9k9k9m1K4M2K9j4n2k3KM2L6k3l6m6RM6L4j0n2k5J0N2L3j2n2l2J5M6L8j2
2837B9m4l4OL3M2rn0j6pN2L0km2l0KN4L3qm4m0J0M3L4km7l6J0L2K8qm0l8J1L5
2871a3M1j0m4l0J4L5M3j4m3j7JM8J9lm6k2J5L5M4j2m9m3L1M1K1k2l4l5J6M4K5
2902C6pm0l5J9M1K2j4l0m2J4L8M1j4n3l3K4L3L3pm7k9J4M1L1j5m0j0J3L5K0nl5
2934aj9jL7L9l4l2j7J0J0M4kl9l1JM3K0j4l0j5OL1K1%l7k8K4K4J7j4l9j6QK9K3
2968A8kl0k7J5L7K2ol0j5J3K0L0j3l5k0J2J7J9kl1k4jL0L1j4k4k9J3K9K0rj4k2
3001b2rL6K2Lm1k1jM4Noj8k6OK8M0k0l2lMK3K1Rk1k1j7L4RPk5l1NJ2L5lk5k6k
$$ plain form
2774 -37 6 43 16 -43 -58 -40 6 31 25 -20 -49 -32 19 52 46 -8 -32 -33 15 37 25 -20 -64 -49 5 29 24 -24 -50 -40 14 59
2806 59 30 1 -40 -16 26 55 41 -11 -34 -32 10 46 23 -13 -59 -50 -4 30 20 -32 -57 -47 5 38 26 -26 -58 -43 3 41 29
2837 29 -15 -49 -43 -10 32 23 -27 -43 -50 2 32 30 -12 -42 -40 14 47 39 -5 -45 -35 8 42 40 -7 -43 -33 -1 27 19 -21 -59 -48 -13
2871 -13 28 18 -26 -56 -42 -7 36 22 -21 -38 -37 11 30 27 -19 -41 -26 9 53 41 -8 -51 -20 21 42 20 -14 -49 -33 11 36
2902 36 29 -11 -46 -27 14 36 22 -8 -50 -36 2 43 29 -24 -57 -33 0 33 26 -21 -50 -36 5 36 21 -19 -29 -16 19 39 34 -1
2934 -1 -20 -21 16 55 21 -11 -28 -18 -8 36 34 -5 -36 -35 8 28 14 -16 -31 -25 6 27 27 -10 -38 -14 10 27 13 -26 -42 -34 -5 18
2968 18 16 -14 -41 -26 11 33 27 -3 -18 -5 15 45 32 -3 -23 -11 6 25 23 -8 -32 -33 -3 28 14 -10 -39 -26 3 23 14 0 -22
3001 -22 -31 5 27 30 -11 -32 -33 11 16 10 -8 -34 -28 0 40 20 -12 -15 -11 12 33 42 21 0 -17 17 26 33 8 -23 -18 -6 29 26 1 -25 -27
3038b7K6J9lk2j0oL1J6Nl8k6K5L4Mj5k2j1j0K4K8%k3k1J7J9Rmpj5pK0K7Lk5l2
3073a7RK4J9j3j2k4mJ3L5ol7k0J0K4J2jpj9lK5K2ok4k0J6J6J2jk6j3LK5K2rk5
3108@j0RJ6KK5k4l1KL5J4k7pj2%J0QJ1k3k8RK1L1l0Jlj2RL3rrk7J4J9llpj5%J4
3147CK3oj7j1MJ3J6kk3lk2L0K1oj5k0%K5oJ0j2j8qJ8K2j2k2J%OJ5lLk3MK1O%j4
3186bKjnK2J2j1l0J3J2J5j5kj4MOJ3Kk6klJ3PLnj0j0lK3Rk8oQJ0%KPl3QJ2J6J
3227A4j9mOMLLjKnJ9POk8jJ3j3MQpk8NNK8j2k8L%J8j3OOk0oK3J1Kj8J1nj1K0J
3269Ilj8j3K4J2mJJj0jJ6O%j9MQpOJ0r%j1Rjj4j2QKOnjl%j2K9nmqJ5j0JLOnmJ
3315bRQj1j4KJ4LJ5rrj5K5Pmj5JrJ3kmJqkJ1%j5Joj1OPJ7pj9KK2qMQNrJOOj7j0
$$ plain form
3038 -27 -1 18 15 -7 -17 -23 8 24 29 -9 -35 -10 24 28 13 -9 -20 -30 -6 22 22 -1 -22 -5 14 23 19 12 -3 -10 10 37 40 15 -17
3073 -17 -8 16 35 22 10 -14 -18 -5 30 24 -13 -33 -23 1 13 12 5 -14 -17 8 30 24 0 -20 -4 12 24 23 -3 -16 -13 12 34 25 0
3108 0 -10 -1 15 17 42 18 -13 -11 24 38 11 4 -8 -8 2 10 21 -2 -30 -21 0 31 1 2 -1 -13 -4 29 20 11 -16 -2 17 14 11 4 -11 -11 3
3147 3 26 20 3 -8 -4 9 25 23 0 -3 -25 5 26 20 5 -15 -15 10 4 14 2 -16 -24 -6 16 4 -18 -17 -17 -11 4 1 4 -19 -15 6 12 12 -2
3186 -2 0 -1 -6 16 28 17 -13 0 12 27 12 10 -4 0 6 19 21 -5 -7 -10 3 10 13 8 -2 -12 -15 8 17 -11 -17 -9 1 1 3 10 -23 -15 -3 13 14
3227 14 -5 -9 -3 1 4 7 6 8 3 22 29 35 7 6 19 6 10 18 11 -17 -12 -7 21 9 -19 -16 -16 2 -11 -5 1 -19 -25 -2 9 11 -7 4 -1 -12 8 9
3269 9 6 -12 -25 -1 11 7 8 9 -1 -2 14 20 20 1 5 13 6 12 22 13 13 2 11 10 -4 -16 -8 -6 0 -5 -6 -9 -9 -21 8 3 -1 -9 6 -4 -3 0 6 1 -3 -2
3315 -2 7 15 4 -10 -8 6 9 24 15 6 -9 16 23 19 4 5 -4 9 7 3 4 -4 -6 5 5 -10 -9 -15 -26 -20 -13 4 -3 -22 -20 2 -6 -2 6 11 2 3 9 15 -2 -12
3361a2J8j1Lj0J8nkMQLj2LjQj4OMj3%%QrlJll%RlqqJ3PQJoJ6j0%J0%jj1%J1Jj1
3408DPMojLmJk3J1%mJ4oNrKJ4j2Kjlj0QqnNnjLKR%OrQOKj2jOPlmOpoPMjlLPnj
3462FpMnpJ1JmpK%kJMj5KK4j0mKmPJj3J8oPkpJ3mklRrOPLj1JpKKj1J4pj1J2Ln
3511apqJ6mNmjrJNJ1j7MoJ8j0jJ9j2jkJ0J1jj6LNJ1rMnpOLkj2J0nrnJ1n%rJ4q
3557iJ0pKLj4RnKQpkPRjOj2lJRoJ%KLLRj2JqJJ2nj1Kj0LjJ0J1%j6%jjjjllK3l
3607EjrkQjKNmKk%J0rjj1J1J4j4K%kjK0j3oojKmJ1qj2LJ3ljjj1KLjNNmj0LJO%
3656eKJ5j5N%Oj6QMOJJ%okMMj5klJ1rkOMmj0PJ8rj6jKKpJ0NmkJ5ljkoJ7lmOj2
3705@%lQOj0NmLPlknpMjJoPlmjMNqJmJ1j3NJ1pj5JK4j2qJ4J5nj6PJ4j5j7K4Lr
$$ plain form
3361 -12 6 -5 -2 -12 6 1 -1 3 11 14 2 5 4 12 -2 4 8 -5 -5 -5 3 -6 -9 -8 -11 -14 -14 -5 -8 -16 -24 -11 -4 4 5 -1 15 5 5 15 15 14 3 3 14 15 4
3408 4 11 15 9 8 11 7 8 -15 -4 -4 -8 6 0 5 -4 -2 12 0 2 1 -2 -12 -4 -12 -17 -12 -17 -18 -15 -13 -4 -4 2 -7 1 7 9 -3 -4 2 9 6 2 8 1 -5 2 6 5 2 5 12 7 6
3462 6 -1 3 -2 -9 2 3 -1 -8 -6 -6 -8 -7 -3 -18 -16 8 -2 -6 -4 -8 -1 0 -13 5 -1 6 4 -3 10 6 4 1 10 1 7 14 17 6 7 0 2 4 -7 7 0 -11 1 4 -1
3511 -1 -8 -16 0 -4 1 -3 -4 -13 -12 -7 4 -13 -9 -15 3 -7 -8 11 -1 -2 -4 6 17 16 0 3 8 19 10 14 9 2 8 11 9 -3 7 2 -7 -12 -1 -6 -6 -15 -1 -9
3557 -9 1 -6 -4 -1 -15 -6 -11 -9 -1 -8 -10 -3 6 5 11 -1 -4 -3 6 0 1 1 3 6 9 18 6 7 -1 0 12 7 -4 -2 -12 -9 -10 0 11 11 -5 -5 -6 -7 -8 -9 -12 -15 8 5
3607 5 4 -5 -7 1 0 2 7 3 5 3 3 13 4 3 -8 3 17 3 5 5 3 2 22 9 3 -3 -4 -2 -6 5 -3 -15 -12 1 -2 -3 -4 -15 -13 -10 -11 -6 -1 -5 -15 -12 -11 -5 -5
3656 -5 -3 12 -3 2 2 8 -8 0 4 10 11 12 12 6 4 8 12 -3 -5 -8 3 -6 -8 -2 2 -2 -12 -5 13 4 -12 -13 -11 -9 -16 -6 -1 -5 -7 8 5 4 2 -4 13 10 6 12 0
3705 0 0 -3 5 11 1 6 2 5 12 9 7 2 -5 -1 -2 -1 -7 0 -3 -7 -8 -4 1 -7 -6 -10 1 -12 -7 4 -3 -18 -17 7 -5 -13 1 16 11 -5 2 16 1 -16 8 11 2
3752BLOJ2j9nJ0Nj1LjJj4qJ0Ljj6K6pJj1J0J1k0M%ojJ7MKllJ2nlkQpqJ4Kj8jJ1
3797GPkrRj0ljJ0Lj3j3QRqLNoj4KJ1kp%J7j3PJ0llqJ5LprJ4noJ%J3pj1K3Jk2O
3843BRjo%J3k3jQJ4rj6jJ1lj9J6Oj1qJ7jqLKJ1jj0J6%j5NOPkj0J3mj3NNkj0PJ5
3887A7mk2OJ9j1pjPNlmJkqJ3pjj5K1lpj7J5J0lj2K6jj0NORk1M%J0j9MK3j3j1J1
3929A0L%qqJ4rj3J4Ok0JJ1qJ2j0ROk1rRQpj7J7J1joJ3Nj6MJ3kJj5J5Ppj1J2j0
3970CrNJ7j9qQP%j2J3mKk1K6%j3kJ1Llk1L0j3j1qJ9Jj4OKRoRJ2lj5kK5jj4pK3
4012B5k4rK3nKj6K5ppj8J9mqj6K0Mj7%K2orkJ3jj8K3Lqj3%K3rqROKj1kL0k0rQ
4054A0Pj1KrJ5qj3J4lj3rJ2mkMjJ7j5j0K2nqKJ1rrNJ2Jk0J2J7k0P%J7j4oRJ5j8
$$ plain form
3752 2 5 11 23 4 -1 9 14 3 6 5 6 -8 -16 -6 -3 -4 -20 6 -1 0 -11 -1 10 -10 -6 -6 -12 -13 4 8 10 7 4 16 11 8 6 14 7 -1 13 15 -3 -4 7
3797 7 14 12 3 12 2 -1 -2 8 11 -2 -15 -7 2 -6 -3 2 -4 -18 -16 -5 -7 -14 -14 3 -10 -3 7 4 1 -7 8 11 4 -5 9 4 -2 -1 -1 12 5 -6 17 18 -4 2
3843 2 11 10 4 4 17 -6 -7 1 15 6 -10 -11 0 -3 -22 -6 0 -11 -19 -2 -3 -11 -8 -6 5 4 -6 10 10 -5 0 6 13 11 1 14 10 -3 2 7 5 -5 2 17
3887 17 13 -9 -3 16 5 -2 -3 4 9 6 2 3 1 -7 6 -1 -2 -17 4 1 -6 -23 -8 2 -1 -13 13 12 2 7 13 22 1 5 5 15 -4 0 23 10 -1 10
3929 10 13 13 5 -3 11 2 -11 3 9 -11 -10 1 -7 5 -5 4 10 -11 -20 -11 -3 -10 -27 -10 1 0 -6 7 12 -4 0 13 11 12 -3 12 19 12 1 13 3
3970 3 -6 -1 16 -3 -11 -3 4 4 -8 5 1 3 -18 8 8 -5 -7 4 7 4 -17 13 0 -11 -19 0 1 -13 -7 -5 4 -2 7 19 16 1 -1 24 23 9 2 25
4012 25 1 -8 15 10 12 -4 21 14 7 -11 8 4 -4 -20 0 4 -13 -13 9 3 -6 -8 5 4 -14 9 12 4 -9 -9 14 5 -3 6 12 14 3 1 31 11 2 10
4054 10 17 6 8 -1 14 6 -7 7 4 -9 -18 -6 -10 -12 -8 -9 8 -7 -17 5 0 -8 -6 5 -4 -13 -8 4 5 -15 -3 14 -6 1 1 18 4 -2 7 22 4
4095DknJ9j0j3K0MrnKjlj0J9mj3pK0kj0JJ0KnmQLqrJ6oqlK4j3mNJ9j5pJ6pNj2
4139BjJ3j4JJ2Oj6nJ2Lk4lJ8LmnoJ1j6JJ9mj7J0PMj9J5Kj4kNJ1kj7J6J2oj7MJ9
4180A4k0KJ2Rj0oJ2j1%pJ2qnNJKrlJ1pj3PK0j4rJ7J0j3jpJ2knJ3j0KJLJ7j4jL
4222A0NKjPrpjLllKPKj2pOlnlJ6j2rJ9mjjJ4j2Qj9J6KooJ0jNj2K0Mj9mK0rJjj
4269HlpOJ2qj0QRj3j8J1mlkRMjkOJnj4K1Mj1lLMj1NJ6jj2JRjrRJ2j1pNMKrjJ0
4316A3oJjLj0j8J8J1j0k1J3lkLMqJ2rmK0j6JJ2lMlJ0pqJ1lJ0nj0J0Qj7J3JKj3
4357CJ0j%j9LK1j1pNmokJOpj1PJ2lkRJ4k4kJ6mkj0OMMKPpj3K1Klj6KMQj3mQko
4404dNJ6j4j4J7qnkKJ4k4J8Jj1Qj1OJ3oj0J0jpkJ0JMj7K7rolJ9j0qOJ6j3Lmjr
$$ plain form
4095 4 2 -3 16 6 -7 13 17 8 3 5 4 1 -9 10 6 -7 -14 6 4 -6 -5 5 7 2 -2 6 9 1 -8 8 2 -6 -9 15 2 -2 3 22 7 0 16 9 14 2
4139 2 1 14 0 1 13 19 3 -2 10 13 -11 -14 4 7 3 -2 -8 3 -13 -12 7 3 -14 -4 3 7 -12 3 5 -9 -11 -6 5 3 -14 2 14 8 -9 -5 14
4180 14 -6 -4 8 17 7 1 13 2 2 -5 7 -1 -6 -1 0 2 -7 -10 1 -6 -19 -12 8 -6 -15 2 12 -1 -2 -9 3 1 -4 9 -1 1 2 5 22 8 7 10
4222 10 15 17 16 23 14 7 6 9 6 3 5 12 14 2 -5 1 -2 -7 -10 6 -6 -15 4 0 -1 -2 12 0 8 -11 5 7 1 -5 5 4 9 -3 17 21 2 -2 18 9 10 9 8
4269 8 5 -2 4 16 8 -2 6 15 2 -16 -5 -9 -12 -14 -5 -1 -2 -4 2 3 -2 -16 5 9 -2 -5 -2 2 -9 -4 12 11 -1 0 9 8 -1 8 20 9 2 7 11 13 4 3 13
4316 13 7 8 7 10 0 -18 0 11 1 -20 -7 -10 -12 -9 -5 -13 -1 -10 -14 6 -10 -9 3 0 4 1 11 4 -4 7 4 14 9 -1 9 17 0 13 14 16 3
4357 3 13 12 12 -7 -4 17 6 -1 4 0 -6 -8 -7 -1 -8 -19 -12 0 -3 -5 4 18 -6 -8 8 4 2 -8 -2 2 6 8 15 8 -5 16 18 15 -1 1 5 13 0 -4 4 2 -4
4404 -4 1 17 3 -11 6 -2 -7 -9 -7 7 -17 1 2 -9 -1 -12 -6 7 1 -9 1 0 -7 -9 1 2 6 -11 16 7 1 -2 17 7 -1 5 21 8 11 7 6 -3
4446cJMKlrJ8mj3pORj1k%QrQJJ3j6lJ2klpJ9lMrLRmjMlj5K2Oj8JjLmKk%lnlMJ
4497cqJ0Jnj3PNlP%MnnJ7Lj2JJ1mjrRnmK4mpnNPrrOOj4JJ4Nk0jJ0jj1JJ0nj2O
4545e%Qq%%J1j2MJQJj1J3nlMJ%OoMm%J2q%j1J5lj3OOlmKJj0OpLjLj1J1jqPljO
4595AkKMoJ3Jjj2KNjkJNLjpPj2J2jmNj3QlnNljKoMjnKNrKLLLlOjMlOpkMMMklm
4651FLNMLkoLpmknjPKJmj4jJ5kj4QNj4OjJ2mJmLO%oLNqPJj1NLMPlj1J5kj2PoL
4703FLlqMJ2j5pJ9oklPqnQpJoJ3J2j5J3j3kJ6mmM%pJ3j2lK0j2mJ1j2NjomRj5j
4748iPkO%KnkNkooON%llNMKKnPMLqnJ9mrJ3pNnqMlRlj1J5j8Nj1J0j0LRrNJo%J
4801cklJKJJJ%jlMKLLJrOqJQLqJ5Qj9JLOpNqj%lMpMMnjM%Lj5J4j1MNlqMqJ4PQ
$$ plain form
4446 -3 -2 2 4 1 -8 10 6 -7 -14 -8 1 -10 -12 -12 -4 -13 -5 -4 9 -7 -10 2 0 -3 -10 9 6 10 1 4 13 9 8 12 9 -6 16 22 4 5 4 7 3 5 3 3 0 -5 -8 -4 -3
4497 -3 -11 -1 0 -5 -18 -11 -6 -9 -2 -2 2 -3 -8 9 12 0 1 12 8 7 -2 7 2 -2 22 18 11 6 11 18 9 0 6 12 -2 -1 13 18 -2 -3 7 6 -5 -4 6 1 -11 -5
4545 -5 -5 3 -5 -5 -5 6 -6 -2 -1 7 8 -3 10 5 2 6 7 7 13 7 11 7 7 19 11 11 0 15 12 -1 5 11 8 4 6 7 -3 3 -4 -1 -2 1 -10 1 0 -8 -1 -4 -5 1
4595 1 -1 1 5 -1 12 13 12 0 2 7 6 4 5 10 13 12 5 12 0 12 11 7 12 -1 7 4 -1 4 1 0 2 -4 0 -1 -6 -4 1 -8 -6 -3 0 3 0 6 5 9 6 12 5 3 7 11 15 13 10 6
4651 6 9 14 18 21 19 13 16 9 5 3 -2 -3 4 6 7 3 -11 -12 3 1 -13 -5 0 -14 -8 -9 3 -1 0 -4 -1 5 5 -1 2 7 -1 6 7 -4 1 4 8 15 12 1 16 14 2 9 3 6
4703 6 9 6 -2 2 14 -1 -8 11 5 3 0 7 -1 -6 2 -5 -4 -10 3 15 0 13 0 -2 14 10 6 10 10 3 16 4 1 21 9 5 16 4 9 8 2 -2 7 -8 -9
4748 -9 -2 -4 2 2 4 -1 -3 2 0 -6 -12 -6 -1 -1 -4 -7 -2 2 4 6 1 8 12 15 7 2 21 17 8 21 14 19 14 6 10 7 16 13 2 17 -1 4 -7 3 -7 -4 5 -4 1 2 -4 -4 -3
4801 -3 -5 -8 -7 -5 -4 -3 -2 -2 -3 -6 -2 0 3 6 7 -2 4 -4 -3 5 8 0 15 23 4 5 8 14 7 12 4 3 3 0 4 -3 1 5 0 -1 3 3 6 -9 5 -6 -2 3 0 -8 -4 -12 2 9 17
4856A7qKjj2kJ4j0OOMqOjNOj3%okmPj1Q%qKoRJ1j7%jJjPj4J6jJOKnpKJ7j5KJp
4905bJ4rJMKj0J5j1MomJjnO%%j2jJ5j1J5j1Oj0kJ0pjORjKmOj6RJ1l%lNmMJ%rJ2
4953A5%Lj5LOj7NKQj4jKKrQk%j3OLKqRmJoJJ0Ok%jKKKNrPjMpJ1%loj3J2KLj0L
5004Dj1PmMMj2NlOjqJ9j0kpJ1j0MkJ3j5J2KKOmnrPjNOj6OJ0j0kQjj0JlQ%pmKo
5052a1KONj1OnkPljMNj2RNqJ0NnjJ0j0LnKQ%%nOr%jkOPqrNpk%J0j2jlKRrj1J5
5103flnLLJpJ0J7j6mJ7okOpNMoQokj0J5oJ2pj1PQj4Rj8J8j3LMpNnlLNpJLjOj3
5151a2KJ4j4J1MKOj8NkOKKjnPqKLqJlL%j1KNlmM%j%KpM%lNQ%MknOj0LJ6lj6J5
5202HpOlpPlKJnJjOjpKoKRomKkjkPlnmNQmjjpPOj2J9j0JmJ0kPj0RllMnOljNMq
$$ plain form
4856 17 9 11 10 -2 -4 10 0 6 12 16 8 14 13 18 24 11 11 5 3 -1 6 -5 3 3 -5 -3 -9 0 11 -6 -6 -7 -6 -7 0 -14 2 1 2 8 10 5 -2 0 17 2 4 5 -2
4905 -2 12 3 4 8 10 0 15 4 8 2 -2 -1 -2 -7 -1 -1 -1 -13 -14 1 -10 5 -6 0 -10 -12 -2 -9 -10 -4 5 4 6 2 8 -8 1 12 9 9 6 11 7 11 12 12 3 15
4953 15 15 18 3 6 12 -5 0 2 10 -4 -5 -3 -1 -10 -2 -4 -4 -17 -11 -8 -6 -14 -5 -9 -8 -14 -13 -3 3 1 1 0 2 4 6 11 2 9 8 12 5 16 16 13 7 -6 6 8 11 1 4
5004 4 -7 0 -4 0 4 -8 -3 -6 0 -1 -9 10 0 -2 -9 2 -8 -4 -6 7 -8 4 6 8 14 10 5 -4 3 2 7 13 -3 3 13 3 1 9 8 -2 -1 -4 4 4 -3 -7 -5 -11
5052 -11 -9 -3 2 -9 -3 -8 -10 -3 -6 -7 -3 2 -10 -1 4 -4 6 11 6 5 15 5 8 3 5 13 13 13 8 14 5 5 4 2 8 15 7 -2 3 -4 -6 -6 4 -8 -9 -12 -10 -1 -10 -21 -6
5103 -6 -9 -14 -11 -8 -7 -14 -4 13 -3 -7 10 4 2 8 1 6 10 4 12 6 4 -6 9 3 15 8 -3 4 12 -2 7 -11 7 -6 -3 1 -6 -1 -6 -9 -6 -1 -8 -7 -4 -5 1 -12
5151 -12 -10 4 -10 1 5 7 13 -5 0 -2 4 6 8 7 2 9 1 3 6 -2 -1 -4 -1 -1 -12 -10 -5 -8 -12 -8 -8 -9 -9 -7 -14 -10 -10 -13 -8 0 0 4 2 -3 3 -7 -4 12 9 -7 8
5202 8 1 7 4 -3 4 1 3 4 -1 0 -1 5 4 -3 -1 -7 -5 4 -2 -6 -4 -6 -7 -9 -2 -5 -10 -14 -9 -1 -5 -6 -7 -14 -7 -1 -13 6 -4 -3 -7 3 1 8 -2 7 4 1 5 0 6 3 2 7 11 3
5258CNqOpL%qpjJ1JpMQknRjrkJqJ3kJ1nMjMJ1j4Pj2kJ1lnj3QMmJ1oj%LrNj0Qk
5309cqJ1j0jKKJlJJ2mK%KkmQjNjnLo%NnJ0JmpRl%Jj1QjlkLLkkj4OJl%JLJKQj5
5363iP%mjMnPJ1Lj5J0kLMKmmpKmJ3j8J3j0NPjlkKqjMrJKoMPKl%%OpJJ0j0lJ4q
5414@KNnl%%J2jloQMj1MpMnMoRj9%QkPj8%J7rlJ7j1j0J6jlKK%mPlNjKmOmllJ3
5465Ijj1PNMj1jJlLj0J6k5RoJKqOJkJ2pj3J6JlNrJ4%kKqJ1lJ1j1RoJ1lKj3K0j9
5511CQj6K0rlOPj8LLjNpnoJ3j2npJJ7rJ0MrjjJ3%mopK1lKoOqjJ4r%oOrmKPN%M
5562HrJoKoJ0oJ9j7nNJJ3mj3J7lrJ3mP%pOLpKqJ2j2LMn%mmlQjj2MQkrLmLLn%p
5613a7pnPJROj0LJ0qJ1KOj2JJ5qOkJ1nnLjjoO%KNj3mOkQqkpJ1j1Njnj5ROQpom
$$ plain form
5258 3 8 0 6 -1 2 2 -6 -13 -14 -3 -2 -9 -5 3 1 -4 5 4 -5 -7 -6 -14 -1 -3 8 3 7 6 10 21 7 14 2 0 11 8 3 -10 -2 2 -2 9 3 2 2 5 -4 1 -9 -1 -3
5309 -3 -11 0 -10 -11 -9 -7 -6 -9 -8 4 0 2 2 4 2 -2 6 5 10 9 4 7 1 1 6 1 11 12 8 1 10 7 7 8 -3 5 4 1 -1 2 5 3 1 -13 -7 -6 -9 -9 -8 -5 -4 -2 6 -9
5363 -9 -2 -2 -6 -7 -3 -8 -1 10 13 -2 8 6 9 13 15 11 7 0 2 -2 11 -7 6 -4 1 8 7 4 2 4 -4 -5 -1 -10 -9 -7 -13 -9 -2 0 -3 -3 -3 3 -4 -3 7 -3 -6 8 0
5414 0 2 7 2 -1 -1 -1 11 10 7 1 9 13 2 6 -1 3 -2 2 -4 5 -14 -14 -6 -8 -1 -19 -19 -2 -11 -14 3 -8 -18 -2 -3 -6 -4 -2 -2 -6 1 -2 3 2 4 0 6 2 -1 -4 9
5465 9 8 -3 4 9 13 2 1 2 -1 2 -8 8 -17 -8 -14 -13 -11 -19 -13 -12 -14 -2 -9 -22 -6 -5 -8 -3 -12 2 2 0 2 -6 5 2 13 2 11 5 16 13 15 2 22 3
5511 3 11 -5 15 6 3 9 16 -2 1 4 3 8 1 -4 -10 3 -9 -14 -21 -20 -3 -12 -2 2 -7 -8 -9 4 4 0 -6 -13 8 5 7 1 7 -1 -2 12 3 3 -3 3 -6 -10 -8 -1 4 4 8
5562 8 -1 0 -6 -4 -10 0 -6 13 -4 -9 -4 -3 10 6 -7 10 7 -2 11 7 14 14 7 13 16 9 11 3 15 3 6 10 5 5 1 -3 -6 2 1 -11 -7 1 -1 -10 -7 -11 -8 -5 -10 -10 -17
5613 -17 -24 -29 -22 -21 -12 -6 -16 -13 -3 -11 0 2 8 -4 -3 12 4 10 8 19 14 9 12 11 10 4 10 10 12 17 4 0 6 4 12 4 2 -5 6 -5 0 -1 -6 -21 -12 -6 2 -5 -11 -15
5663a5lJ5Qj1J1j9J6kjRj9oPK8j4%Nj2kJ2j2J2j0lkMLQpmNLlmK%KqRmQKjlO%%
5710A0pQlMMojNkJ2nkjNj0Lj8J0j4kJ4nJrNrJMj%mjJ0J%pjOonJ6j0J1Ll%J0qj
5759BNL%jQkj4J0RKj3JpONj1jkm%J0ojLpPnOj0kQlJ3j3P%mOnJ0j1OpMRopOkJ0
5809A2oMpNklPj4J0pkoPJ2j3kNklJm%J0pJ0Q%j2QKrKJ0j4J6lM%q%jJ1%j0J0j4
5855E%kJ0mj5lPJ1rJmjjRMj9Qj1J0J1%%q%nOQpMmOLJmNqMJ0qllK%j3RNj2jOj3
5905a3K0oqOmMkMqKmQmkQmKJ3kpNoMJ6j4Nj0MpJ8%qLlOj4MNmlNmqjpN%lJ1%oj1
5957a5jNlNOj5J2PjkMj4KJ0QpoQnjMMk%mJ2oJ2j1k%Qj2Pj0KlJ2mJNj5RnMmnjQ
6006AJ1lMj0QkrNJj3JLPPqKJkj0J3j%kl%joJ5j4nOjknpjJ5mJ5qpOjJ2lLPMj3J0
$$ plain form
5663 -15 -18 -3 5 -6 5 -14 2 0 -1 8 -11 -17 -10 18 4 4 9 -3 -5 7 -5 7 -3 -6 -8 -4 -1 7 0 -4 1 4 1 -3 -1 -1 1 -7 2 -2 6 8 7 4 10 10 10
5710 10 3 11 8 12 16 10 9 14 12 24 19 17 16 21 11 14 -4 6 -8 -10 4 -1 0 -9 -4 -13 -12 -8 -9 -9 -13 -14 -4 -3 -3 -10 -11 -5 -11 -16 0 -10 1 4 1 1 11 3 2
5759 2 7 10 10 9 17 15 1 11 20 22 9 10 3 9 14 3 2 0 -4 -4 6 0 -1 2 -5 2 -3 3 -7 -9 -1 -4 9 -4 3 3 -1 5 0 10 -1 5 -2 2 11 5 -2 4 2 12
5809 12 6 10 3 8 6 3 10 -4 6 -1 -3 -9 -2 10 -3 -5 0 -2 -5 -4 -8 -8 2 -5 5 13 13 1 9 11 2 4 14 0 16 13 17 17 9 9 8 19 19 9 19 5
5855 5 5 3 13 9 -6 -9 -2 9 0 1 -3 -4 -5 4 8 -11 -3 -14 -4 7 7 7 -1 -1 -6 0 8 1 5 1 7 10 11 7 12 4 8 18 10 7 4 6 6 -7 2 7 -5 -6 0 -13
5905 -13 7 1 -7 -1 -5 -1 -3 1 -7 -5 -9 -1 -5 -7 1 -3 -1 12 10 3 8 2 6 22 8 13 3 7 0 18 18 10 13 10 16 2 6 11 7 4 9 5 -3 -4 -11 -6 -6 -9 2 2 -4 -15
5957 -15 -16 -11 -14 -9 -3 -18 -6 1 0 -2 2 -12 -10 0 8 1 -5 3 -2 -3 1 5 3 3 -1 11 5 17 6 4 4 12 0 7 -3 -1 -4 8 4 5 10 -5 4 -1 3 -1 -6 -7 1
6006 1 12 9 13 3 11 9 0 5 6 -7 -6 -3 4 11 3 5 6 4 -6 7 6 6 4 1 1 0 -6 9 -5 -10 -4 -5 -7 -12 -19 -20 -5 -9 6 -2 -9 -3 -4 8 5 8 15 19 6 16
6056A6KnNj4KLJLrJ4mLjqJ1nqonJ0KnJKqj2NKkKMJj5JMJ0moPNOnOJj6JPkPq%N
6108AkNj%moLJ4j0J2j4joJJ5p%J0j4J9lj0nJ2jKMJj0OPklmj4J6KrJ3j0JqJ3nN
6153A3j1Jj0mRmLj0lPLoJ1j2MNLpKmL%M%J0j3RMjJ4j0oLmRJ6qj0JjJ2j4LmJNj4
6200aJ1qnlLRorPj4K2oloLoORj3KPonJ2MNplJ2j4J2pPj1QjOj7J3lPnOpkjmJ3L
6249A4lj0okKJ2mqjRkl%mJ0lQj1J1qROj0J1qKJj1J4jj2J0%jKOj7J2j7NJ0j6rN
6293hLkJ0j3Rj2PKNMj1kNOPj1QQj5J4KjnpLJ1%pJmMJlRj1lpOmRqrkOj0PJLjNQ
6344Hmjj1RKNKj9J4Mj0J1NjrJ7pJpL%j4J0%LmMlmNkj5JJ1j1J4qknkRpJ5j9J3q
6390gmJ6qjj0J2NN%jL%kJ7j4mLqJ1Lpj3MKOqMj1OOjj5QPj0NKoJ2qjOrJ2j0jJk
$$ plain form
6056 16 18 13 18 4 6 9 10 13 4 18 14 17 16 8 19 14 6 0 -5 5 7 2 3 5 -3 -15 -10 -8 -10 -8 -4 -3 -18 -17 -13 -3 -7 -13 -6 -1 5 0 6 7 -9 -8 -1 -3 4 -4 -4 1
6108 1 -1 4 3 3 -1 -7 -4 10 0 12 -2 -3 -9 -8 7 0 0 10 -4 15 12 2 -3 9 8 10 14 15 5 11 18 16 13 9 -5 11 13 4 17 7 8 0 13 8 13
6153 13 2 3 -7 -11 -2 -6 -3 -13 -16 -9 -6 -12 -1 -13 -9 -4 -1 -8 -6 -10 -7 -7 -3 -3 7 -6 3 7 6 20 10 4 7 3 12 28 20 10 11 10 22 8 11 7 8 13 -1
6200 -1 10 2 -3 -6 -3 6 0 -9 -2 -16 6 0 -3 -9 -6 -12 -6 3 -10 -8 -1 -7 -12 0 4 9 2 -1 11 -3 9 2 9 -2 6 5 11 -6 7 4 11 6 12 5 3 2 -2 11 14
6249 14 11 1 -5 -7 -5 7 3 -5 -6 3 1 -2 -2 -6 4 1 9 -2 9 1 10 16 6 17 9 11 12 1 15 14 2 12 12 11 13 19 2 14 -3 2 12 -4 -13 -8
6293 -8 -5 -7 3 -10 -1 -13 -6 -4 1 5 -6 -8 -3 3 10 -1 7 15 0 14 16 15 10 3 6 17 17 10 11 7 11 12 9 18 7 4 -3 3 -1 8 0 -9 -11 -5 -15 -8 -7 -4 -5 0 8
6344 8 4 3 -8 1 3 8 10 -9 5 9 -1 10 15 14 5 22 15 16 9 12 12 -2 8 8 11 7 11 8 4 9 7 -8 -7 4 -7 7 -1 -3 -8 -10 -1 -8 7 -12 1 -7
6390 -7 -11 5 -3 -4 -14 -2 3 8 8 7 10 10 8 25 11 7 10 2 13 16 9 -4 0 2 8 0 4 -7 -1 5 4 -11 -3 4 -6 -1 1 -5 7 -1 -2 4 -5 7 -3 -4 -3 -5
6438ejKJ1jj6NPMLpoKJ2lJloj1J2OnmJNj0J0jkooMJ%J4j1KOo%o%J6mKRj1LlPQ
6488A9j4J1qj1J6LqPokj1J9j1OqoNJ8k0nqkNQJ0j9MqJ1PjpJ6j2lJ5KJ%mpJ3j6
6531aL0j0j5RkjlN%jkJn%JNMjj7qQLnLJ3lrQ%pJ2pjJ0plmKOKJ1Jqjj6LJ3jkpP
6582A0kklJ9j2j5RJ0j3jo%QnnRomPQloJ3oqJ2lKlQqLmKQJmJ0j5J4Jj1klRnOLo
6631A1oLojmlJJ3j8jMjJJ2l%M%lrjJ6%K%NqpJ2Rj0j2J1jnp%QmKJoPNqRj2noMN
6682bprJ1JP%JllLQnLrJ2rLJ3mMqMjJl%jMOj7nOkQnJKkqOpNjoJ0lnO%k0K8qRk
6736GorPPj0J9j3LOqLJ0j4MnLKLj5J1JkpOjlJjj3J9pj8J5lOJ3j1Mj0J0oOnjPj
6782DKl%%JkJ0rJ3j4MjKPj8N%KoPj7J0nQpJMkoPmpLJ3lMmKJN%pKPlqJ8j4J2pP
$$ plain form
6438 -5 -6 -4 7 6 -10 -5 2 6 9 2 -4 -2 10 7 8 5 -1 -12 0 6 1 -3 -2 3 -7 3 2 0 -6 -12 -8 -7 -7 7 -4 -2 4 -2 -2 -8 -8 8 4 6 15 4 7 4 11 19
6488 19 5 16 8 -3 13 16 8 15 9 7 -4 15 4 10 2 -4 1 19 -1 -6 -14 -16 -11 -3 7 -12 -8 -16 -5 2 1 -6 10 -2 -5 10 12 13 13 9 2 15 -1
6531 -1 29 19 4 13 11 10 7 12 12 11 9 10 5 5 6 11 15 14 -3 -11 -3 0 -5 -2 11 8 -1 7 7 0 12 5 4 14 7 4 0 2 8 10 21 22 14 13 -3 0 13 12 10 3 10
6582 10 8 6 3 22 10 -5 4 14 1 0 -6 -6 2 -3 -8 1 -5 -9 -2 6 3 -3 10 4 -4 8 5 7 4 12 4 7 3 5 13 14 10 20 5 19 20 9 7 4 13 8 14 17 11
6631 11 5 8 2 1 -3 -6 -5 8 -10 -11 -7 -8 -7 5 2 2 6 6 3 -6 -7 9 9 11 11 16 8 1 13 22 12 0 11 10 5 -2 -2 6 2 4 5 -1 6 11 3 12 0 -5 -11 -7 -2
6682 -2 -9 -18 -7 -6 1 1 2 -1 -4 -1 7 2 5 -4 8 -1 2 15 11 15 7 11 10 11 8 8 7 11 17 0 -5 1 -1 7 2 3 5 3 -5 1 -6 -1 -2 -8 2 -1 -6 0 0 -20 8 0 9 7
6736 7 1 -8 -1 6 -4 15 2 5 11 3 6 16 2 6 1 4 6 9 -6 5 6 4 -3 3 2 -1 0 -1 -14 5 -2 -20 -5 -8 -2 11 0 4 -6 4 -2 4 -1 -2 5 4
6782 4 6 3 3 3 4 2 12 3 16 2 6 5 7 14 -4 1 1 3 -3 4 -13 -3 -8 0 -7 -6 -2 -4 -10 -3 -7 -14 -11 2 -1 3 -1 1 2 7 7 0 2 9 6 -2 16 2 14 7 14
6833A4kpJqJ3noJ3kqLlqJ1Oj2Kj1OnQPp%jp%QnONQk0K3qkmnJ5rNjj0J7MlppMl
6883CPmqKMmJOlJm%Noj1NJPmPj1J1j2jJ2kjJ4pj0J7ppRlMoQJl%qPj4RnPj4OPj
6934E%mj1kPk%lNRpQj2KLj5J9jPkjJ%jOOj3J4%j%qQj1PRk5JQkjjLpLPpKlqLjM
6987bmKMjLoLJ0rnJ3J%pKKkOqOmmmN%KJnMLqJlpMR%j2PKmpQ%KoJ7nPnmPmLMkK
7044A2Nj5L%JjM%pOkmMlJ2j2%j1NJNlrLJmMRk%qJ0JPj4QKnQKonK%NrOJmjMkKo
7098@KjPj7LQMj0qJ2lKLnKRnqJMj1J6mLOLk%j3OJ0MnLnm%JJ1%Jj3Qj6J2rkQj1
7147clNLlPnKQlj1kLJlJL%RqPnjJ0qOj2J2k%%lRojJJpklNqLpNLqJ2j1%NRpj4J0
7201fJ3rjLMKlNlJ3j7mR%mKJ1k0RJ2kjpj2NNnJ1JroNj2lOnJ1J0j2Kjj2OJKRpP
$$ plain form
6833 14 12 5 6 -2 11 6 0 13 11 3 6 3 -5 6 12 0 2 -9 -3 -8 0 7 0 0 -1 -8 -8 0 -5 1 6 14 -6 17 9 7 3 -2 13 4 9 8 -2 15 19 16 9 2 6 3
6883 3 10 6 -2 0 4 0 1 7 4 5 1 1 6 0 -11 -6 -5 2 -2 5 -6 5 -7 -8 4 2 1 15 8 -2 15 8 1 10 7 11 5 13 14 11 11 3 10 -4 5 0 7 -7 -1 6 5
6934 5 5 1 -10 -12 -5 -7 -7 -10 -5 4 -3 5 -7 -5 -2 -17 2 1 8 6 5 6 6 5 11 17 4 18 18 17 17 9 17 6 13 22 -3 -2 6 4 3 2 5 -2 1 8 1 3 0 -8 -5 -6 -2
6987 -2 -6 -4 0 -1 2 -4 -1 9 0 -5 8 9 9 2 4 6 4 10 2 8 4 0 -4 1 1 3 4 -1 3 6 -2 -1 -4 -11 -7 2 2 -10 -3 -1 -5 -12 -4 -4 -2 -8 9 4 11 6 2 9 5 8 12 10 12
7044 12 17 2 5 5 6 5 9 9 2 8 6 2 6 3 15 3 3 -8 -3 -2 3 0 -9 -6 -5 -9 -5 4 2 2 -6 4 5 12 -2 6 8 3 11 13 7 2 4 4 9 0 6 7 3 2 6 4 6 0
7098 0 2 1 8 -9 -6 2 6 -4 -12 0 -3 -1 2 -3 -1 8 3 -5 -4 0 -11 5 1 4 10 13 11 11 -2 4 14 18 13 16 11 7 7 8 19 19 20 7 15 -1 11 2 0 8 -3
7147 -3 -6 -1 2 -1 6 1 3 11 8 -3 -5 -2 -1 -4 -3 0 0 9 1 8 3 2 12 4 10 -2 10 8 8 8 5 14 8 7 8 9 2 0 -3 2 -6 -3 -10 -5 -2 -10 2 -9 -9 -4 5 -2 -16 -6
7201 -6 7 -2 -3 0 4 6 3 8 5 18 1 -3 6 6 2 4 15 -5 4 16 14 13 6 -6 -1 4 -1 10 11 2 -4 1 -11 -14 -8 -13 -2 8 -4 -2 -3 -15 -9 -8 -6 3 -4 3
7249CJ%J3j0qJ3jj1Q%n%JRqJ4pj4J3jMj1j2QJ0pnjKJ1j0mMn%KklLQoOj0J0kmN
7296A%JJ2KqnPqJ0rQpKpJ1mpMj3K1j7NnONj4LMPj4J1nKjJ%kNj2J5lmORj1OJkK
7345IJMoKjpJ2jj4KMj0Q%Kj1%NjoNPqMjQj2KMKqLOk%jJ7ppQmLOoKLj4Oj0J1%q
7397APj0KLj3RllMnjJ0pknPMlNpMjj1J6Pj3OrJ4J2j4QoOoLLoNjkjqjMJ2j2qRj
7447BnkqJ3pPj2LROjj0nJPKOjNmknPLmOpmnJ4qJ2nn%jjOkmkJlLKqpMNnnQPnjM
7503aLjL%rKOPj1J1nLJ1rj1NpPJ4prJ2j6lJ1mOmnj1JJ7ooKoJ2j2NMnNJ0pm%Lo
7551eJ7j3j%%RllMLqPJj2J0lJLLoLj2mQrKJmnkMJ1%JNqj2K4pnRj2J0J0knKkKR
7601A6nj5MJ1kljNkrOoJ0j3JjKKlKJj2NLlMrRK%%njOmJKQJKkmjKNll%J2j0jMo
$$ plain form
7249 3 4 4 17 7 -1 12 11 0 8 8 3 3 4 13 5 19 12 -2 11 10 14 3 -9 -1 9 2 -3 -4 -2 9 -1 -5 -1 -6 -6 -4 -6 -9 -6 2 -4 2 -8 2 0 -4 1
7296 1 1 2 14 16 8 3 10 2 12 3 11 4 6 -1 10 6 -1 3 -10 11 -6 -1 -6 0 5 -9 -6 -2 5 -9 2 -3 -1 -2 -1 -1 -3 2 -10 5 2 -2 4 13 2 8 9 7 9
7345 9 10 14 8 10 9 2 14 13 -1 1 5 -5 3 3 5 -6 -6 -1 -2 -8 -3 4 -4 0 -1 7 -5 -3 1 3 -5 -2 4 2 2 1 18 11 4 12 8 11 17 11 13 16 2 8 -2 9 9 1
7397 1 8 -2 0 3 -10 -1 -4 -7 -3 -8 -9 1 -6 -8 -13 -6 -2 -5 0 -7 -3 -4 -15 1 8 -5 1 -8 6 18 4 12 6 12 6 9 12 6 11 10 8 7 -1 -2 2 14 2 -6 3 2
7447 2 -3 -5 -13 0 -7 0 -12 -9 0 6 5 -5 -10 -9 -2 0 6 5 10 6 4 -1 6 9 5 11 4 0 -5 9 1 13 8 3 3 2 1 7 5 1 -1 0 -3 0 2 -6 -13 -9 -4 -9 -14 -6 1 -4 -5 -1
7503 -1 2 1 4 4 -5 -3 3 10 -1 10 5 8 19 10 -1 4 -3 4 18 11 2 14 -2 -5 6 2 8 4 -1 -12 -11 6 0 -6 -4 -10 2 -10 -5 -1 -6 -1 9 2 -2 -2 1 -5
7551 -5 12 -1 -2 -2 -2 7 4 1 5 8 0 7 8 -4 6 3 4 7 10 4 7 -5 -9 -1 -10 -8 -7 -11 -16 -18 -14 -3 -3 -2 3 -5 -17 7 0 -5 4 -8 2 12 10 5 7 5 7 16
7601 16 11 -4 0 11 9 6 5 10 8 -1 5 -1 9 -4 -3 -4 -2 0 -3 -1 0 -12 -7 -4 -7 -3 -12 -3 -1 -1 -1 -6 -7 -1 -5 -4 -2 6 7 9 7 3 2 4 9 6 3 3 15 5 4 8 2
7654BMrJOrLJKmlNolpJ2rOKJ1j4RMpkMRqQqLQpj0J5%kKnpJ4mrPKj4PNqPqMlJJ
7708alj0NoJ4oPnJ3j2kJ0jJpkJ0KL%jJqPPm%mnKOoNKpjj0kRLoj2J2jqMOkkRjr
7760fMLKj0J3J0j7OlJ%kKJM%jjrNnJ2j1lPQnkplNj4J6j0J3pJJmJ6k0OJ0LjmLl
7808DMojNML%rJ2noJJkLNk0PKrLQnJ0mOj4kk%QlO%j0QkOj%kqRlOKpjPjMLJlj2
7863@J5kqjMnjJ3j0qPpnJ3NkJj5joJ2oJpPJO%KKnoJ2klJ7j7MOkJ1pj5J9j7MKj
7911EkKj0NjjMqOj0LmnLRnJJ3j4J4jJ0j3J2pMr%%Nj1K1j2QJrOJ3j7RkqnNNjoo
7959cJ5j0qK0j6oJmN%Oj0J3rOJ1j3J0kMqRj0JJ1jLmKkpRNj1NJnJpKrJ1o%PJj4
8006fnMJ2pkklnJ9lLj0LJ1mqQPoLNJk4J7n%J0kjmmjJ2ollN%jlmNJJmNqlm%J3j
$$ plain form
7654 2 6 -3 -2 4 -5 -2 -1 1 -3 -6 -1 -7 -10 -17 -5 -14 -8 -6 5 -9 0 4 -3 -5 -1 8 0 8 0 3 11 4 -6 9 9 7 9 4 -3 11 7 -2 5 7 -7 0 5 -3 4 -4 0 -3 -2 -1
7708 -1 -4 -14 -9 -15 -1 -7 0 -5 8 -4 -6 4 3 4 -3 -5 5 7 10 10 9 10 2 9 16 12 12 8 3 5 11 5 10 12 5 4 -6 -8 1 4 -2 -14 -2 -3 -11 -7 -1 -3 -5 4 3 -6
7760 -6 -2 1 3 -7 6 16 -1 5 2 3 3 1 3 4 8 8 7 6 -3 2 -3 9 -2 -5 2 10 5 3 -4 -7 -2 -16 0 -10 3 -4 -3 -2 -6 10 -10 -4 6 9 8 4 7 4
7808 4 8 2 1 6 10 13 13 4 16 11 5 6 7 5 8 13 -7 0 2 -7 -4 4 -1 9 5 11 -3 -5 -7 -7 1 -2 4 4 -6 2 0 6 5 5 3 -5 4 1 7 9 2 1 8 7 11 14 15 12 0
7863 0 15 13 5 4 8 3 2 15 5 -3 4 -3 -8 5 10 8 9 -6 -7 -13 -1 -7 -6 -13 -6 -5 1 1 3 5 0 -6 6 4 1 18 1 5 11 9 20 13 -2 17 0 4 6 5
7911 5 3 5 -5 0 -1 -2 2 -6 0 -10 -7 -11 -16 -13 -4 -9 -8 5 -9 5 4 14 1 13 6 10 1 1 1 6 -5 16 4 12 13 4 10 23 6 15 13 5 0 5 10 9 3 -3
7959 -3 12 2 -6 14 -2 -8 -7 -11 -6 -6 0 -10 3 -6 0 11 -2 8 6 10 2 11 1 2 13 12 15 11 13 11 4 13 18 7 12 13 8 9 2 4 -5 6 0 0 7 8 -6
8006 -6 -11 -7 5 -2 -4 -6 -9 -14 5 2 5 -5 -2 9 5 -3 5 12 6 9 14 15 -9 8 3 3 13 11 10 6 2 1 13 7 4 1 6 6 5 2 -2 3 4 5 1 6 -2 -5 -9 -9 4 3
8058CkKO%nJ3Jlj4LQlrPpPJ0j0jOnljKRk1Q%J8j8RrKJnqNRj5OPoNqJ0rKJ5%mn
8109CnLjJj0J3JKmOmJ1mMj2Kjj1PjmLJqMQpJ%Mj3J4Jj3J2Jk0J9J1j2JnJ5ljmO
8156A1%qRkMJj6J2nJ%pkJ1j3JP%j0oRqJ9o%lNj5NojJ7pRj
$$ plain form
8058 3 1 3 9 9 4 17 18 15 1 4 12 9 0 7 0 7 17 7 6 12 7 4 3 5 14 -7 1 1 19 1 10 1 3 4 -1 -9 -4 5 -10 -4 3 -3 2 -6 4 -5 -3 12 12 8 3
8109 3 -2 1 0 1 -9 4 5 7 3 9 5 16 12 16 4 6 5 -6 1 0 -4 -1 0 -8 -4 4 -3 -2 -2 2 -11 3 4 -9 3 4 -16 3 14 2 3 -2 13 10 9 5 11
8156 11 11 3 12 10 14 15 -1 11 6 7 7 0 -2 9 -4 -3 4 4 -6 -12 -3 -11 8 2 2 -1 4 -11 -6 -12 -13 4 -3 6 5
8191E
$$ Imaginary data points
##PAGE= N=2
##DATA TABLE= (X++(I..I)), XYDATA
0@%%%%%%%%%%%%%%%%%%%%%%%%%%%%MqQqJ2j6J6j6J7k1K4k4K5l3M0m0M2m9N5o0
48c2O5p3Q1q7R8j08J17j29J42j57J75j91K10k34K58k85L12l35L41k70j57M037
70C778K7196q7424p6968Q9235O4162j04877q1049R4903Q1325o4684l7459Q7656
82d206K8570r0926n744J22980K2702j20546l5143R5047J5303q9626m708P2189
94E892l6630j00280L6607J13695k2518j00659K7720J00438r962n1394O2227P4719
106I9855o0252o4848Q3283Q8947o4728q2731M6682M8778o5865m3152O7528J7739
118G1236j04780m1626R7673M6599q2105l3844P6142K2687o2506J4589R0893j2108
130H2850j00778L602R4888m248r1497o988N2729l7043p2324L6916O4966n8234
$$ plain form
0 0 0 0 0 0 0 0 0 0 0 0 0 0 0 0 0 0 0 0 0 0 0 0 0 0 0 0 0 0 4 -4 4 -4 8 -8 8 -8 9 -12 12 -12 13 -20 20 -20 22 -27 28 -32
48 -32 33 -40 41 -46 52 -56 61 -68 74 -83 92 -99 111 -123 135 -150 162 -173 168 -102 -259 3778
70 3778 30974 -56450 -133418 -44183 19979 -84898 -165947 -71044 10281 -54403 -91862 -4206
82 -4206 24364 -66562 -72306 50674 73376 -47170 -82313 12734 28037 -61589 -66297 5892
94 5892 -30738 -131018 -94411 19284 -3234 -103893 -76173 24265 14303 -37091 25136 99855
106 99855 39603 -25245 58038 146985 82257 -474 46208 94986 29121 -14031 53497 71236
118 71236 -33544 -75170 22503 69102 -13003 -46847 29295 51982 -10524 4065 94958 82850
130 82850 -17928 -14326 80562 76314 -15183 -22171 30558 -6485 -78809 -41893 23073 -35161
142c5161q8232M0872Q1541k8313n5673M2425M8435m6830k8070Q0077N0766p2613
154a0776n2344O5384M8427n4833l3494M8638M167p3549o651Q1962J0423q4298
166e6944j6822P6630K1445m8463J3784O4260j6158n9593L7229Q4209k0368p7978
178A231J1876N8883k2536n1594K8412L4610n9054n5469N3447N6733m9912n6290
190d9663L9051M1380l6560j8072N7219J8690o6713k2227P0923L0489o1766l0865
202b8114M2325N046n1674K102N2874j7605p4030L049O8833K432n6022L286M6537
215i61j2538l5658L7771N3796l3973n5471L3416N8948k1853m4206K2972K6798
227B9041l9990k6433N0071K9377n6904l9395M8058L7973l5186j9501M0208R440
$$ plain form
142 -35161 -123393 -82521 -980 -29293 -84966 -42541 5894 -40936 -69006 11071 61837 -10776
154 -10776 -63120 2264 50691 -4142 -37636 11002 15169 -58380 -65031 16931 27354 -56944
166 -56944 -73766 2864 24309 -24154 -10370 53890 37732 -21861 15368 99577 79209 1231
178 1231 13107 71990 49454 -2140 26272 60882 1828 -53641 -194 56539 6627 -49663
190 -49663 -10612 30768 -5792 -23864 33355 52045 -14668 -36895 34028 64517 2751 -28114
202 -28114 14211 19257 -32417 -30315 22559 4954 -69076 -66027 2806 5238 -50784 -47498 -961
215 -961 -13499 -49157 -11386 42410 8437 -47034 -13618 45330 23477 -20729 2243 29041
227 29041 -10949 -37382 12689 42066 -14838 -54233 -6175 31798 -3388 -22889 17319 26759
239B6759m5308K057O2998Q526o1387j4083N1751J0713m2063k04L5460j9753m9169
252c3703J9827N3712j8487n7278Q152M4053j0777l1202K3667K8674l5325l3215
264d1902M1365M2704l3523m0651K5183K8100k6496j5896L5274R114m9120j6429
276d2277N0315K2266m3052k0479L3743R056l1395O068M1970q928m9575N725N2121
289B5558K140m1575P75L1479j1963k8848K4284L5074k8902m3140K3003M1783j6829
302A2839l2383J6769J9822k7342j6680L7254K0629m1171k7605L4458K6078k6352
314c684j5323K6175M177l3277J285M3608M322m4091r532L6823Q130k7641J918
327g110K5128j4351l2833J7394L9739j3280m0286P280L2431o806k0398J8484J9962
$$ plain form
239 26759 -18549 -16492 46506 55032 -6355 -20438 31313 42026 -37 -241 35219 15466 -33703
252 -33703 -13876 39836 21349 -35929 -27777 16276 5499 -25703 -2036 26638 -8687 -41902
264 -41902 -537 42167 8644 -32007 -6824 21276 -5220 -21116 14158 23272 -25848 -42277
276 -42277 8038 30304 -12748 -33227 516 9572 -21823 -15755 26215 17287 -32288 -26563 25558
289 25558 27698 -13877 -13102 18377 6414 -22434 1850 36924 8022 -35118 -12115 29668 12839
302 12839 -19544 -2775 17047 -10295 -26975 10279 30908 -10263 -37868 -3410 22668 -3684
314 -3684 -19007 7168 11345 -21932 -20647 22961 27283 -16808 -26340 10483 18613 -9028 -7110
327 -7110 18018 3667 -29166 -11772 27967 14687 -25599 -18319 14112 7306 -13092 5392 25354
340B5354k6114k1859L2555L0728k5753k8990J9337J9518k0441j0895K5639L834
352B2913l8019j1183L7075J4043l2999j4410K4028M746k2274O876L0170r038l5904
365b3976O543L8004L7l0142N13J9983j1164k0238J7455K1310k4679l1174J6951
378b0577K8206j2786k0983J3576J3657j7814o338L0957J5298k8215j5644K7546
390F883J8512j8401r124J7673j205k5442K498L0120j792l4155n398K6747M183
403A1099j8619N109J9081j1010k0176J8280L0177j0924k7277P967K1671q176j4733
416B469J2660Q417k4969j7183K1966J6554k3156k1207J3150J1089j4329l466K0254
429B249J710k4582j714K9695R734k1701p055J6526M17j6027N361J7400j2317k7509
$$ plain form
340 25354 -760 -22619 9936 40664 14911 -14079 5258 24776 4335 -6560 19079 22913
352 22913 -15106 -26289 10786 24829 -8170 -22580 1448 6194 -16080 -9204 20966 11928 -23976
365 -23976 -17433 20571 20608 -9534 -9021 10962 -202 -20440 -2985 18325 -6354 -37528 -20577
378 -20577 7629 -5157 -26140 -12564 1093 -16721 -23059 7898 23196 -5019 -20663 6883
390 6883 25395 6994 -2130 15543 14338 -11104 -8606 21514 19722 -14433 -19831 6916 11099
403 11099 -7520 -2411 16670 5660 -14516 3764 33941 23017 -4260 3707 25378 17202 2469
416 2469 15129 23546 -1423 -18606 3360 19914 -3242 -24449 -11299 -210 -14539 -18005 2249
429 2249 3959 -20623 -22337 7358 17092 -4609 -11664 4862 5279 -10748 -5387 12013 -304 -27813
443b7813M607K4026l366k0567K661J3988p384q799J8916J7624j5708j6507J8042
456b80K1949q476j2219J0822O552j5683m507K0235M692k5254j2038J8153Q938
469A2884j5164m715J3421j688j5902O971K4304p38k1348M59J9826J597j2763L956
483A1100R638j3156j6871J0536J5711j3468k1878L683J1850p450q366J0951O100
496a620j5495o537K0444J3964j3341j0261J2030P570r886j051J3274k895k0606
509a4410k336J8617K673j7628m711J1307r44r637Q378J5471p101j5519R207K0830
523A4197p16j1665N119R820p338o755J2934Q716j6368j4782J0096J1020r866r588
537e176O926K315j1822m98J7329M554j5998m907J5505P299r154j323Q964m260
$$ plain form
443 -27813 -23206 820 -2546 -23113 -20452 -6464 -13848 -22647 -3731 13893 -1815 -18322 -280
456 -280 21669 13193 974 11796 18348 2665 -1842 18393 23085 -2169 -14207 3946 12884
469 12884 -2280 -6995 6426 4738 -11164 -4193 20111 19373 -1975 -1516 18310 19907 7144 11100
483 11100 20738 7582 -9289 1247 16958 3490 -18388 -14705 -2855 -10305 -18671 -7720 -1620
496 -1620 -17115 -23652 -3208 10756 -2585 -12846 -816 6754 -3132 -4183 9091 6196 -14410
509 -14410 -16746 1871 4544 -13084 -17795 -6488 -7432 -17069 -8691 6780 -321 -15840 -6633 14197
523 14197 13481 1816 6935 16755 9417 2662 15596 24312 7944 -6838 3258 14278 4412 -5176
537 -5176 1750 4065 -7757 -8255 9074 13628 -2370 -7277 8228 15527 6373 5050 14014 9754
551I754j3469L860J4222n393j9019k102J0945k196r859L820O941r547r541J2190
565i394J4772p104j1911O849J0682m277l683R778L018j4177n908J4264P373j3285
579c003r188P651L313q262R45J1495j936j3803K182J7424L958j0683k30J0015
593I878q38o742O824R961q673j4265M516J2013m309j1173J760M500p383m606J0969
608B432O899j1528q812J0310J0177n508m985O410J311r360n8J2356P23j4995n470
623a0098R921K790q873j332O244m380r765N604J3203k905j2290K019J1166p9n351
638d126N390N763q173p101R780R742q225j0604M286O141n230l156P379J380j0913
653g667k711J2746O454q800m609P561L100n322K065Q685l075j1709R63J1499L17
$$ plain form
551 9754 -3715 145 14367 8974 -10045 -12147 -1202 -3398 -13257 -9437 -2496 -12043 -21584 -9394
565 -9394 5378 -1726 -13637 -6788 3894 -383 -4066 5712 8730 -5447 -11355 2909 10282 -3003
579 -3003 -12191 -4540 -1227 -9489 -8544 2951 1015 -12788 -10606 6818 10776 93 -137 9878
593 9878 9040 2298 9122 19083 10410 -3855 661 12674 8365 -2808 -1048 3452 -3931 -8537 2432
608 2432 9331 -2197 -11009 -699 9478 3970 -1015 5395 6706 -2654 -2712 9644 10367 -4628 -10098
623 -10098 -177 2613 -6260 -7592 -1348 -5728 -15493 -9889 3314 409 -11881 -9862 1304 1225 -4126
638 -4126 1264 7027 -1146 -8247 1533 11275 3050 -7554 -3268 2873 -2357 -5513 1866 3246 -7667
653 -7667 -10378 2368 8822 22 -4587 2974 6074 752 2817 11502 8427 -3282 -2319 9180 9497
668I497j0210j694N461k758n683N477O928p251r759N633J0225k728o847L366M083
683C740n544k439R169M230j0266o815P656N877o024l950M690m60p822J172J0364
698C578L59j0709j969R206K771n452R09N518l446o618N133R339l616r672J374
713c295P088j610m609L578L229o748m852P644O909n894o642M083M639l465j279
728a224N911M41q422j742R034L511p465l779M788R66m564J706O029l113q556J684
744d795Q863P2o926q3M481k074l516M940N095n758o898M496P059k576m975K417
760a78K362m406j387O789K662p428m362N909M373l951k349L452l54n192J229P226
776D395p4p641j503O069J650l845M85L325k875m682L733O473k663o869Q61M893
$$ plain form
668 9497 -713 -2407 3054 296 -5387 90 7018 -233 -9992 -4359 5866 3138 -3709 -343 3740
683 3740 -1804 -4243 4926 9156 -1110 -7925 -269 5608 -416 -4366 324 -136 -7958 -6786 3578
698 3578 3937 -6772 -8741 465 3236 -2216 -1307 4211 765 -5853 -720 8619 5003 -4669 -3295
713 -3295 3793 2183 -2426 1152 4381 -2367 -7219 425 7334 1440 -5202 -1119 3520 55 -1224
728 -1224 4687 5128 -3294 -5036 3998 7509 44 -3735 1053 2019 -2545 -839 5190 2077 -6479 -4795
744 -4795 4068 4140 -2786 -2869 1612 -462 -3978 962 6057 299 -6599 -2103 4956 2380 -2595 -178
760 -178 2184 -2222 -3609 3180 5842 -1586 -5948 -39 4334 383 -1966 1486 1132 -4060 -2831 4395
776 4395 4321 -3320 -4823 1246 2896 -949 -464 2861 -14 -4696 -963 5510 2847 -4022 -3161 1732
792A732r95k980K505J897n050l235N630M808m447m762K968L388k278o71M286K06
808C002n907r55O610K487n316k752L234O92l021J307M110k352n990J313O492M62
824C416m713k63L119r11j944L469L353l951m838K972M979j695l889Q99J370k974
840a601j181M251J650n265l256M028L508k352j724K327J35l163J063N220O6n600
856a894j470M284J389l011m82J846k096l358K460M642j805m979P09M194K31j814
872a154J835J829k842k012M106L637l048l948J586K526j529j217K125l7m171r68
888c282M524K129l653k278K475J525j465P79K876j085l962P17M585M03l862j224
904g98J842o74j965J490J977k973l787J920M013p58k896P02J822j153n21L207
$$ plain form
792 1732 737 -2243 262 2159 -2891 -6126 -496 4312 -135 -4897 -1929 1459 -819 -1490 2796 3002
808 3002 -2905 -3860 2750 5237 -79 -2831 403 1095 -1926 -619 3491 1139 -4851 -3538 2954 3416
824 3416 -1297 -1560 1559 648 -1296 2173 5526 1575 -3263 -291 4688 2993 -896 3 1373 -1601
840 -1601 -2782 1469 3119 -2146 -5402 -1374 2134 -218 -1942 385 520 -2643 -1580 3640 3706 -1894
856 -1894 -3364 920 2309 -702 -1184 662 -1434 -4792 -2332 2310 505 -4474 -3765 429 660 -1154
872 -1154 681 2510 -332 -2344 1762 5399 2351 -1597 -11 2515 986 -231 1894 1857 -2314 -3282
888 -3282 1242 3371 -282 -2560 -85 1440 -25 754 3630 2545 -1417 -700 3885 4288 426 -798
904 -798 1044 370 -1595 -105 1872 -1101 -4888 -2968 1045 287 -2609 -1907 -85 -1238 -1759 1448
920A448J587l510k468K988K768k011k167J073J65k378J33L281Q0l993j096L421
936f79J817j719l00J802m95j801J871L498r24l689J3K939K07j915K15P75k102
953d87j826K309K473k201l019J173K435m93p74J619N68k359n62L247J616k750
969I69k166J402R38j513k72J439j060l099K26L318N12k747p86J859M26q20J305
986f9J773j553k365J507L035n02k490l0J129q46q22J583Q47k456j882K009K309
1003A177r82j472R09Q26r04L37K382L99k576r42K328J312j495j001O53m91j521
1020a061P03K006q01k775j38K286N85j180K01Q96q90r31J788J900j397k323N60
1037e71J693l86j057M65N9j713o04K037J126j915j586J152J316m45j47J092j84
$$ plain form
920 1448 3035 -475 -2943 45 2813 802 -1365 -292 -127 -2505 -2372 909 989 -3004 -4100 -679
936 -679 1138 -581 -881 921 426 -1375 496 3994 3070 -619 -606 2333 2540 625 840 1615 -487
953 -487 -2313 -4 2469 268 -2751 -1578 857 364 -410 1209 1777 -582 -1144 2103 3719 969
969 969 -1197 205 1143 -370 -642 797 -263 -3362 -3136 182 694 -2053 -2839 -980 -554 -1374 -69
986 -69 1704 151 -2214 -707 2328 1826 -664 -694 435 -411 -1233 350 1197 -1259 -3141 -1132 1177
1003 1177 195 -1277 -368 458 -446 -109 2273 2672 96 -846 1482 2794 1299 298 951 460 -1061
1020 -1061 -358 1648 847 -1928 -2066 220 805 -375 -174 722 -168 -1099 689 2589 1192 -1131 -571
1037 -571 1122 736 -321 144 203 -1510 -2114 -77 1049 -866 -2452 -1300 16 -429 -576 516 332
1054C32j565L30K351N87j930r45J086M48p12K33P59j086j740P35K121p4j753k15
1072a038J087Q8k83J046P10j370j222J349J708p07j471J19N04o33j88J131M0j847
1090i77q26J570J173r14q30N22J75n98N66J412l41j831k19J650O22j019m61L79
1108E3m25o44Q61J134q97j668K79J513K05p77J04L86o33k67J320R40j148j302
1126i66O26J147k47n60L09r7j026pJ467M77j428q84Q64P61l70m3N20m67j033N01
1146d56J537J6j434m34Q47K32m03L29L99r05r55Q36J359l90j243oO86p3j80O61
1166D23K25j146o39J146J076o71r56K59M35l17Q3Q37j26j284k85J269O62q29n81
1185d19L94M8m37M52Q57n11j290J08J268K62q07j62L61l12l26Q50P24q85j112
$$ plain form
1054 332 -1233 -903 1448 2035 105 -840 246 694 -18 215 974 -112 -1852 -1117 1004 930 -823 -1038
1072 -1038 49 137 -146 900 1610 240 -982 367 2075 1368 -103 16 520 -113 -301 830 870 -977
1090 -977 -1803 -233 940 26 -804 -282 -107 -705 -139 1273 932 -899 -1118 532 1154 135 -326 53
1108 53 -372 -1016 -155 979 82 -1586 -1307 206 411 -366 -262 124 -509 -776 544 1484 336 -966
1126 -966 -340 807 560 0 309 212 -814 -821 646 1123 -305 -1189 -325 436 66 23 543 76 -957 -456
1146 -456 1081 1097 -337 -771 76 308 -95 234 633 -272 -1227 -391 968 578 -665 -671 15 -58 -238 423
1166 423 648 -498 -1137 9 1085 414 -542 -283 152 -165 -82 755 629 -655 -940 329 991 162 -419
1185 -419 -25 23 -414 38 895 384 -906 -798 470 732 -75 -237 124 -188 -514 336 1060 175 -937
1204i37N06J062j51o63J23J26o43j00J040M35j106p97P32Q05l05k73L89j36p19
1223f12K84J224J23j197m72P91M05m08l2K98n50p57N75J125k68j117m7P98J16
1242B79k55L81K78p63n33R11Q79o10r18J62M57k96j18N37j05j056k80J048N77
1261E75p58n49M24K26k62L38P09l54j000J37J107J93q04k78K96k22l36N28N05
1280D75p20r43M29J002l9n38J40K67k92LQ85M05q85o75O44O87l41m27J30j39o08
1301e40J45Q77Pj043l37P57M45k96JL33l04m85N63R07k59r64q2O08K4l59J15M7
1323A60p27m49O93O77n51p59K38N61l9J3M54M9o66j00R29M42o75n57K61J84k89
1344a51P2L69l70q33J02R11K37o24k07L93R9o1M89M47n10o58M09Q31j10o24j08
$$ plain form
1204 -937 -431 631 480 -183 -60 66 -577 -677 363 798 -308 -1105 -373 432 127 -146 243 107 -612
1223 -612 -328 896 1019 -178 -650 141 546 138 106 404 -146 -903 -328 797 529 -588 -635 163 279
1242 279 24 405 683 -80 -613 298 1177 567 -351 -189 268 -28 -146 391 286 -770 -1050 -2 575
1261 575 -183 -732 -308 -82 -344 -6 703 349 -651 -514 593 786 -18 -296 0 -222 -558 -30 475
1280 475 -245 -1188 -759 243 204 -334 -194 73 -219 -216 669 1074 189 -486 158 845 504 77 207 68 -540
1301 -540 -395 482 489 -554 -891 -134 311 15 16 349 45 -440 123 1030 771 -193 -275 333 357 -2 113 160
1323 160 -567 -1016 -323 354 -197 -956 -718 -157 -196 -183 271 320 -346 -446 483 925 250 -307 -46 138 -151
1344 -151 -79 290 -80 -913 -811 100 337 -287 -494 -101 -2 -63 426 873 363 -295 114 945 835 211 103
1365A03J23k98j06M85J20p94n30N42O24k15l25J96P5k67K66P27K1q00k57O05L22
1386F17l71k46M2l07m22L10N95l00q05k8O59K28j78J28J81k88j59O43N68m11o69
1407b13J28M31p2k03J19r2n93j35O60L54n66m64L40L66m6J11L37j38n14J79P64
1428G53J42o26k94K31L1k19J31J54m87n85K76O61n3n09m6K92j5L0M64K01n27l95
1450c90M86N41k48m50j0M2k69J8M19n4o81k54N64L99k43j84J98Oj76L35N63j31
1472D81o60k6N46J71l20q5M5l14k40L97L98m03n96J44N00M7j49J74O0l12j3O00
1494D45L26m80m57K21K77j55r3J42k10n14L5O12J17n48k55L06J87o9J60K34k70
1515A1m24L01O22l9n21j23K16l6j10K51Q9n02l84M00N14j87l79O7J70r4R6M22
$$ plain form
1365 103 226 -72 -178 307 427 -367 -897 -355 269 54 -271 -75 0 -267 -1 726 747 -53 -310 295 617
1386 617 246 0 42 -265 -687 -377 218 -82 -887 -915 -256 -28 -206 -78 103 -185 -344 299 867 456 -213
1407 -213 -85 346 274 71 190 98 -495 -630 30 384 -182 -646 -306 60 14 125 462 324 -190 -11 753
1428 753 895 269 -25 206 237 18 149 303 -184 -769 -493 168 115 -394 -440 -148 -163 -133 331 532 5 -390
1450 -390 96 637 389 -61 -71 -29 -298 -280 139 85 -596 -850 -286 113 -130 -314 -116 -110 -286 49 612 481
1472 481 -179 -205 341 512 192 107 152 -162 -402 -5 393 -10 -606 -462 38 85 -64 110 170 -142 -155 445
1494 445 771 291 -166 55 332 177 84 226 16 -498 -463 149 266 -282 -537 -231 -44 -113 47 281 11
1515 11 -413 -112 510 471 -50 -173 43 7 -103 148 237 -265 -649 -249 265 78 -301 -234 -64 -158 -62 360
1537C60L3n38j78N29L31k76k50P9n3k16K03L83k18o01m6N09J87k57n6J14j65j11
1559b37L89L84l27n14J19M30J6k05L9k0l29o6M85K37m56m09K30L28o4n9J47j10
1581Hl51J15N55J01m80k33K62J68j04P6J17k90l59K69N11n3m73q2K09K3k7K13
1603A75N7m16k58L94M40j89l66L8J08o0P6K77m1m74j35M41K88k50k35O1jj09J78
1626aK96j85m96J1M42J62k26r0O7j13m7L25K77l02m06J26L75L4j80k6l9k21QL65
1650A56J32l78l17K10K95l6n7Q0p9k27J50M35M2l96j93K08J48p6JJ1k45k42J96
1673a82L83r4l66q6K07R5J5J31K8k53j41L16L56j52k97k1J05k7RJ40j00l69j27
1696d30L35K38j96k06O5Q3K2J78K30j07l09L0L81J27k07j54rp3o8J56J24k73l33
$$ plain form
1537 360 393 -145 -323 206 537 261 11 90 37 -179 24 407 189 -412 -458 51 238 -19 -75 39 -126 -237
1559 -237 152 536 209 -305 -186 244 260 55 94 74 -255 -321 164 401 -55 -464 -234 94 30 -29 118 8
1581 8 -343 -228 327 428 -52 -285 -23 145 41 117 234 -56 -415 -146 365 312 -161 -243 -34 -11 -38 175
1603 175 232 -184 -442 -48 392 203 -163 -125 -17 -77 -1 276 235 -239 -374 67 355 105 -130 -69 -70 -179 -1
1626 -1 295 110 -386 -375 67 229 3 -87 -20 -133 -180 145 422 120 -286 -160 215 249 69 43 4 -217 -209 156
1650 156 288 -90 -407 -197 98 62 5 85 6 -221 -71 364 406 10 -183 25 173 97 98 109 -136 -378 -182
1673 -182 201 107 -259 -345 -138 -43 -28 103 131 -122 -263 53 409 257 -40 -61 44 17 26 166 66 -303 -430
1696 -430 -95 143 -53 -259 -194 -111 -89 89 319 212 -97 -67 314 441 234 80 71 -2 -70 86 210 -63 -396
1719c96P6L12O4j35k8J1m0P2L17J38k60k37J50K52k8j30n5j16j76L6K38j0l30
1742b75j93J72K01%MN0n9q9K02L53lk78j03J43Q4l2j0p8k55j61J69K40j23k73
1766c14l9J67J13P9J32Jj94j3L18K27j39k32k8M8k2K1M6j42l19n7K46J26j60j53
1790b88M1P1N4J89J75j18k12R4K98J00j95j28l2q5k5J09K8k69k85R2K52L9r7j5
1814b07K1j2J48K92Q8k25j46J69J94k2j17o2j54j45Q1J95p0l03j15J67J50L0K2
1837b1K4q0k4K27K79o0k43m3J28O9l1j9j06k62j06J79J52j56k53lJ29Q3Q9J16
1861F8k8j49N2K91J58j54j76MK3l1M3J5k03k53L0K25O9j70q0L8M5J02J98J03j61
1886E9j35J44K60L5j67r0n4n2K7J26m4k77j69J30J78rp5j3l2JJ76K41lk15n7J64
$$ plain form
1719 -396 -320 -8 56 -79 -107 -96 -136 -64 253 391 131 -106 44 296 268 138 83 -33 -209 -173 65 55 -275
1742 -275 -468 -296 -95 -95 -91 -41 -100 -189 13 366 363 85 -18 125 209 177 167 89 -166 -327 -158 82 -41 -314
1766 -314 -353 -186 -73 6 138 139 -55 -68 250 477 338 106 78 126 104 125 171 29 -290 -347 -101 25 -135 -288
1790 -288 -247 -176 -122 67 242 124 -88 6 304 404 209 81 49 -36 -61 48 76 -193 -478 -386 -134 -95 -192 -207
1814 -207 -186 -198 -50 242 330 105 -41 128 322 300 183 121 -33 -178 -97 98 28 -275 -390 -223 -73 -43 -21
1837 -21 3 -77 -101 126 405 345 102 59 187 256 225 206 100 -162 -268 -89 63 -93 -346 -349 -220 -137 -48 68
1861 68 40 -109 -57 234 392 238 62 66 89 58 101 116 -87 -340 -310 -85 -16 -186 -266 -228 -183 -81 117 220 59
1886 59 -76 68 328 363 196 106 52 0 27 153 109 -168 -337 -207 -29 -38 -113 -126 -158 -157 19 260 257 42 -15 149
1912A49J38l3p6q9j40r3J22J24j28k66n4J59J11K2J6k5p5K6K44J69j11j84%J01
1936A07M6lk0j23j87pJ90O1j69j58K0R3Q4P1O2q8j06J12K35O9j53j00NK6K5N7
1962A49l0j92j54Q8J64Oj36n8kN0J05J49nj63p2J49J80j5j11q3m4k4Q8Q5p0k35
1988a81p0J25J33j5n6m6n2L2J63J39o8j67j6J34R9nn6q5j03J4J43Q3j36j79k0
2013a90J09R4K5k2p6q9P5J99Q5j25j31KR1N2K3l5j22j01O1J50M2j30j25J0O6P1
2039IO4j6j31q5J03J84L1j22r4j1O2O7P2m9j50q9J10J60Kj20q1j3L0J07R0o4j76
2066a10o1J30J48lr0p5k7M9J14R4p3j89l9J41J18j7q8p7n7L6J19R6j16j65k3J27
2092c8J10Km7q1n7O5J67P1j07j66QJ05Q0Nn9j10j02P2J61L7j45j39K3R8Q0L7j8
$$ plain form
1912 149 287 254 178 89 -51 -144 -22 102 -26 -292 -346 -187 -76 -54 -38 -63 -138 -112 132 301 190 6 6 107
1936 107 153 150 130 7 -180 -187 3 64 -105 -263 -243 -150 -66 5 67 -21 -127 -15 220 289 136 36 41 67 92 149
1962 149 119 -73 -227 -139 25 31 -105 -163 -165 -115 -10 139 134 -29 -101 48 228 213 102 19 -25 -49 39 124 54 -181
1988 -181 -251 -126 7 -8 -64 -110 -162 -130 33 172 104 -63 -79 55 154 149 93 8 -95 -81 62 145 9 -170 -190
2013 -190 -81 13 38 16 -60 -149 -74 125 210 85 -46 -44 47 99 122 87 -35 -136 -75 75 117 -13 -138 -128 -62 9
2039 9 73 57 -74 -159 -56 128 159 37 -57 -68 -6 61 133 84 -66 -155 -45 115 117 -3 -84 -97 -67 40 130 66 -110
2066 -110 -171 -41 107 104 14 -61 -88 -39 75 169 96 -93 -132 9 127 110 22 -55 -112 -76 43 139 23 -142 -165 -38
2092 -38 72 74 27 -54 -111 -46 121 192 85 -81 -73 32 112 117 58 -52 -154 -82 79 116 -29 -168 -145 -47 33 70 52
2119E2j12o5R7J96L6j30j16K3N0P3L6p7j77r8J23J51oj23r4J6R5J05Q4n5j34n1
2145a01J62J38k1j15q6l0L5R2M4j06j82l6J21J04k6o3p3k0P4J62J00q7j40J0J33
2170H9J09j5p6j16p5M4J28J5j56j55RJ01R2J2l1r1j9J09K00M4j11j00K2Q5N0J3
2196A77r4j50r0P9J25j6j52j01J1R6R6O4l9r9l3J54J80kr8q0PN3O9J9j11j81p0
2223a86R8Q9k2j07o3k3J04J48P5n9j12K8J40J22pq6r0n6M0Q3Mj32j55l5Q3O9P
2250d3m7q3qR9J64O5p2r0J5J14R6J3q7j27p4N8R9k2j33j32j4Q7P8K2n1p7nJ34
2278b1J43N9o9p9J5P1P5J6j02j47o5M5R6m2j05j10j4Q8J09O4m2r5NJ38J52J0p9
2305A16q3j3P5O9Rj08j52m6O3P6oj00r0j7P7J38O1o0q4J6J21J24K2q9q7k7M3R0
$$ plain form
2119 52 -60 -125 -28 168 204 74 -42 -19 31 104 140 63 -114 -212 -89 62 56 -67 -161 -145 -50 55 139 84 -50 -101
2145 -101 61 199 178 63 -23 -53 -18 74 118 12 -170 -206 -85 19 -7 -70 -143 -163 -89 73 173 86 -54 -44 89
2170 89 198 183 107 -9 -84 -40 88 103 -53 -208 -199 -98 -6 6 -25 -116 -135 -26 174 218 107 7 29 114 164 177
2196 177 83 -67 -157 -78 47 31 -121 -222 -211 -115 -19 45 6 -93 -126 28 208 206 108 28 35 88 157 176 65 -116 -186
2223 -186 -88 1 -21 -128 -191 -214 -110 38 113 54 -58 -30 110 232 225 139 49 -7 33 116 120 -12 -167 -202 -119 -50 -43
2250 -43 -90 -173 -181 -82 82 147 75 -15 0 114 210 223 136 9 -65 -7 92 70 -63 -195 -209 -122 -44 -22 -73 -150 -155 -21
2278 -21 122 181 112 33 48 119 194 210 108 -39 -104 -59 37 -5 -110 -220 -234 -146 -37 27 -15 -110 -105 33 185 195 116
2305 116 33 20 95 164 173 65 -87 -133 -70 6 0 -100 -190 -207 -130 8 69 9 -75 -59 62 186 208 119 32 5 48 138
2333A38k5j19j43l2P6Q7j2p6q2PJ07J26N7o8p3K1J12R3Mr7r1m0N5P0j6j21j14
2360a56LP1O0J1m7p8KJ03J18L7p5p5J8R6P4Nq5j15m9P5P5j7j29j04nR4Q7J7n4
2389d3o8qJ32J30Or0o2J0O2O6Qq5j13l2O3O7k7p7p0k0P7R2M3o7r3K2J15R3Np0
2419F6p7nN0P8Pj15j05pQ3O0k5p4m7j4O6J02L4p7q5L6R5O2Lm7p7j2M8Q2oj16q8
2450a05KO7N9jm7q4JP5J07Nq2o3J3P5O0J6n7q1l7P2Q7j4q5o7nN2P4Pn3p9j2Q8
2482a2Q9mn8n4jL5Q0K5o4r2j5P5N5J2o6o6l4N6Q2K9o7r8qQ5Q4mn3q0j1Q0P7Np7
2515Ep4j3P6O3Pm5q1k2N4R1J1p1o8j7O2O5K9o1p4k4P7P7J3o9q0JO5O8Nn3q8j5
2547h6P4Q2j1p1o6j3N2P7J1n0p4qP1P7J8o8n3j3O2N6K1n8q3k2O1P0J2p0p7LL7
$$ plain form
2333 138 113 -6 -149 -181 -105 -18 -30 -106 -188 -181 -74 52 109 41 -32 -11 101 194 198 101 10 -30 25 95 79 -42 -156
2360 -156 -153 -82 -22 -11 -58 -136 -134 -31 87 124 49 -26 -8 88 162 167 82 -33 -82 -7 68 51 -78 -182 -187 -93 -6 11 -43
2389 -43 -111 -119 13 143 149 59 -3 7 69 135 143 58 -55 -87 -24 43 16 -61 -131 -151 -74 18 61 -6 -99 -77 38 131 136 66
2419 66 -11 -16 34 112 119 4 -101 -108 -25 35 10 -64 -111 -125 -59 43 77 0 -85 -49 46 108 111 64 -13 -25 23 105 99 -17 -105
2450 -105 -103 -36 23 22 -25 -109 -108 -33 74 79 -3 -66 -53 22 82 98 41 -40 -77 -5 82 68 -17 -84 -89 -37 37 44 -9 -88 -100 -12
2482 -12 77 73 15 -39 -40 -5 75 100 36 -56 -71 4 59 71 5 -61 -95 -39 43 72 5 -93 -101 -16 68 64 11 -69 -80 0 77 82 5
2515 5 -69 -82 -6 57 64 19 -62 -84 -30 61 72 1 -67 -84 -22 43 72 11 -63 -87 -10 67 80 11 -69 -68 -3 65 70 17 -71 -86
2547 -86 -12 70 59 -12 -78 -91 -39 38 49 -1 -75 -83 -12 65 83 15 -38 -51 11 67 88 30 -53 -75 -14 56 68 -2 -79 -76 -39
2578c9P8J7n9o8lP4P7jn5n6j1N6O2J9p4o9j6M7O3jo7n7rO6O8K2o3p2J4O9P1Mn3
2611C4m1j6L9O0Pp3p5j1O4N1j1n0o3pO0P4J2m8o8J7N9N1K0m4p2j5M1P9ro9o2n
2643g1M0M7J0m1p5KO7P0J0m9m3J0M1M8L3o3p3j1M4N8ko2o4j4N1M7J9n1o2RO0N3
2675C8Jl1m1kK8N9K2o1n7j1M4L8Km8m3j9L5P1J9m7n1KN7N9Ml7n2j2L7Q2j2n7n2
2708c5j7K2N4J0m6o3j5M8P5Qm8n2J4L3O2K3m1n9k6N6M5On9l7j5K3N7J5l9o1j1
2739g3N7M2K1m2l7j3M1O6K2n2o7jM8K8Nn2m2j7L3N5J3m8l9pM5L6K0k2m5k1K9O8
2771E1J3m2m4j5L1M1K6l9p2j5N2N2Qm6n1MK9O5J0l1o9%M8M3Rn6l8j3L8M0J4m3
2803@n3j3L6N6J7m2l6j9L7O2J2l6n5lL8L9J1l3n2pK9M8Qm1m9NM5M6j7k6k5k8N1
$$ plain form
2578 -39 39 56 -3 -71 -74 0 77 76 21 -35 -46 10 72 91 17 -52 -68 -21 42 41 -26 -83 -92 -26 42 64 1 -71 -57 12 83 87 34
2611 34 -7 -23 16 76 83 10 -65 -76 -12 39 28 -22 -85 -92 -32 42 54 6 -62 -45 14 65 85 41 -31 -46 -5 74 65 -4 -66 -71
2643 -71 -31 16 26 -15 -90 -88 -21 49 59 10 -33 -23 18 66 99 36 -37 -48 -4 54 52 -10 -74 -88 -37 10 29 -22 -84 -75 -15 38
2675 38 39 8 -33 -35 -7 52 74 13 -44 -55 -11 27 29 -19 -62 -81 -46 25 44 -3 -54 -52 5 64 68 31 -21 -33 4 86 74 17 -35
2708 -35 -52 -30 24 34 -12 -75 -90 -42 33 41 -7 -59 -45 -12 50 73 32 -27 -53 3 48 54 -5 -42 -57 -34 23 38 -1 -62 -73
2739 -73 -16 26 47 5 -32 -45 -4 62 84 32 -35 -36 12 40 45 -7 -49 -66 -33 22 35 -13 -52 -59 -14 22 42 20 -25 -46 -17 51
2771 51 64 22 -22 -37 -6 35 61 22 -50 -65 -13 39 47 1 -50 -46 -17 48 58 27 -42 -42 6 49 58 2 -36 -49 -11 29 43 0
2803 0 -53 -66 -30 26 43 1 -35 -54 -17 45 57 21 -34 -37 1 40 51 18 -34 -41 -12 36 44 3 -46 -41 4 50 33 7 -18 -46 5
2836EK6K0m2m7JL1L6Qm1m2j0M6L5Nk9n1PK9M3J1l5n4QL1K6K0l0l7k0M1M4Qk9n6
2870d2mL8L0J7l1m4nL1L8J0m0k4rJ9K8K1l2m1LK7M0mk7k6j8J4L8L0l8l0j5K3L9
2903A6Pj6l6k2L2N0Mk7l4rK6L8Jj7l6j0L2K0J0k7k6k0K5L2J3k0l9j9L7L1J7k1
2935A2l2rJ9K7J9k5m0j0K4M4%k1l3j8K6L5J2k4k8j0K0M0J0k6k1qJ1L4J1j9m1n
2967b6PL6lk4j9j8K7K3K0k1k5j0J5L9Rk1j6k1K6K8Rl0k1j3J2K8K0k9l2j4K2M6
2999B4jk5k5J6PL1Qj8k9mJ1K7Ok4l3j1J4L5J1j8l4k8L1M0J3j5l3kK6K4J7k6l5
3032b0k1L4K7Rk9j9qK2OJ4j5k6j4L5K8Pl0mj1ML4J3k4l2pJ8J9Ok1k1k0K6K2K7
3066B9l0k8LK9J3npqnKK6J7k6k5mJ9J5%j4j3k7K0L6jj7rmNK7J4j7k9j7J9K9qj8
$$ plain form
2836 5 31 51 9 -38 -37 -6 30 38 -3 -45 -55 -9 26 31 2 -49 -42 -13 30 41 6 -48 -40 -9 17 37 7 -30 -50 -9 35 43 14 -42
2870 -42 -46 -8 22 39 8 -36 -41 -10 28 38 -2 -26 -35 -16 12 33 1 -40 -37 -10 30 26 -1 -27 -45 -31 7 37 -1 -31 -46 -23 16
2903 16 23 7 -29 -51 -19 31 35 8 -26 -35 -9 29 30 13 -23 -33 -1 19 29 2 -24 -44 -19 13 26 6 -33 -52 -15 16 33 12
2935 12 -20 -29 -10 17 36 11 -29 -39 -15 29 29 8 -25 -43 -17 18 30 6 -22 -32 -12 28 38 12 -9 -17 -6 28 39 20 -21 -26
2967 -26 -19 17 14 -10 -29 -47 -20 3 23 2 -23 -33 -18 21 30 9 -7 -28 -2 26 35 5 -16 -29 -17 11 31 2 -30 -44 -22 24
2999 24 23 -2 -27 -11 -4 27 35 17 -12 -16 -5 22 28 4 -29 -40 -26 9 20 2 -32 -60 -29 11 24 9 -24 -26 0 24 41 15 -20
3032 -20 -41 -7 20 29 0 -19 -27 -5 1 15 0 -26 -40 -5 23 30 0 -4 -15 -11 23 36 12 -20 -27 -9 10 16 -5 -26 -46 -20 2 29
3066 29 -1 -29 -26 3 16 11 4 -4 -9 -7 19 36 10 -15 -19 0 15 15 1 -12 -39 -19 17 16 -1 -10 -14 -9 18 32 15 -14 -31 -12 17 9 -9
3103ij2NjMK0rk3nJ3K6Jj5Qj6J8LK1ql6QJ9Pjnj3j7jK2K4j8k3j3K1J5pPj1j8k
3142b1K8Njl0PJ8nJ1lk3j6LM3Ok6j3lJ1oK5Mk7qJ7J8qjj3PNKJ8jl7j1QL5qk0L
3182gj0LJ7J9j4k9JJ3J4nrKpJK0Mj0j1pJ1J5ojrj6kK8NLj9%MjJ6Jkk9J0K4Nk0
3223Bj5MPjRlj7j7J6J7oj0lPkJ3PmroRK1qk1MKOJJ4rk0j3K4Rmj3kJ1jJJ1Pk5O
3267aPJlj0KorJ3Mj5oNPQpLOjj3J4J8pljPqMoRk3lJ6Lj4J%PkMOokMLQj7mRMj2
3317fJ6qkk8J3Rj0qRjJ4j7PK2k4ROJ1jrKOrkJ1Nk8J1%%rJ1nlj4J8Nj0%OQj2JJ2
3361Fj1j5QjJ4j0J0k0J1pOJ0jj0qPJ2okRKkJ2nLj6KNNj1%ponJ4QprPJjJLJnMK
3408bJ8k5JJ7qqKJ3k3jJ8MmpmRKMOMpnMRj5j0MM%nPjqNMj0%JOojLJ7oomJ4qLO
$$ plain form
3103 -9 -21 -16 -17 -13 7 -2 -25 -30 -17 9 10 -5 3 -13 5 8 29 21 -15 -7 12 19 18 13 0 -17 -18 4 28 10 -13 -26 -5 10 3 10 -1 -19 -21
3142 -21 7 12 11 -19 -12 6 1 12 9 -14 -30 -27 16 22 -4 -17 -20 -9 -15 10 14 -13 -21 -4 14 6 5 -8 -1 4 6 24 23 -14 -25 -17 18 10 -10 -7
3182 -7 -17 -14 3 22 8 -21 -20 -7 7 2 -7 -5 -12 -11 9 13 3 -8 -15 -4 11 5 4 -5 -21 -23 5 10 13 -6 -6 -2 -3 13 14 12 -17 -7 17 22 2
3223 2 -13 -9 -2 -3 6 3 -14 -31 -15 2 -4 -14 -17 -10 -12 1 8 4 -5 -11 -2 19 11 -10 -6 -4 2 3 17 8 -12 -25 -1 8 4 -9 -11 0 -1 0 11 18 -7 -1
3267 -1 6 7 4 -6 -4 -10 -19 -6 -2 -17 -23 -18 -11 -3 -10 -7 -1 -2 -15 -1 17 10 7 6 13 5 9 3 12 -11 -14 2 5 -9 -8 -8 -1 -3 1 7 1 -1 3 6 14 -3 -7 2 6 -6
3317 -6 10 2 0 -28 -15 -6 -16 -24 -15 -16 -2 -19 -12 10 -14 -5 1 12 11 2 4 10 1 -1 10 15 -13 -2 -2 -2 -11 0 -5 -8 -22 -4 1 -9 -9 -3 5 -7 -6 6
3361 6 -5 -20 -12 -13 1 -9 1 -19 -8 -15 -9 1 0 -10 -18 -11 1 -5 -7 2 4 2 14 9 12 -4 -2 3 8 -3 -3 -10 -16 -21 -7 1 -6 -15 -8 -7 -8 -7 -4 -3 -8 -4 -2
3408 -2 16 -9 -8 9 1 -7 -5 8 -15 -16 2 6 2 -5 -9 0 2 6 12 16 9 4 8 17 2 -8 -4 0 0 -5 2 1 -7 -2 2 -8 -8 -7 -1 -7 -8 -5 12 6 0 -4 10 2 5 11
3458A1oJj4Qn%RkKJLjOj8mJ7o%njLNqJ6j1rjKMLrj0NJPkkJmRoQ%%oLJ5mkp%J6
3510A3j2kKoJJ0jrRrRrJ0krkoJ5mlnkNj1QlNmKNLmLmPj0KK1qmJ%mQljo%J6kqk
3562@Rj2JrJ6Jj9PRmoMLj2NlJ2Jj9J9nrJPljPLJj0jLJ6j2NJ0j2JMj2J0jmpJ6j2
3608blRj2QlOlj0NlOJJrj9J5J1lkQpQkmRqJJJ1Qk0J0qkJJ2Lj6jLQqK%Jj7J0MO
3657Fj0oOj1RlNokOJ0lmqQoLJ0Kjj3J0J1%k0jPkmJ7om%J0jj7J3mjLlNpj9JK4M
3704Hk0%Oj3NORj2j1J1K1j2N%kjj2K2Mmj5%QOj7J2Jj4JJ5Qk7jJJ9j5J4nj2Qj1
3745a4J7Jj3kJ3jrNmj2kK1Qj1j3J2Pj0%J7kj1nK5j5j4MJ8mmj3RmoQJ2j7omK1j
3786AmKJrj6J4K0k3J3kJj0J1LlnoJ5Qj5PJrKj2K6kj4J0mPj0kJ3rj3J0Oj0j2LJ3
$$ plain form
3458 11 5 6 -8 0 -5 -5 4 2 4 5 8 7 13 -5 -9 8 2 2 -3 -4 -1 4 -4 12 1 -8 -9 -7 -3 0 -9 -19 -14 -13 -6 -8 -10 -9 -13 -4 -10 -2 -2 -2 -8 -5 10 6 4 -3 -3 13
3510 13 1 -1 1 -5 -4 6 5 -4 5 -4 5 -4 6 4 -5 -7 -13 2 -2 -5 -10 -12 -7 -18 -10 -13 -8 -12 -10 -5 -2 -6 -3 -7 0 -10 -8 13 5 1 2 2 -2 6 3 2 -4 -4 12 10 2 0
3562 0 9 -3 -2 -11 5 6 -13 -6 3 -1 -7 -3 0 -12 -7 -10 2 3 -16 3 -2 -11 -10 -3 -6 -7 0 3 4 -6 -7 -4 12 0 5 15 3 4 8 -4 6 5 1 -6 10 -2
3608 -2 -5 4 -8 0 -3 3 0 -10 -5 -8 -2 -1 0 -9 -28 -13 -2 -5 -7 1 -6 2 0 -4 5 -3 -2 -1 10 18 -2 8 0 -2 -1 11 14 -2 -3 0 8 0 2 2 3 -14 -4 0 6
3657 6 -4 -10 -4 -15 -6 -9 -4 -10 -12 -6 4 1 -3 -11 -3 -9 -6 4 6 5 -8 2 13 13 -7 -8 -1 -3 -7 10 4 0 0 10 9 -8 5 1 0 3 0 5 -2 -21 -20 4 8
3704 8 -12 -12 -6 -19 -14 -8 1 -11 -22 -11 10 -2 3 3 1 0 -12 10 14 10 -5 -5 3 9 -8 4 5 -9 -8 7 15 -12 -13 -12 7 -8 6 1 -11 -3 -14
3745 -14 3 4 -9 -11 2 1 -8 -3 -7 -19 -21 0 8 -3 -16 -4 3 -7 -7 10 8 -3 -8 17 2 -12 -8 10 6 2 -11 -2 -6 -12 -4 8 -9 -15 -19 2 1
3786 1 -3 -1 0 -9 -25 -11 9 -14 -1 -3 -2 -12 -1 2 -1 -6 -12 3 11 -4 3 4 -5 -3 -15 11 9 -5 5 1 8 -2 -4 9 0 -13 -3 3 -7 -19 -16 -3
3828cJoM%qj2J2J5pkNPk1QJ9j8j6J2RPk0KJ5KnQJ0j5j2MJ4jjjNj2%j1OOj0jOj0
3872a5KJ5lj7NK1j5jJmJ3j1qJ6mj0MNLj7J8OKk1J7Jnj5J5J7j0rnJ9j2j2J7Kk1
3911a6NpK9j5oOQqLJKj6mK9lj8JRkkKK4k3oJ0Onj2J0J3j3j0K1Pj4%JQj4j4J6j1
3953hOj7J6j0Nj7L1j4pJ4Ojj6OMQj0rK4qj7K0jlj7%J5rj9L3NrmJ5Jj5JNPnj2N
3995aOk0NJ3nrj8K1%j5%K0jrJ2J0j1k0J9J2Jk9K0OpnMNj2%OJ1j6nJ5%mqJ2Rj9
4036gkJ4%j6j1K4mj0pLloJ0PmLpQLqJ6MqJnK3pk5K0Pk0pJ5Lj5RpLJoK3pmlRmj6
4083a3mOQj5QOmnKQkj7PJ0nj5OK1jnQPj1j1J3LnmMKnj2RPlKQj3JlPLj9MJ7kj4
4130a1%JRj5J3Mj7mJK0j4oNJ0j1kJ8LnrJ4%%nLOj4KK1qr%J3k3OJOoj7J8Pj8j1
$$ plain form
3828 -3 -2 -8 -4 -4 -12 -24 -12 3 -4 -6 -1 6 -15 -7 12 -6 -22 -10 -1 6 -14 -12 3 5 0 8 18 3 -9 -5 9 8 7 6 11 -1 -1 -12 -6 0 -10 -11 -5 -15
3872 -15 -13 2 -1 -18 -13 8 -7 -8 -7 -11 2 -9 -17 -1 -5 -15 -11 -6 -3 -20 -2 4 6 -15 2 3 -2 -17 -2 15 5 -4 -9 10 -2 -14 3 5 -16
3911 -16 -11 -18 11 -4 -10 -4 4 -4 -1 0 2 -14 -18 11 8 -10 -9 0 -2 -4 -2 22 -1 -7 3 9 4 -8 2 15 2 -8 13 20 6 6 7 15 1 -13 3 -8
3953 -8 -2 -19 -3 -13 -8 -25 6 -8 -15 -1 5 4 -12 -6 -2 6 -4 -13 11 3 -14 6 5 2 -15 -15 0 -9 -28 5 10 1 -3 12 13 -2 -1 4 11 6 -6 -1
3995 -1 5 -15 -10 3 -2 -11 -29 -8 -8 -23 -23 -3 -4 -13 -1 9 -2 -22 -3 9 10 -19 1 7 0 -5 -1 4 -8 -8 -2 9 -7 -12 3 3 -1 -9 3 12 -7
4036 -7 -9 5 5 -11 -22 2 -2 -12 -19 -16 -19 -25 -15 -8 -12 -9 -16 -8 -5 -13 3 7 -1 0 -5 18 11 -14 6 13 -7 -14 1 4 -11 -2 -9 -6 -5 -11 12 5 1 -2 7 3 -13
4083 -13 -17 -11 -3 -18 -10 -4 -8 -13 -11 -3 -5 -22 -15 -5 -10 -25 -19 2 1 -4 4 11 0 -11 2 5 0 -4 0 2 -3 -15 -6 1 -2 0 8 -5 -4 -7 0 3 -16 -12 5 3 -11
4130 -11 -11 -10 -1 -16 -3 1 -16 -20 -19 1 -13 -19 -14 -4 -15 -17 1 4 -1 -10 4 4 4 -1 2 8 -6 -4 17 9 0 0 13 -10 -4 -3 3 -3 -20 -2 5 -13 -24
4173b4QK2j3j4J3P%nJRrj6K9lonmRj2J0N%j3RPLkkNnj3L%RomJ2jrLj2LpJ4Pj8
4219a5qJ8mqR%J7qk1J5J3j8LR%j5J2MmLpQlm%J0qNpP%j1J7nrk1J9lrRoNj3QJ0
4264fmqpJ5LjrK1Rk5OK1k1Q%J8j0rJNnj0J3Jj5PJRj2lKJ5j7%RMkj2J1rj5J0J0
4307aj1j2MK3j5lJ0OpoJ0jJ2j3J0J2j8j6K9Kj9nJ5Nj2j0NJ2j3nKRmoPLlmOMro
4349a3J9rjJ0kj4KOJ0j9OjRnrJ2OnJRjqlkMrJMOrjLKMj3J0jj0nJ2JoKjJ0j6MJ
4397iR%J%npNJ2j3lJ0J0LrnKpJ0OmMj7MMPrRnj4Rj%j0RQmj7RNlmQJ2j7kJ0Mlk
4446@NkKj0J5Jlj2ON%okRlLJ0nj5lJ2oj5K0jkpMlorJ3J3j1qKPMj1NLpRMoRqPp
4495@Pj0J2mpj0J2Qj2JMkmP%Kj0J2j2M%OoJq%NJ%j0M%LNlkNJPl%J5nmqQJknmJ7
$$ plain form
4173 -24 -16 6 -7 -21 -8 -1 -1 -6 -5 4 -5 -21 8 5 -1 -6 -10 -1 -13 -3 2 2 -11 -2 5 8 6 4 9 4 -9 -6 -6 3 -3 -7 5 4 -5 -2 -14 -11 -18 -4 3 -15
4219 -15 -23 -5 -9 -17 -8 -8 9 1 -20 -5 8 -10 -7 2 2 -13 -1 3 -1 2 -5 3 0 -4 -4 6 -2 3 -4 3 3 -8 9 4 -5 -26 -7 -10 -19 -10 -16 -11 -24 -16 -6
4264 -6 -10 -18 -25 -10 -7 -8 -17 4 13 -12 -6 15 -6 2 2 20 10 1 2 7 2 -8 5 6 -9 -2 -1 8 -4 -7 -5 10 -7 -7 2 6 4 -8 3 -6 -21 -11 -1
4307 -1 -12 -24 -20 3 -12 -15 -5 1 -6 -12 -2 -3 9 -4 6 18 0 -16 13 15 -4 -9 6 11 -1 -11 -6 6 -7 -12 -10 -1 -5 -11 -4 -1 -4 -8 -2 2 -7 -13
4349 -13 6 -3 -4 6 4 -10 -8 -2 8 -11 -5 -6 3 -2 -11 1 7 2 3 12 11 3 0 -2 2 -7 -6 -2 4 -5 -6 -3 -1 3 -10 0 -1 -11 -16 -4 -3 -9 -7 -8 2 -14 -10 -9
4397 -9 0 0 1 1 -4 -11 -6 6 -7 -10 0 10 13 4 -1 1 -6 4 10 6 10 -7 -3 1 8 -1 8 3 -11 -2 -3 -3 -13 -4 4 0 -17 -8 -3 -6 -10 -2 10 -7 -9 1 5 2 0
4446 0 5 3 5 -5 10 11 8 -4 2 7 7 1 -1 8 5 8 18 13 -2 -5 7 1 -14 6 5 3 -4 0 -3 -9 -18 -5 8 -3 -11 -9 -2 2 -9 -4 -1 -8 1 5 -1 8 0 7 0
4495 0 7 -3 9 5 -2 -12 0 8 -4 -3 1 -1 -5 2 2 4 -6 6 -6 -2 -2 4 -2 -1 -9 -9 -4 -3 -3 -13 -9 -9 -6 -1 -4 -6 -1 0 7 4 4 19 14 10 2 10 11 9 4 0 17
4546A7k0JPkjj0RnlnQm%%mJLJKlOkJ1pj4J6%o%MK%jMklKjMoRNmnj2J7mLj0J1l
4597Fj9LOLmLqMJJ2J2k4Pj4K0j4LMjpMJ8qnj2J4mj1QJ2j3JPj2J5KknKqkNPj0o
4642a0J3j0nnO%NJj1JJ0OpkJ1%NolQLPj8J5rMJknjJPrllLjJ0rkPj0J1j0J2j0n
4689iLmjJ4j0mKLkQPj2KmMLMqL%LNlKJqpjJ0kjjmnLoK2qnNj1NJ1ojrRloMNJrJ1
4743@Rk2NRJqJMPlQj2NKP%jj5l%JLpJlNrKmRkMlNrJ3lmLKmMJ1j1MNLj1QNmqJ9
4796A9mqOjlj1lJ1J1mkpOj1%NrLmjJ0lqKrkJ5oKNnNPnjRj7PJ4rPlnkmJ2koOj1
4846dJ1pmJ2mnqJ3qJ0oLJjq%oJ1lmjJKnmJ0%P%lMJLmKkkkRj3KNRj2kjJ1j5jJ0
4896Bj3RKlnJ1rJ2nJj2J1Pj4lROlkjpNKjRkjmPj0KJ0MomJ2j8QJqQj1mMjJ2j1K
$$ plain form
4546 17 -3 -2 5 3 2 -8 1 -4 -7 -12 -4 -8 -8 -8 -12 -11 -8 -7 -5 -8 -2 -4 7 0 -14 2 2 -4 -4 0 2 2 1 5 3 0 2 1 5 -1 8 13 9 4 -8 9 5 8 -2 9 6
4597 6 -13 -10 -4 -1 -5 -2 -10 -6 -5 7 19 -5 2 -12 8 -6 -3 1 0 -7 -3 15 7 2 -10 4 0 -11 -3 9 -4 -3 4 -8 7 9 7 2 4 -4 -6 -1 6 -4 -10
4642 -10 3 -7 -12 -17 -11 -11 -6 -5 -16 -15 -5 1 -6 -8 3 3 8 2 -1 7 10 17 -1 14 5 9 10 8 3 2 3 10 1 -2 -5 -2 -3 7 -2 -4 3 -7 4 -6 6 -4 -9
4689 -9 -6 -10 -11 3 -7 -11 -9 -6 -8 0 7 -5 -3 -7 -3 0 4 -4 -1 -1 2 7 4 6 7 -1 -8 -9 1 -1 -2 -3 -7 -12 -9 -15 7 -1 -6 -1 -12 -7 4 -2 -3 -12 -3 -6 -12 -8 -3 -2 -11 0
4743 0 9 -13 -8 1 2 -6 -5 -1 6 3 11 -1 4 6 13 13 12 -3 -6 -6 -5 -2 -9 -8 -11 -6 -15 -13 -17 -8 -10 -6 -9 -4 -13 0 -3 -7 -4 -2 -6 -2 9 -2 2 7 10 -1 7 12 8 0 19
4796 19 15 7 13 12 9 -2 -5 6 17 13 11 4 10 -1 -1 4 -5 -2 -6 -7 3 0 -8 -6 -15 -17 -2 -8 -6 -1 -6 -1 6 1 0 9 -8 -1 13 4 11 8 3 1 -3 9 7 1 7 -4
4846 -4 7 0 -4 8 4 -1 -9 4 -4 6 0 3 4 3 -5 -5 -11 0 -3 -7 -8 -7 -5 -10 -14 -4 -4 3 3 0 4 5 8 4 6 4 2 0 9 -4 -2 3 12 0 -2 -3 8 -7 -8 2
4896 2 -11 -2 0 -3 -8 3 -6 6 1 2 -10 1 8 -6 -9 0 6 3 1 0 -7 -2 0 -1 8 6 5 1 8 -2 0 10 14 8 4 16 -2 6 7 -1 7 -4 -8 -4 -5 7 -4 -2
4944bOlkpJ1pKjPj0NPnmJ0krRmM%kOMpNj1J3qKOjmpJ0rj3J1j0mLjJ0j1nPKj5J5
4993iRj1J0j0JlLJOMoKMmRqJ%Oj0NJ1j1OpJ1j0pJ0J%%LmLj3KmkMQj1J0l%KMj5
5041a2J4PJj1kQLJ%lNpRoj2PmJ0j3OlKmKQonOnqPoQmOjmMnMOnjJPmj0J4%LlM%
5094IqJ3Qj4PqJ1rj1J2nkrJj1J3j0kJ0llNm%P%Oj4J1Kj3POrJ%L%lNJ2oOLoJNj1
5142CJMKKkJj5J2%Kj5pJJ0%%qlJ1j0NM%OKqPoqJ0OjojnJ0kRkj0PoJ0j0MQj5Nn
5191cJ0kqPqkoQ%qPljkJ3lJj0LJ1qQJJ%KjKK%j2J3j6QkJ9j9J4pmjkPoJ5j6%LJ
5240Fj1J2j0oPKQj5kjlJ7j2%rJ3NjJ0JJjnPnPmrM%OpJjKlnpJ0KlkJ1r%mRoPnP
5291IqpknJ7%nRj2JJ1oL%J0ll%MjJmo%MKOrpKkKomMjoPmkKKOrJ9qlNoqJ2JjpK0
$$ plain form
4944 -2 4 1 -1 -8 3 -4 -2 -3 4 -6 -1 6 1 -3 7 5 -4 5 1 5 5 3 9 13 6 11 0 13 5 7 13 12 8 1 11 2 -11 0 -10 -14 -11 -12 -2 -13 -18 -11 -9 -24 -9
4993 -9 0 -11 -1 -11 -10 -13 -10 -9 -3 1 -5 -3 1 -3 6 -2 -1 -1 5 -5 0 11 0 6 -1 10 0 -7 3 4 4 4 7 3 6 -7 -5 -9 -11 -7 1 -10 0 -3 -3 -1 3 -12
5041 -12 2 9 10 -1 -3 5 8 9 9 6 11 4 13 7 -5 2 -2 8 -5 1 -2 0 -4 -2 6 0 -5 1 -4 -12 -5 -11 -3 -7 -1 -2 -6 -2 -7 -3 3 -2 -3 -2 5 1 -9 5 5 8 5 9 9
5094 9 1 14 22 8 15 7 18 9 -2 10 5 3 -6 -5 -16 -3 -13 -15 -5 -8 -11 -6 -10 -10 -3 -3 3 -11 0 2 -11 -4 2 -7 -6 -6 -3 -3 -6 -1 11 5 11 14 8 9 14 3
5142 3 4 8 10 12 10 11 -4 8 8 10 -5 -12 -11 -1 -1 -1 -9 -12 -1 -11 -6 -2 -2 4 6 -2 5 -1 -9 1 7 6 0 -1 -6 4 2 11 9 -1 6 0 10 0 4 12 -3 2 -3
5191 -3 7 5 -3 4 -4 -6 -12 -4 -4 -12 -5 -8 -9 -11 2 -1 0 -10 -7 4 -4 4 5 6 6 8 7 9 11 11 -1 12 -4 4 2 21 2 16 9 5 4 2 9 3 18 2 2 5 6
5240 6 -5 7 -3 -9 -2 0 8 -7 -9 -10 -13 4 -8 -8 -17 -4 1 0 10 11 12 11 6 13 8 15 11 2 6 6 12 5 6 5 7 4 -1 -8 2 4 1 -1 10 1 1 -3 6 0 7 2 9
5291 9 1 -6 -8 -13 4 4 -1 8 -4 -3 8 2 5 5 15 12 9 9 13 12 13 9 3 3 7 9 15 6 -1 1 -1 1 -5 -9 -5 -6 -12 -5 -9 -11 -9 -7 -1 -10 9 1 -2 3 -3 -11 1 2 1 -6 14
5346A4j1kJOkkNJjM%qOrJ1Ok4OQJj7Qj3K4oj0koJ4j1J1p%LPj6J0JRjKkkJKoNN
5394A3mknJ4JJqmP%Oj0klPqq%jj1J6pLjmM%jKlnJ9j8LQKKJkJ0qlJLJ3pnLj4Pm
5445bRQoj1P%RpnOjMjLrj0MmKPopQOJ3k1MJ3j0J3Pnj9J7Mj0JJ3j5MomLpJooRQ
5494Ej7J4pL%LmMj1NNLkpMKl%KQqRLnJ2j0KOlRjNj5oJ3rOpJOjLrnrJ3lmkLrLJ1
5547FqLj1jLL%Rkj1nJ0%jMJnJ0pRkoKrJ0QrPmOj0J1qJklOMJpJjLrPmJ5q%MrJ2
5599A4lPj5J6pLJNrj0PnMLj2LJ3rqMpOonPj0J5j7J6j5J4j1J1mqMlLNj1LRqJ8O
5644A4Jj0LQrJ1%qkKJ1%oJ%J0rPj3KpkMrNj%Onjj7J3Nj3QKqmNJ0kkJj2J4j9K2
5691FpRoJrJ4j2MOj0J1kkKlojjJ4o%kkJ1PlnlkMKlKKJ4k1QkjJmMJ4j0mnOmLMp
$$ plain form
5346 14 3 1 2 8 6 4 9 10 9 13 13 5 11 2 13 19 -5 1 9 10 -7 1 -12 12 6 -4 -6 -12 2 -9 2 -5 -5 -2 5 -11 -1 0 9 8 10 8 6 7 9 3 8 13
5394 13 9 7 2 16 17 18 10 6 13 13 19 9 7 4 11 3 -5 -5 -6 -17 -1 -8 -5 -6 -10 -6 -6 -7 -5 -8 -13 6 -12 -9 -1 1 3 4 2 12 4 1 2 5 18 11 6 9 -5 2 -2
5445 -2 7 15 9 -2 5 5 14 7 2 8 7 11 10 13 4 -6 -2 -6 -4 3 -3 -10 -2 4 17 -4 0 13 3 16 23 18 -1 16 20 10 11 24 9 13 7 3 6 -1 0 -6 -12 -3 5
5494 5 -12 2 -5 -2 -2 1 -3 1 -10 -5 0 3 1 -6 -2 0 -3 -3 -1 7 -1 8 11 6 18 8 10 16 13 22 21 26 11 5 18 9 15 8 9 15 14 17 8 3 -6 7 4 0 -2 1 -8 -5 6
5547 6 -2 1 -10 -11 -8 -5 -5 4 2 -9 -14 -4 -4 -5 -1 0 -5 5 -2 7 5 -1 1 -8 2 10 1 8 4 10 0 11 3 4 2 -1 5 9 10 3 4 3 6 -3 4 0 15 7 7 11 2 14
5599 14 11 18 3 19 12 15 16 21 12 2 9 4 8 11 -1 2 15 6 -2 2 -5 1 -5 -10 -3 -13 2 -15 1 -14 0 -11 0 -4 -12 -8 -11 -8 -3 -14 -11 -2 -10 8 14
5644 14 15 5 8 16 7 18 18 10 8 10 21 21 15 16 16 26 17 24 11 13 6 4 8 -1 4 3 3 9 4 3 -14 -1 4 -9 -1 1 -7 -11 -6 4 2 0 1 -11 3 -16 6
5691 6 -1 8 2 3 -6 8 -4 0 6 -4 7 5 3 5 2 -4 -5 -6 8 2 2 0 -2 9 16 13 8 5 3 7 9 6 8 10 24 3 11 9 8 9 5 9 23 13 9 4 10 6 9 13 6
5742FmNpJ2KnroPMmj0L%Pjj2JpKROKj2KOMRmmKLkMPj3kJ3%%j6J1oJ3qRlkkOk%
5794A4poQ%n%j0KMnKKj1PMlRjklLKnRkPLo%lMk3J6mJJ5pj1KPOqm%QqJ1j1nOmk
5846dJL%kNpNJ6j5NJj%%kOkPjLj5K1j3j2QJlo%KjjJ4j2JkPRj2MJj0NKpNknJ2J1
5896B0qj2PmkPjRj2MJLLj4Oj0J9pOJ3j3rnMLj4mLQoMj3J9j1J6mj2j0OJ0J2Kjj0
5940CmlJ7l%onJ3ol%NoJ3Qj8Rj0OrNJ0o%rjQnJrLjoOj2%kN%PjJ0rJ1j4KNN%%N
5991IjrJ0qlJ2LqJpLNJ0oqOlJLKrPpqJ1j0Rmj2J3jPjlnJOKLj5K1qkjMjlMrOqp
6043h%J0Qk2N%rMJJ2%j2J4j4RRlj0JPKj0K%%RJ0j6kL%QPOqLK%%Rj4mMqPMpoMl
6093Dj6J7j4rJ1JJ2plkKj0J1mmNlJ1%Jj2QlJJ7j1mnMMJ1%nkONj0pJ1oKoJ1%j0
$$ plain form
5742 6 2 7 0 12 14 9 0 -6 1 5 1 -9 -6 -6 1 0 -12 -11 -18 -16 -7 -1 1 -11 -9 -3 1 10 6 2 4 7 5 9 16 3 1 14 14 14 -2 9 3 16 8 17 14 12 10 16 14 14
5794 14 7 1 9 9 4 4 -6 -4 0 -5 -3 -1 -12 -5 -1 -4 5 4 2 -1 2 4 -1 8 6 13 16 10 10 7 11 -12 4 0 1 16 9 -2 0 7 13 5 1 1 9 1 12 1 -4 2 -2 -4
5846 -4 -3 0 0 -2 3 -4 1 17 2 7 8 7 7 7 5 11 9 16 15 18 3 24 11 -1 7 8 5 -1 -1 1 0 -1 13 1 2 0 7 16 4 8 9 -1 4 6 -1 4 2 -3 9 20
5896 20 12 0 7 3 1 8 7 16 4 8 9 12 15 1 7 -3 16 9 15 28 15 6 1 5 8 -6 -10 -7 1 -5 -1 -14 5 -6 10 6 -6 -16 -10 0 12 14 13 3
5940 3 -1 -4 13 10 10 4 -1 12 6 3 3 8 2 15 23 5 14 4 10 1 6 16 10 10 1 0 8 3 4 -5 -2 -3 -9 -3 -15 -15 -17 -12 -12 -5 -6 4 -5 6 -8 -6 -1 4 4 4 9
5991 9 8 -1 9 1 -2 10 13 5 6 -1 2 7 17 11 3 9 6 7 10 12 3 10 3 -5 6 -4 5 1 -11 2 1 8 7 4 -1 0 6 8 11 -4 17 9 7 6 10 9 6 10 1 7 -1 -8
6043 -8 -8 2 10 -12 -7 -7 -16 -12 -11 1 1 -11 3 -11 -2 7 4 -6 -5 2 4 -6 -4 -4 -4 5 15 -1 -3 0 0 8 15 21 13 16 18 18 18 27 13 9 13 5 12 16 9 3 7 4
6093 4 -12 5 -9 -18 -7 -6 6 -1 -4 -6 -4 -14 -3 -7 -11 -6 -9 2 2 3 -9 -1 -4 -3 14 3 -1 -6 -2 2 13 13 8 6 12 17 7 0 11 5 7 1 12 12 2
6138BJ%LLmojjQLqJ4k4J1J1Lmkj2ORnkKj3jJ6oMopRMRrpjJNllPk4K6j6PlrJQ%
6189dPj0Pj4%OnK7j8QmJ1qJ9j2LjmjJ3j6LKMMqrJQOOmj6NmJJm%koQqjJmPMKrR
6240Aj6J2JJ8lqjrJ2j%kJ0Jj0Qj0JLrJJ0lJlo%%Qj1qROKmLml%OMoKjK%mLKrOO
6292GqNPlLlj0RnP%Nj1LpkJRj1nkMPLkoNmMmJ2qONnQmrnkJ7mkRrkMMomMJ8j5m
6346DMNj4MLpL%j4LQnkMJjKJ%mKNJ0nmLJKP%lokKoJ5Nrj3KJ3jrPrmmROpopJ1n
6400eLlkJKJOj4MkKkRKMJ0j0J8ojj1LKJJrOmQn%nPj6JPkJ5k1%J1pOj3J0%oMrN
6450dj3LNQloJ2jk%QnNnMLmoPJjlnJrJ0lRj1j2RjjJ5Mj9lJ8jKlj2MmRNJ1mj5P
6500DoPLJMmlJ4lkKmOJnnjpJ5qj2Qro%NNk%j5KlJ2j4J4kjNLKoJJ0j%nPj0mK6j8
$$ plain form
6138 2 3 3 6 9 5 -1 -2 -3 5 8 0 14 -10 1 12 15 11 9 -3 3 12 7 5 7 -6 -7 9 3 7 1 -6 3 7 16 7 0 -1 0 5 2 -1 6 -18 8 -8 -1 -4 -13 -12 -4 -4
6189 -4 3 -7 0 -14 -14 -8 -13 14 -4 4 0 11 3 22 10 13 12 8 7 20 4 7 9 13 17 9 0 1 9 15 21 17 1 6 2 3 4 0 0 -2 -8 0 -8 -9 -8 -12 -5 -1 1 -8 1
6240 1 -15 -3 -2 16 13 5 4 -5 7 6 6 4 14 15 5 13 3 4 7 -2 -1 9 6 7 4 -2 -2 -2 6 -5 -13 -4 2 4 0 3 -1 -4 -4 2 6 0 2 1 3 3 -1 2 4 -5 1 7
6292 7 -1 4 11 8 11 8 -2 7 2 9 9 14 3 6 -1 -3 -2 7 -4 -9 -11 -7 0 3 1 -5 0 -4 0 -4 8 0 6 11 6 14 10 1 -4 -6 11 7 5 14 5 3 7 11 5 1 5 23 8 4
6346 4 8 13 -1 3 6 -1 2 2 -12 -9 -1 -6 -8 -4 -3 -4 -2 -1 -1 -5 -3 2 12 7 3 6 7 9 16 16 13 7 5 7 1 16 21 12 -1 1 14 13 4 11 2 -2 -6 3 9 2 -4 -11 0 -5
6400 -5 -2 -5 -7 -6 -4 -3 3 -11 -7 -9 -7 -9 0 2 6 16 6 24 18 17 6 9 11 12 13 4 10 6 14 9 9 4 11 -5 -4 3 1 16 -5 -5 6 -1 5 -8 2 2 -4 0 -9 -4
6450 -4 -17 -14 -9 -1 -4 -10 2 1 -1 -1 7 2 7 2 6 9 5 -1 6 7 6 3 -2 -1 -10 0 -3 6 -5 -17 -8 -9 -10 5 9 -10 -13 5 4 6 3 -9 -5 -9 0 5 16 12 -3 4
6500 4 -2 5 8 9 13 9 6 20 17 15 17 13 19 20 15 10 9 2 17 9 -3 5 -4 -10 -10 -5 0 -2 -2 -17 -15 -18 -6 -20 -6 -8 -9 -4 -1 1 -5 -4 6 5 5 0 7 -3 -7 19 1
6551AjKLjLPj0%nJ0%jNj6NlRj5MoJ1j3j%LqJ3kNNj0NjPKmmJ6rlnJ1Kj2nRJ3j1
6599EJoqJ3pJ0j0nlRrJ1kk%rJ2mNmlm%JkNJ1pOkNMj4QjP%qJ6lj1j%pJ0Kj7OpL
6649fMNMrJo%NnOkqjPKNmoN%KJ4j2j0%RKkQLllQKnpJ2Lmj3KJnljNqPnlqRjrJ3
6704eMOj0MkJPlrLLlKJ8j1jj%lLPPj1lP%LkpJNj3RJj2Oj1LkkkmOPPj5Rlj%LJ4
6756A0j4OMQKoJojJOj9J5qkP%PnoJ3j5kMqMJ3jpJmnkJmK0j6%kKkkJ5oJ2pJ2j0
6804D%J0Nj3lMRj0mlNLqmJ0JlrMKn%JKmj%Ln%RJj4PRLj0NqJ5%pkJ0lnJ1j%nRk
6856A3Nj3Pnj7J0%Nrm%QoJ%%MJ0oj2QkM%%kJOj6jJ2Lo%MpRKkmJ3mkPpj4RMj1J1
6906Fj5lJ1pkKPj2MnJLJ1j2J1rK4k1PJQj1m%J1m%J0molQNj%joJ1j1JmOnoQl%q
$$ plain form
6551 1 0 2 5 4 7 14 4 4 -1 9 9 8 13 -3 2 -1 8 -7 -3 -9 2 -11 -12 -12 -9 -17 -4 -6 -1 4 -6 -1 -2 5 7 3 -1 15 6 3 -2 9 11 -1 -6 3 16 5
6599 5 6 0 -8 5 -2 8 -2 -7 -10 -1 -10 1 -1 -3 -3 -12 0 -4 1 -3 -6 -10 -10 -9 -11 -6 5 -2 4 2 7 11 -3 5 4 11 11 3 19 16 5 4 4 -3 7 9 -8 -2 -9 -6
6649 -6 -2 3 7 -2 -1 -7 -7 -2 -7 -1 -3 -11 -12 -5 -3 2 -2 -8 -3 -3 -1 13 1 -9 -9 0 2 0 8 11 8 5 13 15 10 3 15 18 14 1 3 4 -1 -4 -5 0 -8 -1 -6 -9 -17 -8 -9 -18 -5
6704 -5 -1 5 -5 -1 -3 -2 5 2 -7 -4 -1 -4 -2 16 5 4 3 3 0 3 10 17 6 3 10 10 13 11 4 5 10 -3 6 7 -5 1 -10 -7 -9 -11 -13 -17 -11 -4 3 -12 -3 -6 -7 -7 -4 10
6756 10 -4 2 6 14 16 10 11 5 4 5 11 -8 7 -1 -3 4 4 11 6 0 13 -2 -4 0 -8 -4 9 8 1 2 -2 -7 -9 -8 -12 8 -8 -8 -10 -8 -10 -12 3 -3 9 2 14 4
6804 4 4 14 19 6 3 7 16 6 2 -1 4 7 -1 -5 5 6 3 -6 -2 0 -5 -5 -4 -2 -6 -7 -7 -4 -9 -9 0 1 -13 -6 3 6 -4 1 -7 8 8 1 -1 9 6 1 12 11 11 6 15 13
6856 13 18 5 12 7 -10 0 0 5 -4 -8 -8 0 -6 -5 -5 -5 -1 9 3 -9 -1 -3 1 1 1 -1 0 6 -10 -11 1 4 -2 -2 2 -5 4 6 4 0 13 9 7 14 7 -7 2 6 -5 6
6906 6 -9 -12 -1 -8 -10 -8 -1 -13 -9 -14 -13 -10 1 -11 0 -9 15 -6 1 2 10 -1 -5 -5 6 2 2 12 8 2 -1 7 12 11 11 10 4 15 4 5 1 7 2 -4 4 1 1 -7
6954gLlj8J7kNokKM%mNMpMJ0NMj4J0nJQlpPjlJqJ1rkKqOjLmrJ2rPJJqjlJ%RLj4
7008a2QJmN%JKLLolJ0r%OmJ0oJ1j0lLpJpJ2p%NmQj1Q%pONk2RmMKlJ5qQpJ1j3J
7058AMoJ2j0KKMKmLrPj2P%J1k0%Nj7J9j0QKopJ1pkkRk0K1oPNj3J2Kj0MRrkJ4n
7104Fj3LLQMPoMj4J1%lj4PrPNPk1OPj1JlMPqlJMmOM%LnRqrRKNRrqlMQkpQj1J3
7157A1JrjQkNnj3J3j1lJ3lj0J0mkj3K3k2LJ1lkJ7j3kQmQjpJ0KlllKkLj6QMJpJ
7203bkRrrQLojJ1kKknNJppJ3j1OJ2j8J0kPrNNj3RJ0LoMnN%j1MlJj2QlJjrQloL
7254a1mJ3lkJLjl%J3k1QPMrQoJN%kLmJ1j3MRj0LjJMnPpjpJqJ0KnMoNlKlljKNj
7307d%%kKPKlpJ3Mnj1N%J2pj3J9jjkj2RPkLj1Oj2J2onOj5QqOkQq%nJ2Kn%MQJO
$$ plain form
6954 -7 -4 -7 -25 -8 -10 -5 -11 -13 -11 -7 -7 -11 -6 -2 -9 -5 5 10 14 0 10 5 6 14 11 4 11 10 7 8 0 11 2 0 2 -6 0 -1 2 -2 -11 1 -8 -1 0 1 -7 -8 -11 -10 -10 -1 2 -12
7008 -12 -4 -3 -7 -2 -2 -1 1 4 7 1 -2 8 -1 -1 5 1 11 5 16 6 3 6 -1 0 -7 5 -2 -2 3 -1 7 -4 4 4 -3 3 8 -14 -5 -9 -5 -3 -6 9 1 9 2 13 0 1
7058 1 5 -1 11 1 3 5 9 11 7 10 1 8 -4 3 3 14 -6 -6 -1 -18 1 -9 -1 1 -5 -12 -1 -8 -10 -12 -3 -23 -2 -8 -1 4 -9 3 5 -5 -1 8 -1 -3 11 6
7104 6 -7 -4 -1 7 11 18 12 16 2 13 13 10 -4 3 -6 1 6 13 -8 -2 5 -6 -5 -8 -4 3 -5 -8 -7 -3 -7 -1 3 3 6 1 10 2 -7 2 4 9 18 9 1 -2 2 10 8 1 9 -2 11
7157 11 12 3 2 10 8 13 8 -5 8 -3 -6 7 4 -6 4 0 -2 -15 8 -14 -11 0 -3 -5 12 -1 -3 5 1 9 8 1 11 13 10 7 4 6 4 7 -9 -1 3 4 -3 -2
7203 -2 -4 5 -4 -13 -5 -2 -8 -9 2 0 2 0 -5 0 1 -6 -13 0 -11 -5 7 -11 -1 -3 4 -5 0 5 -8 1 11 14 8 12 7 12 12 1 5 2 3 -9 -1 -4 -3 -4 -13 -5 -8 -14 -11
7254 -11 -15 -2 -5 -7 -6 -3 -4 -7 -7 6 -15 -7 0 4 -5 3 -3 -2 3 3 1 4 0 11 -2 2 11 1 4 3 4 8 3 10 3 2 -5 -4 -12 -2 0 -5 -1 -7 -2 -5 -3 -6 -9 -10 -8 -3 -4
7307 -4 -4 -4 -6 -4 3 5 2 -5 8 12 7 -4 1 1 13 6 -7 12 11 10 8 -4 5 12 10 13 2 8 -4 8 2 -3 3 -12 -4 -12 -6 -8 0 -8 -8 -13 -1 1 -4 -4 0 8 9 15
7357A5k1NJ3Nj1Kll%J1Kj2j%OnKKmJmPpklRl%kQpmQj2Nj6J0MnLJJ6mjmPOlj0K1
7407B2prKmQqkRjj6OMj3J4j1Q%mNrLLqLQrkjNKMlLpQoOOnKkMNqQqKKJOojqKkl
7463bKrKMpjNNrMQmJnMJ1rPmj1J9kqj0J7mKOLJj0MlkPkLmqMmkJ0j3kj0J3kLLm
7514cJlLlmLoJ3mMomRRJJ%j3Rj2kMJJ2oNJpKnJ1j9J4K%j2J0j1%j2RJJ1j1PqOm
7562fmLjJMJJJ2j3J1lKJ0j2pRmqPmLk%jRj2LmoPoJ1M%pNk2OQMMj0rRmRj1KJJ0
7612@olK1j3jRjRjrlJ3njjrLlOnJqMNj1pQmKOoJ1loJ0rR%pLpJ0j0MOlJKlOmJ2
7664A2onOloJ1lkNrPQj4j0MKQnloj%PoOpLPJJjkKJ0jLj2JJMLjlnQoJkOmLmPok
7719BmJ0nKqKo%%%J0Lmj5J5rMJKKpJ9nmlOQoJklJ3pmNmjnKMrP%mlmJ4j1%JRj0
$$ plain form
7357 15 -6 -1 12 17 6 8 5 2 2 13 15 3 2 2 8 3 5 7 3 4 0 7 0 -2 -5 4 1 1 -1 7 0 -4 4 -8 -3 -19 -9 -5 -10 -7 -6 10 6 5 1 8 14 11 1 22
7407 22 15 6 8 4 12 4 2 11 10 -6 0 4 -9 5 -6 2 2 -2 3 -6 -3 0 -8 -5 3 -6 -8 -9 -4 -2 2 -1 2 -5 3 -3 3 9 4 6 4 8 13 5 13 5 7 9 10 16 10 9 1 3 1 -2
7463 -2 0 -9 -7 -3 -10 -11 -6 -1 -10 -6 2 -2 -1 -6 -2 9 0 7 3 -8 11 9 1 -9 8 4 6 12 15 16 6 10 7 5 12 10 13 9 1 5 1 -1 9 -4 -6 -16 -3 -5 -2 1 -3
7514 -3 -2 -5 -2 -5 -9 -6 -12 1 -3 1 -5 -9 0 9 10 11 11 -2 7 -5 -7 -3 -2 10 4 9 10 3 5 0 11 -8 6 8 8 -4 6 -5 -5 -17 -8 -7 4 -7 0 -8 -2 -6
7562 -6 -10 -7 -8 -7 -3 -2 -1 11 -2 9 6 8 18 6 -1 8 4 -4 3 -1 2 0 0 -1 8 -4 -1 -5 -11 -4 -10 1 5 5 -2 3 -19 -13 -5 -1 3 -7 -16 -7 -11 -2 -13 -11 -10 0
7612 0 -6 -9 12 -1 -2 7 6 15 14 5 2 15 10 9 8 -1 2 -1 5 0 1 -7 -3 2 -9 -16 -8 -12 -10 -4 -10 1 -2 -8 2 -7 2 2 -5 -2 -9 1 -9 -5 1 -2 -1 1 -2 4 0 12
7664 12 6 1 7 4 -2 9 6 4 9 0 7 15 1 -9 -5 -3 5 0 -3 -9 -10 -10 -3 -9 -3 -10 -7 0 1 2 1 -1 1 11 10 13 1 2 3 7 10 9 6 1 9 3 4 2 8 4 7 3 10 4 2
7719 2 -2 8 3 5 -3 -1 -7 -7 -7 -7 3 6 2 -13 2 -7 -3 -2 0 2 -5 14 9 5 2 8 16 10 11 9 6 19 12 8 13 9 8 3 5 9 0 7 7 3 0 -4 10 -1 -1 0 9 -1
7771aPlj5NJ1r%PjNj2LQLmPj0J6MqLmP%nQj1ljpKj0J2JkoOKj2%P%pJJKlNJ3j2
7821@njJ1rJ6k1PMkLJ0pNoNOqjMkQmqMj0MKj7J6j1Rj1LkR%j1J1NKj0Qkj1OQ%k
7869EKoKJ4j2J0roJP%ProMJ1Kj4KOmJpJ0j0Mj2M%mLrJ1mJ2mnLJ6j0kLoKLNKpQ
7918A4llJkKNkKplrJ4pkKO%Mo%njLj1jRjLj3J6qJ%J3nnQLJj0JLjkRj2QjNj1J5
7969A7j0OLj5kQolNj0OkLqj%mJ3%ojMnNlPmQqMLJjj0MJ2oJRmklJ2j3oLoMMJqo
8021a0J1NoKj2OlLMpQmOkpK0k3J2j1LKJ8k0LPLl%JJjLNj3LpMlP%oj%PKj9PNkO
8071Dk2J0oJ0PpK%Rj4Q%Lnkj%J7noJ0qRnMmkRlOj5jOoLo%%j4J2j2J2jlMJJ3j7
8119fnNNLLJqPJ5k0KLOnLlJ2qnRqMnOj6J2Jj2KJPj2lJ2nJ7j6mMlolRnJ0oKoPL
$$ plain form
7771 -1 6 3 -12 -7 4 -5 -5 2 1 6 -6 -3 5 8 4 11 1 17 21 13 16 12 19 19 14 22 11 8 7 0 2 -8 4 5 3 -3 3 5 -7 -7 0 0 -7 -6 -5 -3 -6 -1 12 0
7821 0 -5 -6 5 -4 12 -9 -2 2 0 3 13 6 11 5 10 16 8 7 11 9 17 13 5 9 -1 3 5 -12 4 -7 2 -9 -6 -8 1 1 -10 1 6 8 -2 6 4 -7 -1 7 7 5
7869 5 7 1 3 17 5 15 6 0 1 8 8 15 6 0 4 15 17 3 5 11 7 8 1 11 1 5 -7 -3 -3 -7 -4 -13 -2 -6 6 2 -3 0 16 6 4 7 1 3 6 11 13 6 14
7918 14 11 8 9 7 9 14 12 14 7 4 -5 9 2 0 2 8 8 12 6 6 1 0 3 -8 -9 0 -1 2 -11 5 -3 -2 -2 11 6 1 9 12 13 3 4 7 6 4 13 1 9 8 13 2 17
7969 17 7 13 16 1 -1 7 1 -2 3 -7 -1 -3 0 -8 -9 -9 -13 0 0 -6 -7 -3 -8 -3 -6 1 -3 5 -3 1 4 5 4 -6 -2 10 4 5 14 10 8 5 17 4 -2 1 -5 -1 3 4 -4 -10
8021 -10 1 6 0 2 -10 -4 -7 -4 0 -7 1 -3 3 1 -6 14 -9 3 -8 -5 -3 15 -5 -2 5 8 5 5 6 7 6 9 14 1 4 -3 1 -2 5 5 -1 -2 -2 5 7 -12 -5 0 -2 4
8071 4 -18 -8 -14 -4 3 -4 -2 -2 7 -7 1 1 4 -1 -3 -4 -4 13 8 2 12 4 13 8 12 8 6 15 12 18 3 2 8 2 5 -1 -1 -1 -15 -3 -15 -3 -4 -7 -3 -2 11 -6
8119 -6 -11 -6 -1 2 5 6 -2 5 20 0 2 5 11 6 9 6 18 10 5 14 6 10 5 11 -5 7 8 -4 -2 -1 6 -6 -9 3 -2 15 -1 -5 -1 -4 -10 -13 -4 -9 1 -5 -3 -9 -2 1
$$ [...]
8191F
##END NTUPLES=NMR FID
##END=
