##TITLE=1H_IG-clbenzal
 200.13MHz, CDCl3
 8 sc
 
 19ns.26.2.2025
##JCAMPDX= 6.0         $$ Bruker NMR JCAMP-DX V2.0
##DATA TYPE= NMR FID
##DATA CLASS= NTUPLES
##ORIGIN= UXNMR, Bruker Analytische Messtechnik GmbH
##OWNER= pz
$$ XWIN-NMR		Version 3.5
$$ Wed Feb 26 14:13:13 2025 Russian Standard Time (UT+4h)  new_Human@DPX200
##.OBSERVE FREQUENCY= 200.1313
##.OBSERVE NUCLEUS= ^1H
##.DELAY= (6, 6)
##.ACQUISITION MODE= SIMULTANEOUS
##.ACQUISITION SCHEME= undefined
##.AVERAGES= 8
##.DIGITISER RES= 18
##SPECTROMETER/DATA SYSTEM= spect
##.PULSE SEQUENCE= zg30
##.SOLVENT NAME= CDCl3
##.SHIFT REFERENCE= (INTERNAL, CDCl3, 0, 14.3821)
##AUDIT TRAIL= $$ (NUMBER, WHEN, WHO, WHERE, WHAT)
$$ ##TITLE= Audit trail, XWIN-NMR		Version 3.5
$$ ##JCAMPDX= 5.01
$$ ##ORIGIN= Bruker BioSpin GmbH
$$ ##OWNER= new_Human
$$ C:/Bruker/XWIN-NMR/data/yarkov/nmr/H-C/1/audita.txt
$$ ##AUDIT TRAIL=  $$ (NUMBER, WHEN, WHO, WHERE, WHAT)
(   1,<2025-02-26 14:10:11.15 +0400>,<new_Human>,<DPX200>,
      <created by zg, POWCHK disabled, PULCHK disabled
       configuration hash MD5:
       00 E9 B6 7A A2 85 ED C7 34 08 36 98 17 FE 4E 26
       data hash MD5: 16K
       22 55 DA 44 77 ED 12 E4 6F BB 2C 0B A6 CC AC 15>)
$$ ##END=
$$ 
$$ hash MD5
$$ B1 D6 E3 52 0C 56 05 85 C0 27 6A EB 2E 4B 08 01
##$RELAX= 
##$RELAX= 
##$RELAX= 
##$RELAX= 
##$RELAX= 
##$RELAX= 
$$ Bruker specific parameters
$$ --------------------------
##$DU= <C:/Bruker/XWIN-NMR>
##$EXPNO= 1
##$NAME= <H-C>
##$PROCNO= 1
##$TYPE= <nmr>
##$USER= <yarkov>
##$AMP= (0..31)
100 100 100 100 100 100 100 100 100 100 100 100 100 100 100 100 100 100 
100 100 100 100 100 100 100 100 100 100 100 100 100 100 
##$AQSEQ= 0
##$AQ_mod= 1
##$AUNM= <au_zg>
##$AUTOPOS= <>
##$BF1= 200.13
##$BF2= 200.13
##$BF3= 200.13
##$BF4= 200.13
##$BF5= 200.13
##$BF6= 200.13
##$BF7= 200.13
##$BF8= 200.13
##$BYTORDA= 1
##$CFDGTYP= 0
##$CFRGTYP= 5
##$CHEMSTR= <none>
##$CNST= (0..31)
1 1 145 1 1 1 1 1 1 1 1 1 1 1 1 1 1 1 1 1 1 1 1 1 1 1 1 1 1 1 1 1 
##$CPDPRG= <>
##$CPDPRG1= <>
##$CPDPRG2= <>
##$CPDPRG3= <>
##$CPDPRG4= <mlev>
##$CPDPRG5= <mlev>
##$CPDPRG6= <mlev>
##$CPDPRG7= <mlev>
##$CPDPRG8= <mlev>
##$CPDPRGB= <>
##$CPDPRGT= <>
##$D= (0..31)
0 0.7 0 0 0 0 0 0 0 0 0 0.03 0 0 0 0 0 0 0 0 0 0 0 0 0 0 0 0 0 0 0 0 
##$DATE= 1740564610
##$DBL= (0..7)
120 120 120 120 120 120 120 120 
##$DBP= (0..7)
150 150 150 150 150 150 150 150 
##$DBP07= 0
##$DBPNAM0= <>
##$DBPNAM1= <>
##$DBPNAM2= <>
##$DBPNAM3= <>
##$DBPNAM4= <>
##$DBPNAM5= <>
##$DBPNAM6= <>
##$DBPNAM7= <>
##$DBPOAL= (0..7)
0.5 0.5 0.5 0.5 0.5 0.5 0.5 0.5 
##$DBPOFFS= (0..7)
0 0 0 0 0 0 0 0 
##$DE= 6
##$DECBNUC= <off>
##$DECIM= 32
##$DECNUC= <off>
##$DECSTAT= 4
##$DIGMOD= 1
##$DIGTYP= 9
##$DL= (0..7)
0 120 120 120 120 120 120 120 
##$DP= (0..7)
150 150 150 150 150 150 150 150 
##$DP07= 0
##$DPNAME0= <>
##$DPNAME1= <>
##$DPNAME2= <>
##$DPNAME3= <>
##$DPNAME4= <>
##$DPNAME5= <>
##$DPNAME6= <>
##$DPNAME7= <>
##$DPOAL= (0..7)
0.5 0.5 0.5 0.5 0.5 0.5 0.5 0.5 
##$DPOFFS= (0..7)
0 0 0 0 0 0 0 0 
##$DQDMODE= 0
##$DR= 18
$$ [...]
##$SUBNAM0= <"">
##$SUBNAM1= <"">
##$SUBNAM2= <"">
##$SUBNAM3= <"">
##$SUBNAM4= <"">
##$SUBNAM5= <"">
##$SUBNAM6= <"">
##$SUBNAM7= <"">
##$SUBNAM8= <"">
##$SUBNAM9= <"">
##$SW= 18.0517328524113
##$SWIBOX= (0..15)
0 0 2 0 0 0 0 0 0 0 0 0 0 0 0 0 
##$SW_h= 3612.71676300578
##$TD= 16384
##$TD0= 1
##$TE= 0
##$TE2= 300
##$TE3= 300
##$TEG= 300
##$TL= (0..7)
0 120 120 120 120 120 120 120 
##$TP= (0..7)
150 150 150 150 150 150 150 150 
##$TP07= 0
##$TPNAME0= <>
##$TPNAME1= <>
##$TPNAME2= <>
##$TPNAME3= <>
##$TPNAME4= <>
##$TPNAME5= <>
##$TPNAME6= <>
##$TPNAME7= <>
##$TPOAL= (0..7)
0.5 0.5 0.5 0.5 0.5 0.5 0.5 0.5 
##$TPOFFS= (0..7)
0 0 0 0 0 0 0 0 
##$TUNHIN= 0
##$TUNHOUT= 0
##$TUNXOUT= 0
##$USERA1= <user>
##$USERA2= <user>
##$USERA3= <user>
##$USERA4= <user>
##$USERA5= <user>
##$V9= 5
##$VALIST= <valist>
##$VCLIST= <CCCCCCCCCCCCCCC>
##$VD= 0
##$VDLIST= <DDDDDDDDDDDDDDD>
##$VPLIST= <PPPPPPPPPPPPPPP>
##$VTLIST= <TTTTTTTTTTTTTTT>
##$WBST= 1024
##$WBSW= 4
##$XGAIN= (0..3)
0 0 0 0 
##$XL= 0
##$YL= 0
##$YMAX_a= 472301
##$YMIN_a= -458878
##$ZGOPTNS= <>
##$ZL1= 120
##$ZL2= 120
##$ZL3= 120
##$ZL4= 120
##$ABSF1= 10
##$ABSF2= 0
##$ABSG= 5
##$ABSL= 3
##$ALPHA= 0
##$AQORDER= 0
##$ASSFAC= 0
##$ASSFACI= 0
##$ASSFACX= 0
##$ASSWID= 0
##$AUNMP= <proc_1d>
##$AZFE= 0.1
##$AZFW= 0.1
##$BCFW= 1
##$BC_mod= 2
##$BYTORDP= 1
##$COROFFS= 0
##$CY= -3
##$DATMOD= 1
##$DC= 2
##$DFILT= <>
##$DTYPP= 0
##$F1P= 0
##$F2P= 0
##$FCOR= 0.5
##$FTSIZE= 0
##$FT_mod= 4
##$GAMMA= 1
##$GB= 0.15
##$INTBC= 1
##$INTSCL= 1
##$ISEN= 128
##$LB= 0.25
##$LEV0= 0
##$LPBIN= 0
##$MAXI= 10000
##$MC2= 0
##$MEAN= 0
##$ME_mod= 0
##$MI= 1.114404
##$NCOEF= 0
##$NC_proc= 0
##$NLEV= 6
##$NOISF1= 3.799351
##$NOISF2= 2.8
##$NSP= 1
##$NTH_PI= 0
##$NZP= 0
##$OFFSET= 14.38212
##$PC= 1
##$PHC0= -1177.494
##$PHC1= 0.1922531
##$PH_mod= 1
##$PKNL= yes
##$PPARMOD= 0
##$PSCAL= 0
##$PSIGN= 0
##$REVERSE= no
##$SF= 200.129724274929
##$SI= 16384
##$SIGF1= 3
##$SIGF2= 2
##$SINO= 400
##$SIOLD= 16384
##$SREGLST= <1H.CDCl3>
##$SSB= 0
##$STSI= 0
##$STSR= 0
##$SW_p= 3205.1282051282
##$SYMM= 0
##$S_DEV= 0
##$TDeff= 0
##$TDoff= 0
##$TI= <>
##$TILT= no
##$TM1= 0
##$TM2= 0
##$TOPLEV= 0
##$USERP1= <user>
##$USERP2= <user>
##$USERP3= <user>
##$USERP4= <user>
##$USERP5= <user>
##$WDW= 1
##$XDIM= 8192
##$YMAX_p= 0
##$YMIN_p= 0
$$ End of Bruker specific parameters
$$ ---------------------------------
##NTUPLES= NMR FID
##VAR_NAME=  TIME,          FID/REAL,        FID/IMAG
##SYMBOL=    X,             R,               I
##VAR_TYPE=  INDEPENDENT,   DEPENDENT,       DEPENDENT
##VAR_FORM=  AFFN,          ASDF,            ASDF
##VAR_DIM=   8192,          8192,            8192
##UNITS=     SECONDS,       ARBITRARY UNITS, ARBITRARY UNITS
##FACTOR=    0.0002768,     1,               1
##FIRST=     0,             0,               0
##LAST=      2.2672688,     0,               0
##MIN=       0,             -458878,         0
##MAX=       2.2672688,     472301,          0
$$ Real data points
##PAGE= N=1
##DATA TABLE= (X++(R..R)), XYDATA
0@%%%%%%%%%%%%%%%%%%LlOj1J3j6J6j7K1k5K8l4L9m3M9n7O4p1Q2r2J04j17J31
$$ 0 0 0 0 0 0 0 0 0 0 0 0 0 0 0 0 0 0 0 3 0 6 -5 8 -8 8 -9 12 -13 15 -19 20 -23 26 -31 33 -38 44 -48 56 -61 70
41G0j45J61j80J99k19K41k69K95l23L56l94M36m78N26n81O41p09P89q79R84j108
$$ 70 -75 86 -94 105 -114 127 -142 153 -170 186 -208 228 -250 276 -305 336 -373 416 -463 521 -587
62e87J256j438J664j949K314k763L009J401J74365P4237o0419O4966J68262M7983
$$ -587 669 -769 895 -1054 1260 -1503 1506 2907 177272 251509 191090 256056 424318 472301
76D72301j67596j67980j1764K1133j50200k42711j01508P1191L2704j01237o8351
$$ 472301 304705 136725 124961 146094 -4106 -246817 -348325 -277134 -244430 -345667 -414018
87d14018J32387K16121Q2298k8456P0572K06872J37970o1396j09809K2137O9641
$$ -414018 -281631 -65510 16788 -11668 58904 265776 403746 342350 232541 254678 324319
98C24319q7535k26178j47720J4079K561j44635j51815L4711J56525O6823m6219
$$ 324319 236784 10606 -137114 -123035 -120474 -265109 -416924 -382213 -225688 -158865 -205084
109b05084L8174K04033J89501J5241n4722N7853J29848k74j67636j40818J770
$$ -205084 -166910 37123 226624 241865 187143 244996 374844 374570 206934 66116 67886
120F7886L130j44562j97000n1804Q3877K7374q4057k5204J46406J84307N1739
$$ 67886 71016 -73546 -270546 -322350 -238473 -211099 -295156 -320360 -173954 10353 62092
131F2092k7814P2640J72790Q0800q7168r9317K1556M1200j04993k00997j00074
$$ 62092 34278 106918 279708 360508 273340 174023 195579 236779 131786 -69211 -169285
142a69285L3113l007j22739r8853O9681J48248M7152l5834N7037J82528J36901
$$ -169285 -136172 -139179 -261918 -360771 -291090 -142842 -95690 -131524 -74487 108041 244942
153B44942j8080n5520N3271R1763m0621j63363j09132J0491r079j35988j48665
$$ 244942 226862 171342 224613 316376 275755 112392 3260 13751 4672 -131316 -279981
164b79981n560R0510K0905o2500R465J50469J51426K1634k7243P1963J35561L2674
$$ -279981 -285541 -195031 -174126 -236626 -227161 -76692 74734 96368 69125 141088 276649 309323
176C09323j04632q6478K2899J5909j14726j68393n9900M5269m903j01887n3370
$$ 309323 204691 118213 141112 157021 42295 -126098 -185998 -140729 -145632 -247519 -300889
187c00889R3818J33106L0750k6113O7083J58781R0129m3309n1281M5838N7252
$$ -300889 -207071 -73965 -43215 -69328 -2245 156536 246665 203356 152075 197913 255165
198B55165o6652j52938q0867J8228j7639j20834j05710K7325R2457J5651m5953
$$ 255165 188513 35575 -45292 -27064 -44703 -165537 -271247 -243922 -151465 -135814 -181767
209a81767L4813J45229J18116K4k5375O6787J03267m903j10551p2781K1204j687
$$ -181767 -146954 -1725 116391 116415 91040 157827 261094 256191 145640 72859 94063 92376
221I2376j16588j38422k5569N1257p565q0261j8099J06200J16506J6348j7994
$$ 92376 -24212 -162634 -188203 -136946 -144511 -224772 -242871 -136671 -20165 -3817 -21811
232b1811P1851J32334N2872n8769m7398L9808L0664q3384j36021n6624K2460k2036
$$ -21811 50040 182374 235246 176477 129079 168887 199551 116167 -19854 -76478 -54018 -76054
244g6054j05540o9612N0972Q8138R668l1720N0342J35329Q8529j7480k1993O1872
$$ -76054 -181594 -251206 -200234 -112096 -102428 -134148 -83806 51523 140052 122572 100579 162451
256A62451P4284l1362j10842n8367K0527j5894j11971j07940k59N4635r901o2154
$$ 162451 236735 205373 94531 36164 56691 40797 -71174 -179114 -179373 -124738 -134639 -196793
268a96793R211J10209R6627M347j1674P1535J08090K1150o7444l9353L2941J0341
$$ -196793 -187582 -77373 19254 23601 11927 83462 191552 212702 145258 105905 138846 149187
280A49187r0735j18217l3695K5887k6259q8486l9689O5260Q0476L605k0808O0191
$$ 149187 58452 -59765 -93460 -67573 -93832 -182318 -222007 -156747 -76271 -72666 -93474 -33283
292c3283J20051O1524k9442j9512N5738N0181n0351j03994m3146J9379k3697j02800
$$ -33283 86768 148292 118850 99338 155076 205257 154906 50912 7766 27145 3448 -99352
304i9352q0620K0158N3158j1923m5528K6895J06754P6404o248o413O8333Q4119
$$ -99352 -179972 -159814 -106656 -118579 -164107 -137212 -30458 45946 39698 33285 101618 185737
316A85737j917p1093l2328K9304n515r1773r7591j5114K8070k6342p2804j6023
$$ 185737 183820 112727 80399 109703 104188 12415 -85176 -100290 -72220 -98562 -171366 -187389
328a87389P3823O9628k084j2759O3403J03553L7103l8029j5536M7465L0465o1107
$$ -187389 -113566 -43938 -46022 -58781 4622 108175 145278 107249 91713 139178 169643 108536
340A08536r3992k9189J9847k8663r0844n5108L3509N0382j3355l2550L9278R8363
$$ 108536 14544 -14645 5202 -23461 -114305 -169413 -135904 -85522 -98877 -131427 -92149 6214
352F214N7557j3703l776O2545O2962k0654o9565k5141K4345j5061q7889p7858
$$ 6214 63771 50068 46292 108837 171799 151145 81580 56439 80784 65723 -22166 -100024
364a00024Q67K8566k5743n7298K214P6171N8727q136n945O3164Q5702J7610m3293
$$ -100024 -99157 -70591 -96334 -153632 -151418 -75247 -16520 -24656 -30601 32563 118265 135875 92582
377I2582j2463M1358J2894o6805q1305j6970J9045l0944p7274l3845M3376M4500
$$ 92582 80119 121477 134371 67566 -13739 -30709 -11664 -42608 -119882 -153727 -110351 -65851
389f5851j3026k1596M6171Q8230M0501j9763p78N4981M3803l2529o6732j7596
$$ -65851 -78877 -100473 -54302 33928 74429 54666 53888 108869 152672 120143 53411 35815
401C5815K0189k1985q0610n9141J2424K8408k4559m4930J6992P4047M7302j0802
$$ 35815 56004 34019 -46591 -105732 -93308 -64900 -89459 -134389 -117397 -43350 3952 -6850
413f850j760O0559O9159J025m4473r452L3698M65o7473o8855o048J6905l1266
$$ -6850 -8610 51949 121108 122133 77660 68208 101906 102371 34898 -33957 -40005 -23100 -54366
426e4366o4024j6559M7724L9511j3899j2707M9796P6587K6001k3258Q90M8561
$$ -54366 -118390 -134949 -87225 -47714 -61613 -74320 -24524 52063 78064 54806 55696 104257
438A04257K7701m0744o0215j1254J6955k6290p3190m2596K1581K5629k3349l2621
$$ 104257 131958 91214 30999 19745 36700 10410 -62780 -105376 -83795 -58166 -81515 -114136
450a14136K6281P0444L6528j3700K712N6382N3134j1459m4403n936K7742j0281
$$ -114136 -87855 -17411 19117 5417 8129 64511 117645 106186 61783 55847 83589 73308
462G3308o5963n5025J947J5628l0868n2301j874N0153L2443j3735n039N1084O5000
$$ 73308 7345 -47680 -45733 -30105 -60973 -113274 -115148 -64995 -32552 -46287 -51326 -242 64758
475F4758J3098k5386L538M0927J4700m5759n3812n173J4514k9641o4019k8489
$$ 64758 77856 52470 56008 96935 111635 65876 12064 6891 21405 -8236 -72255 -100744
487a00744K7414K3271k2243k3078L3941O3916K6524j5253N817N1565L9242k0793
$$ -100744 -73330 -50059 -72302 -95380 -61439 2477 29001 13748 19565 71130 110372 89579
499H9579m1777k806K2091j6702o2515m3938Q793J3445l0079m0906Q590N0122K6404
$$ 89579 47802 44996 67087 50385 -12130 -56068 -47275 -33830 -63909 -104815 -96225 -46103 -19699
512a9699j3653Q05N0624N3902K781k6790M525L5803L606m8812m6040j24J1798
$$ -19699 -33352 -32547 18077 71979 74760 47970 52495 88298 91904 43092 -2948 -3072 8726
525H726l0428n5754j6258L1740K0280k0530j4736L8069N8409J6977j7019Q700
$$ 8726 -21702 -77456 -93714 -61974 -41694 -62224 -76960 -38891 19518 36495 19476 28176
537B8176M5796K6683k7542l9910O76J7457k2494n8236l2804J4628J2003k7861
$$ 28176 73972 100655 73113 33203 33879 51336 28842 -29394 -62198 -47570 -35567 -63428
549f3428l1299J7989M9202K0685j3702N342M8524M4032o963k7169N765K8853m950
$$ -63428 -94727 -76738 -27536 -6851 -20553 -15211 33313 77345 70382 43213 48978 77831 72881
562G2881m9982l9719N224R195l1360m7055n353L4780J7551j9197o771M1403N1462
$$ 72881 22899 -16820 -11596 -2401 -33761 -80816 -86169 -51389 -33838 -53035 -59806 -18403 33059
575C3059R268j7981J0433M0791J5758l3827l5713K861J3217k6937n3454k2715
$$ 33059 42327 24346 34779 75570 91328 57501 21788 24649 37866 10929 -42525 -65240
587f5240J8881R760k5917k2379K4861M7823J5193j3709R524M6316L3645j4067
$$ -65240 -46359 -36599 -62516 -84895 -60034 -12211 2982 -10727 -1203 45113 78758 64691
599F4691k6985P146K3471j2296n0023l2614Q516P093l1275l9434M547L6163J4086
$$ 64691 37706 44852 68323 56027 6004 -26610 -18094 -11001 -42276 -81710 -77163 -41000 -26914
612b6914j7598K0M3043M4596J604j7925J1845L5071O018l6600l2041N967Q738
$$ -26914 -44512 -44492 -1449 43147 44751 26826 38671 73742 79760 43160 11119 17086 25824
625B5824k9396m7744j3822K1777Q438k4652j4419L0594M3997R653j3118J2053
$$ 25824 -3572 -51316 -65138 -43361 -34923 -59575 -73994 -43400 597 10250 -2868 9185
637I185M3417K4279j9835k5402Q093J8503j8214m8217k5478J2330M454l0881l0492
$$ 9185 52602 76881 57046 31644 39737 58240 40026 -8191 -33669 -21339 -16885 -47766 -78258
650g8258J1950L6252J0221j6286N599M2766L6792m812j7379J3190L0201k460l8013
$$ -78258 -66308 -30056 -19835 -36121 -30522 12244 49036 44224 26845 40035 70236 67776 29763
663B9763k6929P592N262l0191m1679n590K3499N776k2014p049L3501L9242M093
$$ 29763 2834 10426 15688 -14503 -56182 -61772 -38273 -32497 -54511 -61560 -28059 11183 15276
676A5276j2535J4692L8391J5486k4113k2879R693J3441k2756m4308j7713J4387
$$ 15276 2741 17433 55824 71310 47197 24318 34011 47452 24696 -19612 -37325 -22938
688b2938K878k9290k2310J8462L4267O007j4344R868M0691K8269j0575j5917J4188
$$ -22938 -20060 -49350 -71660 -53198 -18931 -12924 -27268 -17400 23291 51560 40985 25068 39256
701C9256K3697r380l7821k1111R601K077l0361l3599K186K4694L029j9814n44
$$ 39256 62953 53573 15752 -5359 4242 6319 -24042 -57641 -55455 -30761 -27732 -47546 -48090
714d8090L4772L3382j060j1778J5994L3348O669k6915j9282J0201Q787k5966l8987
$$ -48090 -13318 20064 19004 7226 23220 56568 63237 36322 17040 27241 36028 10062 -28925
727b8925r708J6296Nk6321j3882K3157L0953K296j2571J3418L7234J8936j4586
$$ -28925 -38633 -22337 -22332 -48653 -62535 -39378 -8425 -6129 -18700 -5282 31952 50888 36302
740C6302j4117J4370J7578j5160l5623j5161J0383l86k9427k5452R100K3825Q81
$$ 36302 22185 36555 54133 38973 3350 -11811 -1428 -1814 -31241 -56693 -47593 -23768 -22887
753b2887j6605N191L4615K6635n575j0441J6645K7066o80k8214j6032J0812L881
$$ -22887 -39492 -34301 314 26949 21374 10933 27578 54644 53964 25750 9718 20530 24411
766B4411k7136l2819l058J6627j238k3166o179K6048K6915j046r539J5464L2919
$$ 24411 -2725 -35544 -38602 -21975 -23213 -46379 -52558 -26510 405 -641 -10180 5284 38203
779C8203J1448j7922j1795J3345J1674j9041l3180r983J1150k762k7088j8602
$$ 38203 49651 31729 19934 33279 44953 25912 -7268 -17251 -6101 -8863 -35951 -54553
791e4553J4121K2986j102j3305R476L3328K0372q289q988J6746K1543p286k8449
$$ -54553 -40432 -17446 -18548 -31853 -22377 10951 31323 23034 14046 30792 52335 45049 16600
804A6600j2533J0272k0k7548k7021K534J6936l213j9256Q9K7464K3314l880p089
$$ 16600 4067 14339 14319 -13229 -40250 -37716 -20780 -23993 -43249 -43160 -15696 7618 3738 -3351
818c351J7546K8322M781j9690r702J2348O363k2478k9730n307J1007m961k4757
$$ -3351 14195 42517 47298 27608 17906 30254 36617 14139 -15591 -20898 -9891 -14852 -39609
831c9609j1523J7917K1167k989j0271J3576L1479J4777j1555o739J6834J5532
$$ -39609 -51132 -33215 -12048 -15037 -25308 -11732 19747 34524 22969 16230 33064 48596
843D8596j2691k7386q780R899m016k7013k1248P537J5879m492j5875N556K8311
$$ 48596 35905 8519 -261 9638 5622 -21391 -42639 -35102 -19223 -23715 -39590 -34034 -5723
856e723J8494n691m809J8031K3903j500k0381p470J1540K067k4224k5841r52J1083
$$ -5723 12771 7080 2271 20302 44205 42705 22324 14854 26394 28461 4237 -21604 -22556 -11473
870a1473o785k2048n418K0177J8135l696p483J5859K8628Q840j3022n026J6020
$$ -11473 -18258 -40306 -45724 -25547 -7412 -11108 -18591 -2732 25896 34736 21714 16688 32708
883C2708J0732j6863k5136n098Q782o166k5619j5102J0863J4305n718j2032R779
$$ 32708 43440 26577 1441 -3657 5125 -1041 -26660 -41762 -30899 -16594 -22312 -34344 -24565
896b4565K7250J4045p389l030J8311J8263o312k0133n489J1103k077k4373k1318
$$ -24565 2685 16730 9341 6311 24622 42885 36573 16440 10951 22054 19977 -4396 -25714
909b5714K906J0873q019j9102J18K1924J5006n581m727J7535K4587L741j4481
$$ -25714 -22808 -11935 -19954 -39056 -38938 -17014 -2008 -7589 -12316 5219 29806 33547 19066
922A9066l154J4800N632j9167k2568j433Q432q706k2802r553J3982J2781p031
$$ 19066 15912 30712 36344 17177 -5391 -6824 1608 -7098 -29900 -39453 -25471 -12690 -19721
935a9721q785J2962K5529R090q569j549J7794J3542j0639j9369k990R553m802
$$ -19721 -28506 -15544 9985 19075 10506 8957 26751 40293 29654 10285 7295 16848 12046
948A2046k3915j6377O577R832q730j4966M398K2127J2010o961k471J8554J9863
$$ 12046 -11869 -28246 -21669 -11837 -20567 -35533 -31135 -9008 3002 -3959 -6430 12124 31987
961C1987j287j4693j514J3021Q98k0555j8368J096P074r548j9621l998J5560J0512
$$ 31987 30700 16007 14493 27514 28412 7857 -10511 -9415 -2341 -11889 -31510 -35508 -19948 -9436
975i436o990n174J4886K2646N312r817L78J5694Q781j3636j8288r51Q089p382
$$ -9436 -16426 -21600 -6714 15932 21244 11427 11805 27499 36280 22644 4356 3405 11494 4112
989D112k2256j1194R186Q203q515j1201Q460K1377Q595o550l40J7607J5626n364
$$ 4112 -18144 -29338 -20152 -11949 -20464 -31665 -23205 -1828 6767 217 -123 17484 33110 27746
1003B7746j4252l34J0685l160k0421j5410L474N864j0134j6202O33J6318Q612
$$ 27746 13494 13160 23845 20685 264 -15146 -11672 -5808 -15942 -32144 -31511 -15193 -6581
1016f581o534k174J6277J9045K097r713J229J3604M255j5224j6098Q72N979r298
$$ -6581 -13115 -15289 988 20033 22130 12417 13646 27250 31505 16281 183 1055 7034 -2264
1030b264k0185o830J0607O912q305p362J1257J9650O366p070K185J6433J0803
$$ -2264 -22449 -29279 -18672 -11760 -20065 -27427 -16170 3480 9846 2776 4961 21394 32197
1043C2197q010j3547J207Q184o207j9969j1565N078M496j0332j2888M689J6101
$$ 32197 24187 10640 11847 20031 13824 -6145 -17710 -12632 -8136 -18468 -31356 -26667 -10566
1056a0566O673o110K67J6665J6522k223q895K530J1469L83j6484j3578K247M251
$$ -10566 -3893 -10003 -9736 6929 23451 21228 12333 14863 26332 26715 10231 -3347 -1100 3151
1070C151j0551j7021l346J0949N694p623m261J3501J7747L243o924M180J4596
$$ 3151 -7400 -24421 -27767 -16818 -11124 -18747 -23008 -9507 8240 11483 4559 8739 23335
1083B3335P050j0656j1597J961N827q292j8350q584O457K795j0042r054P135J5497
$$ 23335 30385 19729 8132 10093 15920 7628 -10722 -19306 -12849 -10054 -20096 -29150 -22015 -6518
1097f518N252n564K466J6002J2537l808q780L075R803l147j6508j1095K981K966
$$ -6518 -1266 -6830 -4364 11638 24175 20367 11587 14662 24465 21318 4810 -6285 -3304 -338
1111c38j1252j4064k3J1747M159o908j255J4455J5188Q14o066M549J3081L036
$$ -338 -11590 -25654 -25677 -13930 -9771 -16679 -17934 -3479 11709 12523 6457 11006 24087 27123
1125B7123j1772j0339K782L673r839j6510n554P368K255r091o048R686J4619L170
$$ 27123 15351 5012 7794 11467 1628 -14882 -20436 -13068 -10813 -19904 -25952 -16266 -1647 1523
1139A523n333M480J4883R200o070q421L671P115n433j6150q648M446R01j0829
$$ 1523 -3810 670 15553 24753 18683 10262 13933 21048 15615 -535 -9183 -4737 -3836 -14665
1153a4665j1297L397J1899K851n982J648J4722J2316j270n757N056J0874J67j3108
$$ -14665 -25962 -22565 -10666 -7815 -13797 -12149 2573 14889 13619 7862 12918 23792 23959 10851
1167A0851r107L412K055j0627j4936j927P960J507q314l249J1413J3582J236m281
$$ 10851 1744 5156 7211 -3416 -18352 -20279 -12319 -10812 -19126 -22375 -10962 2620 3856 -425
1181d25N385J3674N630p508p617L501N024p808j5008o535M637N48j0349q398N763
$$ -425 4960 18634 24264 16756 9139 12640 17664 9856 -5152 -11687 -7050 -6502 -16851 -25249 -19486
1196a9486J1749K160n128L532J4538R861l352m891N080Q800k766j3302p627L350
$$ -19486 -7737 -5577 -10705 -7173 7365 17226 13874 8983 14063 22863 20097 6795 -832 2518
1210B518L17j1032j2439L69Q588M66p128k7J2238J2384l38l385O037J2319K568
$$ 2518 2835 -8197 -20636 -20267 -11679 -11213 -18341 -18368 -6130 6254 5916 2531 8568 20887 23455
1225B3455r001o763L544K816q958j4439m228N143o27r531n421P933J0930J246
$$ 23455 14454 7691 11235 14051 5093 -9346 -13574 -8431 -9058 -18589 -24010 -16077 -5147 -3901
1239c901l909N175J3901P446m508m620N376O655n551j2996o052L241r09j1356
$$ -3901 -7810 -2635 11266 18712 14204 9584 14960 21615 16064 3068 -2984 257 -652 -12008
1253a2008r628K588Q441K3n891K135J2737J0286j139k932O840R846P08j0174n619
$$ -12008 -21636 -19048 -10607 -10584 -16475 -14340 -1603 8683 7544 4612 11452 21298 22006 11832 6213
1268F213L504R88j0611j2521j928N157j175r285j881R401R745P9k668O465J2835
$$ 6213 9717 10705 94 -12427 -14355 -9198 -10373 -19658 -21539 -12138 -2393 -2314 -4982 1483 14318
1283A4318M774n717l431N069M089p212j2631m416L188j892j0706p284M633P941
$$ 14318 19092 13375 9944 15013 19102 11890 -741 -5157 -1969 -3861 -14567 -21851 -17218 -9277
1297i277o2m830L984J2690Q226j956k284P074Q184k434r936n220L400p97j0851
$$ -9277 -9339 -14169 -10185 2505 10731 8775 6491 13565 21749 19315 9379 4159 7559 6762 -4089
1312d089j0877J34N296k178p043j62J0398Q715p90j553P523J1165K718o662l285
$$ -4089 -14966 -14832 -9536 -11714 -18757 -18919 -8521 194 -596 -2149 5374 16539 19257 12595 9310
1327I310M858J917q241j1857k827L133k657r945m914O001P751p87l246N573J2346
$$ 9310 14168 16085 7844 -4013 -6840 -3707 -6364 -16309 -21223 -15222 -7471 -8258 -11504 -5931 6415
1342F415O210k746j557O378O261m664j0312l676K608j882j1302q500J848M825
$$ 6415 12625 9879 8322 14700 20961 16297 5985 2309 4917 3035 -8267 -16767 -14919 -10094
1356a0094j974n789K591J0606P425o90r86P836R323M65p358k551L895M6r864j0054
$$ -10094 -12068 -17857 -15266 -4660 2765 2075 1089 8925 18248 18713 11355 8804 12699 12745 2881 -7173
1372g173j729L185l518q713k204P731P195r72j690O790J1158M419l806j267O094
$$ -7173 -8902 -5717 -9235 -17948 -20152 -12421 -5226 -6198 -7888 -1098 10060 14479 10673 9406 15500
1387A5500L701o375j0189k434J870l513j0005o598L602M641k157l718M450J1039
$$ 15500 19201 12826 2637 203 2073 -1440 -11445 -18043 -14441 -9800 -11957 -15675 -11225 -186
1401a86N857j624L16P358P499j566p630k444L050j714j0254r266n5L047l692p227
$$ -186 5671 4047 4363 11721 19220 17654 10024 7580 10630 8916 -1338 -10604 -10659 -7612 -11304 -18531
1417a8531J94Q560O504p82r21Q050J0264K198m319j077N393J553q103r427j829
$$ -18531 -18337 -9777 -3273 -4055 -4976 3074 13338 15536 11217 10140 15533 17086 8983 -444 -2273
1432b273J850m302r955m086N002M399j593k831O377J0447N105j904P10P043N837
$$ -2273 -423 -4725 -14680 -18766 -13764 -9365 -10958 -13789 -7412 3035 8140 6236 6946 13989 19826
1447A9826l868p850k115K477l156j0538p792J346K716l266o067K214R039N687
$$ 19826 15958 8108 5993 8470 5314 -5224 -13016 -11670 -8954 -12220 -18287 -16073 -7034 -1347
1461a347r76N14Q307R009K89m949k21M269m07q954q691j134J779n043q628k331
$$ -1347 -2323 -1809 6498 15507 15796 10847 10626 14895 14488 5534 -3157 -4291 -2512 -7555 -16183 -18514
1477a8514N902M701k157q55O840J0547L537k531J093O876L647n525p577j549J377
$$ -18514 -12612 -7911 -10068 -10923 -4083 6464 10001 7470 8563 15439 19086 13561 5984 4435 5812
1492E812m202r959o268K644K637l794m040L767R659M994j526J352Q433P173j446
$$ 5812 1610 -8349 -14617 -11973 -9336 -13130 -17170 -13403 -3744 1250 -276 1076 9509 16682 15236
1507A5236n393j93L929k429r201p877J92J091n090p437L8O664M463k183n2Q022
$$ 15236 9843 9650 13579 11150 1949 -5928 -5736 -4645 -9735 -17172 -17134 -10470 -6007 -8190 -8242 -220
1523b20R680J812l008J289O026J688o379q074p76J177m782r447m197L619K486
$$ -220 9460 11272 8264 9553 15579 17267 10888 2814 2038 3215 -1567 -11014 -15211 -11592 -9106
1538i106l522k605N424R185L834j204K040P828N302l219n316k54K757l486r738
$$ -9106 -12628 -15233 -9809 -624 3210 2006 4046 11874 17176 13957 8641 8387 11144 7658 -2080
1553b080n847Q40Q36n002n908J767P199L843j613J319Q232P918N76l498J640M741
$$ -2080 -7927 -7087 -6251 -11253 -17161 -15394 -8195 -4352 -5965 -4646 3586 11504 12080 8582 10222 14963
1569A4963m1p710o703l96Q26o120p948k137M029K477k979r01O670Q765K671j346
$$ 14963 14922 7212 509 113 939 -5181 -13129 -15266 -11237 -8760 -11739 -12640 -5970 2795 5466 4120
1585D120K018P465L322m339n622J68J446m476r236n040J607J156m830m039L291
$$ 4120 6138 13603 16925 12586 6964 7132 8578 4102 -5134 -10174 -8567 -7411 -12241 -16280 -12989
1600a2989P558L059j105K091Q333O344o51l559J308L745k033q184o002j17J97
$$ -12989 -5431 -2372 -3477 -1386 6947 13291 12640 9081 10389 14134 12101 3917 -2085 -2202 -2005
1615b005n761p309j62N294K052k470P54P101Q154J563j660K985O230J581n467
$$ -2005 -7766 -15075 -15237 -9943 -7891 -10361 -9607 -2506 5648 7211 5551 8536 14766 16347 10880
1630A0880n625J33P81n866q906l205K421M38l790k422M660P828K325p53K940P774
$$ 10880 5255 5388 6169 303 -8603 -11808 -9387 -8949 -12739 -15161 -10501 -2673 -348 -1101 1839 9613
1646I613M910k139l326R52K600l234q786m822N23r01n422n765J334N601J784j691
$$ 9613 14523 12384 9058 10010 12610 9376 590 -4232 -3709 -4610 -10032 -15797 -14463 -8862 -7078 -8769
1662h769J881P681P155O89j535L059M906J3o361n407M08n03o009p516k348L073
$$ -8769 -6888 793 7948 8637 7102 10161 15067 15080 8719 3312 3720 3217 -2792 -10308 -12656 -9583
1678i583N72l773r63O219P182J747o33L906O722L699l400l502J198J292m905p780
$$ -9583 -9011 -12784 -13747 -7528 -346 1401 768 4674 11396 15095 11695 8193 9391 10683 5778 -2002
1694b002m129R15o33n466m132K828N650J747j385K971P628N751n93j569K988L827
$$ -2002 -6131 -5216 -5849 -11315 -15447 -12619 -6969 -5222 -6607 -3636 3992 9743 9150 7581 10569 14396
1710A4396j787o902m050L60r56o375o727m70L340N90k811M81O549O394J415m79
$$ 14396 12609 5707 1657 2017 1061 -5314 -12041 -12511 -9171 -8581 -11392 -10911 -4362 2032 3447 2968
1726B968L411O184J681m190l279Q61Q75n558p626k876J501j029n056k350M337
$$ 2968 6379 12563 14244 10054 6775 7636 8511 2953 -4673 -7549 -6048 -7077 -12133 -14483 -10146
1741a0146N294J122p93L516P146M765j525j556K286K798k863o981l551L54j354
$$ -10146 -4852 -3730 -4523 -1007 6139 10904 9379 7823 10109 12907 10044 3063 -488 -134 -1488
1756a488o078n332Q20L933M94k205J710O835N302P02n29L696M939P4m902k720
$$ -1488 -7566 -12898 -12078 -8145 -7651 -9856 -8146 -1311 3991 4693 4164 7860 12799 12873 7971 5251
1772E251N58m42n398o795j364J684j261m011n54M532N268P83l38L811P039K419
$$ 5251 5809 5367 -31 -6826 -8190 -6506 -7767 -11778 -12332 -7800 -2532 -1749 -2087 1724 8763 11182
1788A1182j910k117K330J659m185o499k895M78j414n809l854K259L848L81j450
$$ 11182 9272 7155 9485 11144 6959 460 -2435 -1957 -3371 -9180 -13034 -10775 -6927 -6546 -7996
1803g996K235P254M566n70j50L372M079j313n140k782P08j221n869n818l17K026
$$ -7996 -5761 1493 6059 5489 5339 8711 12790 11477 6337 3555 4263 3042 -2827 -8645 -8962 -6936
1819f936q65l337j5N649N015M14k33M351N637J627k784j472J418N63m515o357
$$ -6936 -7801 -11138 -11153 -5504 -489 -75 -308 4043 9680 11307 8523 7051 8469 9032 4517 -1840
1835a840k170R49j688n098k518K865L962k7o09L246O222L881p61m21L128K936
$$ -1840 -4010 -3061 -4749 -9847 -12365 -9500 -5538 -5565 -6174 -2928 3294 7175 6414 5993 9121 12057
1851A2057k495n201k203L79j742n523m854N33K210p80k494J231N707M740l67K83
$$ 12057 9562 4361 2158 2537 795 -4728 -9582 -9049 -6839 -7619 -10113 -8882 -3175 1565 1198 1481
1867A481M077M926J87l171j395J650p37n370n342j317O21j659m387j143L864L716
$$ 1481 5558 10484 10671 7500 6105 7755 7018 1648 -3694 -5011 -4390 -6049 -10436 -11579 -7715 -3999
1883c999j29n69L935O062K647j519PK702J822l320n129j977Q37k215n652l570
$$ -3999 -4128 -4697 -762 5300 7947 6428 6435 9137 10959 7639 2510 533 1370 -845 -6497 -10067
1899a0067J412K625j038j815K406N675L314nJ98M177L854q31l687j425J221j065
$$ -10067 -8655 -6030 -7068 -8883 -6477 -802 2512 2507 2705 6882 10736 9905 6218 4793 6014 4949
1915D949n180m949n75J126j874l808J99M106L377R3R3M166N285J234j667j45K561
$$ 4949 -231 -5180 -5755 -4629 -6503 -10311 -10112 -6006 -2629 -2536 -2443 1723 7008 8242 6575 6430 8991
1932H991K74l821m926j424K70k136n000j954K164J744o50p35K914N122L141o82
$$ 8991 9265 5444 518 -906 -636 -2772 -7772 -9726 -7562 -5818 -6468 -7203 -4289 833 3974 3292
1948C292O82L744K741j917l801j146O31j450n092m112J56R15j576l027J502M293
$$ 3292 3974 7718 10459 8542 4741 3595 4226 2776 -2316 -6428 -6272 -5357 -6933 -9960 -8458 -4165
1964d165K999k7N52L888M582N40k246k12J822r5m475m165r59L11k639l887j338
$$ -4165 -1166 -1193 -641 3247 7829 8369 6123 5911 7733 7638 3163 -1002 -1961 -1650 -4289 -8176 -9514
1981i514K460K231m96r2L286M900K231p82N84K961J963k444l561j359P91k147
$$ -9514 -7054 -4823 -5319 -5411 -2125 2775 5006 4224 4808 7769 9732 7288 3727 2368 3159 1012
1997A012n054k920O96R77j691j780J810M478K951n57J080L765L484l58k166l99
$$ 1012 -4042 -6962 -6266 -5289 -6980 -8760 -6950 -2472 479 -78 1002 4767 8251 7893 5727 5328
2013E328J521q85m612l987j85J4k255l615m29L282K134l75n2L727M713J240r36
$$ 5328 6849 5964 1352 -2635 -2820 -2806 -5061 -8676 -9105 -5823 -3689 -4064 -4116 -389 4324 5564 4628
2030D628N29K795R47l033l590r38P5k206m331k145J162J283j778j107K478M330
$$ 4628 5157 7952 8899 5866 2276 1338 1413 -793 -5124 -7269 -6107 -4824 -6602 -7709 -5231 -901
2046i01K309m22J046L509K739o73k695m32R96r53m604l610N20k47k312k618N41
$$ -901 1408 986 2032 5541 8280 7607 4912 4480 5476 4523 -81 -3691 -3171 -3418 -5730 -8348 -7807
2063g807L371J678o62Q23L803M009P33j339K27K667K20l627l004n27J21k604m239
$$ -7807 -4436 -2758 -3420 -2597 1206 5215 5948 4609 4836 7503 7723 4096 1092 565 686 -1918 -6157
2080f157j109J797J008j252p22K887L967J587p67J387L400K022j476k689k34Q97
$$ -6157 -7266 -5469 -4461 -5713 -6435 -3548 419 2006 1239 2626 6026 8048 6572 3883 3649 4546
2096D546k019m372k181K48L21k240k111J062L495J487k74N15L889L302j33j357
$$ 4546 2527 -1845 -4026 -3778 -3457 -5697 -7808 -6746 -3251 -1764 -2038 -1523 2366 5668 5535 4178
2112D178Q16J570m75l228l054l8k37k370l582m06K174Q41j110j80L265L684R77
$$ 4178 4994 6564 6089 2861 -193 -231 -468 -2838 -6420 -6826 -4652 -3811 -4921 -5101 -1836 1848 2825
2129B825p74J263K812J024k065k149l40P45k466l646k027Q46K58j881j393J673
$$ 2825 2051 3314 6126 7150 5085 2936 2596 3341 875 -2771 -4798 -3952 -3694 -5575 -6968 -5295
2145e295L325J409o19R32L411L026q88j341O30J097q59l383k735K04j40k475k665
$$ -5295 -1970 -561 -1180 -248 3163 6189 5301 3960 4590 5687 4828 1445 -1290 -1086 -1226 -3701 -6366
2162f366l6K432Q03q95O56L038L407L61q17Q45K615M19k358k397K58j7k108l657
$$ -6366 -6402 -3970 -3167 -4062 -3406 -368 3039 3400 2583 3428 6043 6462 4104 1707 1965 1948 -160 -3817
2180c817j335J122N39j704n79J835L350J117p75J445L057K080j514j114Q7J091
$$ -3817 -5152 -4030 -3491 -5195 -5774 -3939 -589 528 -247 1198 4255 6335 4821 3707 3794 4885
2196D885j736l243j921L32j89k325k267Q88K687P44j003O25L405K627J45o86Q39
$$ 4885 3149 -94 -2015 -1683 -1872 -4197 -6464 -5576 -2889 -2145 -3148 -2523 882 3509 3654 2968 3807
2213C807J979j10k721j835K1q5k689l259j95J262R3j230j59K904K760N23n24J533
$$ 3807 5786 5676 2955 1120 1141 1056 -1633 -4892 -5087 -3825 -3732 -4962 -5121 -2217 543 1066 542 2075
2231B075K987R43j481j809P67P92k396k939j674M38Rk296j738J429K375P26n09
$$ 2075 5062 6005 4524 2715 3482 4274 1878 -1061 -2735 -2297 -2288 -4584 -6322 -4893 -2518 -1792 -2301
2248b301J295K932K242l94q23J108J601q34k651j900K62n51k572k303j18J273
$$ -2301 -1006 1926 4168 3774 2951 4059 5660 4826 2175 275 537 -14 -2586 -4889 -5007 -3734
2264c734L29r27O1K587K566N95l31J359K647P19j868j487L66N7k044l097q63P77
$$ -3734 -3405 -4332 -4271 -1684 882 1477 1146 2505 5152 5871 4003 2516 2882 2939 895 -2202 -3065 -2288
2282b288o77j579r25J393K396N09l14J225L049J465o53o72O41J260j018k915j509
$$ -2288 -2965 -4544 -5469 -4076 -1680 -1171 -1485 -260 2789 4254 3601 2929 3570 4830 3812 897 -612
2299f12O01m51k623k005N42J591k0r24J024K727J956L2m76J325K113J89k090r39
$$ -612 -11 -462 -3085 -5090 -4548 -2957 -2977 -3901 -2877 -150 1806 1838 1362 2687 4800 4989 2899 1960
2317A960K07n05j625k780o79R54m40j487k91J910J971M53o44J328L081J126j314
$$ 1960 2167 1662 37 -2743 -3422 -2468 -2908 -4395 -4686 -2776 -805 -352 -996 332 3413 4539 3225
2334C225n92P71O75j292k645j028R0n73k022j275O59J723k35l81P13K646J811
$$ 3225 2633 3404 4079 2787 142 -886 -796 -1369 -3391 -4666 -4007 -2284 -2519 -2900 -2187 459 2270
2351B270k44k69J109J817m49k128j020O11l42k327k090l60J045k14j319k77K100
$$ 2270 2026 1757 2866 4683 4234 2106 1086 1697 1355 -972 -3062 -3422 -2377 -2591 -3910 -4187 -2087
2368b087K085Jl14J527K179N82j243p06Q50O8j422k362m37K08k71k113r01J106
$$ -2087 -2 -1 -315 1212 3391 3973 2730 2024 2874 2942 1520 -842 -1279 -1071 -1342 -3455 -4356 -3250
2386c250J445Ko69J049K600J521o88k90J203J335q12j995q42L89l96k015k135
$$ -3250 -1805 -1803 -2472 -1423 1177 2698 2010 1720 2923 4258 3446 1451 609 998 602 -1413 -3548
2403c548N30Q77n1j056MK260J539K16l21J413J725L22j471p98J114K6k019k134
$$ -3548 -3018 -2141 -2192 -3248 -3244 -984 555 771 450 1863 3588 3910 2439 1641 2755 2781 762 -1372
2421a372m64P50o05j701r02J736J699o66l03J607K171R81p36j95J004Q98j250
$$ -1372 -1836 -1086 -1691 -3392 -4294 -2558 -859 -1525 -1828 -221 1950 2931 2195 2000 3004 3902 2652
2438B652k215l24L49p79j860j249L49J203l43q45M27K426J377m47N3J351J756
$$ 2652 437 113 462 -317 -2177 -3426 -3077 -1874 -2217 -3062 -2635 -209 1168 721 774 2125 3881
2455C881m94j498l26O45k57k052j742J28N83q62j625J40J186J653j90l24J412
$$ 3881 3387 1889 1563 2208 1951 -101 -1843 -1715 -1132 -1994 -3619 -3479 -2293 -640 -830 -1154 258
2472B58K235M58n08o33J119K69j283j819n39L53n98j837q83R69N14q5n83P08K128
$$ 258 2493 2951 2443 1810 2929 3198 1915 96 -443 -90 -688 -2525 -3408 -2439 -1925 -2010 -2593 -1885 243
2491B43J152m27K70J135J164o88j348q3J58o56j511j513r4Q87n31j362L54J423
$$ 243 1395 968 1238 2373 3537 2849 1501 1418 1576 920 -591 -2104 -2198 -1311 -1842 -3204 -2850 -1427
2509a427R88K82l01J284J761Q3r07j32J006J66j367j735m22L94q00j578p39J271
$$ -1427 -439 -157 -458 826 2587 2670 1763 1631 2637 2803 1436 -299 -721 -327 -1127 -2705 -3444 -2173
2527b173Q57m91n07J353J759J002o96J52J169O47o36j412l48O35q11j712j158
$$ -2173 -1316 -1807 -2314 -961 798 1800 1104 1256 2425 3072 2436 1024 676 1311 500 -1212 -2370
2544b370J96O48m19r72N30J600J080l82K65R51J589k39o31k12O96n0j687j762
$$ -2370 -2174 -1526 -1945 -2917 -2387 -787 293 -89 176 1127 2716 2477 1846 1634 2330 2280 593 -1169
2562a169L29J75r86j102n5R99P85m66k30J389J281O57m84L56J073M01j151r88
$$ -1169 -840 -665 -1651 -2753 -2808 -1809 -1024 -1490 -1720 -331 950 1607 1123 1479 2552 2953 1802 814
2580H14k07K1n78j622j105O98P48q71m34N07K039J59L5k5J002J285j6q65k21O00
$$ 814 607 628 50 -1572 -2677 -1979 -1231 -2102 -2536 -2029 10 169 204 179 1181 2466 2450 1585 1364 1964
2600A964m03j260j442K48J00q29q83K19Q85O40j75k92J427J275J36l16l37J210
$$ 1964 1561 301 -1141 -893 -793 -1622 -2505 -2286 -1401 -761 -936 -1228 199 1474 1610 1294 957 2167
2618B167L44j199j168J78J89p40j714j98J66N52n00k55J196J092N43l32PJ669
$$ 2167 2511 1312 144 322 511 -229 -1943 -2141 -1975 -1423 -1923 -2178 -982 110 653 321 328 1997
2636A997Q36n40q08j97N07n71j682p38J39r1o08o51K63J094N74n55J71J477J024
$$ 1997 2833 2293 1485 1288 1795 1224 -458 -1196 -1057 -1148 -1756 -2407 -2144 -1050 -476 -1031 -860 617 1641
2655A641L34q52J90Q59N8j238o63k12j71o96j187l71Q62J54k87l64J052J520K70
$$ 1641 1975 1123 1313 2172 2230 992 329 117 -54 -750 -1937 -2308 -1446 -1292 -1579 -1943 -891 629 899
2674H99k93N57O98P04r12o74j95P45r27j188p12K68o3l42q65L17R44O57k4k75
$$ 899 606 1163 1861 2565 1653 979 784 1529 602 -586 -1298 -1030 -1093 -1435 -2300 -1983 -1039 -382 -406 -681
2694f81J371R63n0l34K21M41kj226j115L33J5q04j289K98L29M95l74j45J193J269
$$ -681 690 1653 1603 1269 1490 1931 1929 703 -412 -79 -64 -868 -2157 -1859 -1530 -1035 -1409 -1554 -361 908
2714I08L5l41L75J031K79q00q35M3M80r80j309m31M65K02q24n89P58J013M44j14
$$ 908 943 602 977 2008 2287 1487 652 695 1175 195 -1114 -1545 -1080 -878 -1702 -2291 -1533 -520 -76 -190
2734a90K66R07P95l39l74N16J02m03r95p47K39k71o62q97J98N03O65q53K76J128
$$ -190 76 983 1778 1439 1065 1581 1683 1280 285 -462 -223 -494 -1156 -2053 -1855 -1352 -687 -1540 -1264 -136
2754a36J047J37l93L54J014L88j189j109N03o1n95j258m50N57J43n99k65P06R77
$$ -136 911 1048 655 1009 2023 2411 1222 113 616 555 -40 -1298 -1748 -1191 -1048 -1647 -1912 -1206 -229
2773b29L48K6L23Q22O20k56o97N24J22q10r11o61J49P2p48p80M37O79L61l65K43
$$ -229 119 145 468 1290 1910 1654 957 1481 1603 793 -118 -779 -630 -558 -1306 -2086 -1649 -970 -609 -974 -731
2794g31Q65J171k61l82O21N05J91j116n35J39j07r22q16L5K34K0l58l36J003R40
$$ -731 134 1305 1044 662 1283 1788 1979 863 328 467 360 -562 -1378 -1343 -1109 -1089 -1447 -1783 -780 160
2814A60L12k09M59J104nm31l84N4K11k91j334n54qk3o64m09N15O09M59l84K92
$$ 160 472 263 722 1826 1821 1390 1006 1060 1271 980 -354 -908 -916 -939 -1603 -2012 -1497 -888 -429 -813 -521
2835e21J326L75L10n98N32O84n01j058l70K94l70r08o35J1M82k27l20M83L89R99
$$ -521 805 1180 1490 892 1424 2108 1607 549 179 473 103 -805 -1440 -1429 -947 -1174 -1494 -1011 -622 377
2855C77K61n22R10P75k04m33l32M75m10n27j141k63J76p6q06k67Q29N72m2l3O27
$$ 377 638 116 1026 1801 1597 1164 832 1307 897 370 -771 -1034 -858 -934 -1740 -2007 -1178 -606 -648 -681 -54
2876e4P94N77j50k81K84M58m14q98o35K49l84m45p71q5Q82j4n49N67N79R58j59
$$ -54 740 1317 1167 886 1170 1628 1214 316 -319 -70 -454 -899 -1670 -1755 -873 -887 -1436 -869 -290 668 509
2897E09J59L80R34M0j036o13M30m0o68j052l08N51j94p23K17M46O95L68l11L13
$$ 509 668 1048 1982 2022 986 373 803 763 95 -957 -1265 -714 -908 -1631 -1414 -968 -273 95 -216 97
2917I7J026K06k1r9J75Q2o00n84o19L39l85q44n58O55J26j3m15P42J052O21l07
$$ 97 1123 1329 1308 1209 1384 1466 866 282 -337 2 -383 -1227 -1785 -1130 -1004 -1017 -1432 -690 362 983 676
2938F76o4N39M99R6q88k95K70j74p43j084j21K72q6l27O2Q41M66J05L9N64P38
$$ 676 612 1151 1650 1746 858 563 833 659 -84 -1168 -1289 -1017 -1103 -1430 -1368 -527 -61 44 83 647 1385
2959A385J68o82R3K16K48o55j014k2L1m90p60l00N68J68J34r2O52N89O12J7n0
$$ 1385 1553 871 964 1180 1428 773 -241 -263 -232 -722 -1482 -1782 -1214 -1046 -912 -1004 -352 237 849 866 816
2980H16M39M05n46k54m65J07n07q32n17j19N96j14n64L40Q27O96j98J49M15Q99
$$ 816 1255 1660 1114 860 395 502 -5 -837 -1354 -1473 -877 -991 -1555 -1215 -388 308 110 259 674 1573
3000A573k19l78K7M47l53j125m69N0k20k16q83K39O85L46j09n2O62M52P81k42
$$ 1573 1354 976 1003 1450 1097 -28 -497 -447 -667 -883 -1766 -1527 -842 -496 -605 -657 5 457 1238 996
3020I96J04K51L61o92r71PR9m97l93p62K40M75k70n13R19N74N32j12R5P37K97
$$ 996 1100 1351 1712 1020 49 56 155 -342 -735 -1497 -1257 -782 -1052 -1565 -646 -72 460 348 443 1180 1477
3041A477j72j19l07R4r5r00p73k64M27m00m76J64N17N41j79P4P25P98J29q3l61
$$ 1477 1305 1186 879 973 878 -22 -795 -1059 -632 -1032 -1508 -1344 -827 -286 -465 -391 334 1132 1261 1178 817
3062H17P27k76n66q67J78J39p04o91n09N49L12j9m89R88O10L55N0J02N84O52o24
$$ 817 1544 1268 702 -165 13 152 -552 -1243 -1752 -1203 -891 -910 -1399 -411 199 554 604 706 1290 1942 1318
3083A318q65L40K28n50p62m15l02K04l34k25k44Q64O14l5l8R34O91nn78K17K26
$$ 1318 453 793 1021 471 -291 -706 -1008 -804 -1138 -1363 -1607 -743 -129 -164 -202 732 1423 1418 840 1057 1283
3104A283n9n64j031L33j86o47m96k22N98N68m22K5P01P25K02k23J85L89L93l41
$$ 1283 1224 660 -371 -38 -224 -871 -1367 -1589 -991 -423 -845 -820 -119 606 808 585 770 1159 1552 1211
3124A211o69K3m8l79o85p26M72q5j29j85K06P58J73J71J76M39M70L3j58k11J58
$$ 1211 542 565 517 138 -547 -1273 -801 -886 -1015 -1200 -994 -236 -63 108 284 723 1193 1226 1068 857 1015
3145A015l10n54o53K92j91q57k13M3O01J25K41j35O48P52k07P1K18N97l63m04
$$ 1015 705 151 -502 -210 -401 -1258 -1471 -1428 -827 -702 -461 -596 52 804 597 668 886 1483 1120 716
3165G16p20K20K92q04n36m51J69M88l94K9M20M45J45K42K47N48N31n57j00r7j01
$$ 716 -4 216 508 -296 -832 -1283 -1114 -626 -1020 -991 -571 -126 19 261 508 1056 1587 1030 930 833 732
3186G32j10o66o62p9J81j12n64L09K02N42l02L54O02O06k20k25N73j76Mk79p43
$$ 732 622 -44 -706 -785 -604 -716 -1280 -971 -769 -227 -529 -175 427 1033 813 588 1161 985 989 710 -33
3207c3Lj00n86l92p1J49N0N2QN12Q27M46l19L56J21J92k45k46Q6m76k88n16m06
$$ -33 -30 -130 -716 -1108 -1179 -1030 -980 -928 -920 -408 419 865 546 902 1023 1215 970 724 810 334 46 -470 -876
3230h76L5M64p06l96N45N57J97NM59M59K93j84R0O2Q5j52p57o25M03m45n03k29
$$ -876 -841 -377 -1083 -1479 -934 -377 -180 -175 284 743 1036 852 942 1004 1089 937 180 -445 -42 -487 -990 -1219
3252a219q4N78j44J61J27P61J51L00n9M27M10j59m84j34j51k54k49q85J10j78
$$ -1219 -1303 -725 -869 -708 -581 180 331 631 572 999 1409 1250 766 632 481 227 -22 -907 -797 -975
3272i75K79n79J38O58N19k10K49L40M65J37M1l05K06N7j28j114j37M8k18l98k50
$$ -975 -696 -1275 -1137 -479 40 -170 79 419 884 1021 1062 757 963 1020 892 -222 -359 -311 -529 -927 -1177
3293a177J15N41k31L14K67N83N72m98L08R7O03m99l71k81J2j24j002l82K3K83
$$ -1177 -1062 -521 -752 -438 -171 412 984 486 794 891 1494 995 624 343 355 231 -771 -1153 -1130 -847
3313h47J59l68J90N08K76K02J64M33N41j23l05L4n8l2p32l89k77R6k4o57M50j21
$$ -847 -688 -1056 -866 -358 -82 120 284 717 1258 1135 830 864 806 774 42 -347 -624 -528 -552 -1209 -759 -880
3335h80K35L67J5L34N46j05O6L50j14N02n99n77J9q1n47j74j43LJ89rk9N1M86
$$ -880 -645 -278 -263 71 617 512 578 928 814 1316 717 140 159 78 -469 -643 -786 -783 -594 -603 -632 -581 -95
3358i5L56k37K76M61M72j28m33N5l19J00k72p35l36L34k43j46l95N01M39L46j64
$$ -95 261 24 300 761 1233 1105 672 727 408 508 236 -499 -835 -501 -744 -890 -1285 -784 -345 1 -163
3379a63L57M89K40m2n05L37L44l87n94l70Rk03k73k68K3M03N9OM24K41M92q8L98
$$ -163 194 683 923 881 376 713 1057 670 76 -294 -285 -488 -761 -1029 -1006 -603 -544 -538 -114 127 619 531 929
3402I29n2K74j76m41k51p6K5m00o23J94l4j20j68K44L28J41L3K26J72O39q5R0
$$ 929 877 1151 975 534 283 207 232 -168 -791 -597 -631 -751 -919 -675 -347 -206 -173 53 225 864 779 869
3424H69k75J23on10m24j20j21j87p4k0k38M50J61j31N78K12M28l30Q5L80J93l11
$$ 869 594 717 711 201 -223 -343 -464 -651 -725 -745 -983 -533 -372 -503 75 287 715 385 470 850 1043 732
3446G32n89k69K72k99k53n20K48K21m37J73J84K45L47jL21J80M65j08k95J17j69
$$ 732 143 -126 146 -153 -406 -926 -678 -457 -894 -721 -537 -292 55 54 375 555 1020 912 617 734 565
3467E65l34j52o64j21K55k77p3p4R7M88J86l49M19O29q5J74k59K92J54j7m41m13
$$ 565 231 79 -585 -706 -451 -728 -801 -875 -778 -290 -104 -453 -34 595 510 684 425 717 871 854 413 0
3489@j32k6n27j44J64J33k0j49L12L63M29Q9J56j22N73l84j58k8l16j7j05o15
$$ 0 -132 -158 -685 -829 -665 -532 -552 -701 -389 -26 403 492 648 526 1099 715 557 529 213 196 91 -524
3511e24O6k00p0R7l83M52M20J29j92O29K34j49J37P5J27j37l51k85M7j70j48m57
$$ -524 -458 -658 -728 -631 -1014 -562 -142 -13 -205 424 658 509 646 721 848 711 360 75 122 -48 -196 -653
3533f53l9N2k0K99N0n0M86p9L73k29N04K18j33l19l17J10k63k17j17k82m1N8k8
$$ -653 -692 -640 -660 -361 -311 -361 125 46 419 190 694 912 779 460 143 253 -10 -227 -344 -626 -667 -609 -637
3556f37K2M22M84q6M7P3M98j31k85l3k17M19n23j06j16m74P4r7k04K33J29K99
$$ -637 -615 -193 291 205 252 325 823 692 407 374 157 576 53 -53 -169 -643 -569 -666 -870 -637 -508 -209
3578b09J38L20R6l43K97L57l0j6L9l32K9m67n7k47r0j00K72l45J41J29L77K24
$$ -209 -71 249 345 2 299 656 626 610 649 317 346 -121 -178 -425 -515 -615 -343 -688 -547 -418 -41 183
3600A83kM3J53L01j01J6j04k17l0m17j27kk18k0m27M72j40K61K92P4L82P2K45
$$ 183 181 224 377 678 577 593 489 272 242 -175 -302 -304 -522 -542 -969 -497 -637 -376 -84 -10 372 444 689
3623F89j14j80L10l2j09p33J93k33o8k59r3J0q2K71kJ33L90L00K63l84J02K7n1
$$ 689 575 395 705 673 564 -169 24 -209 -277 -536 -629 -619 -701 -430 -432 -299 91 391 654 270 372 399 348
3646C48J33k52J11k79m22J51N0j99k5m31J68O18L9j56L23l7M38K4K08n25K51P6
$$ 348 481 229 340 61 -361 -210 -160 -359 -384 -815 -647 -29 10 -146 177 140 578 602 810 285 536 612
3668F12l79j32j25k48ml10k54P2L36L12j22L0M24J53O9j94J87M6p0l67O6L05m43
$$ 612 233 101 -24 -272 -276 -586 -840 -768 -432 -120 -242 -212 212 365 434 240 427 473 403 36 102 407 -36
3691c6j28q9j74j59L03r4L45l20M34r9J03K22J97K8j47o5lP1l02k07j40n3q0j34
$$ -36 -164 -253 -427 -586 -283 -377 -32 -352 82 -17 86 308 505 533 386 321 318 389 87 -120 -260 -313 -393 -527
3715e27J6R3L27j72q1N08J62k9j02K81k38L04q3l51j76L1q3k16j08K69L2j56O7
$$ -527 -511 -418 -91 -263 -344 164 326 297 195 476 238 542 459 108 -68 -37 -120 -336 -444 -175 -143 -299 -232
3738b32R8J97m9K67q5J04o4J53q6L9j17J57n34j06j36L05j57j81L0K81j75J84
$$ -232 -134 63 14 281 196 300 236 389 303 342 225 382 -152 -258 -394 -89 -246 -427 -397 -116 -291 -107
3760a07M7MJ16J79Q0L6j14Q6R4m50N6j83j44K12n27L80k39K35Q6J81K64k38J40
$$ -107 -60 -56 60 239 319 355 241 327 421 -29 27 -156 -300 -88 -615 -235 -474 -239 -153 28 292 54 194
3783A94L0J64m9J08l8l43K00l31q5j69l4J49k63J01L8J35j01K93K2K01Q9O8j81
$$ 194 224 388 339 447 409 66 266 -65 -150 -319 -353 -204 -467 -366 -328 -193 -294 -1 21 222 311 379 198
3806A98l1N0Q5K4n05K22L1l56Nj62M29mk37L7J78n3J49P9J30j44L51l49K69l24
$$ 198 167 217 302 326 -179 43 74 -282 -277 -439 -10 -14 -251 -214 -36 -89 60 139 269 125 476 127 396 72
3830G2o1j01o4J4j18n4k10J75J56K91j57L5j95N33J8ol6K25l47rQk64j94j28l8
$$ 72 11 -90 -154 -140 -258 -312 -522 -347 -191 100 -57 -22 -217 316 334 328 292 517 170 161 169 -95 -289 -417 -455
3855d55J4K95K29k90n1M43j68J5J21m3N9L45k02k13M3J17k95J60l78n3j23K07
$$ -455 -441 -146 83 -207 -258 185 17 32 153 110 169 514 312 99 142 259 -36 124 -254 -307 -430 -223
3877b23j1N5m2jJ74j19n4K78L27n8l4L2k63J52r3Rj08o5O4n15K87O7J66k24j28
$$ -223 -234 -179 -221 -222 -48 -167 -221 57 384 326 292 324 61 213 120 129 21 -44 20 -495 -208 -141 25 -199 -327
3902c27O36m35L02K5n6j5K03j64N3J17m62L09j55j40j64K18j36p2N3J77j40L5
$$ -327 309 -126 176 201 145 130 333 169 222 339 -123 186 31 -109 -273 -55 -191 -263 -210 -33 -173 -138
3924a38J52K5J39K48l89J9J77p0P3l16J15j60l8L1j38K62k18L03l7P8n8K34m9
$$ -138 14 39 178 426 37 56 233 163 236 -80 35 -125 -163 -132 -270 -8 -226 77 40 118 60 294 245
3947B45O6j23R6q9o5P0k5j39k33K04l66K52O5K4k4J98k04R0K79j18j75K82k35
$$ 245 311 188 284 195 130 200 175 36 -197 7 -359 -107 -42 -18 -42 156 -48 42 321 203 28 310 75
3970G5N4j52K93l57m9J83j69j93K57l7n1J02m0J67k52L99J61l96J08L20l47m9
$$ 75 129 -23 270 -87 -136 47 -122 -315 -58 -95 -146 -44 -84 83 -169 230 391 -5 103 423 76 27
3992B7Jl9J12P7m38J7j36M9M2K54j29J02J95q7l27M75K05j96M1k54R4j56J71j13
$$ 27 28 -11 101 178 -260 -243 -379 -330 -288 -34 -163 -61 134 47 -280 195 400 204 245 -9 85 -71 100 -13
4016a3k05J20kJ12j77N9K22K9k16M7j19M85l69K65j98K19m2n08N25j08k20K33
$$ -13 -218 -98 -100 12 -165 -106 116 145 -71 -24 -143 342 -27 238 40 259 217 -291 234 126 -94 139
4038A39k59RJ09m5j73K52N9k38M17r5p1L5j23Q3k14qJ06j08K6q4O2k1J56J33l84
$$ 139 -120 -111 -2 -47 -220 32 91 -147 270 175 104 139 16 99 -115 -123 -17 -125 -99 -183 -121 -142 14 147 -237
4063b37L4K13n9L06r3p7j45R7M2n5J73k43k9o6n3J90k84J18J43P8j45L59j63l39
$$ -237 -203 10 -49 257 164 87 -58 39 81 26 199 -44 -73 -139 -192 -2 -286 -168 -25 53 -92 267 104 -235
4087b35L99m5o2j33M64k94J69l22P6j2k75J45%mJ69p9%p4j5J75OK33n57L52R2
$$ -235 164 119 57 -76 388 94 263 -59 17 5 -270 -125 -125 -129 40 -39 -39 -113 -128 47 53 286 -271 81 173
4112A73R1j58j85O8J40m34L55j02j66Q1J19J49j30R0J16k04j88J35R4M4K4j6k07
$$ 173 264 106 -79 -11 129 -305 50 -52 -218 -137 -18 131 1 91 207 3 -185 -50 44 88 112 96 -111
4135a11K79o9l48L8K8j8L73k58J43J48m28K94L4n6L1OJ01l12J38m8J65l5k2l8
$$ -111 168 99 -249 -211 -183 -201 172 -86 57 205 -223 71 105 49 80 86 187 -125 13 -35 130 95 73 35
4159C5l16L56o0l50K39j11j38M13J43r4k05K01K25j28j48k8k89L62L1j78J31K8
$$ 35 -281 75 15 -335 -96 -207 -345 68 211 117 -88 113 338 210 62 34 -255 107 138 -40 91 119
4181A19j94L1j13K78l96L17J36k47K01L0O5j70L42m00K24l58J79L13j38m36J05
$$ 119 -75 -44 -157 121 -275 42 178 -69 132 162 227 57 399 -1 223 -135 44 357 219 -217 -112
4202a12k6J69o1m7J83r8j89K10K90r1J34l60K3q5J50N6j3%P2k42K5l91j69N87
$$ -112 -138 31 -30 -77 106 8 -181 29 319 228 362 2 25 -60 90 146 133 133 205 -37 -12 -403 -572 15
4226A5J94l25J79l7q0K7M7J00k0j33j71L52j73l0kj75J23O7k03K21k22J61m8J72
$$ 15 209 -116 63 26 -54 -27 20 120 100 -33 -204 148 -25 -55 -57 -232 -109 -42 -245 -24 -246 -85 -133 39
4250C9l5L94m88Q8K05j91M1nKq2J12K5l00J50j33L3J71p4J11j58K57j69K76n0
$$ 39 4 398 -90 -2 203 12 53 48 50 -32 80 105 -195 -45 -178 -145 26 -48 63 -95 162 -7 269 219
4274B19J00m65R1Q8O2Jj99J93J3k17l48L70K47q3p3J2j83L36p6J81j8k69J43o7
$$ 219 319 -146 -55 33 95 96 -103 90 103 -114 -462 -92 155 72 -1 11 -172 164 88 269 251 -18 125 58
4298E8j18O7K33m36K16k70J01M2l98M30K23j31k41M24k46J68j91K64L3l07J71
$$ 58 -60 7 240 -196 20 -250 -149 -107 -505 -75 148 17 -224 200 -46 122 -69 195 228 -79 92
4319I2R2n13M14k04k18M72k99O8O5n9QK00j49M3j18J75j66K49p3j3p6j20Q6J02
$$ 92 184 -329 85 -119 -337 135 -164 -96 -31 -90 -82 118 -31 12 -106 69 -97 152 79 66 -10 -130 -44 58
4343E8q8J33m0M1l93K8K34QJ83l08O02m08K46j60j8k44J37O4j69L24l54J81j35
$$ 58 -30 103 63 104 -289 -261 -27 -19 164 -144 458 50 296 136 118 -126 11 75 -94 230 -124 57 -78
4366g8J44j95n5m2o4L55l79K61M01k52j1K45k16Rj68K37k75J76k38K29jp4lj27
$$ -78 66 -129 -184 -226 -290 65 -314 -53 348 96 85 330 114 123 -45 192 -83 93 -145 84 83 9 6 -121
4390a21k21J66K18j20L16j88K01J5R2l45K13j50l72L38P7N1j61k11K4K58k42k
$$ -121 -342 -176 42 -78 238 50 251 266 358 13 226 76 -296 42 119 170 9 -202 -178 80 -162 -164
4412a64O1J3J15k9K97j95n2K05p7p7n9K3j35m95L65N5n3l0Q8J07L7l37K80K40
$$ -164 -103 -90 25 -4 293 98 46 251 174 97 38 61 -74 -569 -204 -149 -202 -232 -144 -37 0 -337 -57 183
4436A83K17m01J1J38k7j67J86J07m83M75m11M51l16J06n2r6J10j35K8R4j86J57
$$ 183 400 -1 10 148 121 -46 140 247 -236 239 -172 279 -37 69 17 -79 31 -104 -76 18 -168 -11
4458a1j80K53j41K01l49L06l15K14R6p7k51M03j83r8j54J34K42l44N87M1j78p3
$$ -11 -191 62 -79 122 -227 79 -236 -22 74 -3 -254 149 -34 -132 -286 -152 90 -254 333 374 196 123
4480A23J44j35j05k31K30N8K51m32L33k93P0l95K04K65Nk33L53Kk81q9K74j44
$$ 123 267 132 27 -204 26 84 335 -97 236 -57 13 -382 -178 87 92 -141 212 214 -67 -156 118 -26
4502b6k8J21m15M25k53M2P3n9j71K61l8J22j75ol3J54J44J19k09K5j53L94k84
$$ -26 -54 67 -348 77 -176 -134 -61 -120 -291 -30 -68 54 -121 -127 -160 -6 138 257 48 73 -80 314 30
4525C0j90j8J23l06M75l11J56R9K6l8j42M10j17k3M6j0j99K7j24N6K48p4j73L6
$$ 30 -160 -178 -55 -361 114 -197 -41 58 84 46 -96 314 197 174 220 210 11 38 -86 -30 218 144 -29 7
4549Gj50J45K2k0j80m6P3K51J73m00P0K01l26M40j14o8j04k7l4l2J72r7j12K10
$$ 7 -143 2 24 4 -176 -222 -149 102 275 -125 -55 146 -180 260 146 78 -26 -53 -87 -119 53 -44 -156 54
4573E4p0P9j88J76l5J64j62j55J09J07K56j77j90ql21K45J25n0j03k9J31J31O9
$$ 54 -16 63 -125 51 16 180 18 -137 -28 79 335 158 -32 -40 -361 -116 9 -41 -144 -173 -42 89 158
4596A58o8j03j4K33R2j67r7K28k95J96o7k50L1r4J1J72J8j78J48p2K2J86o4K69
$$ 158 90 -13 -27 206 298 131 34 262 -33 163 96 -154 -123 -217 -206 -34 -16 -194 -46 -118 -96 90 26 295
4620B95l96K55j1K09k20q5jj93J67l35K22J64m71K59O5K45l4j20O1o7R9R1l1j06
$$ 295 -101 154 143 352 132 47 46 -147 20 -315 -93 71 -400 -141 -76 169 135 15 76 9 108 199 168 62
4644F2J1J08l5p0j83KJ23j00k82K32J14Km2j02L1K92O2M4j01r0j19N3N8k26K67
$$ 62 73 181 146 76 -107 -105 18 -82 -364 -132 -18 -16 -58 -160 -129 163 225 269 168 78 -41 12 70 -156 111
4669A11p4j02n1o8J78o6K06j04mJ46k46K94j31J27k10K81m94M41k20l99J23R0
$$ 111 37 -65 -116 -184 -6 -72 134 30 26 172 -74 220 89 216 6 287 -207 234 14 -385 -262 -172
4691a72R7J25l5k83K25k75N27k03j21K02Q3n4k09R7j36K09P0K77p24K75K0m40
$$ -172 -75 50 15 -268 -43 -318 209 6 -115 87 170 116 -93 4 -132 77 147 424 -300 -25 -5 -445
4713d45M11J13m97L23j6J71l7l58N00M77m15k9r4j15j64K52R0l28L40q1q6P6k33
$$ -445 -34 79 -418 -95 -111 60 23 -335 165 642 227 198 104 -11 -175 77 167 -161 179 98 12 88 -145
4736a45K64J3j3J1K04j59p2J10q6L63k91k37K6j12j39K98R4l78O2kJ80R1k13J42
$$ -145 119 132 119 130 334 175 103 213 127 490 199 -38 -12 -124 -263 35 129 -249 -187 -189 -9 82 -131 11
4760A1q4J96j26K23Pj92K62k60K4j16j4j61o3L88l53L26j17ok21M59j60j42r2
$$ 11 -73 123 -3 220 227 35 297 37 61 -55 -69 -230 -293 95 -258 68 -49 -55 -276 183 23 -119 -211
4783b11L86j68o2J53J58l80L24m20J38J37k4k70O6J02j77K26J44k88L68l86K76
$$ -211 175 7 -55 98 256 -124 200 -220 -82 55 31 -239 -173 -71 -248 -22 122 -166 202 -184 92
4804I2q0K82k30l3l0nK5n9L3jP4j12n11L11N27j10j75J67j12j22L57p2R2M6n27
$$ 92 12 294 64 31 1 -4 21 -38 -5 -6 68 -44 -555 -244 283 173 -2 165 53 -69 288 216 308 354 -173
4829a73j1K99J22k75j6j63j47Q6J12K35k08J37j70L55LR4j48J36K9l11r5J21J90
$$ -173 -184 115 237 -38 -54 -217 -364 -278 -166 69 -139 -2 -172 183 186 280 132 268 297 -14 -109 12 202
4852B02k17J70j81k15j04N7N04k26J67j95jK82l7O7k69J24p1j10P8l2J02k94J41
$$ 202 -15 155 -26 -241 -345 -288 216 -10 157 -38 -39 243 206 273 4 128 57 -53 25 -7 95 -199 -58
4875e8M5N5j19j22J20L32l11L15N5L1j66J7j2k88J95lO2J7l21o1K50l89L24k21
$$ -58 -13 42 -77 -199 -79 253 -58 257 312 343 177 194 182 -106 89 86 148 165 -156 -217 33 -356 -32 -253
4899b53J6L58mR1k95M41j06m09J38r9P9K49m18KJ98j67n3K34M3j97L4K26RL6J21
$$ -253 -237 121 117 208 -87 354 248 -161 -23 -122 -43 206 -212 -210 -12 -179 -232 2 45 -152 -118 108 117 153 274
4924B74j31J0j49j66K40K39j94j29j04J28j92J03n7p8j23L11K3K40j79K01k30
$$ 274 143 153 4 -162 78 317 123 -6 -110 18 -174 -71 -128 -206 -329 -18 5 245 66 267 37
4945C7L3M8m7J05Q6k67J66j33l16L1J18j53K02m6l0m9o5M05K37j44l17L2L13L4
$$ 37 70 118 71 176 262 -5 161 28 -288 -257 -139 -292 -90 -136 -166 -215 -280 125 362 218 -99 -67 246 280
4969B80n9m0j88jj25J09j73J6O7j8J59k59K28J15K67k56K45j76k10N2J05J01m34
$$ 280 221 181 -7 -8 -133 -24 -197 -181 -114 -132 27 -232 -4 111 378 122 367 191 -19 33 138 239 -195
4992a95L30k19K08l57J40P3j88K16J99j86l9k12M31l12kj1J80Q8J22k18k0j35
$$ -195 135 -84 124 -233 -93 -20 -208 8 207 21 -18 -230 201 -111 -113 -124 56 144 266 48 28 -107
5014a07m0K9j54K12P4J54p9j4R2n7K8j77P6M11j19l24L9Q7j98J02k13L34l93K
$$ -107 -147 -118 -272 -60 14 168 89 75 167 110 138 -39 37 448 329 5 44 131 -67 35 -178 156 -237 -235
5038b35M9P6K03J12j53j41J62K55k40J14r6k09M4Q5k32j8K87j01j06J67j38L1
$$ -235 -186 -110 93 205 52 -89 73 328 88 202 106 -103 -59 26 -206 -224 63 -38 -144 23 -115 -84
5060h4j71K71j79L29J34k56J21k55J98K16l35p1M6m5M16l65p2K57m4k25j27K19
$$ -84 -255 16 -163 166 300 44 165 -90 108 324 -11 -82 -36 -81 335 -30 -102 155 111 -114 -241 -22
5082b2J60k14j03K86K61l52L09l82J73M1k00j57L85p0j15l29L83r6J24j39J7N4
$$ -22 138 -76 -179 107 368 16 325 -57 116 157 -43 -200 185 115 0 -329 54 -42 82 -57 -40 14
5104A4n9J16k23L75j05R4l9m9j12M5l5n2j83M6J24j44K37l46K52r6J32Q3k77J37
$$ 14 -45 71 -152 223 118 212 173 124 12 57 22 -30 -213 -167 -43 -187 50 -296 -44 -140 -8 75 -202 -65
5128f5M7k05J93J47j6j70j26n3J89P0k16oN9J57j30J81l0j92L76l73J9J88P4r9
$$ -65 -18 -223 -30 117 101 -69 -195 -248 -59 11 -205 -211 -152 5 -125 56 26 -166 210 -163 -144 44 118 19
5152A9j3k27L72m6j90J03k4K79n03M09j92J33r2J4j94J51p1R4Jk3m8r7j03K69
$$ 19 6 -221 151 105 -85 18 -6 273 -230 179 -13 120 28 42 -152 -1 -72 22 23 0 -48 -145 -248 21
5176B1J16k14J10j8o0%J4jk8j4J05K7k0J45q9j00m0N4R8j47k6J35k04M90k06p3
$$ 21 137 -77 33 15 -45 -45 -31 -32 -60 -74 31 58 38 183 94 -6 -46 8 106 -41 -67 68 -136 354 148 75
5202G5k6k00M02m81M20j93K55l18K27j6j28k90K24j48K33Q6k82K20j60N8j30J6
$$ 75 49 -151 251 -230 190 -3 252 -66 161 145 17 -273 -49 -197 36 122 -160 60 -100 -42 -172 -156
5224a56J58p6J38J23k20K68l98K36j21L3J00J75l40k4K22j86J1N7j66K53k75J78
$$ -156 2 -74 64 187 -33 235 -163 73 -48 -15 85 260 -80 -104 118 -68 -57 0 -166 87 -188 -10
5246a0L9J96k06l29N05j69J5k23L36K6l44J56l5J61J1K1l06J04K9J85qk19K83
$$ -10 29 225 19 -310 195 26 41 -182 154 180 -164 -8 -43 118 129 150 -156 -52 -23 162 154 -65 218
5269B18k74j2J38k57K27j53J18K28l50M2R3j74J02J32K9r0L3P9r9j89K93o9rj79
$$ 218 -56 -68 70 -187 40 -113 5 233 -117 -75 18 -156 -54 78 107 17 50 129 30 -159 134 65 56 -123
5293a23k3L6j3O5J19l35O7K16M5j68j09O03m06J48m0j78M01n05L8M61n06L18j23
$$ -123 -146 -110 -123 -58 61 -274 -207 9 54 -114 -223 380 -26 122 82 -96 305 -200 -162 299 -207 111 -12
5316a2r2R7q8J35k00K50q0J64o2j6j43K56k22Nl15M66K0qk59J40j09J87j57j0
$$ -12 -104 -7 -95 40 -160 90 10 174 112 96 -47 209 -13 -8 -323 143 163 155 -104 36 -73 114 -43 -53
5340e3J16j83L50l75L03p9j32j13J38K2L1j29R0J0K1K7j20L19Oj33kk78J97j5
$$ -53 63 -120 230 -145 158 79 -53 -166 -28 -6 25 -104 -14 -4 17 44 -76 243 249 116 114 -164 33 18
5364A8K08j49M9p9K20k68j59P7J02m1k57K72k59L45m07L18Q7k53J03k1q1J21n1
$$ 18 226 77 126 47 267 -1 -160 -83 19 -22 -279 -7 -266 79 -328 -10 77 -176 -73 -94 -175 -54 -105
5387a05M89k50o5k33K99j92j0j5k5P1k7K77l48M1JnK01l20L28l25M98j76k81K49
$$ -105 384 134 69 -164 135 -57 -67 -82 -107 -36 -63 214 -134 -93 -92 -97 104 -216 112 -213 285 109 -172 77
5411G7j15rJ51k54Q9O1J08P8k52J11m9j07J73k95L18n5k52L2K3L84j39q6J36k90
$$ 77 -38 -47 104 -150 -61 0 108 186 -66 45 -4 -111 62 -233 85 30 -222 -190 -167 217 78 -8 128 -162
5435a62O5J13k1L1J37q1P9j45k1k5K03k58J34j45Q0M5LjN8o6L2j62l8o2J00R6
$$ -162 -97 16 -5 26 163 82 161 16 -5 -30 173 -85 49 -96 -16 29 32 31 89 23 55 -107 -145 -207 -107 -11
5461a1j20J15L04k22k34K91k50L20k66J19l15J35J28l8J63lM7j24q0L33j66l03
$$ -11 -131 -16 288 66 -168 123 -127 193 -73 46 -269 -134 -6 -44 119 116 163 39 -41 292 126 -177
5483a77L08j25q0J09R9N0k43J09j06K77m27K38J91k82L5j5j00J66N3m2J9J93r3
$$ -177 131 6 -74 35 134 184 -59 50 -56 221 -206 32 223 -59 -24 -39 -139 27 80 38 57 250 157
5506A57j56m8M10n06K60P2j53M6j05K35k94J35N3l7K09k97J19j98J00P6l75L20
$$ 157 1 -47 363 -143 117 189 36 82 -23 212 -82 53 106 69 278 -19 100 -98 2 78 -297 23
5528B3k9j38o0K48J61k44L45k88n0Kp7K4j31L08n5j60K47L0K89m89J8J26m0o5
$$ 23 -6 -144 -204 44 205 -39 306 18 -32 -30 -107 -83 -214 94 39 -121 126 156 445 -44 -26 100 60 -5
5552ek0l9P6l70L63mJ25j50m8J05n3q2L61k44k32QJ30J52j90J07J19P9k21J13
$$ -5 -25 -64 12 -358 5 1 126 -24 -72 33 -20 -102 259 15 -217 -209 -79 73 -117 -10 109 188 -33 80
5576H0j95J36K02k93j05K92K9j04Q3n41M25J16p0P1J83k56L9LM5r8l3j07J03q1
$$ 80 -115 21 223 -70 -175 117 146 42 125 -416 9 125 55 126 309 53 92 95 140 42 9 -98 5 -76
5600g6K01j81J05k22N84l24J18j54J71k62pJ63l48K83J8k90k2K78N5o3j75J20
$$ -76 125 -56 49 -173 411 87 205 51 222 -40 -47 116 -232 51 69 -221 -243 35 90 27 -148 -28
5622b8J09M2J8N6k11L7L4p8j41K77j19j26L5p3J90qk28J08L18k49r9J67K84l84
$$ -28 81 123 141 197 -14 23 57 -21 -162 115 -4 -130 -95 -168 22 14 -214 -106 212 -37 -136 31 315 -69
5646f9j23P2J56p8K0N3o6j47J77jL6n5r4O6J28m10L09K74k68M3l09K14O3n4R1
$$ -69 -192 -120 36 -42 -22 31 -35 -182 -5 -6 30 -25 -119 -53 75 -335 -26 248 -20 23 -286 -72 -9 -63 28
5671B8m41N48k26K1L6J63j93j04N8J45k94J22J87K49J7k95k3q7J83K6Q8j12j08
$$ 28 -413 135 -91 -70 -34 129 -64 -168 -110 35 -259 -137 50 299 316 21 -2 -89 94 120 208 96 -12
5694a2J73l96K94j71n3m1k13O74l70K44o5k0N1N3JK5j78j12J56j92K36k7j70j14
$$ -12 161 -235 59 -112 -165 -206 -419 255 -115 129 64 44 95 148 149 174 -4 -116 40 -152 84 57 -113 -227
5718b27L44k51J91m7m4J82j0m2q7j74M15j01k16J86j22j69Q4J35OJ05q6j37M4
$$ -227 117 -134 57 10 -34 148 138 96 9 -165 250 149 -67 119 -3 -172 -88 47 53 158 72 -65 -21
5741b1RL94j68r3p1n1K83l37K16j09j45L76l81m4N2P6KN0Q8k53J06l6K68oj27
$$ -21 -12 382 214 121 50 -1 282 -55 161 52 -93 283 -98 -142 -90 -14 -12 38 126 -127 -21 -57 211 205 78
5766G8j0P3m4J66j00k73M66j71j27k05J03k0m1l3J84k11J58P0QJ30p8%q2L3j13
$$ 78 68 141 97 263 163 -110 356 185 58 -147 -44 -64 -105 -138 46 -165 -7 63 71 201 123 123 41 74 -39
5791c9q8J38r5M7J36N4k27n6J54j26J86k83L3J43K53k00l1J4J7J45j22N5j89J
$$ -39 -127 11 -84 -37 99 153 -74 -130 24 -102 84 -199 -166 -23 230 30 -1 13 30 175 53 108 -81 -80
5815h0j81K18J45jk00J89k1l2J45j36o4j66J71q9J65k23Q7Q5k86K00J83n5j90
$$ -80 -261 -43 102 101 -99 90 69 37 182 46 -18 -184 -13 -102 63 -160 -73 12 -274 -74 109 54 -136
5838a36j51R0M19j0l21J1j2K55rp3jJ18n77M11j19J48K3j42K12k85K13Q7j33O7
$$ -136 -287 -197 222 212 -109 -98 -110 145 136 63 62 180 -397 14 -105 43 66 -76 136 -149 64 151 18 85
5862H5L1R9k43p3M7P6j21q7J36j1QL01j44j73K29l04k8K60j19m1M6o2K65l08L09
$$ 85 116 215 -28 -101 -54 22 -99 -186 -50 -61 -53 248 104 -69 160 -144 -172 88 -31 -72 -26 -88 177 -131 178
5887A78l02j39K24o1J30j36j03K3J60K98l63j9K0J77l84K56k63M49n5l22O30j93
$$ 178 -124 -263 -39 -100 30 -106 -209 -186 -26 272 -91 -110 -90 87 -297 -41 -304 145 90 -232 398 205
5909B05n4m4j07k3j9%L22k17l1j88K66L9l36N0J52n3J37p8J88l07K67m6j21k23
$$ 205 151 107 0 -23 -42 -42 280 63 32 -156 110 149 -187 -137 15 -38 99 21 209 -98 169 123 2 -221
5933b21K12R5j81oJ29J08j90K4Ll5J49k43P9L93j46m72L29L0L2k3j19N9j69K23
$$ -221 -9 86 -95 -101 28 136 -54 -30 -27 -62 87 -156 -77 316 170 -302 27 57 89 66 -53 6 -163 60
5957F0k24J78J60j68K7j54J65k01N6k61M64Nr0k45K47J39j67k73L74k57J26K83
$$ 60 -164 14 174 6 33 -121 44 -157 -101 -362 102 107 17 -228 19 158 -9 -282 92 -165 -39 244
5979B44l37K43k3j22m8l50O34l42M6J53j04J29k08J31m2K64k51k13K04P8j19j36
$$ 244 -93 150 127 5 -43 -393 241 -101 -55 98 -6 123 -85 46 4 268 17 -196 8 86 -33 -169
6001a69M49m40M2M03k16j53K7K01j43J59k25l6N0J26p7J80J06k79pk51J08J60
$$ -169 280 -160 -118 285 69 -84 -57 144 1 160 -65 -101 -51 75 -2 178 284 5 -2 -253 -145 15
6023A5P6jj42J13j25O0r2K95j78O6k30j05L52K7k55J73N8j39J62k81QL52k13J51
$$ 15 91 90 -52 61 -64 -4 -96 199 21 87 -143 -248 104 131 -124 49 107 -32 130 -151 -143 209 -4 147
6047A47J9j24o8J66j69J87j59OR3l31K24O0r0K32k83K99m2l67K15o1J50J24j55
$$ 147 166 42 -26 140 -29 158 -1 5 98 -233 -9 51 -39 193 -90 209 167 -200 15 -46 104 228 73
6070G3j24j73J61k23J76M11o2j37n4j98J62K8L2Q9j81n2M0J14j25J15l52N12j49
$$ 73 -51 -224 -63 -286 -110 301 239 102 48 -150 12 40 72 161 -20 -72 -32 82 -43 72 -280 232 83
6093H3J69m11p8J02J73j29J47L52m92J4J31j10J48q4j23N29j83m78P4M86k67k83
$$ 83 252 -159 -237 -135 38 -91 56 408 -84 -70 61 -49 99 15 -108 421 238 -240 -166 320 53 -230
6115b30L49l01J32N9nj55N3o4K82O4j01j02oj72J60J48o9R6n6l93L80k45J80m3
$$ -230 119 -182 -50 9 4 -151 -98 -162 120 184 83 -19 -25 -197 -37 111 42 138 82 -311 69 -176 4 -39
6139c9M1j03o8L16j35J7j95K07j72K72j16J83m03M0M89l43R5k94K19m4k03L50
$$ -39 2 -101 -169 147 12 29 -166 41 -131 141 25 208 -195 -155 334 -9 86 -208 11 -33 -236 114
6161A14m5r2j08J59J7J30pk58M3J33j57J94k4j7k45J84Nk32J66L0M7j21J5J67
$$ 114 69 -23 -131 28 45 175 168 -90 -47 86 -71 123 99 82 -163 21 26 -206 -40 -10 37 -84 -69 98
6185I8q7rP2k72J89q0J18p0O1j34L18l03N7K01k91J27r9N9m2mJ38J50m25M6P3
$$ 98 11 2 74 -198 -9 -89 29 -41 20 -114 204 -99 -42 159 -132 -5 -104 -45 -87 -91 47 197 -228 -182 -109
6210a09L48j94r1J33j16K75l51M14l94J78P4q2k4J79m03M6J18K37j21k72n0M26
$$ -109 239 45 -46 87 -29 246 -105 309 -85 93 167 85 61 240 -163 -117 1 238 117 -155 -205 221
6232B21j13k6J24l18j66L81N1j36m9K08o43L44L38m86K18R4J80l70N8J29k47K77
$$ 221 108 82 206 -112 -278 103 154 18 -31 177 -466 -122 216 -270 -52 42 222 -148 -90 39 -208 69
6254F9j01K35j62J46J89m84j05J10M6q8m6K56o0J07k9K8k5m32O31j50l30L49l26
$$ 69 -32 203 41 187 376 -108 -213 -103 -57 -145 -191 65 5 112 83 111 86 -346 285 135 -195 154 -172
6277a72L1K30lj34j74K33J07J84m74K26O1k15J17qk95M58m1j99J17l7K00m07L24
$$ -172 -141 89 86 -48 -222 11 118 302 -172 54 115 -100 17 9 -286 172 131 -68 49 12 212 -195 129
6300A29j61r3R0q6J19j3J16o5r6P5l18J86K68J25k27k24J96j66J95l61K15J24
$$ 129 -32 -125 -35 -121 -2 -15 101 36 -60 15 -303 -117 151 276 49 -175 21 -145 50 -311 -96 28
6322B8K52k46%p6J62j1N2l04L4k24L70j68K01NJ79l45K4J31k33J67N4k24K9J1
$$ 28 280 34 34 -42 120 109 161 -143 -109 -333 37 -131 70 75 254 -91 -67 64 -169 -2 52 -172 -143 -132
6346a32O1J33k5m39M36L07p68K33K00j46J43L1P0j94K18P0k07J48j56j40K41P
$$ -132 -71 62 37 -402 34 341 -427 -194 6 -140 3 34 104 -90 128 198 -9 139 -17 -157 84 91
6368I1L7J29m43M02k41l7M4J7P5J62k35Lk2j74J35j61J36J64N4l53L03K7K14k52
$$ 91 128 257 -186 216 -25 -62 -18 -1 74 236 1 4 -18 -192 -57 -218 -82 82 136 -217 86 113 327 75
6392G5K1k36l6R8m9J31k37N72o9l78n3M41m70J25q3J28j70J98j85K04L45m40N6
$$ 75 96 -140 -176 -78 -127 4 -233 339 270 -108 -161 280 -190 -65 -148 -20 -190 8 -177 27 372 -68 -12
6415a2J1J3o3J51l01K07m8l4J22K05p5l59N0pJ3N2R1o3L06k80K02j14p9J14m59
$$ -12 -1 12 -51 100 -201 6 -42 -76 46 251 176 -183 -133 -140 -127 -75 16 -47 259 -21 181 67 -12 102 -357
6440c57J61L3L05n5j23K34n87N61k28J6O2J92j62j26m6K24m1j40l4N90n52p0K8
$$ -357 -196 -163 142 87 -36 198 -389 172 -56 -40 22 214 52 -74 -120 104 63 -77 -111 479 -73 -143 -115
6463a15L09j12j74J04J53l15K74k51K16n9O2l19J87n2K25j36r1K99l54r2K14P1
$$ -115 194 82 -92 12 165 -150 124 -127 89 30 92 -227 -40 -92 133 -3 -94 205 -149 -241 -27 44
6485D4K7J62l89K8J78Q5q3J27l95L03M7j89J31J59K3n33K20r5R3q5L23k06mj2
$$ 44 71 233 -156 -128 50 135 52 179 -216 87 134 -55 76 235 258 -275 -55 -150 -57 -142 181 -25 -29 -41
6509d1j22M72n23L72k55r2K54k88J69P5j47L23j7j41k46J76n5O5J12J04l32J6
$$ -41 -163 309 -214 158 -97 -189 65 -223 -54 21 -126 197 180 39 -207 -31 -86 -21 91 195 -137 -121
6531a21M1j46n3L51j47L14l63K72m05J12K98l10J44J1j08K58k74Q4K11r5j69q7
$$ -121 -80 -226 -279 72 -75 239 -124 148 -257 -145 153 -157 -13 -2 -110 148 -126 -42 169 74 -95 -182
6553a82N36j67l65l5L68l76M64k50m6J03l51J19l3L7L24m85M17o7J10l48K67J76
$$ -182 354 187 -178 -213 155 -221 243 -7 -53 50 -301 -182 -215 -178 146 -339 78 11 121 -227 40 216
6575B16o5l36p1P1J1P8lj30P3J38J96k6jk88j6K98l77q0N38j5l98P3K82m2j37
$$ 216 151 -185 -256 -185 -174 -96 -99 -229 -156 -18 178 152 151 -137 -153 145 -232 -312 226 211 -187 -114 168 126 -11
6600a1K31l45p2M75J01q7l33N5k52j01L44R8l89L69K55m75L65l24L8J08j98J35
$$ -11 220 -125 -197 278 379 292 -41 14 -238 -339 5 103 -286 83 338 -137 228 -96 -58 50 -148 -13
6622a3J75j91j7j51L16j09J07o9j24K88j37J60j22j35j3L4J52j1p5j68oNJ29r0
$$ -13 162 -29 -46 -197 119 10 117 48 -76 212 75 235 113 -22 -35 -1 151 140 65 -103 -109 -104 25 -65
6646f5M3n4Q3J71r5k5M71n82k9K3k08L02L4O3k59j80K85L87l45j57J62k85J72
$$ -65 -22 -76 7 178 83 58 529 -53 -82 -59 -267 35 69 132 -127 -307 -22 365 20 -137 25 -260 -88
6669h8K21k94O8J92k20K27j27j69o6K30J11Mj25l0j15Q4J74o6m5L36l76r4K38
$$ -88 133 -161 -93 99 -121 106 -21 -190 -256 -26 85 89 -36 -66 -181 -97 77 11 -34 302 -74 -168 70
6692G0J2j70L41l80K56m7k15K09l68M03k7j55J24Q0k09J81kk69L07j80n2Q2N8
$$ 70 82 -88 253 -127 129 82 -133 76 -292 111 84 -71 53 133 -76 105 103 -166 141 -39 -91 -9 49
6715D9j10L01j04j81P4K6R9n8m46K49J7L04J7o9k31k06J91J28k50p3N78l27q3
$$ 49 -61 240 136 -45 29 55 154 96 -350 -101 -84 220 237 168 -63 -269 -78 50 -200 -273 305 -22 -105
6738a05J39O6j04oP7j88K66j27r5p7K08J25j25n6j78J46R1J4M0j73K8K6N7j38
$$ -105 34 100 -4 -10 67 -121 145 18 -77 -154 54 179 54 -2 -180 -34 57 71 111 -62 -34 -8 49 -89
6762h9J06O0j95L4J29k6K08l4k51L6J41l7k41J72n0l7j31K07r0J94k25J64j98
$$ -89 17 77 -118 -84 45 19 227 193 -58 -22 119 82 -159 13 -37 -74 -205 2 -88 106 -119 45 -153
6785a53K36q0mM4k10K47j36M2J16j74OMP5M2k57K14k33L95m0r7j69K69m5k8J35
$$ -153 83 3 -1 43 -167 80 -56 -14 102 -72 -66 -62 13 55 -202 12 -221 174 134 37 -132 137 92 64 199
6810A99j56O8j96k59M30m19L14j11l9R1J30j68L78k43j83K42j36J58M2j69J65
$$ 199 43 111 -85 -344 86 -333 -19 -130 -169 -78 52 -116 262 19 -164 78 -58 100 142 -27 138
6831A38q4j11P7j0N1L10l07j99Q9o2K09K89m45J27o6p9J99k36J51jp1J45k78J78
$$ 138 54 -57 20 10 61 371 64 -135 -46 -108 101 390 -55 72 6 -73 126 -110 41 40 -31 114 -164 14
6855A4k1j69M4K6J63O9j09K36m11J0O5Q0j08M38k96N1r4O6k09P1M4R0k85L2M13
$$ 14 -7 -176 -132 -106 57 126 17 253 -158 -148 -83 -3 -111 327 31 82 -12 54 -155 -84 -40 50 -235 -203 210
6880B10k65m8j98n8J63J19l62M23j16p3J61O1N6N2j39k19N8Q4j34K35j90R1N8
$$ 210 -55 -103 -301 -359 -196 -77 -439 -16 -132 -205 -44 17 73 125 -14 -233 -175 -91 -225 10 -180 -89 -31
6903c1K33K5l83L50l53K70J15k96jP9J72q4l83N06m43M04m42J56K86k6n%j59o7
$$ -31 202 227 -156 194 -159 111 226 -70 -71 8 180 96 -287 219 -224 180 -262 -106 180 154 149 149 -10 -77
6927g7J72j24J53q1J93l00K09L5j14l18L11j04k06J50J3J08J99n0k20J22k60K97
$$ -77 95 -29 124 43 236 -64 145 180 66 -252 59 -45 -251 -101 -88 20 219 169 -51 71 -189 108
6949A08m0q4J2p1L58l04J13j28M8o1j85k2M0L87j05Q0j22r5J50k64P3J70M3j39
$$ 108 68 -16 -4 -75 283 -21 92 -36 12 -49 -234 -256 -216 171 66 146 24 -71 79 -185 -112 58 101 -38
6973c8LK5j67J84K1M7j63J5j5L22j13p2l74J73L90j98k12J00K01r9J01l07K15
$$ -38 -35 -10 -177 7 28 75 -88 -73 -88 234 121 49 -325 -152 238 40 -172 -72 129 30 131 -176 39
6996C9m2J74k49K58k68J17j16j10K43r9o5J71kk02K96j05J14k12K55j94L27q0
$$ 39 -3 171 -78 180 -88 29 -87 -197 46 -53 -118 53 51 -151 145 40 154 -58 197 3 330 250
7018B50k94R1k20K03j47K68j3kk38J90K19k62J34m11K58j38K99m46M9J92N5j25
$$ 250 -44 47 -173 30 -117 151 138 136 -102 88 307 45 179 -232 26 -112 187 -259 -210 -18 37 -88
7040h8J52k39j19K07L6J58l48K41L2j98P1M0P9O4J04l03q0L05J39j48l8l4j64
$$ -88 64 -175 -294 -87 -51 107 -241 0 32 -166 -95 -55 24 88 192 -111 -191 114 253 105 67 33 -131
7063a31J8P5J4J3L4J00Pj3j77Q0K9p0j16K57k42j37L37J40P6j84L0k87J86jj6
$$ -131 -113 -38 -24 -11 23 123 130 117 -60 20 49 -21 -137 120 -122 -259 78 218 294 110 140 -147 39 38 22
7088B2j67J46L6j50J54O9j58L4Q3q3K76k4k96K50j14M0k12K02j86P3P2o3K76k64
$$ 22 -145 1 37 -113 41 110 -48 -14 69 -14 262 238 -58 192 78 118 -94 108 -78 -5 67 4 280 16
7112A6L4k57K78J51j10k70M15j88j44L19j99L3L5n2j00j4K02j36o4L14k52m3r7
$$ 16 50 -207 71 222 112 -158 257 69 -75 244 45 78 113 61 -39 -53 149 13 -51 263 11 -32 -129
7135a29P8K63k10J9nJ87l76P9j20J55Q4n9o1pK54k43J4Q9Pnj56J70l42K37K38
$$ -129 -51 212 2 21 16 203 -173 -94 -214 -59 25 -34 -95 -102 152 -91 -77 12 19 14 -142 28 -314 -77 161
7160A61j23k09l14N64k08J81J16l2j70K8l2l0J89R4j97M55l93j44K08j00k03K53
$$ 161 38 -171 -485 79 -129 52 168 136 -34 -6 -38 -68 121 215 18 473 80 -64 144 44 -159 94
7182I4j40k96L31mr7J73k11M1KJ05l68J52L45j45j30J67J38k13J87j9k79K82k0
$$ 94 -46 -342 -11 -15 -112 61 -150 -109 -107 -2 -370 -218 127 -18 -148 19 157 -56 131 112 -167 115 95
7205I5n9j4m8j1%p1J03k13J87j8K82j00j40J25jKl61L04j17K70k58L1L0O7Lm83
$$ 95 36 22 -26 -37 -37 -108 -5 -218 -31 -49 233 133 -7 118 117 119 -242 62 -55 215 -43 -12 18 85 88 -395
7231c95N02r1NJ24J4k66k8J04J23k32L03l82j07L37M9M5J58j75k71K33k30P5K7
$$ -395 107 16 21 145 159 -107 -135 -31 92 -140 163 -219 -326 11 60 105 263 88 -183 50 -180 -105 -78
7254g8k49M72O2k26j77M7nL48n7l01O8K44k04MK50k31N6k6J05J2J27m13J11K4
$$ -78 -327 145 207 -19 -196 -149 -154 194 137 -164 -96 148 -56 -52 198 -33 23 -3 102 114 241 -172 -61 -37
7278c7n0J19j72J81j08j08J53L56l15J44o3k59J27j51J90l9k27K13j34J34J08
$$ -37 -87 32 -140 41 -67 -175 -22 334 19 163 100 -159 -32 -183 7 -32 -259 -46 -180 -46 62
7299F2J02j85J00K2J9k13k23K27J22k03L57n1o6R7m05J90j34K72k34K82o6r4j42
$$ 62 164 -21 79 101 120 -93 -316 -89 33 -170 187 136 70 167 -238 -48 -182 90 -144 138 72 -22 -164
7322a64K07j42l8K22q1J37m8m14K40m0K00j73P9M3j66M31m01K3J40j60l3L68j73
$$ -164 43 -99 -137 85 4 141 93 -321 -81 -121 79 -94 -15 28 -138 293 -108 -85 55 -105 -138 230 57
7345E7Q3m0j32n8R8j97J86k37L46l34K9K86j52Jq3K59k33K32j08K4L8O2l10L03
$$ 57 140 100 -32 -90 8 -189 -3 -240 106 -228 -199 87 -65 -64 -147 112 -121 111 3 27 65 127 -183 120
7369A20r2p3jJ47j39N1J49q6K00l52l1J17O6N3j25p4J71j00%l4K7k2N7m46P28
$$ 120 28 -45 -46 101 -38 13 162 76 276 -76 -107 10 76 129 4 -70 101 1 1 -33 -6 -28 29 -417 311
7394C11p2j56J75k45M2p3q8L03j33k12J65L7RJ06L6m34K25M9m03L00J08j97K47
$$ 311 239 83 258 13 55 -18 -106 197 64 -148 17 54 63 169 205 -229 -4 45 -358 -58 50 -147 100
7417A00J8j38P0K29k82mJ23R7k81k57L37j08K80l16K5rk9L57j45K5k90P8J59K5
$$ 100 118 -20 50 279 -3 -7 116 213 -68 -325 12 -96 184 -132 -107 -116 -145 212 67 92 -198 -120 39 64
7441F4o5j78L67j76m4J22l9k61K87J73m20N1n3K04j79M6k54L60j53K16j94K46
$$ 64 -1 -179 188 12 -32 90 51 -210 77 250 -170 -119 -172 32 -147 -101 -355 5 -148 68 -126 120
7463A20m6J0j03M6k36L71j57Q2m0L7j10K11k75K38j74N6k93M48j15K4m5J04l29
$$ 120 74 84 -19 27 -209 162 5 87 47 84 -26 185 -90 148 -26 30 -263 185 70 94 49 153 -176
7486a76O0K06q3L2k3r3L4m3J05J1k11J47L7p8j09K87k01j13J91J31q6O6j57J47
$$ -176 -116 90 7 39 16 -77 -43 -86 19 30 -181 -34 3 -75 -184 103 -98 -211 -20 111 25 91 -66 81
7510H1j77N9J08q2R4K16k96j50J59L9l8L36j55k32J1P2j10j09K68n1J45o0p6k56
$$ 81 -96 -37 71 -11 83 299 3 -147 12 51 13 349 194 -38 -27 45 -65 -174 94 43 188 128 52 -204
7534b04O4J58J45l92J67n4K49j87K56l04J32J02o8kk51K99O4l39N4R0j58R2N2
$$ -204 -140 18 163 -229 -62 -116 133 -54 202 -102 30 132 64 62 -189 110 174 -165 -111 -21 -179 -87 -35
7557c5j36R4j08P7o3R7j24N8L93l28J48O8j04N8R5k96K96l35j4J89k3M1N2r7k76
$$ -35 -171 -77 -185 -108 -171 -74 -198 -140 253 -75 73 141 37 95 190 -106 190 -145 -159 30 7 48 100 3 -273
7582b73M88k59J12m6j86J00q1J36j76M74k44l8K14k94J68Jl75K99j11j67K4M93
$$ -273 215 -44 68 22 -164 -64 -145 -9 -185 289 45 7 221 -73 95 96 -279 20 -91 -258 -234 259
7604B59m80L04l08J80J36q8J00K81l78K61Qp7o5p4J07j83p4M75m34l8K14k24J35
$$ 259 -221 83 -225 -45 91 3 103 384 6 267 275 198 133 59 166 -17 -91 384 -50 -88 126 -98 37
7627C7R0k88J17J95pL6k19Q8J16j92k5j25K98j77N8j37O9K20j21p7l3J60j87p2
$$ 37 127 -161 -44 151 144 180 -39 49 165 -27 -52 -177 121 -56 2 -135 -66 154 33 -44 -77 83 -104 -176
7651a76K43j25j56K18P3J5p3rj95K14j02n8J41qK6K37j25m53M22q0o1j62K32L97
$$ -176 67 -58 -214 4 77 92 19 10 -185 29 -73 -131 10 2 28 265 140 -313 109 29 -32 -194 38 435
7675D35n05L3P2k62L80j70n1j04K99m23O1L36J6j13J33l59L00pq0J37K27j31l91
$$ 435 -70 -37 35 -227 153 -17 -68 -172 127 -296 -235 101 117 4 137 -222 78 71 -9 128 355 224 -167
7698a67K01L1J02k12J12l10K92L9j12K29M1k24r5k59L34J10j1j34j99L6L07j77
$$ -167 34 65 167 -45 67 -243 49 88 -24 205 246 22 -73 -332 2 112 101 -33 -232 -196 111 -66
7720f6Q2k18p1L74k91k5J1K24j66J33R5P7J19l10N5O2o4J27j00J8j03J71J08l95
$$ -66 16 -202 -273 101 -190 -215 -204 20 -146 -13 82 159 278 -32 23 85 21 148 48 66 -37 134 242 -153
7744a53K12j13J00k5J4l6lr6Q6J32n9J42pk66N2K5J69j91m6M1P3j59J16J15j28
$$ -153 59 -54 46 21 35 -1 -4 -100 -14 118 59 201 194 -72 -20 5 174 -17 -63 -22 51 -108 8 123 -5
7769eK4n7J89k70k1L86k80J53j84K59k17rJ3K8L50n69M03j83o3k39K97L0K19l94
$$ -5 19 -38 151 -119 -140 246 -34 119 -65 194 -23 -32 -19 9 359 -210 193 10 -53 -292 5 35 254 -140
7793a40J18K14j93N3k24J19R5kl9l31L18K4P1l76K78k45K54M89m04j04m6R6k8
$$ -140 -22 192 -1 52 -172 -53 42 40 1 -330 -12 12 83 -293 -15 -260 -6 483 79 -25 -71 25 -3
7816cj20J40Kk2j06j46L14q2N3j18J74NlJ55j68j03M05k74K83m93k1J99j13j3
$$ -3 -123 17 19 -3 -109 -255 59 -23 30 -88 86 91 88 243 75 -28 377 103 386 -107 -128 71 -42 -55
7840e5J99j58j42J18l98N04l01K10K71l59M5pj37MJ81J43k29l7J84j4J80l19N29
$$ -55 144 -14 -156 -38 -436 68 -233 -23 248 -111 -66 -73 -210 -206 -25 118 -111 -148 36 22 202 -117 412
7863D12p05L07l9J35k10j07J56n7M3l7J26k06J10Q0P9j49J36k44K26J2n0j26N6
$$ 412 -293 14 -25 110 -100 -207 -51 -108 -65 -102 24 -182 -72 8 87 -62 74 -170 56 68 18 -108 -52
7886e2L9j07q2J55j83K25j56K00Km0k54j43M16m3P8q5O1k04Q2J34M3p0J57r1k41
$$ -52 -13 -120 -202 -47 -230 -5 -161 39 41 1 -253 -396 20 -23 55 -30 31 -173 -91 43 86 16 173 82 -159
7911a59k8J87r2K57k51JN9nP6K4J4k22Q4p3Q1K9N8j85p5K32k1j7N7QK0j64k51
$$ -159 -187 0 -92 165 -86 -85 -26 -31 45 69 83 -139 -55 -128 -47 -18 40 -145 -220 12 -9 -26 31 39 59 -105 -356
7938c56K50qK07J04k82j47J77J11R2l14K00L93l54O8j8K3k78J73k75J93J91j13
$$ -356 -106 -114 93 197 -85 -232 -55 56 148 -166 34 427 73 141 123 146 -132 41 -234 -41 150 37
7960C7p8P3O5j45N3k74L53j65Q7J00j15j84L15j04O4k08K64j43J27k53K74k4k69
$$ 37 -41 32 97 -48 5 -269 84 -81 6 106 -9 -193 122 18 82 -126 138 -5 122 -131 143 119 -150
7983a50K13j62J18j36K65j86j46L54k28kj27K45k04L66j88K38n91N66l87l8K71
$$ -150 63 -99 19 -117 148 -38 -184 170 -58 -60 -187 58 -146 220 32 270 -321 245 -142 -180 91
8004I1m60K93j00K06o7K01l67N06k53j74L6L10r9m7j04L5l0pl2o4J43K1J9q4J61
$$ 91 -369 -76 -176 30 -37 164 -203 303 50 -124 -88 222 123 76 -28 7 -23 -30 -62 -126 17 38 57 -27 134
8029A34Q2p2k10J98K11k35O0n6qq6R6m9K6k86K77Jj94K17j50L69k66P2K54k51
$$ 134 216 144 -66 132 343 108 168 112 104 18 114 65 91 -195 82 83 -111 106 -44 325 59 131 385 134
8053A34m3J27k49J0NL63l84M12k18l58P8K19k22K5K36o1R9R0k69J8k27K66j56
$$ 134 91 218 -31 -21 -16 347 -37 375 157 -201 -123 96 -126 -101 135 74 173 263 -6 12 -215 51 -105
8076a05J62J52j34l26K74k17J96J97j10Mj79q4K08m6J75p4k76K68M22o68L56j72
$$ -105 57 209 75 -251 23 -194 2 199 89 93 -86 -170 38 -8 167 93 -183 85 507 -161 195 23
8098B3k44K43M0n2j61J01L73j57k98J28lR9M5k66j1j33J58L0L01l13m3l7P6K12
$$ 23 -221 22 62 10 -151 -50 323 166 -132 -4 -7 92 137 -129 -140 -273 -115 -85 216 -97 -140 -177 -101 111
8122A11p3L01k25k32K32j49J45j27MJ63j71J09J66l98k2M06j86R6j59k9oj14J8
$$ 111 38 339 114 -118 114 -35 110 -17 -13 150 -21 88 254 -144 -166 240 54 150 -9 -38 -44 -158 -140
8145a40k7R3J87O0k73J86l9p5K68m30L98k1j62k86N15j57j53j43K12k00R4J17
$$ -140 -167 -74 113 173 -100 86 47 -28 240 -190 208 187 25 -261 254 97 -56 -199 13 -187 -93 24
8167B4MJ68m44K49L27k27J55M9l74q4J79j68Q7J13k19k4j00J41J05O5J8j45m9
$$ 24 28 196 -248 1 328 101 256 305 -69 -153 26 -142 -55 58 -161 -185 -285 -144 -39 26 44 -101 -150
8190a50p7
$$ -150 -227
8191b27
$$ Imaginary data points
##PAGE= N=2
##DATA TABLE= (X++(I..I)), XYDATA
0@%%%%%%%%%%Qj6J6j9K5l2L7m6N9p2Q6j02J22j43J69j97K29k66L09l56M06m65
$$ 0 0 0 0 0 0 0 0 0 0 0 8 -8 8 -11 14 -18 19 -27 32 -40 46 -56 66 -77 92 -105 124 -142 167 -189 217 -248
32b48N28n99O78p66Q62r66J081j205J342j492J657j837K034k248K480k736L018
$$ -248 280 -319 359 -407 455 -511 570 -635 707 -785 872 -965 1069 -1179 1301 -1435 1583
49A583l325L661m033M446m906N416n992O647p393Q256r272J0483j1955J3796j6170
$$ 1583 -1742 1919 -2114 2332 -2574 2842 -3150 3497 -3896 4360 -4912 5571 -6384 7412 -8758
64h758J9366k3933L1046m3768P3639k81512k24958K58872K784j5811O3409K68449
$$ -8758 10608 -13325 17721 -26047 47592 -233920 -458878 -200006 -197222 -213033 -149624 118825
76A18825J66392k753o5004J00428J20213m0477k14809j26583J2859j7419j97530
$$ 118825 285217 282464 217460 317888 438101 397624 182815 56232 69091 51672 -145858
87a45858j98509k0129J05017L607r4285N515J97570J91273L2136k4425J15058
$$ -145858 -344367 -364496 -259479 -255872 -350157 -344642 -147072 44201 76337 51912 166970
98A66970J93836N5825j24263r3062M1226K2432j57571k25700q4878M6105l0187
$$ 166970 360806 416631 292368 199306 240532 262964 105393 -120307 -205185 -159080 -189267
109a89267j50674q1382J13178J63036L0682l3520R9386K16761J25286m2768m7019
$$ -189267 -339941 -421323 -308145 -145109 -114427 -147947 -48561 168200 293486 250718 203699
120B03699P8280Q6549q1421j90974r9041K0515l4571j70564j49510K4268J02084
$$ 203699 281979 368528 287107 96133 -2908 17607 -16964 -187528 -337038 -312770 -210686
131b10686J434p0076M1319J87377J52282L157j8615J05722J46737N199j29348
$$ -210686 -209252 -279328 -238009 -50632 101650 104807 86192 191914 338651 343850 214502
142B14502p9156L6846m113j57173j82378l9836N2267k8647j19072l1624J29632
$$ 214502 135346 172192 168079 10906 -171472 -211308 -159041 -187688 -306760 -338384 -208752
153b08752J38660J4629j8068J02317J79904P4670o4418m1386O5606M4732j03609
$$ -208752 -70092 -55463 -73531 28786 208690 283360 218942 177556 243162 287894 184285
164A84285j69782o8538K5686m2083j46724r5900N5896R8411j631m7033O5616J72502
$$ 184285 14503 -54035 -28349 -70432 -217156 -313056 -257160 -158749 -160380 -207413 -141797 30705
176C0705J10990j7559j6059R3240J05175l4425j30859o0912L1359k4302j48553
$$ 30705 141695 124136 108077 201317 306492 272067 141208 80296 111655 87353 -61200
187f1200j40553m457N7054k8920q8441P426J34650J14933J579q130J01825J43102
$$ -61200 -201753 -206210 -149156 -178076 -266517 -259091 -124441 -9508 -7929 -16059 85766 228868
199B28868L1281p5936l6441N2231J3841j15578j45497m0680K7151m3712j21614
$$ 228868 260149 184213 147772 200003 213844 98266 -47231 -87911 -60760 -104472 -226086
210b26086n4157P8371R0193o192k7113P9710J52762P6245l2810j2231Q1613O6693
$$ -226086 -280243 -201872 -111679 -117871 -144984 -65274 87488 163733 130923 118692 200305 266998
222B66998o0214j24269m6266K6293l7713j36140j01755K1267N6024k6177o2770
$$ 266998 206784 82515 36249 62542 24829 -111311 -213066 -191799 -135775 -161952 -224722
233b24722L5021J32300R0766p589J86R5364J09999j387q1847k9023M0591r276
$$ -224722 -189701 -57401 33365 25776 25962 121326 231325 229938 148091 119068 159659 150383
245A50383j17981j21179j8001K7931m4737r7583j9936Q8617P9670q864j2796Q7528
$$ 150383 32402 -88777 -106778 -78847 -123584 -221167 -241103 -152486 -72816 -81680 -94476 -6948
257f948J31781M5267m1754q376O8912L6791p8067j12676l0905K0727m5398j19514
$$ -6948 124833 170100 128346 119970 188882 225673 147606 34930 4025 24752 -20646 -140160
269a40160o9049M0298N2582k5831m0705N3728J22702O8557j5632N944Q7490P9848
$$ -140160 -209209 -168911 -116329 -142160 -182865 -129137 -6435 62122 46490 52434 139924 219772
281B19772k5245q0937k2470L2037k6051j14695r5430N14K7000m2845p6389N524
$$ 219772 194527 113590 91120 123157 97106 -17589 -113019 -112505 -85505 -128350 -204739 -199215
293a99215R3100O5780j1630j017Q7176J09532K0352m8395m391N7262J3057q5910
$$ -199215 -106115 -40335 -51965 -52982 34194 143726 164078 115683 111292 168554 181611 95701
305I5701r7583j7573J8525m9517j01553m0391N1303M6751k4143k4375O4410J10341
$$ 95701 -1882 -19455 -930 -50447 -152000 -192391 -141088 -94337 -118480 -142855 -78445 31896
317C1896M6641k0604R464P6795N3990m2394p6912j4546K4082l5621j05279p2023
$$ 31896 78537 57933 67397 144192 198182 155788 78876 64330 88412 52791 -52488 -124511
329a24511J5892K5944m0848n6906K4723R0935N2734j5399O586Q3439Q6196j40
$$ -124511 -108619 -82675 -123523 -180429 -155706 -64771 -12037 -27436 -20850 62589 148785 148645
341A48645m9998j242M5727m145q7571q0922n233J5007m8611q3457j7871N7890
$$ 148645 98647 97405 143132 138987 51416 -29506 -34739 -19732 -68343 -151800 -169671 -111781
353a11781M0083k2478j0613O8112R5231K8711k5468J1164O5737L2031n2437p0047
$$ -111781 -71698 -94176 -104789 -36677 58554 87265 61797 72961 138698 170729 118292 48245
365D8245q197J9599m1537r4049m9925K5944K3889l7024m0083L7371Q5990L9555
$$ 48245 40048 59647 18110 -75939 -125864 -99920 -76031 -113055 -153138 -115767 -29777 9778
377I778j6864J1793P5929O5561j6311m9870J849L5314j7418q4096o5157M719J2862
$$ 9778 -7086 4707 80636 146197 129886 80016 81865 117179 99761 15665 -49492 -44773 -31911
390c1911m7040o5731N39O0045L3495k0587j062O8866P9562J2597k7247J2080N4435
$$ -31911 -78951 -144682 -144143 -84098 -50603 -71190 -72252 -3386 76176 88773 61526 73606 128041
403A28041J5003n8801o1300j927J3970m3565q0581l2266L3240K0853l3355k5077
$$ 128041 143044 84243 22943 21016 34986 -8579 -89160 -121426 -88186 -67333 -100688 -125765
415a25765M5681P7788K7710j8072J5229O8496M5482k7142m6105L093K7093k6700
$$ -125765 -80084 -2296 25414 7342 22571 91067 136549 109407 63302 66395 93488 66788
427F6788p8120m9132J1170R984m3394n0050J3774N8952K6113j8168O602O5770
$$ 66788 -11332 -60464 -49294 -39310 -82704 -132754 -118980 -60028 -33915 -52083 -45481 20289
439B0289O4453J142k8485J3526M4250J082o0251n2156L167R837m4581o8836j5401
$$ 20289 84742 85884 57399 70925 115175 116257 56006 3850 7017 16854 -27727 -96563 -111964
452a11964L6712J7524k9007j3696N1076O7905J7043j7935J7724N9070K9198l4742
$$ -111964 -75252 -57728 -86735 -100431 -49355 18550 35593 17658 35382 94452 123650 88908
464H8908m2363O016J8806l2305p0625l5917J6989P570l9767l6348K3840N6395
$$ 88908 46545 52561 71367 39062 -31563 -67480 -50491 -42921 -82688 -119036 -95196 -38801
476c8801J9708j6813J2253O2202N0145r310k7159J3698L5364r708n9976m2439
$$ -38801 -19093 -35906 -23653 38549 88694 79384 52225 65923 101287 91579 31603 -10836
488a0836P289O218m3319n7008l334L8996J3968k5781l538N2092N8618P778j7405
$$ -10836 -3547 2671 -40648 -97656 -100990 -61994 -48026 -73807 -77345 -25253 33365 41143 23738
501B3738J8930N0454J6517l9450l7455P387J3264l6093o3260k4050K0578N582
$$ 23738 42668 93122 109639 70189 32734 40121 53385 17292 -45968 -70018 -49440 -43858
513d3858l5429k5222L1461N2649J3275j5073J5986N7038L7799j7184k6572J4572
$$ -43858 -79287 -104509 -73048 -20399 -7124 -22197 -6211 50827 88626 71442 44870 59442
525E9442K7512j7876n7897l3740J0924L556m2101m5109O939L9763J0551k2359
$$ 59442 86954 69078 11181 -22559 -11635 -8079 -50180 -95289 -88350 -48587 -38036 -60395
537f0395L736N2744M8891n30j6640J9675M2133M340m2728l2086R406P362l8458
$$ -60395 -56659 -3915 44976 44446 27806 47481 89614 93954 51226 19140 28546 35908 -2550
550b550n4726j3074K3701L958l2019j4267L7094M8111P680j4434J9397N1884K5848
$$ -2550 -57276 -70350 -46649 -42691 -74710 -88977 -51883 -3772 3908 -10526 8871 60755 86603
563H6603k3368k4822J4160K1248k5243n5033k5582J3676P01l9502l4893J6011
$$ 86603 63235 38413 52573 73821 48578 -6455 -32037 -18361 -17660 -57162 -92055 -76044
575g6044L9170P452j9113J0522N1436L9917o979j6203K0164L4564n257m3655k7658
$$ -76044 -36874 -29422 -48535 -38013 13423 53340 46361 30158 50322 84886 79629 35974 8316
588H316J0608K800l9724m6983m041K5612K113k7520n752M0739M3069K571j2613
$$ 8316 18924 21724 -18000 -64983 -69024 -43412 -41299 -68819 -74571 -33832 9237 11808 -805
601h05K1617M5899J6365k8535k2341J4401J3939l0082n0870j7997J5802k097l6803
$$ -805 20812 66711 83076 54541 32200 46601 60540 30458 -20412 -38409 -22607 -24704 -61507
614f1507k4702K3210L7491L742j5698J5615M8873L0799j2528j4169J9632K7772
$$ -61507 -86209 -62999 -25508 -21766 -37464 -21849 27024 57823 45295 31126 50758 78530
626G8530j2896m4325k1997J1547j249l9494l8929M101K6477r6k3792J907M2201
$$ 78530 65634 21309 -688 10859 9610 -29884 -68813 -64712 -38235 -38331 -62123 -60216 -18015
639a8015L7158j746j1355K3169M0236O328l1190j9379J4117Q738l3450m6148j0038
$$ -18015 19143 17397 6042 29211 69447 75775 44585 25206 39323 48061 14611 -31537 -41575
652d1575J7015m045l3496j5554K8208L4076L57j3004J9340M5413K2087j6478j2909
$$ -41575 -24560 -28605 -62101 -77655 -49447 -15371 -15014 -28018 -8678 36735 58822 42344 29435
665B9435K0115K0342j9437m1915j6286J2238m448l7992l0198J0729K5895k153
$$ 29435 49550 69892 50455 8540 -7746 4492 44 -37948 -68146 -57417 -31522 -33675
677c3675k0131P690M2511L0333o617r278K3456L3673j731l2317j5790J4287K763
$$ -33675 -53806 -46116 -3605 26728 20111 10833 34289 67962 66231 33914 18124 32411 35174
690C5174l4886l9394k724J7957o528k9072o718L0567K9751k791j0002K1905M0377
$$ 35174 288 -39106 -41830 -23873 -30401 -59473 -66191 -35624 -5873 -8664 -18666 3239 43616
703D3616J3073j9941j0171J8747J4100k4419l8495j0039J2466o784l5058k1704
$$ 43616 56689 36748 26577 45324 59424 35005 -3490 -13529 -1063 -7847 -42905 -64609
715f4609J6662K4259m351j6338J3475L9895K3101j0631p557K3619K6033r170l2348
$$ -64609 -47947 -23688 -28039 -44377 -30902 8993 32094 21463 13906 37525 63558 54388 22040
728B2040j1084J3386k060l4298l1170L442J7521p826k4465R14L2198K4759o052
$$ 22040 10956 24342 22282 -12016 -43186 -39744 -22223 -30049 -54514 -53600 -21402 3357 -2695
741b695o916K2962L3917N196k1902p894J7438P012k7023l3589m829J2832r059
$$ -2695 -9611 13351 47268 52464 30562 22668 40106 47118 20095 -13494 -18323 -5491 -14550
754a4550l1026j3422K0727K1904n835j2285J6972L7155J5551j2576n567K1826
$$ -14550 -45576 -58998 -38271 -16367 -22202 -34487 -17515 19640 35191 22615 17048 38874
766C8874J8878j5250l0854p102J1957n702l2962k3801Q915J6316q549j9259P413
$$ 38874 57752 42502 11648 4546 16503 10801 -22161 -45962 -37047 -20731 -29280 -48539 -41126
779d1126L1803J9868p733m683K3531K7741j928k2284o093J5367J448k8282k9023
$$ -41126 -9323 10545 2812 -1871 21660 49401 47473 25189 19096 34463 35911 7629 -21394
792b1394j04J1691j0412k6654o018K3099J9594p266p881K0024L2979R936j4775
$$ -21394 -21498 -9807 -20219 -46873 -52891 -29792 -10198 -17464 -25345 -5321 27658 37594 22819
805B2819l289J9951J1951j9703k8189m285J0741r522l0735j6688J2954J4617q788
$$ 22819 19530 39481 51432 31729 3540 -745 9996 474 -30261 -46949 -33995 -19378 -28166
818b8166j4526J2249L1321J4883q753k021K3181K1766p673k2594l249J3010l558
$$ -28166 -42692 -30443 878 15761 7008 4987 28168 49934 42261 19667 16418 29428 25870
831B5870k9329k3805M106J0719j1732k2592M23K4610J6574p734m236K2057K8541
$$ 25870 -3459 -27264 -23158 -12439 -24171 -46763 -46340 -21730 -5156 -12890 -17126 4931 33472
844C3472L782j5459j608J8091N943k2539k5035o04Q436j1873k7668j0193J5659
$$ 33472 37254 21795 20187 38278 44221 21682 -3353 -3957 4479 -7394 -35062 -45255 -29596
857b9596J2748r480j0079J6107K9363J0089r632N17K2191J5550j2207k0962j810
$$ -29596 -16848 -26328 -36407 -20300 9063 19152 9520 10037 32228 47778 35571 14609 12799
870A2799J1254o989k8702j8780P788Q855j2187j8744O098K5338J2140p623j429
$$ 12799 24053 17064 -11638 -30418 -22630 -13775 -25962 -44706 -38608 -13270 -1130 -8753 -10182
883a0182K2915K3895j738j5816P59J5919K02k3966k1034J801P283j3362k3814
$$ -10182 12733 36628 34890 19074 19833 35752 35954 11988 -9046 -7245 38 -13324 -37138
896c7138m483J7511J0497r379n759J8095K6286N552j0413K343K0428J0130j5578
$$ -37138 -41621 -24110 -13613 -22992 -28751 -10656 15630 21182 10769 13112 33540 43670 28092
909B8092j9700Q19R187r960k6765j3372J0262P708j2766j3597J0291K4183R082
$$ 28092 8392 9211 18398 8438 -18327 -31699 -21437 -13729 -26495 -40092 -29801 -5618 3464
922C464q384J237K2191J8442o162j4862K297J3028l641k4404j7004M965N713j4293
$$ 3464 -4920 -3683 18508 36950 30788 15926 18223 31251 27610 3206 -13798 -8833 -3120 -17413
936a7413k0122Q59J8504Q088q965k333J9541K2507J185j0505L599J7716N160j8138
$$ -17413 -37535 -36676 -18172 -10084 -19049 -21382 -1841 20666 21851 11346 14945 32661 37821 19683
950A9683j6611K448O942j2112k3982p647J1846N961j1543r371J3485K2600N700
$$ 19683 3072 5520 12462 350 -23632 -31279 -19433 -13472 -25015 -34386 -20901 1699 7399
963G399q621L517K0881J3145r792j4185L705J0194p488k3398j2960O773M256j3849
$$ 7399 -1222 2295 23176 36321 26529 12344 16049 26243 18755 -4643 -17603 -10830 -6574 -20423
977b0423j5964N911J8030O466q547N83K0105J8528k417j0787M773J4974N87j9557
$$ -20423 -36387 -30476 -12446 -5980 -14527 -13944 6161 24689 22272 11485 16258 31232 31819 12262
991A2262j4413L874M988j3230k0779l342J3442M441j0722m722J5993J9758K553
$$ 12262 -2151 1723 6711 -6519 -27298 -30640 -17198 -12757 -23479 -28201 -12208 7550 10103
1004A0103p515N391J8652P929j2462j2322L978P404j0417k1885q730P824K422
$$ 10103 2588 7979 26631 34560 22098 9776 13754 21158 10741 -11144 -19874 -12050 -9628
1017i628j3726j0648Q707J7937M063p235L484J9299J4465n528r484N538J2050
$$ -9628 -23354 -34002 -25295 -7358 -3295 -10530 -7046 12253 26718 21190 11706 17244 29294
1030B9294l907j9270j1695M625K681j4221j6631R63J3088L280r485p43J6905J7013
$$ 29294 25387 6117 -5578 -953 1728 -12493 -29124 -28161 -15073 -11793 -21278 -22021 -5116 11897
1044A1897M2o540O554J6114L487j3777j0649M341M625j2560j9185n731Q534J565
$$ 11897 11939 5399 11953 28067 31554 17777 7128 11469 16094 3534 -15651 -21382 -12848 -11283
1058a1283j2947o394J1166J6344J826o088O025J8141J0437p424q303N729R087
$$ -11283 -24230 -30624 -19458 -3114 -1288 -7376 -1351 16790 27227 19803 11500 17229 26316
1071B6316o919j8808q849N576M59j4382j2835M094J2893J900p761K126J7459J3760
$$ 26316 19397 589 -8260 -2684 -2225 -16607 -29442 -25348 -12455 -10555 -18316 -16190 1269 15029
1085A5029k373n524P512J3583o51j4160q642M393K091j3186j7065k166Q741k01
$$ 15029 12656 7132 14644 28227 27576 13416 4774 9167 11258 -1928 -18993 -21159 -12418 -12619
1099a2619j0728l618J2962J4407P37m939P076J6597O718q654p545O042O050r485
$$ -12619 -23347 -26965 -14003 404 1141 -3798 3278 19875 26593 17939 10394 16436 22486 13001
1113A3001j6989o119N038m66j3430r686P114J2238M01o370M723J6926J1015m262
$$ 13001 -3988 -10107 -5069 -5535 -18965 -28651 -21537 -9299 -8898 -15268 -10545 6381 17396 13134
1127A3134m661P712J0579l822j4268p261M487K49j3461j4200R34Q745o65r514
$$ 13134 8473 16185 26764 22942 8674 1413 5900 6149 -7312 -21512 -20578 -11833 -12498 -22012
1141b2012l22J4465J2211q05m056P915J4647L147r880o276N368L717j0954j6060
$$ -22012 -22334 -7869 4342 3537 -519 7396 22043 25190 15310 9034 14402 18119 7165 -8895
1155h895l473N670j549j2061o038Q756J1837p33m877O633J5665Q005n604l910
$$ -8895 -12368 -6698 -8247 -20308 -26346 -17590 -5753 -6486 -11363 -4730 10935 18940 13336 9426
1169I426P495P788o180j4498n376M433j630j3395j1037L427Q867j377p542K089
$$ 9426 16921 24709 18529 4031 -1345 3088 1458 -11937 -22974 -19547 -10680 -12057 -19599 -17510
1183a7510J5089J0425k439k939Q577J2106Mj1024m920N198P60j1974j3584j461
$$ -17510 -2421 8004 5565 2626 11203 23309 23313 12289 7369 12567 13327 1353 -12231 -13692
1197a3692N546k354j0816k690J0554J0273j021l563Q159J4591M627o158l301O917
$$ -13692 -8146 -10500 -21316 -24006 -13452 -3179 -4200 -7763 396 14987 19614 13456 10155 17072
1211A7072N020q404j3914l675M042k775j2521q238N409Q118j458n883M718J4347
$$ 17072 22092 13688 -226 -3901 141 -2634 -15155 -23393 -17984 -9866 -11324 -17207 -12489 1858
1225A858Q659l172k050Q594R657k717j1186l831M174p59j2758j1697Q51N578l418
$$ 1858 10517 7345 5295 13889 23546 20829 9643 5812 9986 9227 -3531 -15228 -14377 -8799 -12217
1240a2217q726l19J1706Q876j550k058R008J2583K640p123k656O487K427r834
$$ -12217 -20943 -21262 -9556 -680 -2230 -4288 4720 17303 19943 12820 10164 16651 19078 9244
1254I244j2918k537M110l985j1912m948O753P836k153m026O745J3738O469l561
$$ 9244 -3674 -6211 -2101 -6086 -17998 -22946 -16193 -8357 -10510 -14536 -7791 5947 12416 8855
1268H855j446Q510P320n216j1029k709L634l297j2114r542K611M803l370p326
$$ 8855 7409 15919 23239 18023 6994 4285 7919 4622 -7492 -17034 -14423 -9620 -12990 -20316
1282b0316K723J1773P423j872q42R576J1226j91p721j699N215M55j0892j1288
$$ -20316 -17593 -5820 1603 -269 -1111 8465 19691 19500 11779 10080 15295 15750 4858 -6430
1296f430p73K963m352j0441k686P994O813k018k346P992J2793L986l933l84Q045
$$ -6430 -7203 -4240 -8592 -19033 -21719 -13725 -6912 -8930 -11276 -3284 9509 13495 9562 9178 17223
1311A7223M319p044j0392j811K860m068j2152p029L910M410l600n308M848J1553
$$ 17223 21542 14498 4106 2295 5155 1087 -11065 -18094 -14184 -9774 -13374 -18682 -13834 -2281
1325b281O270k461P06R318Q489k340p454j188M486j867j1465r447K92L111m938
$$ -2281 3989 1528 2234 11552 20041 17701 10247 9059 13545 11678 213 -9234 -8942 -5831 -10769
1340a0769q847l06Q939O196k325o18Q930J1370K078m587k0P088K109q437r656
$$ -10769 -19616 -19922 -10983 -4787 -7112 -7730 1200 12570 14648 10061 10041 17129 19238 10801 1145
1355A145j301K389m978j1414m437M845M697l806l435O508J1531M575k349J195
$$ 1145 -156 2233 -2745 -14159 -18596 -13751 -9054 -12860 -16295 -9787 1744 6319 3970 5165
1369E165R169O037m067p789q91L418l854j0846q006J599K202m874o787K188R480
$$ 5165 14334 20371 16304 8515 7624 11042 7188 -3658 -11664 -10065 -7863 -12737 -19524 -17336 -7856
1384g856N569k329J007R142R565N63n032M17N580l40r473q942l95J539o073r622
$$ -7856 -2287 -4616 -3609 5533 15098 15661 10629 11046 16626 16286 6813 -2129 -2524 -985 -7058 -16680
1400a6680k339O347L928l070j308P544J1099L182k492J566Q223M215n850q204
$$ -16680 -19019 -12672 -8744 -11814 -13122 -5578 5521 8703 6211 7777 16000 20215 14365 6161
1414F161j70K140m739j1006o169K652J996m840m951M411R995M271j929J800R742
$$ 6161 5991 8131 3392 -7614 -13783 -11131 -9135 -13975 -18926 -14515 -4520 -249 -2178 -378 9364
1429I364P822j785m963O05M778k897j0062p628L83R59o444q417j39P285L550k724
$$ 9364 17186 15401 10438 11043 15821 12924 2862 -4766 -4383 -3424 -9868 -18285 -18424 -11139 -7589 -10313
1445a0313L92Q737J0083J739k932K362O958J866p058p290l68J410n970j0796m206
$$ -10313 -9921 -1184 8899 10638 7706 10068 17026 18892 11834 4544 4176 5586 -384 -11180 -15386
1460a5386L653J727m077l354N937R968L501j856K596R400O042l396n461J251L255
$$ -15386 -11733 -10006 -14083 -17437 -11500 -1532 1969 113 2709 12109 18151 14755 9294 10545 13800
1475A3800m397r994o494R13O65o163o934J704P776K694k037J531R376Q784N25
$$ 13800 9403 -591 -7085 -6172 -5507 -11670 -18604 -16900 -9124 -6430 -8467 -6936 2440 11224 11749
1490A1749l105K266O120Q4q088o967J53M93o486r410k410M236J696l939j575P565
$$ 11749 8644 10910 17030 17114 9026 2059 2212 2705 -3781 -13191 -15601 -11365 -9669 -13608 -15183 -7618
1506g618R051K381j666L296Q515M111m656n245J160K050n061j0430n046J800J83
$$ -7618 1433 3814 2148 5444 13959 18070 13414 8169 9329 11379 6318 -4112 -9158 -7358 -7175
1521g175o096m906L576P897K439k046K887R535P167r45l256K374M900j926q634
$$ -7175 -13271 -18177 -14601 -6704 -4265 -6311 -3424 6111 13278 12333 9077 11451 16351 14425 5791
1536E791o178N32j38o782q367j36M648J639l472L23Q191Q241J278j361L573P408
$$ 5791 -387 145 7 -6775 -15142 -15278 -10630 -8991 -12463 -12140 -3949 4292 5570 4209 7782 15190
1552A5190J983n749m873R66J004o528r169l549K523j26n566k956M978P589K327
$$ 15190 17173 11424 6551 7517 8521 1993 -7176 -10725 -8202 -8328 -13894 -16850 -11872 -4283 -1956
1567a956j747L843Q863N423k409l206K220L932l475r336m912Q69r45o978o606
$$ -1956 -3703 140 9003 14426 12017 8811 11031 14963 11488 2152 -2760 -1891 -2836 -9814 -16420
1582a6420J463N819Q43k482J963Q482P355K33j601L882O583l31o363m806Q11J9
$$ -16420 -14957 -9138 -8295 -10777 -8814 -332 7023 7256 5655 9537 16120 15789 9426 4620 5431 5450
1598E450o871q550j757K608Q3m937j301O314P455J708j362M371Q252L647l137
$$ 5450 -1421 -9971 -11728 -9120 -9037 -13974 -15275 -8961 -1506 202 -1160 3211 11463 15110 11973
1613A1973l209J990J946m926q885l949J256j483o729m845L112N826J111j982L472
$$ 11973 8764 10754 12700 7774 -1111 -5060 -3804 -5287 -12016 -16861 -13749 -7923 -6812 -8794 -5322
1628e322Q596N895m12j425L672M741j596p354m273J084j314p129p283o03L048
$$ -5322 3274 9169 8757 7332 11004 15745 14149 6795 2522 3606 2292 -4837 -12120 -12723 -9675
1643i675k41l790P07P281O670J010o65M801P289K093m284l203K101J73n976q277
$$ -9675 -9916 -13706 -12999 -5718 952 1962 1297 6098 13387 15480 11196 7993 10094 10267 4291 -3986
1659c986k843J126j703n919l074M510N460Q26q49M165Q407M798j313j241L513
$$ -3986 -6829 -5703 -7406 -13325 -16399 -11889 -6429 -5603 -6452 -2287 6120 10918 9605 8364 11877
1674A1877L031l167p181l548N17k062o946n877Q74L250k15k711J615P836N846
$$ 11877 14908 11741 4560 1012 1529 -533 -7479 -13356 -12482 -9232 -9447 -12158 -10543 -2707 3139
1689C139M74m19M876O125K61m838k679J458p75o742p458j627J762k088m820j260
$$ 3139 3613 3194 8070 14195 14456 9618 6939 8397 7622 880 -6578 -8205 -6443 -8531 -13351 -14611
1705a4611N141N103N92m64N063P846L032k213j062L090J782m534p031k937P03
$$ -14611 -9470 -4367 -3775 -4239 824 8670 11702 9489 8427 11517 13299 8765 1734 -1203 -500
1720e00k489o449m549J942L772j79j953L056P811M968m31NM645M603j099n474
$$ -500 -2989 -9438 -13987 -12045 -8273 -8452 -10405 -7349 462 5430 4999 5004 9649 14252 13153 7679
1736G679k538J174j608o766o154n63J479j246m702L94N946M766L42J81N117O547
$$ 7679 5141 6315 4707 -2059 -8213 -8776 -7297 -8543 -13245 -12851 -6905 -2139 -1797 -1616 3501 10048
1752A0048J832k846j313K960O28n454o721j962O84k569n770l167L608L239Lj392
$$ 10048 11880 9034 7721 10681 11309 5855 -866 -2828 -2144 -4713 -10483 -13650 -10042 -6803 -6800 -8192
1768h192L954P238L709p42K76M154L155k708n485k091Q95k040o798n223Q96J640
$$ -8192 -4238 3000 6709 5967 6243 10397 13552 10844 5359 3268 4163 2123 -4675 -9898 -9002 -7362
1784g362j613k993J608O099M378J6L98N353N648J36l426r73K122o19n829n905
$$ -7362 -8975 -11968 -10360 -4261 117 133 531 5884 11532 11668 8242 7269 9391 8772 2943 -2962
1800b962j431O91k722n066j771M545L467l50m42M641O758K622j369J30L902J460
$$ -2962 -4393 -3702 -6424 -11490 -13261 -8716 -5249 -5599 -6041 -1400 5358 7980 6611 6741 10643 12103
1816A2103l207n595j428Q07k961o521l883J657J803j385k255K794O326L687l81
$$ 12103 8896 3301 1873 2680 -281 -6802 -10685 -9028 -7225 -8610 -10865 -8071 -1745 1942 1561
1831A561Q21M822M586q81l875n89J238j379n730n370o31Q87k718m312K51M223
$$ 1561 2382 7204 11790 10909 7034 6445 7683 6304 574 -4796 -5427 -4540 -7258 -11570 -11319 -7096
1847g096L209j59K19N042N836J352j895L06L516N63m422m731j294L91l327n637
$$ -7096 -3887 -4046 -3827 1215 7051 8403 6508 6814 10330 10893 6471 1740 446 837 -2490 -8127
1863h127k432K197J720j523p49L203O050L073o80J172M499L526k141l751r12J258
$$ -8127 -10559 -8362 -6642 -8165 -8914 -5711 339 3412 2732 3904 8403 11929 9788 6037 5125 6383
$$ [...]
8191B31
##END NTUPLES=NMR FID
##END=
