##TITLE=1H_IG-MNbenzal
 200.13MHz, CDCl3
 8 sc
 
 19ns.26.2.2025
##JCAMPDX= 6.0         $$ Bruker NMR JCAMP-DX V2.0
##DATA TYPE= NMR FID
##DATA CLASS= NTUPLES
##ORIGIN= UXNMR, Bruker Analytische Messtechnik GmbH
##OWNER= pz
$$ XWIN-NMR		Version 3.5
$$ Wed Feb 26 14:40:51 2025 Russian Standard Time (UT+4h)  new_Human@DPX200
##.OBSERVE FREQUENCY= 200.1313
##.OBSERVE NUCLEUS= ^1H
##.DELAY= (6, 6)
##.ACQUISITION MODE= SIMULTANEOUS
##.ACQUISITION SCHEME= undefined
##.AVERAGES= 8
##.DIGITISER RES= 18
##SPECTROMETER/DATA SYSTEM= spect
##.PULSE SEQUENCE= zg30
##.SOLVENT NAME= CDCl3
##.SHIFT REFERENCE= (INTERNAL, CDCl3, 0, 14.3821)
##AUDIT TRAIL= $$ (NUMBER, WHEN, WHO, WHERE, WHAT)
$$ ##TITLE= Audit trail, XWIN-NMR		Version 3.5
$$ ##JCAMPDX= 5.01
$$ ##ORIGIN= Bruker BioSpin GmbH
$$ ##OWNER= new_Human
$$ C:/Bruker/XWIN-NMR/data/yarkov/nmr/H-C/1/audita.txt
$$ ##AUDIT TRAIL=  $$ (NUMBER, WHEN, WHO, WHERE, WHAT)
(   1,<2025-02-26 14:38:14.43 +0400>,<new_Human>,<DPX200>,
      <created by zg, POWCHK disabled, PULCHK disabled
       configuration hash MD5:
       00 E9 B6 7A A2 85 ED C7 34 08 36 98 17 FE 4E 26
       data hash MD5: 16K
       31 57 99 47 57 9D 1C 88 4F B5 9E 56 34 2E 2F 71>)
$$ ##END=
$$ 
$$ hash MD5
$$ 3C 69 2A EC 1A 3F F3 99 BF 69 7B 68 C6 88 1C 8A
##$RELAX= 
##$RELAX= 
##$RELAX= 
##$RELAX= 
##$RELAX= 
##$RELAX= 
$$ Bruker specific parameters
$$ --------------------------
##$DU= <C:/Bruker/XWIN-NMR>
##$EXPNO= 1
##$NAME= <H-C>
##$PROCNO= 1
##$TYPE= <nmr>
##$USER= <yarkov>
##$AMP= (0..31)
100 100 100 100 100 100 100 100 100 100 100 100 100 100 100 100 100 100 
100 100 100 100 100 100 100 100 100 100 100 100 100 100 
##$AQSEQ= 0
##$AQ_mod= 1
##$AUNM= <au_zg>
##$AUTOPOS= <>
##$BF1= 200.13
##$BF2= 200.13
##$BF3= 200.13
##$BF4= 200.13
##$BF5= 200.13
##$BF6= 200.13
##$BF7= 200.13
##$BF8= 200.13
##$BYTORDA= 1
##$CFDGTYP= 0
##$CFRGTYP= 5
##$CHEMSTR= <none>
##$CNST= (0..31)
1 1 145 1 1 1 1 1 1 1 1 1 1 1 1 1 1 1 1 1 1 1 1 1 1 1 1 1 1 1 1 1 
##$CPDPRG= <>
##$CPDPRG1= <>
##$CPDPRG2= <>
##$CPDPRG3= <>
##$CPDPRG4= <mlev>
##$CPDPRG5= <mlev>
##$CPDPRG6= <mlev>
##$CPDPRG7= <mlev>
##$CPDPRG8= <mlev>
##$CPDPRGB= <>
##$CPDPRGT= <>
##$D= (0..31)
0 0.7 0 0 0 0 0 0 0 0 0 0.03 0 0 0 0 0 0 0 0 0 0 0 0 0 0 0 0 0 0 0 0 
##$DATE= 1740566293
##$DBL= (0..7)
120 120 120 120 120 120 120 120 
##$DBP= (0..7)
150 150 150 150 150 150 150 150 
##$DBP07= 0
##$DBPNAM0= <>
##$DBPNAM1= <>
##$DBPNAM2= <>
##$DBPNAM3= <>
##$DBPNAM4= <>
##$DBPNAM5= <>
##$DBPNAM6= <>
##$DBPNAM7= <>
##$DBPOAL= (0..7)
0.5 0.5 0.5 0.5 0.5 0.5 0.5 0.5 
##$DBPOFFS= (0..7)
0 0 0 0 0 0 0 0 
##$DE= 6
##$DECBNUC= <off>
##$DECIM= 32
##$DECNUC= <off>
##$DECSTAT= 4
##$DIGMOD= 1
##$DIGTYP= 9
##$DL= (0..7)
0 120 120 120 120 120 120 120 
##$DP= (0..7)
150 150 150 150 150 150 150 150 
##$DP07= 0
##$DPNAME0= <>
##$DPNAME1= <>
##$DPNAME2= <>
##$DPNAME3= <>
##$DPNAME4= <>
##$DPNAME5= <>
##$DPNAME6= <>
##$DPNAME7= <>
##$DPOAL= (0..7)
0.5 0.5 0.5 0.5 0.5 0.5 0.5 0.5 
##$DPOFFS= (0..7)
0 0 0 0 0 0 0 0 
##$DQDMODE= 0
##$DR= 18
$$ [...]
##$SUBNAM0= <"">
##$SUBNAM1= <"">
##$SUBNAM2= <"">
##$SUBNAM3= <"">
##$SUBNAM4= <"">
##$SUBNAM5= <"">
##$SUBNAM6= <"">
##$SUBNAM7= <"">
##$SUBNAM8= <"">
##$SUBNAM9= <"">
##$SW= 18.0517328524113
##$SWIBOX= (0..15)
0 0 2 0 0 0 0 0 0 0 0 0 0 0 0 0 
##$SW_h= 3612.71676300578
##$TD= 16384
##$TD0= 1
##$TE= 0
##$TE2= 300
##$TE3= 300
##$TEG= 300
##$TL= (0..7)
0 120 120 120 120 120 120 120 
##$TP= (0..7)
150 150 150 150 150 150 150 150 
##$TP07= 0
##$TPNAME0= <>
##$TPNAME1= <>
##$TPNAME2= <>
##$TPNAME3= <>
##$TPNAME4= <>
##$TPNAME5= <>
##$TPNAME6= <>
##$TPNAME7= <>
##$TPOAL= (0..7)
0.5 0.5 0.5 0.5 0.5 0.5 0.5 0.5 
##$TPOFFS= (0..7)
0 0 0 0 0 0 0 0 
##$TUNHIN= 0
##$TUNHOUT= 0
##$TUNXOUT= 0
##$USERA1= <user>
##$USERA2= <user>
##$USERA3= <user>
##$USERA4= <user>
##$USERA5= <user>
##$V9= 5
##$VALIST= <valist>
##$VCLIST= <CCCCCCCCCCCCCCC>
##$VD= 0
##$VDLIST= <DDDDDDDDDDDDDDD>
##$VPLIST= <PPPPPPPPPPPPPPP>
##$VTLIST= <TTTTTTTTTTTTTTT>
##$WBST= 1024
##$WBSW= 4
##$XGAIN= (0..3)
0 0 0 0 
##$XL= 0
##$YL= 0
##$YMAX_a= 125717
##$YMIN_a= -166267
##$ZGOPTNS= <>
##$ZL1= 120
##$ZL2= 120
##$ZL3= 120
##$ZL4= 120
##$ABSF1= 10
##$ABSF2= 0
##$ABSG= 5
##$ABSL= 3
##$ALPHA= 0
##$AQORDER= 0
##$ASSFAC= 0
##$ASSFACI= 0
##$ASSFACX= 0
##$ASSWID= 0
##$AUNMP= <proc_1d>
##$AZFE= 0.1
##$AZFW= 0.1
##$BCFW= 1
##$BC_mod= 2
##$BYTORDP= 1
##$COROFFS= 0
##$CY= -3
##$DATMOD= 1
##$DC= 2
##$DFILT= <>
##$DTYPP= 0
##$F1P= 0
##$F2P= 0
##$FCOR= 0.5
##$FTSIZE= 0
##$FT_mod= 4
##$GAMMA= 1
##$GB= 0.15
##$INTBC= 1
##$INTSCL= 1
##$ISEN= 128
##$LB= 0.25
##$LEV0= 0
##$LPBIN= 0
##$MAXI= 10000
##$MC2= 0
##$MEAN= 0
##$ME_mod= 0
##$MI= 1.114404
##$NCOEF= 0
##$NC_proc= 0
##$NLEV= 6
##$NOISF1= 3.799351
##$NOISF2= 2.8
##$NSP= 1
##$NTH_PI= 0
##$NZP= 0
##$OFFSET= 14.38212
##$PC= 1
##$PHC0= -1345.634
##$PHC1= 16.79225
##$PH_mod= 1
##$PKNL= yes
##$PPARMOD= 0
##$PSCAL= 0
##$PSIGN= 0
##$REVERSE= no
##$SF= 200.129724274929
##$SI= 16384
##$SIGF1= 3
##$SIGF2= 2
##$SINO= 400
##$SIOLD= 16384
##$SREGLST= <1H.CDCl3>
##$SSB= 0
##$STSI= 0
##$STSR= 0
##$SW_p= 3205.1282051282
##$SYMM= 0
##$S_DEV= 0
##$TDeff= 0
##$TDoff= 0
##$TI= <>
##$TILT= no
##$TM1= 0
##$TM2= 0
##$TOPLEV= 0
##$USERP1= <user>
##$USERP2= <user>
##$USERP3= <user>
##$USERP4= <user>
##$USERP5= <user>
##$WDW= 1
##$XDIM= 8192
##$YMAX_p= 0
##$YMIN_p= 0
$$ End of Bruker specific parameters
$$ ---------------------------------
##NTUPLES= NMR FID
##VAR_NAME=  TIME,          FID/REAL,        FID/IMAG
##SYMBOL=    X,             R,               I
##VAR_TYPE=  INDEPENDENT,   DEPENDENT,       DEPENDENT
##VAR_FORM=  AFFN,          ASDF,            ASDF
##VAR_DIM=   8192,          8192,            8192
##UNITS=     SECONDS,       ARBITRARY UNITS, ARBITRARY UNITS
##FACTOR=    0.0002768,     1,               1
##FIRST=     0,             0,               0
##LAST=      2.2672688,     0,               0
##MIN=       0,             -166267,         0
##MAX=       2.2672688,     125717,          0
$$ Real data points
##PAGE= N=1
##DATA TABLE= (X++(R..R)), XYDATA
$$ [...]
529h887M666N153r54l896J038P645O548j686p540n299M34J094k848l797K114Q181
545A966O238k269p451l583L227M598J44k449Q50M189P54o926r478k671O159P967
561A265L148l58J521L644k89p457r156k774M697N214J60k223J401N243L008l212
577C832n335q64L999K275l399n143k99M741L093k523m312K91M870L296j968l485
593i31Q10M322J315m931o577j291M093L512p51j494K631N361J810m444n975j162
609c702L108J534l116l384J460N131K982k031k896J275L840N91m719m980K50M407
625b50K612j853k776J144L499M38l952l251K163N628K539l026m317r04J779l44
641h71l321j514L700O438K477l024m246o15J953m72l496k090K600M805J333l086
$$ y = [-8887, -4221, 932, -22, -3918, -2880, 4765, 11313, 9627, 2087, -3212, -2778, -1684, -4532, -8329, -6215, 1966, 8204, 5935, -1516, -5099, -1872, 2726, 2870, 421, 1271, 5460, 6214, -712, -10190, -12861, -6702, 1265, 4413, 4055, 5576, 9220, 8931, 1474, -7682, -10456, -5759, -545, -385, -2608, -1207, 4036, 7044, 3832, -1503, -2367, 1632, 3907, 508, -4635, -4934, -193, 2900, 377, -3935, -3644, 1226, 4522, 2554, -931, -121, 4201, 5516, 585, -5992, -7283, -3190, 322, -429, -1923, 708, 6069, 7879, 3435, -2540, -3702, -594, 940, -2176, -5560, -4100, 1031, 4013, 1982, -914, 361, 4201, 4792, 73, -4907, -4657, -250, 2362, 509, -2267, -1123, 2376, 2814, -1138, -4389, -2226, 3402, 5941, 2915, -1402, -2306, -527, -871, -4192, -5706, -2006, 4432, 6909, 3885, -361, -976, 977, 505, -2991, -5081, -2481, 2324, 3657, 571]
657E71k937J336L394N51l317k595J549L505L94l219k433J901L556K64l451k507
673c438J922L877R08k810k192J488K436p84l902k149K449M175J189k493j827J582
689D31K259q40l671j868K228L504K19k904j731J981K846l20l023j783J959K753
705B040m81k963j283K310L092k23l272j861J752K548k71k576r14K541K628q36
721B231l541j754J908K570j93k325o55K279K329j193l242j248K155K555l53k514
737i91p73K110J996r65k850q62K228K170r01k749p26K334K218q31k492p27K038
754B27J800j202k625m74K514K169q44k604o34J854J568j157k353j65K404J772
770B250j185k587l51K068J578r90k148q3K101J456j385k420j66K309J603j123
$$ y = [571, -2366, -1030, 2364, 2915, -402, -2997, -1448, 2057, 2451, -768, -3201, -1300, 2256, 2520, -931, -3438, -1516, 2361, 3269, 459, -1733, -245, 2191, 1407, -2495, -4644, -2195, 1980, 3169, 676, -1151, 431, 2690, 1850, -1821, -3689, -1461, 2043, 2262, -642, -2373, -392, 2454, 2134, -889, -2672, -713, 2040, 1559, -1404, -2687, -377, 2715, 2492, -780, -2641, -889, 1659, 1388, -1188, -2102, 439, 3067, 2231, -1310, -3064, -1156, 1414, 1221, -1104, -1759, 520, 2849, 1656, -1586, -2834, -679, 1876, 1523, -991, -1764, 346, 2342, 1377, -1473, -2335, -107, 2063, 1162, -1587, -2313, 21, 2239, 1408, -1084, -1811, 227, 2027, 825, -1800, -2274, 240, 2409, 1565, -1039, -1673, 181, 1749, 592, -1761, -1926, 478, 2250, 1065, -1522, -1873, 195, 1773, 783, -1365, -1448, 653, 2109, 724, -1696, -1862, 447, 2050, 927]
786I27k239j50J977J201j322k141P8K291J366j254k221o4K030J248j270j869K84
803a128K139J011j467k218M4K058R96j293j644M34K100J034j540j881O8J875P50
820A338j532j684M75K280J024j335j706M44J835N43j640j863M34J893Q15j432
836a11j463O18J987O57j589j431O11J831N35j549j613L94J710M37j513j219R22
853g86K099O66j428j384M92J399m1j884j416P73J914P15j054r56J007J680J18
870A914j865j518M89J516J43j475r75J008J878K06j460r45R73J547M9j544j261
887a320O94J259k46j555q61J172J995M60j173p09Q69J090n16k015j160P22J423
904A29N4j134k82J359J680J6j456r40N89R35o27j645o98J138J588Q4j076m31J072
$$ y = [927, -1312, -1462, 515, 1716, 394, -1747, -1669, 622, 1988, 734, -1487, -1551, 479, 1727, 457, -1412, -1128, 1011, 2022, 555, -1663, -1619, 439, 1435, 142, -1502, -1068, 1032, 2066, 526, -1355, -1287, 588, 1338, -194, -1878, -1403, 877, 1901, 566, -1140, -696, 1139, 1682, 42, -1821, -1387, 506, 1321, -111, -1574, -956, 1031, 1688, 99, -1332, -721, 1110, 1645, 96, -1517, -1123, 587, 1024, -489, -1708, -786, 1313, 1979, 551, -833, -341, 1058, 1017, -867, -2283, -1510, 404, 1119, 65, -891, 116, 1796, 1914, 49, -1469, -980, 536, 679, -796, -1771, -763, 1115, 1321, -139, -1084, -111, 1436, 1485, -59, -1320, -626, 633, 387, -1168, -2029, -857, 1138, 1598, 425, -284, 585, 1675, 1159, -856, -2016, -1294, 129, 183, -951, -1233, 126, 1806, 1822, 366, -574, 15, 950, 323, -1322, -2020, -882, 706, 790, -286, -717, 355]
923C55J254m76j415o28R56J030n74j666p44R39J263N4p19J33J406J113o08j882
941b09j101M69P02m78r42R3J610J458k75j207m35Q97P14p79j439n37R61Q58m33
960g3j126J09J390J178l74j098k58Q93N20q46j565l54R30Q05l52p16M17J376R30
979A786m78j234l93O15K73r72j152K0J175R26k03p02K66J183N14q04j379l57O99
998b17L80p07q06M20J248P98n47q83J16Q40N01p11r61n9O29J26q28q59L55J388
1018B23R69k74o40P8N85j36j146j089J87R65O75l78n58L78R69K48p49p40J62Q43
1038E72J02r00q74J49Q86L91m85l89M99R99K15p67q96J82O54j6p92o08L69R21
1058B12L85n69l09M30P77k9q34p42J94N93P1o35l87N00Q85K47o44m35L51O47j22
$$ y = [355, 1609, 1133, -282, -910, 46, 1076, 502, -1164, -1908, -969, 294, 348, -371, -238, 1168, 2281, 1673, -209, -1310, -841, -139, -617, -1559, -1466, 144, 1602, 1327, 120, -315, 582, 1296, 517, -922, -1459, -498, 360, -73, -1199, -1090, 300, 1478, 1104, 6, -252, 641, 1161, 315, -1250, -1604, -674, 131, -221, -937, -520, 856, 1786, 1308, 74, -319, 296, 569, -403, -1555, -1535, -360, 566, 363, -339, -73, 1110, 1624, 820, -559, -916, -217, 163, -544, -1350, -930, 318, 1116, 569, -314, -198, 642, 1143, 432, -529, -588, 41, 167, -661, -1520, -1165, 223, 1192, 918, 278, 356, 941, 805, -341, -1430, -1243, -278, 397, 19, -539, -161, 808, 1056, 307, -433, -271, 572, 674, -226, -1100, -951, -65, 326, -159, -548, -49, 950, 1165, 398, -498, -316, 338, 322, -470, -1078, -709, 212, 597, 28, -281, 149, 926, 897, 63, -679, -485, 108, 179, -456, -843, -343, 542, 789, 145, -290, 61, 708, 586]
1079E86q56o22L26P77J13o18l24M43P52M0o73m07L86O96lp81n09K90N66j4n17
1100c49k03O18Q18k7q34m97K62M46o7o34j74N34O74k6p45l02M59N96j9o82l02
1121d54M28M04j60o51k69N92O10j13n92j73L76N38k85n55k07M88M67j69p00l5
1141d60M28N29j54n93j67M74L62k08o63l9M69N23j85o13j55M96M88k95m81j09
1161c53M92L08k50n99qM75M15k76m81j05M36L37l24m24k4N31L38k75n16n9M45
1182H3L36l11l55n4N21K10l00m59p3N29K30k49m21K0M12K08k85m38J19L94K38
1203C55l02l64P1M75J45k53m10J4M28J44k89m04J17M88J47l05l68O6M30K27l70
1224D2l17M3M50J41l45l39O5M52K26l40l54J27L89N9l10l81J61L96J64l11k99
$$ y = [586, -270, -892, -566, 211, 324, -294, -618, -175, 577, 617, -56, -463, -77, 619, 616, -165, -674, -384, 182, 168, -349, -552, 66, 884, 857, 23, -474, -212, 234, 167, -467, -641, -107, 567, 541, -204, -506, -47, 549, 530, -152, -454, -26, 378, 218, -433, -702, -110, 500, 387, -205, -378, -2, 536, 251, -304, -511, -23, 444, 275, -425, -460, -32, 497, 343, -250, -417, 57, 419, 211, -452, -491, -22, 501, 316, -297, -452, 44, 532, 237, -244, -353, 139, 447, 197, -402, -410, 65, 480, 204, -277, -382, 54, 391, 67, -357, -381, 150, 488, 213, -303, -362, 83, 419, 108, -247, -301, 220, 430, 130, -329, -402, 127, 357, 108, -313, -293, 119, 327, 42, -396, -277, 117, 355, 53, -311, -240, 235, 380, 127, -283, -269, 159, 303, 14, -390, -273, 215, 362, 57, -311, -245, 185, 412, 42, -275, -232, 218, 359, 14, -325, -260, 192, 418, 78, -276, -149, 240, 299, -11, -392, -231, 165, 329, 18, -281]
1245b81J46L21R2l41k47J34M22J20m06l15K21L37j4k50k70K53L88k9k83l14J17
1266a99L00O0k28j82J98L86m5l68k14J63L10Kk49j98K29L13Nm36j80K24L29Mk95
1289g1j84K04K73j20k79j62L10L13l3j99k30J39K27j07l15j19K74L42j23j94j71
1310b25K61J80j22j83q7J48K41m2l17j08J29L00J6k83k6K81J64j02l33j75J65
1331a18J68l4k39lK87K02p3k45k7J20J61j27k02p8J63K15j51k88O1K66K37m1k17
1354C7r5J48Q3k15j96q5K65K89j53j38p4K33J88j42k47p5L12R0k48k30n0J88K14
1377I9o4j09K4L86L0k39l51k5K04J52r6j50NJ96J42n5k24N6J36R3p9l24k1J32
1401h2J13q6j75P2K99J18p4k45M8J63lk24j37p8K79Q4j46j19J41K25P9j20k90
$$ y = [-281, -135, 186, 278, -63, -310, -176, 246, 366, -40, -355, -134, 203, 189, -61, -331, -78, 310, 281, -2, -316, -199, 101, 161, -67, -249, -51, 335, 290, -78, -292, -129, 181, 183, -66, -264, -35, 278, 283, -153, -333, -109, 220, 224, -71, -255, -51, 222, 102, -177, -339, -29, 284, 251, 52, -178, -39, 188, 81, -234, -353, -79, 263, 140, -54, -225, 36, 216, 94, -89, -176, -28, 213, 171, -146, -254, -125, 175, 191, -92, -118, 163, 327, 225, -108, -283, -118, 50, 16, -223, -226, 61, 263, 190, -55, -82, 38, 199, 72, -130, -208, -45, 170, 19, -269, -208, 58, 295, 254, 37, -58, 90, 173, -42, -238, -323, -58, 231, 78, -60, -134, 99, 287, 145, -102, -177, 135, 225, -23, -253, -303, -115, 99, 35, -74, -50, 336, 366, 127, -224, -249, -45, 107, 11, -139, -134, 62, 204, 149, -75, -19, 117, 210, 131, -193, -214, -82, 31, -55, -230, -158, 141, 259, 185, -60, -12, 151, 148, -76, -213, -291, -12, 72, -74, -193, -52, 173, 252, 132, -158]
1424a58P8J68L8j67j77K0K25Q4q9j38J03L24j5k10j65r5Q4Q3j23r4J67J84J29
1447B56j94j44L0K07L0j48j13oJ53n6j78p8J60K46Q3j52j11M1N9M7k25j70J21
1470a42J98L7p2j91R3J83K0r3n7P2M0m0j38j47J17J94j6j03JR4J72n9j06j47R6
1495FP7n4j38p4Q5J94k3r7n2J67J6N2k75J8J06J17r9j37m4P1J59lj25l1J78M2
1521A36mk68n7Q3J40L2j08m6J01Q0j1j25jJ34N1q8j09q1P1J18k4j31L4J66O9j32
1547C0j28K8P4L8k4o6q4J17O7qj58L5J57Q8r0j54o5J72L1m5j75N9J78M5o8q0j
1574b7M9J08j37l3J5N5l3k2q0M6J56K9j15n5k2J30L0p8r2KJ61m1l9j61N0J20J03
1601A19n6j07K7M3Jrj85J47M9N6o4q3K1N6M3q7j0R7K7l8m9j35N3J14L6p4j3k5
$$ y = [-158, -80, 88, 126, -41, -218, -198, 27, 111, 22, -116, -13, 311, 296, 86, -79, -174, -90, -7, -130, -224, -57, 127, 256, 62, -82, -52, 155, 185, 37, -76, -82, 71, 15, -163, -241, -81, 165, 248, 96, -15, 26, 85, 132, -93, -263, -142, 56, 93, 21, -170, -77, 106, 126, 33, -24, 48, 88, 48, -90, -237, -120, 74, 58, -45, -44, 50, 222, 163, 57, -90, 6, 83, 29, -109, -183, -98, 96, 73, -24, -76, 91, 107, 159, -116, -98, 8, 125, 26, -111, -155, -84, 75, 72, -53, -84, 94, 136, 132, -136, -193, -110, 30, 62, -46, -92, 9, 89, 78, -47, -48, 86, 137, 49, -60, -141, -70, 48, 24, -107, -73, 93, 162, 30, -98, -70, 4, 42, 18, -48, -132, -15, 52, 44, -114, -79, 78, 166, 76, -78, -143, 29, 60, 15, -160, -101, 77, 122, 54, -26, -27, 22, 130, -7, -40, -25, 30, -3, -25, -105, -59, 97, 126, 11, -44, -66, 64, 94, 16, -76, -74, 87, 46, 7, -154, -104, 16, 119, 63, -44, -17, 26, 27, 18, -167, -20, 29, 85, 21, -62, -41, 15, 58, -29, -39, 58, 85, 47, -2, -137, -84, 30, 66, -8, -21, -46]
1629d6R9k0p3n5O3J22O5j62o4O8o0R4j8p5J32J2J8r3j05Q6R6J0n1n5J7R0m9r7
1657e1m2Q9J00J3j19q0P9R6qj31j8L2R8J6j11n5K1J65k7j8j06PJ16n3j01NP9R3
1685H9rp8j18Q2O1k5m7K1J9O4o6p8J8P4Q1m1m6Jm9J07j5n0m3Q8K9m2o4n4M1O2
1715A2L7k1r3O1J01o8j23n0J78K7j0m6J7j9J7J1j15NN4J21j02m3n5Q9N1n5l3K8
1743b4Q6J7p0k1q2R4M4J8j10l3O2P9j23nR0J6L8Lj32L8kM1Jo5qQ6J6r3r5J01N4
1774B1l1R6r3l5O5J7p2j7L6J02n3m1p9j5J38n5K1l3M3L9Rm2j05J6Q5M5o8qk0L9
1804EL6j03O0K0M7j3q6K4r8J04l8N6m9M5j0K5n4J1k2R0k0jq3k2O0j7Jm4J55p8
1834AK3j9K6k5M6K1l0r4M0Q8k0j05N8k0K3K1l6LRL1pn3pOK1j6kJ1J9N3O9j09q
$$ y = [-46, 53, 33, -40, -95, -32, 90, 155, -7, -71, -3, -63, 31, 13, -62, 70, 82, 100, 7, -98, -12, 84, 94, 43, -12, 5, 95, 46, -51, -93, -4, 96, 109, -10, -90, -11, 85, 77, -54, -72, -40, 58, 74, -37, -92, -71, 94, 67, 49, -57, -50, 66, 13, -88, -83, -4, 89, 80, 2, -116, -34, 27, 2, -45, -24, -5, 59, -7, -85, -67, 7, 88, 47, 1, 2, -47, 60, 45, -5, -48, 40, 69, 27, -37, -91, -50, 12, 49, 28, -65, -4, 97, 29, -94, -144, 34, 61, 51, 5, 22, 3, 20, 31, -84, -79, -25, 96, -6, -49, -104, -15, 36, -19, -52, -24, 62, 79, 9, -12, -94, 0, 44, 62, -48, -81, -19, 60, -63, -68, 22, 38, 76, 79, -53, -15, -17, 24, 25, -40, -48, 38, 54, -39, -134, -33, 21, -10, 86, -7, -42, 23, 40, -32, -49, -13, 89, 36, -5, -84, -99, 39, -16, 5, -28, 15, 54, 63, 21, -84, -68, 17, 62, -6, -14, -34, 5, 41, -62, -2, 18, 65, 52, -34, -10, -108, -4, -42, 14, -35, 10, 0, 25, -29, -18, -40, 50, 30, 29, -54, -76, -16, -33, -32, -76, 79, 1, 24, 5, 31, 6, 52, 73, 43, -51, -11, 77, 57, -48, 10, -10, 13, 34, -2, 1, 10, 41, 34, -19, -26, -20, 1, -15, -17, -6, 13, 66, 135, 26, 18]
1867A8k4NJ6lr0J15j3Nq3J2O4J5mn1j3R3K4q9o7j5P9R7o9j9K3L3J8o5l1n4P5j
1899Ak2rkN4Mo3j1M9K4N6l4o7o3N7N9l0J3K0MRp1lj2N1M1j9o7PJ07j31k5R4k2
1932aO0K4o7m9LQ4m9k8mJj2R0l8r4M3O7l7M9p9K1P3m7j1m7R9l0L4o0j0QM5ooJ7
1966D3j6K5n0l0N5q%L5m6j3k0lN1o4lN1K9l6Lo1J7K1k3J04o3J3L6o9L8k6L0K8
1998D8J9Nj07%P6m0l8JJ7JR2q9l7J10n0l0Q2n9J0L6l9o9N0L0M7m8m7j7M2J3Qr
2030Hm6O5M5o6m5P3J3On2lj2l0L0kj3K8N4orr3j0J28l9L2o5n0N9Kk1m3M5N1n4
2063b0M2mkJ2L3m8k7k3N3j4l4J6O3q2O4m2k8M2k8M2k1L9q9P0J5%j0k4k7M3j9o5
2095g3J03l4O4M7j27OL1k7N2k2K2ln2L4r9oO8K2k9J8n5Q1J9n6qM5M6q3k2K1RL7
$$ y = [18, -6, -1, 15, 12, -78, 37, 24, 29, -54, -42, 22, 37, 33, -18, -31, 62, 86, -3, -70, -85, -6, 91, 22, 3, 26, 59, 77, 12, -19, -73, 2, 1, -21, -30, -32, 22, 26, -37, -48, 1, 25, 81, 47, -20, -83, -26, 33, 3, 16, 36, 40, 49, -22, -25, -37, 14, 55, 36, -31, -24, 83, -48, -73, 21, -1, 59, 83, 16, -33, -30, 54, 5, -23, -27, -26, -38, 52, 14, -80, -37, 30, -7, 42, -37, -16, 57, 10, -1, -48, 51, 21, 55, -5, -15, -7, 38, 32, 26, 43, 27, 52, 2, -28, 27, 19, 19, 54, 8, -5, -25, -28, 23, -41, -44, 7, 36, 0, 3, -58, -41, -20, -43, 61, -2, 11, 47, -22, 16, -10, 20, 48, 67, 72, -35, -35, 41, 1, -37, -36, -19, -18, 74, -15, -52, 58, 8, -22, 60, 1, 11, 47, 8, -61, -11, 19, 66, 18, -29, -46, -4, 9, 17, 8, -38, 27, 72, 6, -39, 34, 47, 53, 1, -2, -14, -44, -14, -16, -29, -1, 53, 47, 38, -55, -65, 63, 24, 56, -9, -59, 0, 2, -19, -62, -17, 34, -20, 22, 18, 16, 28, 61, 13, -14, -37, 16, 2, -32, -16, 47, -35, 29, -13, -41, 1, -27, 15, -6, 33, -56, 14, 29, 29, 19, -5, -32, 11, -8, -73, 30, -4, 60, 107, -20, -14, 17, -10, 42, 20, 42, 39, -13, 21, -78, -84, -16, 6, -23, -5, -60, 21, 40, -16, -24, 21, 67, -16, -38, -17, -8, 29]
2127B9J6p6K6P0o0M0n5o0J02M8q0k0J1K8rL7m2j4l5R0l1j3n1P6rJ1p6L6l6N6l0
2158b1K1k5L0N1l5q3P3m0M6MJ1p4M4Lm5O6k3j4J9Qn8M0K5m6N5k6k1K0k4P2l4o
2190A3M5j7o1k3L7O9n4ko0L5n8O5O5k8j0l2J1m9M8l5QJ29p6n6L4qm1kM4J5k7L1
2222A0K0m3rjP6k4n1l3M6M8p6%P5m3l3P1l3n9P0L1m9jM0J0k6l5M5N1k5p4mJqq
2256d1M9j5l8P9k1k0N7n9j7L8Pp7N9M6n2K6l8L5m4oO8n4q%j0L1N0o8J0M2j4Pn
2289A7l8P7o1L4k8pk6M9k4pJ1MKj9J5oK7m7N3k4K1Lpm2k6M1K1K1m0oO5k6n9J02
2323G0j37Q1L0n8qkK0K9l1J4j9mj2R3k6o7j1K6N1k5p4Q4qo6P8k1J2k9Prj1nK6
2356bk0K9k5Rj3M2m3l0K9N1k8j6mk7R2J5lj27P0Kn1L2l0J0J5O5n7K5j5K3j5K5
$$ y = [29, 45, -31, -5, 65, 5, 45, -10, -70, 32, 80, 0, -20, -9, 19, 10, 47, 5, -9, -44, 46, 15, 2, -49, 27, 18, 29, -47, -11, -47, 9, -21, 0, -25, 5, 56, 21, -62, 11, -29, 17, 21, 32, -42, 2, 5, -40, 26, 3, -11, 8, 16, -42, -2, 23, -23, 32, 6, -15, 5, -19, 53, 19, 13, 58, 41, -20, -43, -6, 63, 9, 7, -53, -18, -76, -11, 54, 26, 16, -16, -5, -54, -6, -41, -33, 96, 20, -36, -2, -10, -51, -53, -9, 6, -21, 10, 30, -13, -22, -23, 53, 29, -22, -55, -9, 39, -37, -37, 38, -5, -38, 33, 0, -59, 11, 42, -7, -8, 32, 42, 16, -19, 26, 77, 52, -22, -26, -25, -33, -41, 8, -7, -45, 34, 13, -7, 50, -9, -26, 12, 19, -58, 1, 47, -5, 21, -17, 18, -26, -32, 36, -18, -26, -26, -36, -5, 45, -23, -13, 29, 15, 22, 17, -21, 56, -5, 29, 1, -6, -32, 17, -7, -14, -3, 1, 3, -16, -1, -7, 20, -27, 26, 2, 23, 26, 19, -23, -49, -8, 13, 34, -6, -12, 53, 27, -32, 70, -67, 14, 44, -14, -22, -24, -4, 25, -6, 8, -11, -15, -27, 66, 40, -27, -38, -12, 39, 14, -60, 24, 16, -50, 28, 7, 19, -10, -3, -12, -23, -28, -2, -22, 7, -18, -9, -22, 20, -23, -53, -24, 27, -1, -17, -21, -48, 44, 59, 56, -71, -1, 1, -50, -18, -48, -38, -23, 42, -15, 10, -5, 18, 3, 28]
2388B8o4O0mj0l8rQ9L0j00K1PpK0n3K0j8L0J1L6r3O4LN2j16K8nM3l9j0L6K8n8
2420a8K4P1j11M2j1rM5l2j2KK1nQl8N3m0m7L4j1M4K1j1J2K4p1M5m4qN5o6nL7o7
2453f8O9O9p4j9J0k8L8J9Ol7o%M5k2jPL0l7oK0L5o3nj8K8l5P7pm5k1M8m6rj3L5
2488b4L3Ll1kM4o1J1N4o5l8P0M1m6M7m7RK5J8m4M3n1KK2j0j0K3K3k6r2Q7qnJ9
2521A4j6k4K7N1o8LqQ9p7M2p1N2K2Jkl2o1R6K4q5L2j8nQP3k9j9k6L0j0l7Pk2L3
2555fk2rM0j4L4j4j3Ll1N7p7J7%M7k4qmk0L3K3j3rqj8K4M1n8N6l4l0R2o4LLQM3
2591D8j6K8J9n3rl3m3O1nl6m2R4L6l7M7j05J04l8K2l9l5jK9O3n4j9j5K1K9l5o
2622b0J3P7m7j8M2m8j9L2M5r9M5Pk8Q7l7ll9J6m4j6M5j7O8o9K3J4K8k6%l2J7Q
$$ y = [28, -36, 24, 20, 10, -28, -37, 52, 82, -18, 3, 10, 3, 23, -30, -10, -28, 2, 13, 49, -44, 20, 23, 75, -41, -13, -18, 25, -14, -24, 12, 40, -18, 6, 77, -34, 8, -3, -12, 33, 1, -11, -9, 12, 7, 15, -23, 30, -10, -57, -23, -34, 10, 31, 20, 32, 56, -15, 30, -14, -22, 33, -33, -38, -1, -68, 1, 70, -4, -23, -13, -41, -3, 16, 22, -15, -21, -21, 24, 2, 1, 8, 38, 1, -5, 15, 50, -13, -18, -36, -8, -43, 34, 27, -18, -39, 9, -37, -46, -59, -24, 9, 12, -19, -21, 23, -38, -27, 27, -38, -76, -6, 35, -11, 36, -11, -2, 23, 41, -3, 40, -11, -9, 13, 3, -7, 16, 39, 13, -79, 8, 0, -5, 14, -2, -26, 1, 52, -16, -13, -21, 68, -9, 33, -38, 14, 36, 37, 35, 3, -58, 38, 62, -23, 9, -9, -14, -6, 67, 38, 19, -7, 23, 13, -24, -17, -39, -6, -28, -37, 3, -11, 23, 9, -4, -1, -32, 25, -52, -35, -35, 12, -12, -20, -24, -44, -11, 12, -1, -10, -18, -36, -12, 29, -29, 27, -7, -37, 55, -9, -6, -3, 5, 48, 32, 60, 79, 26, 17, -16, -59, 2, -3, -39, -81, 13, 49, 12, 59, -46, 58, 20, 42, 3, -32, -33, -4, 59, 5, -14, -29, -8, 21, -14, -20, -7, 70, 23, 5, 47, -1, -20, 12, 57, -42, 3, 10, -18, 69, 32, 29, -10, 6, -38, -54, -9, -26, 42, -27, -4, 10, 38, 12, 12, -20, -3, 5]
2654E%L4p8M6L5l1J5o0O2%J6j6j12O8l5N3J4M1k9j2j25R2k6J5M4N1m8rk3PK7j0
2686A1L5n7MK5m2O8q1l1J23l5k8J1L4k6J5p0N0qL0n1j7J13n0M0q3mJ4k0N9k4K7
2717C2m7Ql0RO4m4k1Q8n4K1k1n0l0P5kkj3n0M2J3O1p0P2o9QM1j3k0k7J1QK3K6
2750C9m5L9qNl6l2K3M3n9j1K9l5O2k3m0M4l0J4N7l6J2J0Pj2m3K6NN1l6j8J6Mk6
2783dk7N1j00Q4L8l2l6LJ7l0M0Pp4M5J6j7K8l2K8n5O0j5l3M9J3l3OL6o9L3P2p6
2815grM4J3m6JJ4l5J4J0j3J3%M4k9p5K4%P5J4p3K4j8j0j8M2k7L2lj8N3l5M5l6
2848A0k5J6o2P3k4mnNkN5m6lK3n9M5rqOj9MO5k4%n5N4n5R7k3N2q5K4m7qM5j8q
2884a5J3O0q7jj4J01p1k3j7J04Nq1J5P6n5j8J6n7K8L6j14O5R6p4M7jo8J7L3jK6
$$ y = [5, 5, 39, -39, 7, 42, 11, 26, -34, 28, 28, 44, 28, -84, -16, -51, 2, 16, 57, 28, 16, -109, -17, -43, -28, 16, 67, 19, 10, -13, -6, 21, 11, 46, -11, -7, 18, -24, 44, -37, -68, 55, 20, -8, 3, 37, 11, 26, -44, 6, -2, 28, -23, -40, 73, 23, 63, -20, -24, -10, -30, 29, 5, 32, -15, -7, -37, -28, 36, -8, -29, 59, 5, 26, 5, -45, -75, 0, -2, -4, -17, -67, -25, -12, 49, -21, 51, -18, -10, 31, 18, -2, -29, -18, -10, 13, 39, -6, 33, 25, 30, -6, -38, -15, 28, -31, -42, -13, -48, 14, -9, -49, -5, -35, -21, 36, 0, 12, 22, 29, 17, -26, 0, 5, 56, 20, 2, 18, 22, -4, -31, 20, -80, 4, 42, 10, -26, -23, -6, -36, 4, 11, -63, -18, -2, -19, 9, -23, 5, -50, 10, -5, -38, 11, 24, -9, -3, 33, -36, -3, 69, -7, -16, 28, 41, -5, -4, 10, -25, -11, -1, -14, -1, -1, 43, 14, -61, -37, -37, 38, 52, -21, 3, -15, -25, -43, -1, -28, 4, 1, -17, 36, 1, 46, 10, -15, 1, -61, 12, -12, -16, -21, -16, -18, 37, -9, -12, 11, -48, -3, -12, -20, -14, -33, -29, 36, 12, 12, -43, 11, -44, 53, 30, 82, -3, 21, -26, -34, 11, -7, -15, -2, 58, -29, -30, -44, 57, -14, -37, -54, 50, 55, -26, -11, 65, 10, -8, 8, -49, -21, 15, -99, -34, 62, -12, 35, 34, -34, -17, 16, 15, 41]
2915D1n1M7k6lk7KM6rmJ0p3O3MK7j3k4%J7m5j3K2L3J5L6m7j1Jk3K8l1k8L3PJ0
2949A4j3K8p7K9J6n1O8oj2J3J5p8QJ26r3j8M9j3Mk0M8n0j2jj9N9mnm9L5l3O8J4
2982D0o3K1K1k4l3K7J7J0l2Q5q4j3Lk2J02m2qJ3k7M2Lm3n0M3L5L8kl7n2K2NP5
3014G0j6p2Kk5L0JJ8K9m6Qj1m6M4nk0K9N3k0rL4q9PK2J2l4Q6k0K3p7m1N5j1jJ9
3048aK5M9p9Lj7L0p0pO2o7Q7L1m8j9J8J6j7M4qj2J2l9k8lJ8m6Q1L2Pp4k5M7k6
3081b4J4J1RJ1m9J5m0L5M6j4Rl2N9j3qnM7o1m7L7j1jK4j3k2Ok2M5lj7j1j0O3n7
3115b9M8oo9O1J2m3K4Qj5k5N0m9N8m7nL0QJj3L2k7%oJ9m7M3k6M4k6K5l7M7Jm0
3149AKK5n2K1j9N8n4N0j0k2J5j3l1pL0m9R9l8k8M5k5K3l5J4K3nk7Qm5J1J5O5m4
$$ y = [41, -10, 37, 11, 8, -19, -17, 29, 20, 16, 26, -47, 16, 20, 47, 34, 10, 10, 27, -18, -31, -9, 24, 39, 75, 28, 17, 18, -5, 23, -8, -36, -3, 4, 14, 1, 29, -48, -19, -3, -54, 14, 8, -4, 9, 24, -54, -46, 80, -13, -31, 18, 5, 9, -11, 37, -13, -25, -26, -45, 14, 10, 5, -44, -9, -42, 26, 40, -23, -2, 19, -5, -38, -11, 6, 16, -16, 69, -15, -28, -25, -47, 55, 13, 5, 18, -9, 33, 36, -7, -57, -14, 21, 59, 57, 20, -32, -10, -5, 70, 54, -18, -16, -41, -11, -10, 8, 37, -9, -1, -12, -58, -14, -19, -39, -10, 43, 23, 14, 48, -41, -34, -12, 0, -34, 52, 32, 55, -22, -63, -8, -19, -20, -1, 24, 73, -6, -3, -20, 10, -60, -67, -5, -72, 15, 46, -2, -21, -3, 13, -4, 40, 32, 20, 32, -7, -35, -38, -20, -66, 15, 47, 54, -20, -45, 2, -24, -10, 1, 10, 21, -28, -13, -53, -18, 28, 14, 23, -9, 50, 37, 29, 24, 71, 10, -37, 0, -11, -12, 12, -1, -23, -17, -39, 6, 3, -14, -25, -35, 28, -29, 19, 13, -56, 5, 17, -26, -2, 6, -9, -34, 16, -33, 25, -22, -27, 3, 11, 12, -1, 31, 4, 4, -2, 17, -30, 13, -13, 31, 5, 30, -7, 40, 41, 1, 3, 28, -24, -3, -22, 36, -18, 32, 22, 0, 15, 2, -29, -36, -6, -55, 44, 6, -22, 23, -2, 21, -14, 0, 23, 18, -9, -1, -46, -35, -20, 45, 1]
3182AK0j5K6Pn1NmJ9n2L7L8L0n4K2l5K9j3l0J1K8Rk1n0M9k5P1o6M0N0n4j6mL0
3215C2o8N3j4K2O6q0j9pj4M0l2j8M4pp7P0M2qj5QK2p1Q1j27J23j9l4QqJ6n5O3
3247A7n0L7QJ3l7mj6k3P0L6q3Qj4P1rj3j8N5o7N2o9O9l1k4L1k0k9KJ12o8j1Rj2
3280hN4l2jl8P0p6P3m3k2kJ5L7l8L8k6L8k7L7j06P7qln7K3L1k4J5m5O6J3o1RM3
3313B2k6M0n1K7k3j0Km0R0m6OO5n8L8l4K0L0l9M2l8J9j6qj2J9Qol2QO9r4p9J40
3346C3o3L0J1N3p6k4O8m5Q7k1o4K3K7pMm7N9n5k9M4K4q6O4k0NJ7J9o6qL7m6O2
3378A0QMr0Q0%J0o7L5PK2N6j41J06n6k0M2NLpKn1L9LmJ5q8P3K4k6l3N6m8j3J6
3412b8N6m0M2Kp0O5mjm2PM7n4nQ4l3k9m5J6M1n1J8M4M2q7L1Jj4Jk7P3m5m2O3j8
$$ y = [1, 21, 6, 32, 39, -12, -7, -11, 8, -44, -7, 31, 61, 7, 29, -6, 23, 10, -20, -9, 19, 28, 7, -43, 6, -19, 52, -14, 26, 76, 22, 6, 2, 32, -36, 17, 3, 25, 91, 11, -8, -15, -29, 11, -21, -39, 5, -2, -79, -9, 33, 25, 10, 18, 40, -31, 50, -77, 46, 27, -7, 1, -7, 9, -46, 17, -33, 4, 12, 25, -12, -16, -32, -55, 15, 51, -32, -24, -38, 33, 24, 11, -7, 48, -19, 33, -36, 33, 2, -22, 9, -11, -40, -38, 74, 6, -5, 4, -8, 46, 14, 13, -25, 45, -31, 42, -1, -23, -25, -10, 27, -11, 27, 1, 39, 12, 49, -57, 20, 12, 9, -48, -25, 6, -18, -3, -48, 18, 31, -30, -21, 22, -4, 36, -15, 12, -11, -21, -19, -59, 31, -15, -9, 56, -2, 36, 2, 22, 52, 13, 55, 17, 36, 20, 12, 0, 19, 27, 21, -11, -3, 66, -28, -107, 33, -30, 0, 11, 64, -12, -36, 32, -13, 74, 53, -11, 12, 39, 32, 36, -11, 48, -7, -36, 8, 32, -54, 10, -10, -5, 12, 31, -35, -43, -6, -52, 10, 18, 22, -68, 12, 12, 22, -45, -10, -3, 19, 75, -66, 40, -16, -36, 6, 11, 14, 7, 9, -42, -3, 0, -4, 11, -77, -4, 20, -6, -39, 17, -31, -44, -28, 28, -12, 30, 32, -38, 27, 23, 22, -20, -13, 34, -20, -25, 59, 26, -3, -48, -32, 9, -42, -24, 20, 62, -25, 6, 7, -7, -6, -33, 40, -5, -47, 16, -2]
3446bm3jN9PnL0p4O3J1k0m4l3Q8r8O7j6%N8q0K8o8P7m5L1k5N4nk1NmOl0K1N2r4
3481e1L5K4M8l3J7qk1j3J0P2q9qM2K5o3O5n3k2MO6l2j0n5R7m1J2l4M8lo1PM7l5
3514a3l2l2J19o0M5k7mpk0N0rK6k2m6O9l9Mj9L5p1J15q3KKN3jr3N8J3j7QjJ0m
3548Ij3J8J3pj7L8l3jl3M2L4j14Q0lqK5J0j8l9JQpOJ3M7m8pl2L9j3QJ0mlj6K3
3584HM4o5o1P6JJ8qj4m4N4n1O4o0Q2q4Q4ko2N9n7N4n6M2n2P8qp7L8L0k2LOMK3
3618D5r2R1n7J5o0P3o1nR6o0o0Q2l3N3M1qn0m3O7l6N2p8M9j3l6ML5%J0l2O0lm0
3651Fk0j9N5p0J0N8K7Lq4P5p4K9Nk4P7j17O7j3nPk3N6p7K8M7l5N7m9j2M8k2n7
3683d6N8Pm1N2jk9K3l6O4j17Q3k5J7j6k9P6Jj3j6qL8l9N5n9O2p5J0J2qM5k3m0
$$ y = [-2, -45, -46, 13, 20, 15, 45, -29, 34, 45, 25, -19, -52, 36, -62, 5, -11, -11, 47, -33, -5, -73, 4, -41, -10, -35, 19, 14, -7, -2, -6, 0, -30, -9, 43, -51, -16, 8, 56, 23, 40, 32, 11, -2, 8, 80, -9, -17, 25, 50, -13, 52, -1, -23, -19, 47, 15, 5, -50, 47, 6, 18, -16, 32, 29, -32, -25, 22, -13, -45, -77, 42, -18, 27, 0, -4, -11, -31, 19, 10, 36, 14, -32, 37, -2, 2, -17, 18, -53, 62, -21, -19, -17, 36, 35, -58, 0, 13, -4, 4, 3, 13, 9, -4, 14, 27, 20, 3, 41, 8, 7, -26, 16, 50, -64, 16, 13, 5, 30, 40, 22, -17, -16, -8, -15, -9, 4, 51, 3, -4, -36, 3, -10, -2, 8, 4, 1, -15, 8, 52, -13, -74, 2, 3, 21, 13, -1, -45, 9, -42, 22, -38, 44, -40, 44, 42, -20, 39, -18, 36, -20, 22, -30, 48, 40, -37, 1, 31, 9, 12, 18, 22, 45, -47, 44, -13, 2, -58, 15, -46, -51, 45, -15, -75, 7, -26, 27, 68, 60, 10, -33, 34, -2, 50, -28, 21, 8, -28, -24, 11, 11, 21, -11, 49, 46, 6, -14, -33, 22, -48, -38, 20, 47, 50, -34, 41, -33, -4, 1, -23, 54, -63, 4, -9, -14, -7, -30, 26, -51, -23, 24, -11, 46, -3, -15, 33, 11, -46, 12, 19, -22, 30, 29, 0, 23, -13, 51, -66, 17, -8, 9, -7, -36, 40, 41, 28, 12, 4, 42, 3, 58, -1, 61, -14, -4, 8, 0, 45, 22, -18]
3715a8J0J9l0K5k7K8nn4L1lLPM5o9L7L6n0j1qJJ6J2Nn1L6K0l9M0j1o2L1j5N4p4
3749g1O0J9n4N5o5O3Rm8K7K3j0J5j0j6l0K7J0M3q1K0j4P2j9lJ7k3k3n3N6m1mL7
3781a2J4o9J04Lo1M5k9n6K4L3M4n6k1O0j2qk6M9l0m4RM9J5k4Jk1L9p9M2j9M2l
3813Cj1J5p2N9m1L1j3K9m7O7j3J1l2qR2n6m0j1P5No1L1l7J01o9K2k4M4o7L3o0
3844d4l8J20k4J6l1j3L8k1l7QK4j0R3o3J6p2K4ON4m3oO9j55O0JJ1OL4%o5M4l4
3876c2K9m9K1P1l0k3j3J1lj8OK8l7%Q2k4m2mK5k1nL2o1M4J6pj8l8J6M9JK9j8J2
3910B9J3m1n3N9Oj1oJ6n0j0Q4n1J5qjk9L0m3M1K1n2M8l8JNQl5R3m0M0n9j0JL6
3944Ij0J4l5o7R7l4N7p0P8m1n5M5j2J8rJ8J9n2nM1K5l3nJ5pl0QJ3J6j2j6M8J9
$$ y = [-18, -8, 11, -19, 6, -21, 7, 2, -52, -21, -24, -21, -14, 31, -38, -1, 35, -15, -26, -34, -33, -17, -5, 0, -51, -15, 5, -34, 6, -5, -67, -36, -51, 3, -71, -11, 8, -46, 9, -56, 7, 16, -32, -5, 18, 8, 23, 13, -3, -33, -6, 4, 47, -34, -14, -28, 44, 25, 22, 39, 16, -7, -60, -4, -45, -49, -12, 2, -67, 37, 40, -21, 24, -5, -61, -37, -4, 40, -16, -37, 23, 11, 3, -23, 26, -4, -48, -39, 10, 25, 1, 2, -19, 20, -59, -17, -36, 6, 3, -8, 7, -65, -6, -47, -16, -29, 0, -47, 20, 7, 18, -14, -22, 70, 14, -26, -37, 38, 43, -18, 13, -24, 77, 8, 30, 6, 50, -17, 16, -44, -82, 38, 14, 30, -1, -14, 24, 3, -34, -26, -2, -12, 81, 18, 34, -38, -14, -8, 46, 3, -3, 66, -89, -29, -28, -17, -11, 23, 23, -42, 2, -32, -3, -52, -31, 40, 10, -13, -26, -15, -18, -36, -30, -2, -39, -39, 43, 19, -23, -27, -2, -23, -28, 4, -57, -13, 3, -4, -22, -60, -44, 5, 6, 35, 17, 29, 42, 1, -52, 7, 13, 2, -4, 12, -38, -48, 36, -15, 0, -8, -9, -38, -8, -51, -10, 11, -41, 7, -31, -30, -25, -17, -52, 41, 1, 41, -18, -28, -27, 9, -1, 13, -22, -89, 8, -26, 31, -39, 39, -2, -57, -12, -24, -6, -15, 3, 22, -30, -35, 6, 31, -2, -7, 8, 1, -29, -21, -8, 8, -4, -20, 28, 47]
3977D7r1M8k7J0k9j1N3J8K7l5p4K2R3l2J7o7K9PK4Jrj4k4L6K5r4K1N2K7n3J9j2
4009DL4l1k8K4M2p9RP4o0O0n6Kj7KM0p7J07o7Pl2K7l8M7K7p2M9Qk6O7l6p2N8K2
4042A9Nk4Pj7L3nk3Klj6K1j9j9L6Ql0M6J8l0NN2j06M8J4k8J6jo0O0k1j9Rl5K1
4076c6O2j9j7l4P1l1l1P9k5p6QP3l3pk6L9O4m6l2K0Pm4O0J2j6k6j0J3k7Q0n7k8
4108c3L4J7p1O7j8j0J1kK0J1lm8l0N9j5J0L1n4L9j3K2%K1Jl6LLq2L7M6j8j8K0
4141Aj1J0K8n8L9m0j8L6m1Q0%l2NK1m2n2P2J2qJ2QK6n9k3l7M3K8mJ4%L7m2l5J0
4175b0M2k7o6Q9l6rK3Qn8J09n5qJ9M2j09M3RM6j01O1Lk9kj9P1r4Q8J0p1J8L8M9
4207F4q3Mn4M7lJ5K4m6O5Nn6L7l0M4k6j5ol3O8l9L6q1M9M8k2m5N9k9j8J9k5L9
$$ y = [47, -44, 4, -23, -13, -42, -53, 0, 18, 45, 10, -64, -42, 51, 19, 36, -31, -2, 5, 29, 30, 21, 7, -17, 19, 44, -50, -29, 23, 50, -3, 16, 4, 38, 7, -21, 3, 45, -34, -25, 49, -11, 49, -7, -5, -22, -20, 20, -57, 50, -17, -10, -42, -15, -53, -6, 21, -51, -2, 6, -20, 47, 11, -61, -3, 19, 24, 0, 7, -10, 23, 18, -5, -3, -6, -22, -1, -20, -39, -3, 5, -25, 21, 39, 9, 14, 66, -40, 8, 22, -6, 10, 9, -51, 9, -12, -31, -22, -57, -36, 26, 7, -10, -44, 27, -4, -35, 44, 19, -57, -49, 24, -9, -16, -42, -3, 61, 15, -17, 3, 10, -34, 26, 38, 22, -4, -14, -1, -28, 52, -5, -33, 1, 18, -53, 14, -4, -14, -3, -5, 15, 26, 23, -25, -55, 4, -11, -1, 30, -24, 15, 2, 24, 24, 45, 46, 10, 13, 16, -66, -29, 17, -1, -19, 1, -10, 0, 28, -30, 9, -31, -49, -13, -54, 26, 26, -6, -1, 20, -22, -74, -2, 10, 2, 14, 22, 48, -11, -34, -71, -28, 0, -4, 10, 10, 47, 5, -30, -20, 22, -5, -71, 18, -18, -27, -4, 4, -54, 55, 0, -8, 11, 53, -56, -13, -4, 42, -59, 2, 5, -24, -26, -45, 26, -68, 20, 30, -41, -23, 15, 64, -19, -15, -69, -22, -25, -10, 14, -32, 33, 38, -18, 19, -11, 33, 7, -8, -14, -47, 21, -18, 18, -63, -14, 34, 12, -33, 26, -3, -21, -2, -27, 12]
4239A2l9M1j6L5q7M1K1j1M1m9L6n6kN6J9%l2l1L5K%k1L6k3rrl5K9M2jj7J9jm3
4273a7J1J8l8N6o9P2Ln2pJ0j1L0RlRp1k0J21p5K4jN2j4j4k0m5KL9n5K8N5l9j5
4306b7RK2MLl8Oj7L7j9K8m0J9ON2j1J0m2j7pM3l0L6p5J7j7P5mk4K1l8pj4L7N0
4340D8o1j0Ql5L3M2J8l8Pn4M6j9K3K5n5M4m3RLK7q9J30o6K5n1jN1jm2J8N6l1j8
4373a%Pl5L8L4n8j5K1j8K2P6m2j5QqLj8m3P7L6q2QJ2j5lQ1j22L6J1k2%N1Mn4n
4408c1K2m8L7QM8o4K0O%L8m7pP5j9j01P3J9l6Jl0J6K2n9K4M5l4nN1j6o2P3L8m4
4441A3j5jJ2k0rk3J13q3Nm6L0K7Rn9%L9L2j7om1J8K1M4m3j8j5L3K6k9Rk4O6q0
4474c2L6MN%J2p5R3n7nRJ2L6o8M4n8M2M2m9l6N9m3N2l4L3J7qr5Q1j5k2O9p5J1
$$ y = [12, -27, 14, -2, 33, -54, -13, 8, -3, 38, -11, 25, -31, -33, 23, 42, 42, 10, -21, 14, 16, 16, -5, 31, 8, -1, -10, -45, -16, 26, 25, 8, 27, 26, -17, -6, 12, -26, 30, -39, 33, 36, -16, -23, -13, -24, 6, 15, 12, 21, -50, -70, 51, -24, 0, -1, 51, 37, 23, 3, -42, -40, -1, -56, -28, 27, -12, -27, -18, 4, 8, 11, -27, -21, -38, -1, -20, 8, -32, -13, -7, 45, 34, 44, 2, -15, -22, 21, -9, 27, -48, -31, -48, 27, 23, -1, 20, -18, -25, -39, -2, 48, -13, -23, -15, -50, -17, 25, 43, 5, 12, -42, 4, -15, 8, 33, -22, 22, -21, -12, -9, 18, -71, 59, -7, 18, -33, -34, 17, 16, -26, -8, 48, 17, -1, -1, 6, -29, 9, 43, -15, -30, -9, -27, -5, 71, 29, 14, 22, 14, 17, -1, -44, 33, 69, -13, -5, 7, -8, -11, 70, -52, -16, -5, -27, -27, 24, 28, -26, -31, -9, -57, -20, -12, 36, -28, -8, -2, -2, 36, -11, -18, 57, 38, -63, 10, 29, -7, -6, -36, -20, 2, -57, -33, 12, -22, -27, 24, 8, -54, 19, 57, 13, -2, -3, 9, -11, -20, -43, 70, -13, -8, -54, -24, 3, 12, -47, -47, -8, 24, 7, 1, -40, -22, -1, 43, 0, -18, -33, 0, 26, -3, 6, -18, 48, -32, 4, 8, 13, 13, 25, -50, 43, -14, -19, -10, 2, 38, -30, 14, -44, -2, 40, -9, -45, 14, -29, 23, -11, 22, 39, 31, -64, 17, 2, -20, 49, -26, -15]
4507a5J6j5N3Jr7R2j8m1M5pp5K8Q8p9lj5j1Q7k4j9K4o3P2k6m3Q9o9M6K0q6J7M
4539b4N4k3nl0k1J6M7k8L3k9J7l0J2Oj6K5rjk6J6J6L9Jo8n2Q4lKj4M6m1O1j32
4572g7J01k8K6m6L8m4K5Qm5N2kl1J9K3m0K9n2Q0mo9PM2n2M3j5J4M3j4q5O6J5R
4604C6K5j46Q7NJ6l2M8l7K2m9L5QqP1q4L0m6J2o4O0o5J15o1K8kk2N9p3J3LP%n8
4637f7N4L4K7o7M8r2P6L2m7l8l9J07k4L9j01P4m0P5Ln9j6J0l1K6kM7m5L0k1K0
4667A3J6RMj4n5J0O0m9r3Q0L0m5l3%J0M6MK4m0pL4L8j9p1O5N1n8r4J04q7O5J7
4699A5j7o7K3J05k1p0lM9L3j1kq5R0q4O1k4Kj4RM2q6M7QO2r7J6LJ7k3J0k0Rk5
4732d8M6K4o1%O4jk8K8n2k5J17p6L2oqj1K6on0N8p0K2O6o1J4J3n4Q2r7M0M5nm3
$$ y = [-15, 1, -14, 39, 40, -57, 35, 17, -24, 21, 14, -61, -33, 55, -24, -27, -42, -53, 34, 10, -9, 15, -48, 24, -2, -45, 44, -25, 21, 41, -45, -28, -24, 30, 7, 2, -28, -49, -33, 14, -14, 19, -10, 7, -23, -11, -5, -21, 4, -5, -6, -32, -16, 0, 39, 40, -28, -80, 4, 1, 3, -11, 35, -6, 55, -77, 24, -4, 22, -24, 14, -30, -5, 3, -42, 10, 8, -23, -4, 19, -21, 8, -44, 36, 32, -37, -30, 12, -40, 3, -12, 2, 45, 31, -54, 12, 27, 36, 61, -85, 2, 7, 23, -9, 39, 2, 24, -25, 10, 18, 10, 81, -3, 27, -19, -7, -71, -11, -76, 39, -22, 6, 4, -18, 41, -32, -19, -16, -9, -9, -67, -13, 21, 48, -19, 29, -63, 13, 45, -2, -40, -79, 28, 4, 43, -58, 16, -24, 51, 54, -5, -21, -11, -42, -16, -18, 29, -16, 14, -7, 13, 29, 38, 42, 28, -27, -17, 43, -6, -99, -19, 11, -34, -67, -67, -57, -11, -7, 17, -23, -30, 4, 42, 23, -48, 17, 68, 10, -84, 20, -67, -2, 15, -2, -69, -46, 59, 38, -32, -35, 14, 47, 36, 34, -51, 39, -45, 16, -8, -6, -20, -11, 31, -55, -8, 0, 62, -35, -19, -16, 1, -22, -12, -32, -23, -48, -2, 22, -39, -39, 25, 24, -4, 24, -28, -53, 64, -12, 20, 14, 6, -5, 21, 15, -35, 23, -47, -25, 41, -20, -6, 7, -47, 35, -62, -22, 23, 18, -25]
4765b5N6p7L6LK3Qo2J9O2k0K0k7J6k5L4k6k4k4j2O4J8L1r8M8qql9PP4m4j5L9l6
4798a2o8R6k6oqK6Qj9J0M3n3m9O3k6oK9L0l1J9l1L1J0l5j4L7RJ5q5R3o8J5K2q5
4831f6O4m1L4M1k6J8mm5K8J3j7K0j4Qkj2okJ2J1j1k8K4k0K3K0lM3q0rkL8mJK9
4866C5n4N3n8M7m2jM1l2n6J7M1jQj7J2MK5Qj5Pj4k8K0kJJ0lN1n1j5QM2k3l0Pk
4902gK1J9J0j9l1rj4K5KM8n4L3n9M0l0N0jRk5J2o9N1jo4M3k4N9l5J0k3J9K2k7
4935a9j2M0k2J1mL0p3O9%Knl3J4l7OK4J5M7p8K5L0l4j0M4l8k5m0P9J6K6n9K4q
4968EO0r4J2O3qm7J2%pJ1l1J7j7O5qo4P1l2J0Pk9L4k4lm0J1nKO5l5L7p1M0K3o6
5003c6%K8m2L0J4l4L5M1Ll3L1k8LL7J7o0K5m5L5k7O5l7n1j3L1L6p1O5nk8j7k1
$$ y = [-25, 31, -46, -10, -7, 16, 24, -38, -19, 43, 23, 43, 16, 32, 7, 41, 15, -9, -33, -45, 19, 37, 68, -30, 18, 10, 2, -37, -30, 44, 0, -15, 24, -12, -80, 16, -10, -16, -24, 2, 10, -9, 1, 44, -9, -58, 5, -21, -27, 2, 32, 1, 20, -11, 20, 30, -5, -19, 18, 27, 42, -43, 50, -18, -3, 19, -66, -2, -43, -9, 32, 6, 24, 20, -25, 3, 16, -1, 19, 5, 13, 11, -1, -7, -9, 3, 14, 3, -25, -1, -21, 2, 22, 19, 62, -18, -27, -29, 9, 5, 6, 35, -19, 34, -24, 23, -19, -20, 21, -11, -67, -50, -9, -10, -2, -19, -7, -3, 22, 30, 15, 22, 8, -20, 0, -2, -1, 9, 6, 57, 6, -9, -1, 41, 18, -12, -5, -7, 14, 33, 43, 24, -7, -16, -30, -5, -3, 45, -9, 24, -35, 5, -25, 25, 24, 33, 8, 20, -49, 2, 1, -63, -20, -44, 15, -20, -10, -33, -14, 8, -19, -31, 9, -13, -2, -6, 24, -49, 20, 20, 22, 17, -16, -2, -39, -33, -9, 6, 53, -25, 0, 30, -4, -14, 30, -8, -33, -73, 6, 22, 48, -11, 13, 5, 65, -29, -17, 46, 38, -9, 3, 3, -4, 7, -24, -7, -24, 41, 33, -31, 40, 8, 18, 25, -4, 30, 6, 3, -37, -26, -31, -29, 36, 1, 38, -33, 7, 30, -36, -36, -8, -50, -20, -6, -40, -5, 36, 39, 6, 37, 9, 12, 49, 66, 6, 31, -14, 21, -6, 59, 22, -29, -42, -11, 25, -46, 19, 14, -14, -31, -52]
5035e2M4K4k2K3oK4Kn0L3K3k8m7J6M8m0j5K0J2j7J7On3M8%mk2O0n6O0n3K7L5m1
5068A6o3J8M8l2R8r1N1ol0Kl9R9l3o3P8o8NK8J6o4l5O4p5K7N2l4L8Ok5J3m2K9
5100a2j4J7K5ol4N2k6mM8k4rm5N8l8rJ8m0O5m0nN1l8K3n3K0QLk2K6K2k2n9K5N4
5134A5K1k7k3l6N7lj6k3L6NRj0M5j01N4k1J2Om1K1M7J8o1L6J9Oo6K4j1RL5l7J6
5167A5pk1L1l0MLM8r8M5M6m5J1o1K4L4l2k0K4k9R2rl6M5Jk0Lk0Nm7J8O3m5p4R7
5201A5o1L1K4o1L5J6J6m9N1LRl8k0pO2Om4l5N2l9J4J4pk9KN0n8N6k7Qj5J3O4l4
5235A7j0J9ok0oM2j8onoJ6j5j8K2o5L7L3k2JK5k9K8K7l9K5m0Mk2L1k0Q7l8On1
5269a6k7k3J16n6k5j8J2Q2k1Ol5m0M9J5l3N7q9O4j5OkK7m2N0k0J5p0K1j0PJ8M
$$ y = [-52, -8, 16, -6, 17, 11, 35, 37, -13, 20, 43, 15, -32, -16, 32, -8, -23, -3, 9, -8, 9, 15, -38, 10, 10, 6, -16, 44, -12, 48, -5, 22, 57, 16, -47, -29, 19, -13, 85, -6, 45, 39, 9, 11, -28, 71, 38, -25, 53, -15, -10, 18, 34, -30, -65, -1, -76, -49, 3, -31, 7, 13, -12, 1, -41, -12, -26, -9, 16, 10, -24, 28, 2, -2, 46, 22, 13, -32, 26, -12, -21, -3, -43, 22, -18, -23, 28, -10, 13, -40, -20, -12, -9, -31, -5, 17, -5, -64, -39, 15, 36, 9, -14, -50, 7, 4, -12, -35, 1, 6, 15, 5, 50, -51, 3, -18, -6, 0, -41, -20, 27, 45, -16, 20, 39, 45, -21, 3, -8, 1, 36, -1, 15, 8, -13, 18, -12, -8, -5, 43, -55, -10, 36, -9, 2, -59, -35, -1, -33, -53, -29, -58, 34, 25, -11, 34, 35, 15, 18, -2, 3, -44, -26, 37, -8, -82, 15, -46, -15, 9, -52, -17, -1, 15, -34, 17, 20, 29, -9, -29, -36, 26, 32, -12, -47, 5, -34, -20, -6, -13, -42, -40, 10, -48, 8, -19, -11, -26, -13, 51, 17, 7, 26, 20, 0, -6, 36, 18, 12, 7, 1, 17, 2, -16, 6, -59, -22, 11, -11, -10, 15, -14, 14, 41, 2, 27, -13, -9, -31, 0, -20, 67, 29, 35, -16, -43, -66, 50, -6, -31, -49, -37, 45, 24, 30, -5, -45, 4, 19, -14, 43, -46, 18, 3, 9, 7, 34, -8, 42, 22, 37, -33, -12, -22, -15, 3, 7]
5301GOk6j6M4m0K9N0p7J7o3R0o2N1rl2k7O2J5j01M6j7M8k5K9J6k4K0l1M5l6N1
5332D0LNk0j7L5q6k6R1j4J3K4l6q1M9N2p0P9l4k3J8J0k9L0j8m0L3j1Q5q1J7Pn8
5364e3O6j0j7J3Loj4mj0R8k5k5K0mk2n8N1M4j02Q3krLo7J07m9l2J2L9n2M3J1J6
5397D8m7J9o2O5p3O6j2J4Mj5k5N9k7k0K6O0r9k5Q1p2RO1r1N7Qj8M1%l2l0O1Nn5
5430a9rM1J5l2J2J7Ol6K4j6Jn0L8kk2K8j8nN1l9k5L2k3K0j7J8K4k7JK2jlRn7O8
5465B6J3m8K8J8l3l1J7m1L0OJ0L2o8OM5k5L2k0o1M9J7ljOo1J8kL9PM1n6m0P8o6
5499c8J6J9k2N3m0kK1m4O5j9l6j4L5K4k7J9k9J5PJ3l7O6j1k5l5K0j4j2KO5rj9
5531GK0j1o3Q4n0j2RJ2K7k0oj2P3o3K2Ll9L0QPjn7L3k2%K9k2K0Pp1Q1K7k3l4p
$$ y = [7, 13, -13, -29, 15, -25, 4, 54, -23, -6, -69, 21, -41, 10, 1, -31, -58, 4, 19, -82, -36, -53, -5, -30, -1, 15, -9, 11, -20, 25, -11, 40, 43, 48, 28, 11, 46, -40, -66, 25, 11, 24, 48, 12, -69, -20, 32, -38, 41, 7, -16, 2, 12, -17, 13, -5, -45, -12, -23, 62, -19, -2, 5, -53, 13, 3, -14, -1, 2, -4, -18, -22, -32, 66, 41, 16, 36, 32, 10, -48, 3, 47, -55, 28, 26, 17, 20, -47, 60, 11, -21, -9, 30, -22, 21, 32, 48, 1, 20, -42, 23, -50, 16, 4, 18, 22, 7, -18, 41, 14, -6, 20, 80, -19, -44, 37, -35, -26, 35, -56, 1, 9, -9, 32, 32, 0, -30, 31, 36, -19, -28, 13, 28, -4, 8, 25, 31, -5, 19, 3, 4, -46, -8, -10, -32, -4, -22, -27, 24, -15, -40, -8, -31, -11, -28, -10, 14, -13, -12, 10, 9, 6, 15, -42, 26, 39, -9, 19, 37, 4, -27, -10, -51, -21, -15, -5, 27, -41, -35, 10, -15, 17, -3, -64, -15, 2, -1, -2, 4, -57, -39, -41, -2, 5, 46, -10, -50, 28, -38, -22, -3, -25, 28, -12, -14, 7, -37, 28, 9, -27, -41, -6, 18, -9, 10, -19, -4, 3, 16, -21, 45, 34, 9, -26, -6, -20, -32, -30, 35, 26, 7, 27, 16, -47, 37, -13, -25, -16, -4, 23, 3, -3, -15, 58, -5, 17, 20, -19, 11, 19, 26, 25, -32, 1, -21, -21, 8, -14, 6, 13, -58, 23, 50, 27, -7, -14]
5566a4OL0o7M7q5J02n7k4N8j9L5L4r0K2j7k1M1N3m4%J0K8j7k7K0m6N7k7P0m8L
5597A3j6l5L7L1l1Jk3JK3j1mj3k4N4j0L9k6J5Rm1NqM7j03J9J09k0m5L8m3L5Nk4
5630Dj2k2L9Qk4pJrk8M7j1M8k8p0J25j01J6k8KM5m8K4J6J9l4j2M0j1J2J9j0j2
5662bJ8J8o%K9q1Jj8M8LK4n2NjL3k5L9rOK3n8j5M0q6M5M0k8j2M4Jp4M3j2J6nj8
5698b6kJ4jj2N2k9j0QK5m7oP2l1J1l9K2P5m2J2m7ON7jq7j9R2m9N8m1j0Jm5Q8k5
5732B4J1Qm6n1P1K4Kl2K0l9l3O7o3jQ3J0k2j9ml4JJ3O2p5%Qk5K3p8J11k5Oo7J4
5766e6J11j22N3O9o4j6l3Q5l4KPKl3KO6p9P7j4l9N0m5K9Ok8L1p1nJ2L4j0%M4k9
5799BN2k4k9K1k8L9m4k9K5on9J12k6M0n0L9n4J4L0o8M3j6PK7l8RL9n2O5m6K6o3
$$ y = [-14, -8, 22, -45, 2, -83, 19, -38, -62, -4, -23, 12, 46, -44, -22, -39, -60, -19, 34, -10, -10, 0, 28, 11, -16, 4, -42, 15, -12, 58, 10, 13, -3, -38, -1, 30, -1, 0, -23, -22, 1, -10, -14, -27, -51, 3, -7, 32, 6, 21, 30, -11, -6, -14, 33, -70, -51, 58, 38, -7, 31, -12, 23, 28, 4, -8, -30, 9, 17, -7, -14, -13, -22, -50, -3, -14, 34, 6, -64, 61, -40, -24, -52, -50, -5, -53, -29, -13, 6, -28, -40, 0, -11, 1, 20, 10, -2, 16, 34, 28, 28, 57, -24, -23, -41, 7, 10, 34, -18, -13, -14, 19, -6, 33, 24, 30, 53, -5, -20, 20, -66, -21, 19, -9, -21, 23, 24, -50, -7, -19, -3, -8, -26, -28, -14, -15, -27, 25, -4, -14, -6, 19, -28, -34, 38, 7, 18, -21, 1, 76, 34, 46, -1, 5, 62, 61, -26, -45, 47, -2, 56, 15, 5, 6, -39, 49, 24, 35, 43, -3, -54, 17, 41, 43, 11, 31, -8, -41, 26, -37, -38, 45, 55, 33, 14, 10, -24, -23, -10, 52, -23, -23, -15, -40, -17, -95, 16, -9, -3, -70, -56, 55, -67, -14, 55, -9, -25, -58, 27, -7, -5, 2, 4, -29, -27, 39, -40, 37, 23, -16, 34, -11, 18, 24, -4, 27, -44, -49, -37, -3, -13, -13, 31, 2, 54, 30, 1, 22, -6, 33, -11, -40, -15, -21, -80, 32, 6, 46, -4, 35, -19, -5, 25, -43, 0, -16, -9, 18, -20, -11, 28, -24, 41, -5, 21, -42]
5831d2N1n8K2j7J1Q5nm0J4n9Q8j15L7k2R4p5J1k7K6O6m9J3j2K2l2lK0M0m3J4k3
5862hn6K4K6m1N0M1l6Qj5qJ7k9L7Nl3J4L1qk7N2o8k8L4QJM2l3L1k6m3K6k0J0L2
5896A0K8k9J2j9NO8r2J2K2Jm4K8rj8O7m9N4p4L3K3K4l5oj3%KJ3k3l8P6n9M6m8
5929c2N7J3p3J0K5J5k7j8M7j2Lp9J27o7J9k1P6m3p5O9j5kjkM3n9PQ7o3ro2L9J8
5962eK0m9M3K8k9m1K9%k6j2P3Jn0NK0n4O1k9k5P7j7p4Q3j8n3M4l7P7l5l9N4m4
5994b2K2L1%p6j6L7M0m5l7R8k2n8O9n5j7L1Oj5JO1p4J1Pn0P6k4m7O3oK3j6l8K8
6027a4k9LK5k3O4k4K4k3Jl8O4m0j6L4l2J8L5K2o5NJ4J5m7K9m1M8J2Qo5M3K6qj5
6060A0k5O6o2J03j03L2q8J27o8L6j2ll2j4J11j18J7N4l8Mj8m3O3j2p6Q2nk9M4
$$ y = [-42, 9, -49, -27, -44, -33, 52, 47, 7, 21, -38, 50, -65, -28, -50, 44, -31, -20, -47, -21, 45, -4, 9, -3, 19, -13, -16, 4, 44, 1, 15, -8, -64, -40, -14, -55, -5, 36, 0, 8, -7, -15, 2, -27, 10, 15, -18, -4, 27, 19, -8, 44, -24, -52, -18, -10, -9, 33, 0, 31, 5, -38, -12, -32, -22, 10, 38, 9, 21, 2, 7, 75, -17, -5, 17, 18, -26, 2, -7, -25, 42, -7, 47, -27, 6, 29, 53, 18, 12, -1, -1, 1, 14, -9, -47, 29, -30, 16, -32, 25, 38, -35, -25, 0, 15, -12, -30, 17, 5, 8, -71, 56, -11, 8, -13, 63, 20, -55, 14, -1, -3, -4, -6, 37, -22, -15, 72, 9, 0, -62, -23, -5, 15, -34, 9, 37, 8, -33, -4, -4, -30, -42, 31, 32, -18, -13, 7, -47, 14, -15, -40, 37, 20, -54, 29, 11, -42, 2, -35, 42, 7, -32, 22, -22, 0, 31, 31, -45, -61, -24, 16, -29, -66, 32, 10, -48, 21, -34, -51, -20, -14, -29, -28, 33, -41, -30, -23, -73, 3, -21, -68, -5, -11, 12, -4, -42, -14, -43, -40, -15, -38, 26, 2, 26, 3, 4, -34, 30, -10, -26, 8, -24, -6, 29, 51, -14, -9, 5, 20, -27, 2, -39, 9, 21, 29, -36, 7, 33, 25, 10, -15, 51, -11, 92, -11, 21, -67, 60, -8, 28, 16, 13, -19, -33, 78, -40, -23, 31, -7, -3, -21, -64, -1, -13, -89, -7, -12, -41, 3]
6089CML0j0l6kJ1k4j3K7pM7qn0K0mR9q6n5O0L9j8k6O1r3L8kj5K8k4j2L4k8kj1
6123b5M4K0n1L0l5J9J1o1M9m4M1nL2o5P4rrj9OJ2j7n8O8k5j6K8nL4n6K6L7n0j3
6156c2jN4ok0j3j1K9j6J5nl8M9J6m8M3j3k7j0K5M4q1N7MJJ4k4j0K9n4O0np5R8
6189D9n3L8k8kl6J4oJ1Ok0K9l2L7j2J6n3K8LJ5l1K0n1O1m7P5m6qQ4q4j7P5om2
6222a3j4JP6p5K2L6rl5NRO5r4J1J30q3J0l9j2RM6l9J9J3k2n2K5L9J4p1mnO8j6
6255A5Om4K7kj7RL2k9L3m2%OJk3R0q8P2r3M4nJM3k8l3O1q2Q7o8N7pn0LjM9pK0
6291C7lk5K7l7QK6m4L4rK2Ok5m3PK3J9mm4K7l4K2K6l5k4P5qL1j3n8L1j3pk7J6
6325a6j6Jk8P0N8j16O0PK6j3l6qQ7p4j4K6J5r1J09k4jm8J2lkL0rj9J0l5P6o2N1
$$ y = [3, 7, 37, 27, -9, -11, 0, -24, -37, -10, -17, 30, 22, -28, -8, -12, 87, 1, -54, 6, 45, 27, 1, 62, -31, 7, 5, -10, 18, -6, -18, 16, -12, -14, -25, 19, 39, -12, 18, -17, 2, 13, -48, 1, -43, -2, -7, 25, -40, 34, 25, 16, -3, 3, 15, -2, -60, 8, -17, -33, -5, -10, 24, -32, -6, 31, -19, -32, -33, 21, 15, -5, -18, -29, 0, -16, -1, -6, -44, 5, 21, -27, 16, 3, -24, -34, -9, 35, -46, 11, 15, 16, 30, 6, -4, 25, -29, 31, 26, -49, 49, -4, 34, 6, 4, -32, -18, -24, -13, -7, -27, 2, -30, 7, -5, 11, -42, -14, -11, 4, -27, -7, -58, 3, -44, 31, -15, -23, 61, -23, -40, 35, 29, -13, -27, -26, 50, -25, -3, 33, 24, -11, -6, 3, 68, -26, -15, 115, 32, 42, 3, -9, 0, 46, 7, 26, 39, 17, -35, -10, 29, 43, -28, -32, -37, 31, 15, 21, -23, 4, 2, -15, -6, 26, -3, 30, -12, -12, -6, -5, -28, 62, -26, 46, -47, -3, -8, -7, 36, 8, -25, 36, -46, 41, -27, 30, 23, -27, -24, -25, 24, 17, 37, 34, 9, 36, -1, 7, 33, -11, 23, 14, 36, 42, 17, -26, -19, 4, 23, 19, -25, 2, -32, -10, 16, -19, -43, 32, 24, 55, 42, -16, 15, 2, -5, -32, -16, -32, -31, -59, 11, 69, -47, 13, 20, 46, 33, -3, -11, 76, 2, -12, 14, 29, -62, 47, 23, 22, -26, -14, -17, -19, 11, 2, -17, -7, -42, 34, -28, 23]
6358B3o6L1n3L9O5p5L6m9N1n3Q8Jl7mJ0j3rjL5m9k5N0K5l6Kk0M2l6J5L0k7k6K0
6391a6J8Nl6J9M1j9k7kK6l2lL0rj9M1o6J14p9LK5j1j8J1j5N6n3O4n6M9m9L8m0
6423a0J6l8oOJ8K9q8R1k9l9Q0Mm8Q5j22N0m6j6M7L6%l4RL2k8o6L8M3Mk4J6K1p
6456B4k3J8m8L5L4r2R5q0M8l3l5R8K0o9k2P8p1MkL8mpN3p8K0N1q4O9m1Nj1L6J0
6489C6j9j7J3L3k3kLo1O5k9qJ8Jk3J3n3O0RnK3n0m0JN9qK0j7J9l0L5j8j5OM0l7
6524aO8j01O3j3p0L3M5K3j5j6l2L7j8mj8N6n7K7K6o3N4n8K2pn3Q1n6N7J4k7KJ5
6556A4n2K6N9o2m4N4l6N5l9R4p6m9K5P1k0l9RN8m0l3M1m6N7o5k4N9j9KP4m5%O6
6588G5j1k6q1P0m9kJ0N4l9j0Lm0j1Q5k3Jp9QO8K0j9K8k8noqKj1K1J9k3mL6on3
$$ y = [23, -43, -12, -65, -26, 39, -36, 0, -49, 2, -51, 37, 38, 1, -3, 7, -6, -15, -16, 19, -30, -55, -5, 20, -16, -14, -34, 8, -28, -13, 17, -10, -36, -16, 2, 7, -29, -10, 31, 12, -15, -17, 9, -23, -26, 4, -5, -24, 17, -49, 65, -14, -11, 14, 3, -15, -4, -19, 37, -16, 48, -8, 41, -8, 30, -10, 6, -32, -38, -32, -14, 15, -73, 18, -11, -50, 30, 34, -14, 71, -51, -1, -47, -63, -16, 20, 20, -14, -5, 27, -1, -67, -29, 14, 18, -6, 10, 31, 24, 1, 19, -29, 6, 40, -52, 43, -37, 11, -22, -57, 41, 61, -8, -30, 48, -23, -19, -21, 17, 13, 6, 59, -19, 1, 52, -32, 37, -4, 1, -10, 26, 36, 17, 0, 13, 46, 23, 21, 24, -37, 28, -1, -9, 9, 10, -13, 0, -53, 7, 16, 11, 34, -16, -56, -55, 4, -4, 16, -1, 18, -12, 23, 5, -10, -4, 36, -1, 67, -34, 29, 16, -54, -21, 24, 47, 32, 16, -16, 21, 3, -1, -19, 37, -20, 7, 33, -30, 24, -34, -12, -19, -72, 9, -47, 10, 24, -3, -1, 14, -38, -12, 47, -15, -59, -5, -41, 14, -25, 69, -7, -56, -31, 40, 20, -19, -10, 48, 8, -25, 16, -30, 27, -38, -62, -3, -22, -20, 54, 9, 9, 75, 64, 38, -43, 27, -22, -24, -14, 40, 1, -9, -6, -46, -57, 28, 5, 6, -73, -65, 3, 23, 4, 32, 4, -1, -7, -15, -13, -24, -3, 16, -7, -11, 25, 19, -34]
6623c4P8j06J3J04m3Mk0K9l0L7r9O6K1l2k3pM0J7Rj0lj0n3Q8j28Q2N1n7M3nll8
6655a9j8J9LJ5K6Mm4Pk6L3lkJ1k2L3J0k8k4lOQ0j3k4k4K9k8Jm3M2MO8p0pJ0m4
6690d1L8J2lK3k5KKOj2m7Q1m0k6rM4J2m7N3n8j5K6K3K8K9j0r2M1l6J2K3N4p6K3
6723eJ7oj1K1n4j3N0k0J4k1K3J5n3R6j25M2N0n5P7n0M8no1J5Jml4M6M6p6O4k8
6755Dl0M0J3nK2p1m0L7J6k3K5m8L9j9K3M7r4N2km0L5R0o1kJ7J6k4mJ6l7M2j08
6787g4N2NQL6j4Rk7L2o4lJ7LN0lo2N4j8l2K1j1m5J22Nn9m8P0L5Mo3k8N5J7o8J9
6821ePm3O0rn8N1M8r7R5k2k5J6J5p0P7k9j8K5k6j7R3j5km6J9n9L8J5l6J8k5M6
6853B1j9k2JnJ9N5n5J0kl8M4j0j8J8j6N0k7J9p0k4Q0j3OJ1k0j5J7L1j3k6M9j4
$$ y = [-34, 44, -62, -49, 55, 12, 16, -4, 25, -5, 32, -67, -1, 20, -12, -35, -42, -2, 15, 24, 14, 11, 1, -52, 36, -92, -10, 41, -16, 27, 22, 19, -19, -37, -18, -15, 0, 26, 30, -14, -7, -33, 0, -3, -5, 6, -16, 17, 27, -1, -25, -28, -22, 58, 45, 21, -3, 26, -2, -1, -44, -2, 2, 70, 0, -7, 3, -41, -3, 9, 6, 29, 4, 6, 8, 14, 2, -45, 36, -4, -30, -39, 5, 17, -30, 23, -35, -50, -24, -1, 27, 56, 46, -46, -5, -41, -29, -6, 48, -28, -5, 12, 6, -5, 16, -38, -51, -1, -21, -7, -28, -5, 10, -43, 53, -72, -30, 20, -35, 42, -8, 40, 35, -26, -11, -10, -14, -48, -2, 44, -32, 32, 4, -26, 14, 27, 22, 44, -27, -67, -30, -14, -37, -12, -60, -21, -40, -17, 30, -64, -12, -14, -54, -19, 71, 10, 8, 25, 41, 17, 13, 29, -8, 34, -74, -22, -17, -9, 27, 13, 22, -5, 27, -37, -40, -23, -20, 30, 27, -35, 19, 1, -31, -10, -21, -66, 56, 61, 2, -46, 24, 59, 63, 0, -28, 27, 44, -24, -5, 2, -41, 19, 10, -48, 3, 51, -46, 49, 27, 2, 18, 33, -37, 40, 11, -7, 18, -8, -25, 68, 53, 51, 5, 24, -35, 3, 18, -18, 0, -25, 21, 2, -20, -19, -24, -5, 50, -5, 5, 3, -35, 9, -1, -19, -1, -17, 33, 6, 25, -45, -69, 11, -2, 4, 15, -5, -20, -3, 28, 15, -11, 38, 24]
6885B4oJ4l9k5J8k0Q2m1Rj2K8n5RK1J8j9OL1k6j3j9K1k8l1M5l2O6K9m9J2k4RK1
6918B4l0J4K1m7M4o0K5K4L3q0N5j2n5K3k5OO2o8K3M3o1N6l5rM7l7J7j1L2m0j8
6949c9jN3J7plo6N4K5J3o9K4o7Q2j0Jn1J6N0q3O5n2J5L2k0M0n2J2j4K5jqj1L0
6982@o7O0kj3K2j4L6mMJ8p2P3k4l7j4R5ln7j2OL4l9J0J1lj3k3Pk1N9qk5qj7O5
7017B4l5k1N8j4l1J2N1j3k5k2m0P2k0L8l7rP2p8L5j9J6n4O3Rm4L0l3J9m0qR3k8
7049B1m9M9l5m4O7JrN4k5k4j4K4J2p1J3L5j6l1M7j5j6O6k2J2q2L8O4%n6K7o5O0
7081A6k6j3L9l2J5Kl2P8l4j0K6r7N1K1KL8m8p4R4ol6l0J03n0o2N5N0l5n4N6jj4
7113hn6P7pmK6j3K2o6K8J3M2qo3qPJ6J6p4O0j2K6qm0j5M0j6O2l3o8O0j3K5k4R
$$ y = [24, 18, 32, -7, -32, -14, -34, 48, 7, 16, 4, 32, -23, -14, 7, 25, 6, 12, 43, 17, 4, -15, 6, -22, -53, -8, -40, 26, 55, 6, 18, -6, 3, 24, -6, 8, 29, -18, 26, -34, -9, 15, 48, -32, 23, 11, -44, -21, -46, -40, 22, -46, -23, 20, -41, 15, -20, -29, 18, -19, -2, -13, 19, -21, -39, -40, 13, 30, 23, 20, -46, 8, 33, 46, -23, 1, -66, 16, 6, 7, -44, -28, 22, -61, 4, -48, -33, -1, -21, 19, -33, -21, -35, -10, -11, -19, -30, 0, -67, -7, -9, -22, 0, -14, 22, 18, 22, 40, -32, 41, 17, -20, -34, 61, 58, 1, -11, -5, 29, -10, 0, 11, 8, -5, -28, -21, -42, 17, 9, -16, -24, -41, 24, -11, -32, 26, 12, -19, -7, 44, 31, 6, -16, -56, 16, -4, 34, -3, -12, 60, -18, 17, -2, 14, -40, 23, 32, -12, 18, -15, 4, -36, -44, 49, 21, -28, 21, -14, -58, 9, 10, 1, 55, 30, 6, -8, 16, 28, -43, -30, 5, -11, -42, 5, -10, -26, 40, 18, 30, -52, -14, 50, 50, -6, 21, -44, 16, -10, -23, 16, -16, -1, 1, -31, 47, 13, 3, 29, -68, -17, 4, 6, 44, -4, -78, 16, 10, -26, -56, 47, -3, -65, -10, 40, 5, -49, 7, 6, -8, -64, 13, 6, 2, 28, 15, 37, -29, -1, 12, 54, 46, -17, -25, -18, -2, 14, -60, 0, -12, 14, 6, -34, -49, -9, -25, 37, 4, -64, -4, -17, 8, -16, -7]
7147gJ3qN1q2K2M3m8O8m4j6M6p3KjP4o4K6kM1r8M8K8j1M0m5K8m8P6j2o5J6L4P
7180C9o1O4o3J3J0m5Q7q2M9oL1K6r0rO1J2J8q9N0Kk2N2o1Op3N9J4m4J12k5k7k0
7212a2L7pJ9o4j4k0R6l5j8QM0l1j7K1K5kj9j7K0J2k9K5k5KL0J7o7N1k5Lk6n3O7
7245hm1N7j2K4jj1l7O4Qn3j0L5Np4P9k1J8p9J04J8m4l7L2rK3J0o7L7J0j0k6nK
7278a9J9m3M9j6NO1q1%N9m5O2r0K0j3OK7nJ03j01k4QM8p5O4m0kM9ol8qM0mqJ6
7312A8m3K6K6qnj9m7N7k7M9l5k3lM0j2L0nJ4J4q6P5q1qQ6p0pL7J3QL6l5k7Rk9
7346c2K9K9k4p7N5K9k6K2Ro4K0k5L4L3l1NK9j0L3q3J01n8J7p3L5j8O7l4M0Rq0
7377c9R6k7n5L8k2K8%j4Oo1N2k1Kl8J31p6K9m4j5J4L8n3N%j5M6kJ7K7m5l1L2k
$$ y = [-7, 6, -2, 49, -33, -11, 32, -16, 52, 8, -8, 38, -35, -33, -34, 40, -24, 2, 0, 41, -57, -9, 19, 8, 48, 3, 31, -17, 59, 47, -18, -2, 32, 39, -22, 42, -21, -8, 2, -43, 44, -38, 11, 5, 36, 62, -28, -37, 24, 36, 54, -35, 15, 17, -5, 47, -14, -8, -81, -22, -8, -52, 60, 35, 8, -12, 25, 18, 37, -27, -41, -61, 35, 0, -18, -10, 30, -1, -18, 3, 28, 26, 7, -10, 10, 22, -7, 18, -7, -5, 25, 42, -25, 26, 1, 4, -22, -75, -8, -49, 8, -4, 20, 19, 8, -29, 35, 43, -10, -20, 15, 20, -54, 25, 4, 22, -57, 47, 65, 21, -16, 16, 7, 30, 40, -27, 10, 20, 10, -16, -21, -19, 0, -43, 6, -10, -5, 56, -25, -25, 34, -11, 51, -39, -19, -32, -26, 1, -4, 99, -2, -26, -18, 30, -45, 19, -21, -23, 26, 20, -18, -26, 14, 10, 2, 18, -25, 1, 27, 19, 14, -5, -52, 5, -22, 27, -8, -31, -34, 6, -6, 24, 19, 33, 47, -39, 36, -45, -53, 33, -37, -44, -7, 6, 14, 50, 15, -12, -3, -32, -3, 26, 2, -75, -20, 9, -17, 5, 14, -50, -30, -55, -21, 12, -19, -14, 15, 5, 38, -45, 56, -2, 15, -58, -23, -41, 26, -8, 32, 41, -39, 57, 30, -25, 13, -9, 19, 19, 5, 11, -50, 2, -19, -17, -55, 76, 0, 29, -15, -30, -16, 22, -31, -26, -26, -41, 5, 3, 20, 47, 2, -29, 3, 1]
7410An7Q7m3J1Rj3J4j1J2m0K7K4k4l6L2pN6n5NJ3J7m1O9p1j9N0j2PJ3o6Q7n8k9
7443d8L6kLN0j9j4N0n7k5j3N7k3Pj3J4Qm5N0l1j3M2l2ol3M0l1K6O5n1n6O2jj3
7476a6k6J3qM3rL0l1Mm4N1K1l8Mj1J1k4j7J9KL7j7K6qk3K1L2j4j8KK6o3M0M5q
7510E2n1J0RJ1jp0K9M5m2k0L0n6N5k2N1k4No5L5K3J9K9m6n1N6Jj9O6o1kj8J5J7
7543A0Ok6O1q7J9LJ4l0N6j4J5n6K0j7K3L7rk8pPK1Mn3J5o0Q1Nk2o5NO7lm1O0%
7578A1J2k4mL9qk2MK0k1j9qm3R0m2J3J7l6J2kL2n0N2L3k8mj13J01Pqk0oM0n1L8
7612A2l0O5p2K9j8j4oO5l6PKq7M7K1K1l9O6J8k7j5p8P8p3P0PN6m1j2n0P1J3k9
7644B1qN3r2L2j1l4N6k4L4rm9L1m6qM0l3J20r0K1nJ6k4j0O7n1L7m7ML8j8j6L7
$$ y = [1, -56, 31, -12, -1, 8, -5, 9, -2, 10, -30, -3, 21, -3, -39, -7, -14, 42, -13, -8, 5, 22, -19, 50, -21, -40, 10, -2, 5, 18, -48, 39, -19, -48, -12, -14, -11, 39, 20, 6, 56, -1, -26, -39, 18, -5, 2, -11, 3, 11, -34, 16, -15, -28, 14, -18, -24, -57, -17, -48, -22, 43, -8, -64, -2, -3, -16, -42, -29, -37, 6, -3, 27, -4, 0, -44, 7, 28, -10, -6, -17, -6, -30, -47, -28, -26, 11, -6, 20, 12, -11, 10, 42, 28, 10, 12, 38, -25, 15, 60, 52, 1, 11, 20, 31, 30, -40, -11, 34, -8, -28, 2, -54, 1, -21, 30, 6, 11, -54, -19, 4, 23, 52, 6, -45, 11, 12, -7, 59, -2, -4, -22, -7, 10, 16, -10, 51, -36, -17, -14, 0, -30, 26, 12, 27, -29, -9, -26, -3, 34, 25, -3, -10, -3, 18, 22, -31, -16, -76, 5, 10, -12, -77, -72, -5, -8, -49, 11, 11, 23, -1, -5, 34, 26, 4, 8, 28, 7, -12, -20, -63, 27, -15, -2, 15, -21, -9, -11, 21, -29, 23, 56, 28, 24, -89, 12, 19, 11, -9, -15, 25, -26, 12, -18, 47, -25, 4, -14, -28, -34, 31, -5, 2, 4, -83, -36, -15, 6, -33, 33, 51, 24, 9, -69, 9, -64, 6, 13, 69, 28, 16, -34, 37, 50, 21, 13, 66, -26, 6, -5, -39, 17, -7, 27, 18, -31, 0, -46, -54, -14, -47, 73, -17, 4, -1, 15, -9, -19, 48, -3, 34, -13, -9, 29, 11, -5, 32]
7676C2j9m0pJ05o3N4qn0j3J9J8j9rJ4p7M3J7L2k5nM4m8J5M1o3M5k1k5L7l6Jo4
7708g5P7l1K4J1p2O7QmK8p9P9k6K3j5l0O3l9L5l5M2l5lj3K6m3J2jL3Km0j5M3n5
7741c8M2ooK5p6N4l3O4J9m9N4q1P8Jk6j7J7o0O5l3J5j3L9o4N2K5m0J6nm9jP1m
7774C6m5k1M4o5N2K2j0j2O6r1qL5j4l9Ok6P5kQj9N2n6K3k8Rk1R7m5n1N3o%l1J2
7808@J5k6k1K1KJrN7p2K7P5k7o8K5mJ5jmj3J7Kj6Qr4R2kjj9K4M6q6OJ7LL1p6M9
7845fJ5l6M5p2J10k0l1J1j9j8O4l5l9O1lk8M2n0kK4Qj8k0K5j1K4M5p0K6Qr5N0
7877a5J4MK2j1p5O7N3n0m9KR1q0R8o2J0j8p7J01pJ0n5mk4R2o4M8n7N6nm7RK7j3
7910iL1n4J4J6J4k6kk3k5P5n3L5NlK2j8L7n2L7jj5O3m1j6jk8m0P1l3Rn9J01j2
$$ y = [32, 13, -27, -34, 71, 8, 62, 54, 4, -9, 10, 28, 9, 0, 14, -63, -20, -3, 29, 4, -1, 43, -5, 10, 51, -12, 33, 12, -13, 24, -12, -11, -75, 2, -29, -5, 6, -66, 1, 9, 5, 33, -46, 33, 7, 30, 15, -15, 48, 9, 44, 9, 51, 16, 13, 0, 26, -17, -5, -6, 27, 29, -11, -26, 17, -38, 4, -2, -8, 17, -59, -5, -38, 26, 45, -4, 50, -31, 47, 48, 22, 5, 22, -38, 27, -6, 9, -4, 35, -29, 23, 48, 8, 24, 19, -30, -31, 40, 36, -9, -30, 14, -51, 1, 23, 13, 1, 67, -24, -32, 3, -11, -50, -44, -70, 5, 3, 11, -8, 44, -12, 11, -17, -8, -29, 68, 23, -28, 25, 19, 19, -12, 0, 15, -11, -32, -11, -9, -8, -17, 40, -32, -5, 70, 43, -25, 0, -4, 11, 10, 6, -7, 10, 12, -4, 4, -90, 2, 0, -1, -20, 4, 50, -36, -30, -13, -10, 21, -55, -6, 9, -27, 18, -54, 56, 36, 5, 16, -3, -21, 43, 8, -31, 30, 27, -1, 41, -9, -11, 13, 21, 3, -17, 8, -3, 21, 66, -4, 22, 30, -65, -15, -1, 3, 25, 14, -61, 6, 59, 9, -40, -38, 53, -27, 71, 9, 19, 1, -76, 25, 18, 28, -27, -31, -55, 37, -27, 21, -36, 20, 15, -32, -23, 4, -9, 22, -32, -18, -2, 12, -14, -16, -39, -64, 11, -42, -7, -2, -5, 17, -1, 36, -16, 21, 20, 5, 68, 27, 11, 10, -18, -58, 13, -20, -11, -70, 31, 19]
7943A9j3rK4K0p2OL7M0m3rl8QoN5Jj9n5N1on0R7m9K1l2J1J2J5n6R6j07K8rL9J
7977HJ5k2k1P1p2O3po7M8L2n1j8P9o1JkL6j7k6MK6m9Lk0L9m8L8J6K8O7p3k9J1
8010BO4n5k2m3P5k0k5QoJ6K7J3r5P8Qj8j0M3o5N0j1j0Okl7M8Jo1J7m6N0M5n6O
8044b5j5oO3Jl6n9N7qK5k3%K4nJ2m4J0K5J2l0K2K2k0kJ4RPj8pm6N1N6n0l2Ol0
8079d0kL4p0J08m5l5L0k4K2O1j6l6K7l7K9l5LRM1L8o9QJ2k9M0m6K0m9N3j6Nl9
8111d8N4M4j4k3o8L8K6m2O5j3l2j8M7L2n9L7l5J2nK3oN5j00j0P9k4O4p4l8N4m7
8142b6K8M7l0n7R1n8o5P3l7P1K5o8QJ6KN6q3O3p6K6L8k0n5L8m0m3L0L6P0Kp1L7
8174B8N2j12Q0q4O5l5O0k3n8K2k5QJOJ6k0K
$$ y = [19, 6, -3, 21, 41, -31, -25, 12, 52, 9, 0, -38, -30, -36, 19, 20, 1, -54, -3, -9, -59, 38, -11, 10, -22, -11, 1, 16, -40, 56, -51, -23, -32, 7, 8, 23, 1, -20, 51, -21, 42, 35, -32, 16, 48, -3, -21, 58, -3, -2, -4, 32, 15, -11, -7, 19, -30, -27, -47, -8, -56, -18, -2, 26, 93, 20, -9, 2, 66, 11, -11, -54, 21, 1, -24, -16, -22, -6, 21, 34, -61, 17, 25, 7, -3, 40, -25, 25, 14, 4, 10, 8, -29, 19, 20, -41, -24, -70, -20, 25, -31, -25, -40, -46, 17, 18, -18, -77, -20, -28, -3, -26, -26, -2, -7, 5, -39, -29, -4, 8, -22, 0, 22, 2, 0, 14, 23, 30, 12, 5, -41, 10, 66, 16, -16, -10, -40, -42, -8, -78, 30, -15, -50, -20, -44, -22, 39, 23, -13, 14, -23, 6, -29, -26, -17, 24, 62, -7, 1, 13, -16, 24, -22, -2, -51, 2, -14, -9, -48, 6, 50, 36, 13, -55, -17, 9, -33, 32, 19, -13, -31, 16, 48, -11, 26, -9, 3, -2, 21, 15, 70, -30, -40, 39, 15, 79, 5, -33, 21, -26, 2, 49, 19, -38, 53, -5, -70, 3, -34, 37, 62, -6, 2, 18, 20, 76, -7, 56, -20, 6, 44, 24, -31, 7, -33, -76, -46, -10, 60, 62, -9, 28, 80, -32, 48, -36, 29, -6, 54, 31, -27, -5, -30, -22, -21, -15, 1, -19, -17]
8191a7
$$ Imaginary data points
##PAGE= N=2
##DATA TABLE= (X++(I..I)), XYDATA
0@%%%%%%%%%%%%%Qj6J6j6J6k1K9l2M0m8N6o5P3q8J04j20J37j55J79k04K29k60
35a38K93l31L72m15M63n16N73o35P05p81Q65r57J054j160J278j408J551j710J887
54I90k083K302k553K841l173L563m027M589n291O197p414R146j1828J6593k7623
69a7771J02351M1137j61003o0852j7478K8775P890M0990O6779P3173n374p2728
81B5889q0543m796M8104M3018o694j7576K773J5650k1964n4400l3796L5585O8848
94B0098L5948k2117k9379O455K8858j343m0333l6499O165K4600m908l6829j3950
107f3234M4558P0280L0595k5942l8612r759L631k1782m4067j7162L6168N3023
119A7697J4794k7300k0801K0036L5702K845l4413k8426O238J7434r270k9815o069
$$ y = [0, 0, 0, 0, 0, 0, 0, 0, 0, 0, 0, 0, 0, 0, 8, -8, 8, -8, 8, -13, 16, -16, 24, -24, 32, -33, 40, -48, 56, -64, 73, -82, 97, -107, 122, -138, 155, -176, 196, -219, 244, -272, 301, -334, 371, -410, 455, -502, 552, -608, 670, -738, 813, -897, 990, -1093, 1209, -1344, 1497, -1676, 1887, -2140, 2449, -2842, 3355, -4059, 5087, -6741, 9852, -17771, 84580, 125717, -35286, -96138, -113616, -84841, -76951, -35961, 30818, 103991, 98617, 25889, -54654, -59450, -11346, 31672, 24978, 7402, 10175, 25825, 3861, -50539, -84335, -48750, 20098, 56046, 33929, 4550, 11005, 39863, 38520, -1813, -38312, -32147, -7547, -12455, -49284, -63234, -18676, 51604, 82199, 56257, 17645, 7886, 11517, -10265, -54332, -71494, -35326, 17697, 32491, 5191, -15610, 4426, 40128, 42973, 8560, -19866, -13628, 3806, -5464, -35279, -41348]
132d1348L7861M4203K65m2143l3876R345L1908J4608o246K667K1532O050m2548
145B278o9812l5105L2248O7635M8181J3214J658K456j8730n6591o4618j7535M6530
158d8191O5903K9944j2550j9580m321m417k2788k4283R335M5191L7863r070m3627
171e91l1201M171J7128R15r308Q583L0169J9754j6400l3950j0226K3301K3086
184B5431r469l1067j5914J2582J6441k628r406J2300L3171J7619k2617m2254k0172
197c5983J4101K0683Q03j0225N131K1673R933j8792k6528r74K5768J9589j0673
210A4506k5612q216J5187J3155p620j3764M721K0428P336k0360k5598J929K9351
223E443K4165m647k0860j0206L243l241j7919j0980J9671L9960K3013j4853l3215
$$ y = [-41348, -3487, 40716, 40981, -1162, -35038, -25693, 6215, 20823, 14577, 17244, 38776, 44826, 2278, -67534, -102639, -70391, -2756, 45425, 58639, 60297, 62753, 44023, -12568, -77186, -94721, -48191, 17712, 47656, 35106, 15526, 11205, 6788, -16000, -40283, -30948, 14243, 52106, 43036, -591, -31792, -27621, -10493, -9578, -18886, -10303, 19866, 39620, 23220, -10730, -20956, 2345, 25431, 15962, -15105, -31019, -18437, -1996, -4624, -14030, -1730, 31441, 49060, 26443, -15811, -35983, -21882, -1199, -396, -10621, -5490, 16183, 26116, 7324, -19204, -20178, 5590, 25179, 14506, -11106, -19322, -4135, 9020, 1400, -12364, -7643, 12785, 20121, -239, -25837, -23908, 5443, 29608, 24961, 4101, -6105, -2862, -6103, -24022, -35002, -15331, 24629, 47642, 32789, -426]
236d26j8674K258M146n251k87K0237K8417O182k6030l2166o882J8476J6956o97
250F259o419N256J1522l458k2366j7935Q963K6588J3988j1705j9081k693J1449
263C68N053r112o859J1118J8193J35k2454k0853M056K2168J4022n509j0232J781
277A875P408n237j8671j0079J4215K5342R263j4522j8312k039R653K881p994l141
291i358J2541J5669k682k1041j6333O224J9402R472p496q798K971O647n531j5840
305a4153o062J5199K1921M894j5572j5855k0Q905J020p864j055J3359J4194l801
319A5110j9468j3231O595J5391M560q579o096N886Q147m169j3114m224J2536J5025
333A4369r80j5407j0927N116J1285J910p282k205R016P843p357j6876o643J1931
$$ y = [-426, -19100, -16842, -12696, -17947, -18234, 2003, 30420, 36602, 10572, -21594, -28476, -10000, 6956, 6259, -160, 5096, 16618, 13160, -9206, -27141, -18178, 8410, 22398, 10693, -8388, -11081, 368, 5421, -3691, -10550, 568, 18761, 18896, -3558, -24411, -20355, 1813, 15835, 10326, 94, 1875, 9283, 4046, -14625, -24704, -10489, 14853, 24116, 9594, -8718, -10757, -1104, 1777, -6217, -9358, 3183, 18852, 16170, -4871, -21204, -14980, 4422, 13894, 6398, -2400, 571, 7218, 1687, -14153, -20215, -5016, 16905, 21799, 6227, -9628, -9648, -743, 277, -7587, -8642, 4717, 18911, 15110, -4358, -17589, -10994, 4397, 8957, 378, -5718, 168, 8315, 4146, -8968, -13192, -656, 14369, 13389, -2018, -12945, -7829, 3456, 5366, -1916, -4121, 4895, 12738, 5381, -11495, -18138, -6207]
347f207J6696L487r905p719K903M030n937j0804M43J5353J4568k320j5146r662
361a0220M701Q927K8o725o88Q485N116q719j4557k856J3758J5984K160r606p312
376a524R85N33p453q429M326J7034J3542l885j5432r891K745O075m73k936M820
391C7J2019N011j1032j7940p154Q203J1204K822k456K865Q553K737j0031j3984
405i146l703Q184P368k869p050R48R905P110l797q485j480O072K697p127q996
420a0369J165J0811P409m398r334k196O353M808l225m446L841R726K921r928j3327
435a0189l673P001O634o51k463M252Q681K308q158r266L19Q034L717o551r171
450i176j204O467M847j348o89O468R147L32j1819j3626l275O607O410J69q07M418
$$ y = [-6207, 10489, 13976, 4071, -3648, -745, 3285, -2652, -13456, -13013, 2340, 16908, 14588, -558, -10220, -5519, 3408, 3436, -3289, -3977, 4508, 9624, 905, -13652, -16508, -2750, 13234, 15394, 5788, -1524, -539, -6, -7459, -15888, -11562, 5472, 19014, 15129, -303, -10194, -7449, -1374, -1847, -4783, 37, 12056, 17067, 6035, -11905, -19059, -10856, 348, 3170, 714, 3579, 12132, 14869, 4838, -9146, -12849, -4665, 2703, -166, -7216, -6268, 3637, 10747, 6950, -1535, -3015, 3057, 5754, -1373, -10369, -9204, 1607, 9016, 4618, -4716, -6912, -559, 4249, 1024, -3422, 419, 10145, 13066, 3138, -10189, -13862, -6861, -227, -878, -3341, 911, 9592, 11900, 3742, -5524, -5205, 2829, 6546, -5, -9176, -10380, -3913, 934, -414, -1103, 5365, 14512, 14844, 3025, -10601, -13876, -7269, -859, -690, -1497, 2921]
466B921N845j817j0359q305L676J2084P925k211o613k688l41m543q870l765Q299
481h762J4784Q529k607o321j995Q21l642q833n495M245R309M213l401l280L678
496A243O670O64o801o154J340N182N13n535l995L254O044M01o170l594M655Q674
512F391L287m311m691N97J810l696q186m066N496R450M072k861k470K927M123
527G872j604p136m866J843L797j303n831k138O261R151L278l505l564O08J069
542C932m152p278k208O200Q048J302n549m711J280L532K19k537J324O600N227
557A1229l477j0077p574K86M272J984j8L172P382N277l009q634n842Q56L046p93
573a920l621q3N177N089p62m499j524L877L713j899n488k163L442L695j688m998
$$ y = [2921, 8766, 6949, -3410, -11715, -8039, 4045, 11970, 9759, 3146, 458, 117, -4426, -13296, -17061, -8762, 6022, 14551, 11944, 5623, 3628, 4449, 807, -8026, -13521, -9276, 33, 4246, 845, -2435, 1243, 7913, 8577, 1776, -4378, -3038, 2144, 2657, -2878, -6873, -3619, 2425, 2826, -3344, -6938, -2283, 6391, 9678, 5367, 676, 1273, 3083, -613, -8799, -12865, -7369, 2081, 6153, 3292, 822, 3749, 7872, 6268, -868, -5734, -3891, -94, -1397, -7228, -9366, -3105, 6046, 9324, 5819, 2255, 2863, 3932, -220, -7498, -9706, -3506, 4542, 5844, 295, -4416, -3136, 396, 615, -1922, -598, 6002, 11229, 7752, -2325, -9899, -9613, -5341, -3357, -3375, -203, 7179, 12456, 9447, 813, -5029, -4173, -1127, -1920, -5541, -5624, -447, 4642, 3880, -619, -2143, 1734, 5447, 3548, -1940, -4103, -661, 3034, 1346, -3652]
589c652j635L654L783r53l467M16N479M207k289o470l598J487K095j794k997J435
605d299O213M911j248m819j774K572J894k963m998j093L683L372j250k827R31
620a695M990K974k822n464j803K998K749j473l011N47L778J832l507m820j0N008
636B71M330n72l088n72J880k69m601m497Q12N833M500m88k678j66K313K98l811
653e05m040N67M263K458k025l210N12L611J699k555l271N36L530J370k691l143
669b894Q80L671J354k896l444N48L607J848j957k163J180L269M01l769l726N78
685c513L515J844j735j839J484L130M20l333l025Q98L297J068k484k250J229L201
701A907O61k550k391J189K937M16k916k264J513L412Q23k533k373R64K583K00
$$ y = [-3652, -5287, -1633, 2150, 1197, -2270, -1854, 3625, 7832, 5543, -927, -4525, -3038, -943, -2737, -5734, -4299, 1914, 6825, 5577, 758, -1016, 1556, 3450, 487, -4511, -5604, -1921, 1451, 201, -2626, -1695, 3295, 6269, 3447, -2017, -3820, -822, 1927, 454, -2557, -2010, 1768, 3600, 93, -4727, -4737, 271, 4601, 4029, 941, 369, 2249, 1980, -2621, -7118, -6306, -473, 4027, 3539, 861, 695, 3008, 3306, -505, -4545, -3978, 285, 2743, 718, -2492, -1980, 1631, 3330, 775, -2496, -1960, 1570, 2940, 249, -2894, -2014, 1657, 3011, 115, -3329, -2781, 826, 2674, 717, -1446, -266, 3003, 3404, -365, -4091, -3513, 2, 1846, 111, -1728, -244, 2886, 3306, -27, -3052, -2154, 1143, 2211, -273, -2523, -1294, 1907, 2568, 18, -2373, -1184, 1753, 2169, -747, -3011, -1498, 1914, 2737, 204, -2169, -1205, 1378, 1578]
717A578k617j731J965L344N84k926k492Q90K404K36k364j252J942K892N3k960
733d54k080J217K697K01k340j441J772K600j11k650j677J629K531j52k633j632
749b523J652K583nk275j335J693K257m79k747j439J824K594n6k254j205J639J969
766A893o51k468j042J876K331l22k481j137J611J935n42k114o87J860J939o45
782A356k445r49J735K102m76k189p26J709J730q18k312o83J928J879o60k337n74
799a730J702J573q07k035l62K032J672q07k225n48J598J407r46k037k29K059J564
816A881q13j971l41J714J245j225k155k02J791J555q17j750j9J899J289j160k039
833a118l51J724J172j080j862M6J858J174j143j717J51J835J071j037j780M1J573
$$ y = [1578, -1039, -2770, -805, 2539, 3123, 197, -2295, -1405, 999, 1235, -1129, -2381, -439, 2453, 2506, -454, -2534, -1317, 1380, 1581, -759, -2200, -428, 2172, 2061, -589, -2266, -637, 1894, 1742, -891, -2523, -871, 1712, 1707, -568, -1903, -210, 2047, 1568, -1179, -2618, -794, 1800, 1744, -510, -1715, -76, 1893, 1242, -1226, -2268, -392, 1939, 1617, -864, -2001, -390, 1545, 1003, -1111, -1798, 62, 2001, 1356, -1089, -2038, -303, 1799, 1323, -866, -1592, 117, 1847, 1029, -1283, -1966, -38, 1841, 1181, -1156, -1730, -28, 1545, 738, -1297, -1659, 373, 2045, 1238, -987, -1535, 63, 1470, 524, -1513, -1742, 317, 1881, 1068, -903, -1244, 470, 1715, 490, -1665, -1867, -76, 1479, 662, -1088, -1107, 792, 2081, 921, -1118, -1469, 255, 1427, 347, -1515, -1469, 389, 1563, 420, -1297, -1146, 689, 1760, 723, -1057, -1016, 557]
850E57P16j405j762K37J906J236q43j310L27J722N94j573k018p8J453Q30j013
867d24j135P56J965R48j212j680Q5J522L87j431j520M18J706O84j157j253N47
884g94J767O92j069j320L92J367J34j673j571M10J663P02p78p45R74J646L91j590
902E98j542M2J171N1j351j033R49J825O67q82q66O70J279q3j805j328M45J335
920A42L37j056p81R43J405K88j147q16P90J343K0j621j232K46R21k4j043k38J441
939h2J829L86j128j115K41N99n27j554o80R99J484L28r84l65R16J200j93j356
957bq03N42Q65l86j309n68R02J343J32q58k31R92J087l88j405q36M28O65m47j161
977a438k04J239J329J50p92k88P85O35p07j496o44O95P99k36p69j6J285J163j69
$$ y = [557, 1273, -132, -1894, -1657, 249, 1485, 642, -668, -341, 1381, 1975, 402, -1616, -1694, -241, 589, -424, -1559, -803, 1162, 2110, 898, -782, -697, 825, 1212, -219, -1739, -1321, 385, 1069, -88, -1341, -794, 973, 1665, 596, -724, -332, 1035, 1169, -504, -2075, -1665, -2, 700, -78, -823, 151, 1797, 2188, 598, -944, -902, 269, 320, -1031, -2064, -1115, 710, 1377, 495, -371, 299, 1578, 1495, -310, -1638, -1193, 142, 479, -577, -1358, -415, 990, 1278, 131, -685, 105, 1448, 1468, -153, -1385, -1139, -218, -242, -1285, -1523, -82, 1747, 2133, 1005, -110, 131, 730, 203, -1351, -2031, -1032, 452, 780, -204, -569, 347, 1547, 1354, -2, -805, -263, 602, 216, -1093, -1661, -759, 584, 716, -142, -373, 619, 1706, 1318, -87, -923, -495, 170, -277, -1438, -1642, -403, 926, 1076, 284, -4, 781, 1416, 709, -787, -1431, -736, 63, -173, -942, -958, 327, 1490, 1321]
996A321j081m74N39M49p61j183j86R73R24k31q78n6R93Q24l00q77j12O88L76r52
1016dj250m21Q87R16Q1l77K76J002M57q11j292m42N94N76m41p01J89R87O53m17
1036D62p54O9P99N59o49j063k24N87L62m78o83K51J123N95l87p36K5P22K72p62
1056I0r39M7O28M50m68n46L32R97N09n74p57o3O41J36p18o90J64P67M80m13n26
1077d53L75Q09K18p18p70R2N38K86n23o35L51P71K44o22n05K92Q05K68n78o17
1097c72N5N21M9o63n12M55Q39M04m72n08L2N71qo71m44L27P34J63o05m48K66O70
1119C83J52n87l53L45N92o5o89m62L57O44M4m88l36L20O22n9n52l85L95N04J4
1140C96o37l41L69N17R0m87k49L52M95r2o26l96L59N68m8m83k67L52M93l8n50
$$ y = [1321, 240, -234, 305, 754, -7, -1190, -1376, -403, 521, 290, -588, -644, 349, 1173, 873, -4, -116, 572, 948, -4, -1254, -1675, -788, 128, 209, -168, 108, 1110, 1567, 756, -536, -978, -384, 192, -249, -950, -761, 226, 879, 462, -292, -223, 576, 1135, 486, -577, -801, -214, 148, -330, -1013, -762, 361, 956, 569, -167, -142, 580, 852, 90, -849, -802, -174, 276, -192, -738, -406, 591, 1100, 526, -231, -294, 347, 483, -235, -925, -761, 6, 486, 73, -453, -78, 731, 949, 231, -539, -447, 91, 377, -146, -781, -430, 341, 585, -37, -542, -250, 555, 823, 245, -372, -317, 204, 253, -410, -922, -467, 372, 776, 304, -204, -172, 399, 391, -280, -724, -397, 337, 500, -105, -553, -287, 383, 535, -52, -405, -60, 532, 467, -222, -684, -327, 317, 361, -127, -463, -143, 479, 420, -132, -517, -122, 382, 396, -241, -582, -213, 304, 394, -93, -342, 10, 505, 413, -213, -609, -250, 318, 270, -213, -480, -128, 365, 327, -223]
1161b23j97L86M41o3n63l10M05N26j12n05j85L68M71j83n32j83M33M12p2n73j44
1182d03L45M27j71m94n6L30M38j26n41j63L65L82j40m50q6L81L29j63n18p4M49
1203F1K98j82m16j03M47L11k47l26j28L71L14k93l97k2L75K82k10l96m6L42K45
1224B80j33m02p7N21K25k53m79j9L94K20j74l46N5L75K26l24m22rL43K70j90l35
1246b54K9M25J04l10k47oL80K33k53k73j3L53J15k57l20J27K83J80j93m01Q5L04
1268I1J42k92l02J80M25R9j94l59P4K43R5k85j61P0L64J11l25k56P3L02J79k37
1290C7k80J77K71N8l41k42J31L43J11k26j91J42L37m9l51k65J75K83L9j99k42
1311b82K03L06k2k96j76J33M17p8k79j76J40K27Oj88j65J98L43k8k59j69M5K38
$$ y = [-223, -420, -34, 407, 344, -219, -529, -124, 402, 290, -215, -400, -32, 439, 256, -276, -459, -26, 386, 314, -259, -403, -58, 369, 198, -296, -352, -22, 416, 290, -251, -414, -49, 333, 193, -257, -343, 38, 367, 204, -314, -388, 61, 359, 177, -239, -342, 105, 416, 169, -157, -285, 86, 400, 107, -290, -312, 63, 345, 135, -261, -307, 35, 280, 147, -255, -332, 189, 414, 161, -318, -337, 57, 277, 103, -243, -188, 187, 413, 89, -333, -342, 1, 271, 81, -254, -225, 200, 304, -6, -253, -259, 121, 354, 101, -172, -185, 168, 283, 26, -294, -167, 116, 296, 103, -298, -213, 91, 233, -59, -361, -181, 244, 343, 149, -210, -136, 107, 202, -83, -244, -174, 190, 301, -24, -280, -207, 95, 274, 37, -243, -66, 205, 263, -78, -320, -189, 154, 265, 39, -152, -10, 327, 278, -73, -338, -163, 120, 159, -40, -282, -79, 227, 205, -91, -267, -134, 283, 205, -74, -250, -110, 117, 123, -65, -230, -32, 311, 283, 24, -145, -100, 138]
1333A38J2l29j14J83K66O5k86j50K17K47q6j77j80K06J73o0l19j78K04K73J27
1354B32k25j24K54J24j29k94j24R3K69K3k14n4J13K77r2k20q4K61J83o1l03j42
1376b37R7J77r4k16R0L08K40p1k60j25O9J43j32k11m2K60J58r3j86K2K05J79j64
1399A17j40j20J31J52j87k05j5J84K49n1j14KJ60R9r9k29j08J64jn1j67P0K45
1422H6J37j16j39j3J43J27j48k05o5J70J00j97r0O5K93O0K5k37k0J33Rk00j80
1445b62K0K20J40j76j38R6J84J15o1j67J8J58k9j13k34k1K01J59n4q9O1J76J7
1468B21j91j69M7J54M1j26j58M0J54J08n3p5L4J33J23k79j44JJ27P6k18n8J26
1491h6J83Jq9n6Q4Q5L0k47k0pJ25Q7q4j32J49J08N0k07p0N4Q6P3j73j31R9R6K2
$$ y = [138, 150, -179, -293, -110, 156, 221, -65, -215, 2, 249, 163, -14, -194, 12, 185, 125, -194, -372, -168, 105, 232, 7, -117, 137, 261, 132, -162, -286, -193, 76, 99, -115, -169, -56, 221, 129, -91, -175, 86, 269, 208, -95, -237, -140, 37, -57, -273, -183, 125, 365, 294, 34, -91, -22, 121, -11, -222, -264, -4, 154, 61, -125, -103, 102, 281, 117, -23, -143, -12, 140, -47, -252, -267, -83, 166, 115, 1, 3, 163, 262, 163, -66, -174, -10, -11, -62, -229, -159, 86, 223, 107, -32, -45, 98, 225, 77, -128, -193, -23, 77, -120, -210, -145, 148, 208, 233, -4, -24, 109, 118, -82, -262, -242, -22, 118, -58, -196, -100, 84, 199, 138, -29, -11, 147, 118, 5, -229, -250, -49, 110, 56, -33, 28, 204, 221, 30, -139, -92, 62, 103, -23, -181, -141, 13, 121, 68, -7, 27, 160, 283, 4, -140, -139, -12, 64, -154, -212, -86, 97, 98, 9, -47, 37, 122, 152, -95, -115, -122, 3, 90, 6, -126, 23, 131, 181, -26, -96, -42, 44, 117, -56, -187, -88, 8, 30]
1518C0q9p5J52J75n5j13k13J22N6L1j09o6J59R0o3j08k5L6K13j8j42p2rJ29n7
1543b1j13m1J87J66r2k7j20P4O7K7j53J7N2P9n8j62j7J21J43n5r2m6R8M2l6j55
1569a15k9J29Q7J4j48n5J36M6m0j02j1J29N7j48m7l9J37J28n5j11M9MO6q9p6N0
1595c3J03P9j61J0p4N9O6k7q4NQ3J02j08j47O9P3N7K6j33q1J67K6j39p4O0J21
1621D5M8j00r4L3O1O9k9p8jO1P3q4j44L7J53M7r7J9r6R9O7j60M5m1J27P6j26j16
1649a06L9M7Q8j15j4K4R9Mq8j09M8J68l1l8m3o0J11N5j16m4N8Q6L1j44o0rJ41
1676B2J4l6k5P1L2rp3q7Q5Q1M2q6r4K9J07m4r8jP8R3m5j14o0R0N4Ml9j03Q8J33
1706A09j35p1L7M3J09m2p6j5j5O9lJ1l2J8J23q6q1l3K3K5LJ0KN7P0j18p2J8M7
$$ y = [30, -59, -134, 18, 193, 138, 25, -188, -66, -10, 21, -88, -154, 5, 95, 32, -76, -101, -65, 148, 130, -12, -84, -93, 36, -21, -134, -175, 12, 178, 86, 59, -61, 13, 80, 107, -46, -29, 23, 102, 44, -118, -135, -14, 129, 74, -18, -64, 34, 76, 40, -115, -144, -15, 72, 86, -62, -117, 19, 65, 25, -77, -88, 41, 98, -50, -97, -136, 1, 129, 74, -37, 12, 16, 82, -7, -83, -33, 70, 149, -12, -2, -76, -17, 49, 22, -62, -57, 26, 128, 20, -127, -58, 15, 72, 98, -35, -116, 51, 77, -62, -136, -76, 45, 93, -7, -101, -68, -7, 62, 33, -45, -46, 15, 88, 4, -140, -103, 50, 97, 0, 19, -77, 22, 89, -71, -26, -67, 60, 136, 10, -106, -67, -20, 68, -47, -61, -37, 62, 66, -22, -131, -83, 85, 54, 16, -27, -87, 24, 79, -37, -81, -23, 63, 94, -50, -110, -119, 22, 36, 0, -25, 46, 78, 69, -4, -91, -6, 75, 117, 31, -63, -34, 73, 29, -69, -70, 8, 101, 56, -58, -118, -28, 26, 30, -9, -112, -24, 109, -26, -97, -60, -17, 92, 50, -26, -41, -56, 13, 10, 21, -11, 7, 130, 44, -37, -70, -47, -22, -19, -9, -7, 50, 120, 2, -70, -52, -5]
1735eN0j5nj41J31qo0o3O2O3K9n9l8RJP4j1k1l3R6k4km4j0K1R9n2j32j4P9J34
1766A11r5m7P2MpRo5k4P0kMl1j5l0O9o3m9N3Q6M9n1r4L6J8j7lp4J2J00K3n0n3
1798e4m1O3Q1n3jqM9K9j43j9Q4P5K8J4j36Qm1Q6j6n0NP8jk3j06P9K6qj9k0M4j3
1830cln0qQ6J2J5q0j4O3J2Nm5j2L4J0j8r6L1Q2k9K8m2rN8M8kj08J5K1qL0o2k2
1863f1M9O4m2K4k7j2K7M0j28j1O6Mql3N8k3LK4k7OK7mL5q8J9J1RJ7nl3M1P9m7
1896E4l8k8K4J4j7k8l1N7j2k7L0n4O7J2j4J1q7N3L1k4K3m6L7Q1j29L0k8N0K4o0
1926b5Rj4L6p8M6qQ8l5L2J7n7l0m7N5Mk4M1l9O4j4q1J29k6n5O2o6m6L8J2L4l8
1957a6k7P4l1J8o7k1J15q9K3K3RLk5L8j30K7Q6J9J3n1J1K6K8o7k9M4L9L1o5mm3
$$ y = [-5, 45, 30, 25, -116, 15, 7, -53, -116, -54, 9, 38, -21, -59, -50, -49, 25, 14, -7, -40, 56, 32, 30, -14, -24, -3, 96, 44, -88, -102, -23, 111, 16, -31, 41, 45, 38, 47, -18, -42, 28, 26, 30, -1, -16, -46, 23, -40, -89, -36, 50, 99, 48, -46, -10, 8, -9, -12, -86, -74, 26, 49, -1, -54, -95, -32, 49, -4, -5, -13, 36, 65, -78, -97, -13, 62, 90, 104, -32, -24, -65, 21, 5, -45, -40, 38, 37, 14, -92, -13, 13, 5, -14, -34, 10, -3, -6, -56, -64, 22, 34, 49, -31, -45, 18, 30, 35, -10, -22, 12, 22, 4, -92, -61, 21, -8, 20, -22, -31, 27, 75, 73, -35, -20, 1, -7, 23, -39, -61, -12, 52, 10, 34, 7, -5, 22, 62, -66, -77, -11, -7, -15, -48, 10, -13, -10, 14, -13, -7, 20, 16, 51, -37, -18, -7, 2, 19, 14, -19, 22, 101, 54, 16, -12, 12, 26, 9, -19, -50, 7, -5, -32, -2, -56, 11, 23, 9, 20, -67, -14, 17, -7, 16, -30, 7, 88, -41, -11, -39, 11, 35, -25, -16, -30, 6, -72, -26, -34, 54, 19, 51, 68, 11, -19, -66, -11, -7, -31, 10, -29, 35, 21, -60, 69, 43, -12, 50, -16, -62, -24, -12, 22, -16, -43, 31, 0, 18, -49, -70, 45, -44, -21, 2, 11, 14, -11, 27, -103, -76, 10, 29, 42, -9, 2, 28, 56, -11, -40, 4, 43, 74, 9, 5, -38]
1988c8O0j7o3l0R9kl0qn2P9j2P8q9O1l0j9L7n3L1n3Q8q5J3J7N7jm2m6RP0m0M5
2020C4l0j2J1N3n7k7K4P9p8J8j3k1%M0k4j8j6J7M2n3L7K7n6K4LPp1N9K2J7K0q5
2052b7J5mk6K3jL1J7Mm5k1L3LK2m1K4qJ3J6o4L6J6KK0m9K6lPK1l3o2J01m9O2q3
2086b4jN3l9L5k1Rj3j6M8o5M1JJ9l2K4k5j2ol9R5p4J39n2k0On8L8k0m7J6kN5o6
2119e3L8J3NQNl7mR%J2k0M4J1j9j7J8q7P6m3O7qj13J01qk4L1k1L9J6k9rm3K8Q3
2153F9r4N4K3q5N4Mk9p9N8N4ll2j3l8J6O9l3n7P7l3K6J3n4k1P6k3nM1k4%Nm3N0
2186B3q0L4L8Jl4nK0J5j8O5m4M5j4m2m3mL8L8m7p5J40l6l6J1n9O0M9k5J8ll9Q
2218aqk1p2J27n4pP1n7P4oj3K3p2k9J9P0k7jn7L3j1k4J5qP8m4K8mo3M4N3k7m2
$$ y = [-38, 22, 5, -58, -88, 11, 9, -21, -29, -81, -2, -14, 64, -25, 36, 6, -13, 24, -29, 2, -51, 37, -48, -35, -18, 39, 38, -4, -50, -41, 29, -11, 34, 4, -8, 3, 56, -1, -28, -4, 75, -3, 15, 2, -19, -19, 21, -3, -21, -37, -20, 22, -31, 6, 33, -23, 1, 4, 11, -60, -1, 21, 38, 58, -27, -12, -16, -42, -19, -20, 11, 28, 32, -13, -34, -1, 2, 24, -17, 7, -1, 12, 28, -36, 0, 16, 18, 38, -11, 15, 12, 19, 40, 7, -55, 46, -3, 59, -24, -25, 28, -11, 24, 3, 12, -1, -17, 31, -34, 7, 8, 27, -5, 19, -6, -18, -24, -63, 32, -42, 97, 45, 25, 31, -27, 11, -9, -56, -40, -42, 13, -53, -15, -2, 3, 11, 16, -21, -25, -16, -16, -4, -24, 20, 31, 12, -5, 13, -74, 2, -41, 26, 18, -95, 6, -2, -26, 5, -16, 23, 39, 10, 1, -42, -14, 69, -25, 29, 52, -33, 21, 25, -4, -83, -25, 29, 26, -6, -19, -57, -41, 28, -5, -62, 15, -18, 8, 21, -33, -54, 22, -1, -6, 35, 11, 11, 16, -27, 23, -57, -23, 15, 16, -18, -23, -3, 12, -6, 59, 15, 60, 46, 4, -39, -43, -5, 33, -14, -89, 51, 15, -21, -10, -69, -9, 40, 15, 33, 30, -9, -1, -9, -30, -102, 25, -29, -36, 35, -22, 52, 46, 33, 56, -16, -45, -26, 44, 17, 16, -41, -8, -19, -43, -28, -36, 42, -2, 26, 22, -41, 3, 56, 29, -13]
2251a3LM6q2K1K5j7o5J06o6j3J13n8k3N4m1K4m2j6L4L3K4j6o2P6q5M5L7j13Q1
2280A0mL6m8mj4L6K3k3k2J6J9Jk9%k4K2O2o3Kn7Q0nqp9O4l0l1P4j2K8m0L6J2l1
2314ck2L8m0J7N9j6j0KMLq8R9Kl5l1k7N6J1k1J4pN7n2K0n1N1l7J0k2MLmN9pj18
2349h2R2P5p9j1J8%n9L7L2n8L1P7j8Mr2K4n2O2Mk5J4J2M3o2j9J9M3k6m0N5k1q
2381a0M7k9n3mj1pO4j9mM6jL8o7J1J2lRJ1Rl7QOk9K0n1L0O6m9n3Q4m5L5l8n5P9
2416A0m2P2m0j8L7k4j4K4nm8N9j9j4J2J8j6J4K5Jn8M3m1k5K2O5l8k3K6l2Q8m2
2447A7Kn5Pj4M9L3p1N0%M5mr1N2l5P3n3k1K9K7j8j4k4p6J00l9J5J5l8K1pP1l5
2479A1J8k1j5j6K0lP5p9J1n4L3N5o4N8o8rLJ20m5nj2j5M4Qm7M6J9o5opoLk0O9
$$ y = [-13, -10, 36, -46, -25, 0, -17, -82, 24, -42, -55, 58, 0, -23, 31, -10, 14, -28, -44, -10, 23, 47, 31, -31, 45, -40, 5, 42, -71, 10, 6, 42, -6, -10, -24, 12, 35, 12, -10, 6, 25, 26, -3, -3, -27, -5, 57, -6, -4, -61, 19, 14, 6, -73, -9, -39, -70, 4, -8, 20, -20, 16, 28, -3, -25, 13, -27, -10, 49, 33, 23, 25, 29, 32, -56, 43, 45, 10, -21, -48, 8, 19, -2, 12, 5, 62, 10, 30, -21, 30, -7, 3, -19, -15, -12, -16, 43, 36, -82, 10, 85, 6, -5, 13, 13, -46, -9, 23, -35, -4, 73, 55, 59, -33, -9, -61, 1, 5, -20, -6, 6, 49, -13, -32, -13, 30, 4, -36, 19, -2, -10, 37, 8, -45, -49, -60, -67, -3, -22, -26, 20, 19, 57, -10, 1, 13, 10, 19, 30, 39, 2, 10, 16, -13, 7, -44, -14, 52, 3, -50, 34, -11, 24, -14, -69, 10, -32, 40, 0, -18, 19, -5, -19, 5, 0, -48, 11, -8, -22, -10, 8, -8, 6, 31, 32, -26, 17, -24, -49, -27, 38, 0, -23, 3, -29, 59, 17, 19, -36, -29, -43, 6, 39, -32, 18, 18, 63, 59, -32, 20, -15, 58, 5, -16, 13, 40, 22, 8, -16, -92, 8, -31, -16, -1, -39, -18, -25, 46, 11, 29, 8, -7, -23, -3, -6, 69, -10, 1, -53, -20, 35, -29, 29, -39, -48, -45, 75, 30, 25, 13, -2, 42, 50, 3, 49, 68, 3, -3, -10, -16, -13, -33, 36]
2513C6m7K2k3L0m4k4K4J6o0O9pJ7J1mMm7J9qL6k3K8o5K4M3k9k2O0M4o8N8r7qL7
2546BPK7r3M5M1p1PMK9l1JM4J3n5l5O0k5K4lJ4K6n8rJL0l3M6L4m5j3L9j6PJ0J7
2581D1J2l7l9j3M8M0n7m6J11l3n7L1l4m2J18M1j04J5J6Pj0j4om9P5j0J5l3KN5
2611D3Mq1L5k5O6j6j7kJ2j2n9P0pnL6r4L1JL9qk6l5L1J1J1K7n8k1L7J7m0N7l2
2644a0L5m1K0nL0n0J3%j5L9Oo8R5q9N9P1j12J00o9J8O2p4j4lKj9RJ3j4k7J1M7
2676B0n0N8k4m8R3r9M4M2q5L7k5PlJ0%O6j08qO6j1J6J9j2kj4K4kl5L3K9j8J0p9
2709d9M4j2k1P9J9m4%j1n8L5L0l5N5n4k2P1J0ok7o0N6k6J7j1J8J1rK5j6k4J2l0
2741c3l1K0Q2J8n7j5K4Nn%opMN3n3Mj6K0p6K4P1q6R1m4K5K1m8QK4M7l6p7J9j6
$$ y = [36, -11, 11, -12, 18, -26, -50, -26, -10, -70, -1, -8, 9, 20, 16, 20, -27, -8, -16, 20, -3, 25, -40, -16, 27, -2, -24, 36, 80, 12, 70, -27, -35, 2, 9, 36, -57, -12, 29, -42, -35, -31, -2, -33, -32, 12, 25, -30, -65, -5, -30, -6, -9, 5, 31, -27, -36, -35, -5, -38, 8, 42, -3, -16, 23, 7, 14, 24, 41, 53, 16, -23, -36, 12, 52, -5, -51, 60, 27, -30, 1, -33, -75, 43, 84, -20, -5, 11, 18, 8, -6, -12, -61, 14, 4, 19, -14, -12, 43, 47, -34, 1, -24, 42, 26, 9, 7, 19, 7, -52, 18, 11, 6, 42, -52, -21, -20, 19, 11, -15, -50, -19, -8, 3, 30, -28, -49, -12, 5, -35, 22, -10, 25, -16, 4, -1, 29, -21, -8, -8, -23, 16, 22, -46, 49, -40, 19, 90, -22, 78, 9, 27, 89, 15, 1, -2, 0, -19, -10, 3, -11, -38, -27, 20, -30, 28, 4, -44, 49, -50, -6, 36, -49, -12, -37, -30, -33, -23, -23, 43, -65, -73, -7, -18, -2, 17, 5, 3, -11, 13, 11, -24, 9, 38, 20, 30, -49, -5, -17, -38, 41, 60, 16, 16, 5, -53, -18, 12, -23, 32, -22, -44, 27, 37, 31, 4, -56, 0, -26, -9, -20, -2, 9, 0, 25, 9, -15, -3, -33, -64, -44, 38, 56, -1, -16, 8, 13, 8, 8, 2, -5, -1, 52, -1, 3, -13, 7, -69, -45, 26, -60, 31, -13, 12, 33, -15, -7, 17, 64, 28, -49, -30, -46]
2775d6K8J6KL0l5k2Q3j7o8J3M0m2L5l6J7L0n9RM0MJ3k4n6M9M7j00MK4jK1J0n8
2807d9J5K0J4J6Mn2J%j1K0J2m0P4%k3j2J7K4l3j6M3J5m5K5l6o3N6J6rRJ9Q0m6
2840D5Kp6pL2L5k5L2pmo3K9j9L1K6No6J3mk2Rj0K3ROJ7m2j0J8KK0J5r4J34p2n
2875b3N1l2rJ5J5k8J3j3K4n4n0R7L3l6M2k1l9j2j0L3M5n2l6N5j2l4M4jj8%Nk1
2907b9N3o7O6l5J5K2m6K6K1%n1J3M8j4lM0K7j07K1K4jJ2k3Nl1JKpM7p5L7k3L2
2940@J5o0l1O8P8q9l4N9Ol1OJ0k0L6M6q6L9Jm2pM5M3po7M7j4k7N9nk4Om9O4j3
2974B2m0k9K2K8l4P2m2L3nk6Lo1L1LL5m8k1N6j2j0j1L8m7P9kn2k6M7J2k7J22n5
3006E5j12K1M4K5m7L1MO3n2j3l2M9q8N0m2P3k7J8K7n1PK9j1m9K5k8J5j3rK1L8
$$ y = [-46, -18, -2, 0, 30, -5, -27, 56, 39, -29, -16, 24, -18, 17, -19, -2, 28, -31, -22, 18, 22, 35, 11, -45, 4, 51, -49, -45, -21, -22, -1, 9, -49, -34, -14, 0, 16, 20, -32, -31, -31, -42, -22, -10, -50, 24, 24, 1, -11, 6, 30, -3, -19, 24, 39, -6, 19, -17, -80, -24, -8, -17, -8, 11, 91, 45, 47, -29, -36, -4, 31, 6, 38, 31, 27, -36, -7, -26, 5, 31, 36, -30, -17, -21, -43, -34, -44, -21, -12, -6, 11, -31, -41, -23, -21, -1, 14, -80, 54, -18, -23, 28, -4, -13, 2, 17, -11, 2, -11, 13, -41, -91, 6, 39, 3, 45, 24, -15, -27, -37, -4, 41, -11, -47, 8, -4, -38, 6, 5, -13, -13, -8, -29, 24, -43, 23, -12, 3, 25, -21, 5, 26, 26, -25, -12, 36, 22, 19, 59, 86, -21, 0, 24, 23, 35, 12, 17, -14, -13, -11, -18, 29, -46, -9, -32, 0, 15, -45, -76, -8, 70, -19, -53, 6, 12, -19, -13, -3, -23, 13, 59, -27, 12, 13, -29, -36, 9, 52, 45, -22, 25, 11, -16, 43, 38, 14, 20, -29, 35, 22, -18, -47, -25, 3, -31, 41, -1, 32, 27, 1, 4, -57, -26, -23, 12, -36, -57, -1, -13, -23, -34, 4, -43, 36, 34, -18, -44, 3, 15, -12, 110, 55, -57, -36, 8, 33, -14, 17, 21, 84, 32, 19, -13, 36, -52, -2, -44, 29, 2, 20, 47, -4, 3, 32, 21, -28, -3, -31, -16, -29, -38, -17, 21]
3037B1j7m2L9j3RQl7L6OJ3p8P2L9J0Km9RJ0n1rN9J2k1j1Po6PM7ml8K6M6o0j2o
3072c6N5L6l7l5P2n8K1m5L3K9n6K7k9J5N5n0K9mMrno0J55p5J8n8P2p8l8R5joj8
3105A8nqO8p5N1j30N5Rk0J7j5J2L9l7l1L6k1J06r9j6P4n6P7o4J9n1L8L8%j5k2
3136hM9l8j1K7j7K1pM4n0l3M8l5k8J8Oj8Q4n8k2J3N1n0j0O6m2k6K9K8l2P1p2k1
3168b3O5M0q8RJ0N1J1j10N8K3k1Lk8P6o8r3O0O4j05N1K4J2o1J0L0K9l4o4Q2N1
3198F4q1rO1o3k4qO6l4M1l3Q2j07Q1n6MpL8%K7ok6K7p3O7m7k5K5P2k5l8M4o2L
3231b2lK5K7o4M3l1K1l6J5M6K5n2K5n6L7K5Rk3n0M0l2pM4m0K1nM6j6M2p0o3J00
3263B1k4Pj1P3k5n5J2k7L4jj2K4pj9kj3J9J1p5OM6K0m2J8N2np4N8k1rq5Q7P6r
$$ y = [21, 4, -38, 1, -12, -3, 5, -32, 4, 10, 23, -55, 17, 56, 66, 68, 19, 28, 38, -13, -22, 37, 49, 28, 17, 24, -42, -35, 12, 8, -30, -4, 42, -18, -30, -36, 19, 55, 18, -17, 55, -3, 18, -27, 6, 35, -21, 6, -23, -8, 47, -3, 26, 22, 26, 17, 12, -48, 107, 32, 50, -8, 64, -14, -52, 43, 42, 36, 18, 13, 5, 73, -2, 49, -81, -26, -17, -37, -20, -35, -23, 16, -21, -52, -16, -37, 69, -30, -46, 28, -28, 49, -15, 4, -47, -9, 29, 29, 14, -8, 41, 3, -8, 19, 2, 23, 16, 60, 10, -23, 25, -10, -38, -20, -14, -32, 52, -6, -28, -15, 36, -14, -24, 42, 0, -26, 3, 31, -1, 70, -2, -23, 42, 82, -6, 3, 13, 64, 75, -35, 23, 46, 25, 28, 0, 76, 8, -85, -25, 39, -66, -15, 9, 21, -40, -30, 0, 29, -5, -69, 13, 64, -17, -26, 35, -28, -52, -60, 6, -28, 13, -20, 62, -45, 36, -20, -16, -23, 15, 15, 42, 36, 10, 37, -36, 31, -16, -41, -16, 56, 31, -7, 37, -25, -22, -25, 0, 27, -37, 6, -25, -4, -40, -25, 21, 46, -6, 19, -37, 0, 25, 34, 11, -39, 1, -31, -38, 6, -34, -13, -18, 28, 12, 54, -16, -79, 21, -3, 4, -7, 66, 41, -14, -2, -29, 5, 4, -8, 16, 9, -10, -12, -25, -6, 5, -70, -64, -18, 2, -40, -22, 30, 25, -49, 9, -12, -21, -106, -19, 57, 48]
3297D8n8J5J2m5M9Pk7J2oO6o8J3J9k6J3OOj0Mk0l0P7p1O0nj10J25o8L4j4J1q4
3329f5L7M8k8J7jPl6J6J5l5O8l8m7R9j7mk2j0J1KJ5k1J6l4Rj5K2Lj0N2n0ljm%
3364dPn9N9o5N5O2m6oj5K1j5K9o6P0n9P1l3K1n3M1Jn4L1L6k6L0l2J2rJ7N7k7j4
3397C7m3M3jl0k4L0k7NNJ1M1m6j5nl5K9OPl2M0M1m7qJrl9P7o3J3k7M8J9J7j7K
3432DL1l0O8l9Qj2L0l1j3J3Pk1Rl6L9p7M9l2O0k4p8M5J0%K5Rqk0j0o5N0P9l9j5
3466a4L1qp7K4N1j0J6k0N9m7%mn2L4k5J7P3o6N1k4M8k2rJ4m5n6K4R5q8pL7L2l4
3499bL2no2L4j6LkrM4l4mN3k9k6K0qN7J7k5p0M2%Rj4l3J8K3K5%o9L0K6K7j13R2
3534C1o6L6K3k7O2k7k9K4n8L5j1l1N9n0O5p0M2Ql7L0m4N1m1M4j3m5m3O6Q3j16
$$ y = [48, -10, 5, 17, -28, 21, 28, 1, 13, 7, 73, 5, 18, 37, 11, 24, 30, 36, 26, 30, 10, -20, 57, -14, 46, 41, -69, 56, -12, 22, 8, 19, -65, -28, 20, -8, 9, 8, 15, -21, -5, 10, -25, 43, 5, -42, 57, 40, 36, 14, 4, 15, 17, 32, 11, 27, -7, 2, -13, 9, 12, 2, 54, 4, 1, 0, -4, -4, 3, -56, 3, -62, -7, 55, 9, 3, -12, 9, -6, 23, -43, 27, -32, 39, 6, 27, -26, 15, 16, -38, -7, 29, 3, 33, 1, 13, 4, 21, 78, 51, 37, -6, 37, 36, 6, -18, 12, -15, -10, -5, 6, 47, 1, -14, -19, -54, -25, -19, -12, -44, -4, 37, -10, -18, -17, -26, -65, 12, -51, -38, -65, -17, 2, 19, 2, 4, 35, 5, 73, 34, 42, 30, 60, 29, 16, 29, 36, 15, 24, -12, 27, -50, -1, -33, 27, 3, -75, -30, -20, -20, 5, 14, 6, -14, -24, -89, -39, 40, 1, -14, 17, 9, -68, -44, 7, -3, 13, -7, 52, 5, 5, 1, -51, -17, -42, -25, 48, -18, 33, 9, 57, 35, 26, 40, -5, -61, -37, 58, -30, -37, 0, 32, -2, 30, 25, -37, -3, -19, -16, -18, -27, 17, -17, -21, 32, 3, -23, -3, -11, 46, 63, 38, -32, 10, 10, 19, 5, -28, -10, 13, 38, 38, -31, -1, 25, 52, -61, 31, -35, 1, 24, -3, 59, 32, 3, 27, -31, 4, -7, -38, 21, -29, 36, -34, 8, 16, -21, 9, -35, 16, -25, 19, 6, -39, -82, -16, 67, -49]
3564d9N6N9p0j3KJ6J0J4Q1q6pr6J03l3m0O0o2N1L9k0l1M7j5qoN1K5p9j4k4LQ0
3596D4J3j29j7O5J3O3r0L5L2k2K2k4J3J9n1M0j4l1%M9l0J0j8J7o5J10o6JK8j2
3626En7K9J8l7LM5rPm9O5j5l1lNj0R9p1L2m1K6j5M9l6J6L3m9n5Q5m5N9o8M9k4
3659A0n8L4pL5Oj8n7M2K4l7k6%M4K7Jl7Q2o4Ol9L5J5k9O2j23J08o8lLL9l6Q5l8
3692A8j4Ml8M3j6jL1nk9L9m6J6nq3P3l6RN6j7pk1LM8j03K5L6n1O9JJ6k3qj5k5
3726e6K9MK2Ql5O8j1l1OJ4Qj3j8m3K8J4K9j0%J1k7L3jLj4rj6j4p0Q5l7m0R5m0
3760b8K9j6j5KKK7J0m9K8J2J5m4K9L9o6O7jJ1o1K2m2K4qK7k2Kqk7N3k2J8m2J8
3793a6k4N3m8J2M2Pk5kmP%rm0N4j4L1l8L4q1J19n7kpK3j4L4n1K8l8J9j4K0QKJ7
$$ y = [-49, 7, 66, -4, -17, -15, 1, 11, 25, 106, 20, 13, -83, 20, -13, -53, 7, -55, -4, 35, 15, -16, 31, 16, 8, 2, 53, 78, -1, -15, -39, -36, 44, 57, -72, -89, -24, -11, 52, -38, -3, 29, 7, 29, 5, 18, 37, -14, 26, 12, -19, -19, 30, 0, 10, -8, 9, -56, 54, -12, -11, 17, 5, -52, -23, -5, -42, -39, 6, -3, 4, -45, 20, 5, -26, -29, -24, -34, 65, -6, 26, -15, 11, -4, 45, 9, 25, 58, 9, -46, 39, -6, 53, -15, 34, 10, -48, -14, -21, 14, 20, 2, -55, -13, 11, -26, -52, -52, -8, 19, 20, -17, 65, 1, 7, -32, 3, 18, -11, 51, -72, 36, -32, -35, -32, 7, -29, 56, 18, 4, 8, -30, 13, -3, -4, 27, 22, -7, 32, -14, 2, -3, -86, -13, -49, -40, 16, -1, -8, -29, -26, 22, -81, -56, -20, -71, -2, -1, 15, -8, -16, -31, -56, -27, -23, -1, 7, -28, 40, 29, -2, 4, 18, 26, 13, -5, -48, -20, -6, 23, 13, 13, 24, -3, 30, 29, 32, 18, 9, -7, -21, -91, -6, -43, -83, 12, -28, 1, -15, -30, -28, -26, 1, 11, -38, -10, 2, 17, -27, 2, 41, -25, 42, 41, 52, -9, 13, -29, -5, -13, 14, -8, -6, -14, -41, 12, -10, 8, -34, -16, -40, 13, -35, -23, 19, 26, 1, -1, -5, 2, 2, -7, -47, 7, -7, 24, -14, 20, -61, 58, 1, -1, -8, 15, 1, 35, -16, 12, -26, -7, -21, -1, 7, 9, 26]
3828B6m5N7k6k6PK8j2k1K5mk9K9o0L4N7p9K5JJ7NK2r3Q4Njp1R6n7qK1kl7R8qo2
3863dl9L3K5q%K2n6N7j2k3J3l9O0Mjm7N1o7n9M8O7l2j1L3m0j0M1q0R0l4oMqN8
3897C0m4RRk3O5j2k0m9M1O9p3Kl4J3J4j4OM3o7M6Mn4L5pk9P7o4J7%l3N3l9J6j9
3931c2Q4n4n2J2K1kk2N0o8N3J2l0M1l9L1j4K3l2J11o5l7L9p0O4l8j4jQ0k1j41
3961a11J05J1j3n8R5p5PM5J0n1N2j7p4O0j8O2n4J6o7J11k9K8l6J6Jl5O1L8l5m1
3991DL0n2Q4q1N5n7k9J7K0Rj2k1J4oJJ8k5KjK0n1L7N5r7N9lL4l0J4m7N7qlj6p
4026a6K8jl7O7n8K4j0O7o7m0Q3n3N7o8Q5j16Q2j8K9lk3K9q4K5m1K0n4J02Ml3j1
4057c1lpK8lqL1k4M9l1r4M6Q6m6O2j8k8Jl3P3n1lj5J3k9kM2Rk5k7l2J17l1o0J08
$$ y = [26, -19, 38, 12, -14, -7, 21, 9, -12, 13, 9, -20, 9, -51, -17, 40, -39, -14, -13, 4, 9, 31, -62, 22, 27, 26, -45, 51, -6, -14, 7, 5, -32, 66, 58, -4, -43, -10, 15, 7, 7, 29, -27, 30, 18, -5, 8, -31, 29, 33, 32, -15, 36, -31, -90, -42, 25, -7, -18, 15, -25, -35, 6, -74, 16, -18, -24, -20, -28, 30, -14, -5, 4, -19, 46, 34, 14, -35, 6, 75, 2, 4, -30, -17, -3, -17, -11, 32, -35, 11, 15, -39, -4, -11, -40, 37, -27, -10, -10, -43, 10, -29, -13, -32, 52, -2, -54, -42, -21, -23, -45, 5, -63, -10, 2, -28, 13, -26, 5, -9, 14, -18, 93, 28, -9, 30, -40, 24, -14, -28, -29, 51, 30, -111, -6, 5, -8, -66, 29, -46, -39, 6, 16, -35, 17, 0, -74, -14, -32, 30, -24, -8, -75, 36, 7, 35, -1, 15, 16, -19, 42, 80, 45, 4, 34, -18, 66, -15, 40, -17, -46, -29, -9, 0, -12, -33, -19, -25, -24, -6, -31, -29, -30, -10, -61, -24, 31, -66, -7, -10, 24, -6, 8, -39, 18, 10, 7, -9, -16, 12, 11, -26, 41, -17, 7, -3, 64, -3, -43, 40, -13, 44, -24, 61, -55, 27, 9, 38, 35, 12, 41, -43, -18, -59, -39, -93, 9, 13, -20, -31, -34, -41, -13, -16, -24, 7, -17, 32, 1, -93, -47, 39, -7, 55, 37, 9, 10, -23, 50, -1, -4, -19, -6, -35, -37, 5, 14, -11, -38, -70, 47, 16, -44, 64]
4091F4o8j4k6M9o6J4N5n1k4N5l4K1L4o8L7lM0pl1k3J9J3qK6k9J7L6L9l0K%mm1
4124fP2o4mk6N3J3o1jkM5k4J0m6N4Nn1J0qKJ7j1K7oNnKQK5l6m0J2Q8m8N3oo2J9
4161A3j5J8n0N8j2l5O1j8o3M8L7k6j7Q7q8L0lpn5L2O9q2K2l6P1m9P%K3l4N3lq8
4194e2O0Lk8K0npJ8LNl0l5Q4q5R4k3l9nML2L4j0j2Mm4l8N8p6N9N8j01N4L2q8K4
4228c2K7M9m9l7N5Pn2oL6OJJ8L5l7m4N6q3N9k9L5LK0p1N5l9P7n0lk3J8M9q9j6
4261e4J06q6rJ0K8K5p5M9J2J4K3o5O1p0N1k9%j2K7p3J03m5k9L8Ok8J1k4O8J1k7
4292A7LPK8o2L2k1j0l1P7m7N2J8J0m8k4m2P7l5rJK8Mq0O3K4j23O6L2m5P9o3M8
4324B6L0q3O5l3KJ4j6L1No6N8o2L8l4K7K1l2k2N6J1o8R7r5M8l7O5m8n4QML8%O9
$$ y = [64, -4, -18, -44, 5, -61, -47, 8, -43, -67, -12, -46, -25, 9, -59, -22, -25, 15, 8, -23, -46, -27, -14, -22, 4, -25, -8, 28, 67, 37, 39, 39, 35, -6, 66, 2, -2, -28, 25, 38, -23, -24, -26, 19, -5, 5, -41, 13, 18, -33, -23, -31, -29, -12, -23, 4, -2, 3, -2, 0, 8, 33, -3, -43, -31, 57, 9, 62, 56, -6, 13, -2, 16, -34, 24, 12, -23, 38, 20, -43, 5, 42, 16, -1, 86, -2, 28, 25, 18, -37, -5, 64, -18, 4, -32, 39, -10, -3, -3, 20, -14, 39, 36, -52, 8, 11, -17, 3, -2, -9, 9, 12, 17, -13, -48, 36, -49, 45, 22, -17, -22, -18, 14, 48, 38, 26, 30, -14, -52, 6, -70, -11, 47, -54, 0, 32, -56, -32, -5, 44, -5, -42, 13, 20, -32, -38, -2, 4, 5, 23, 58, 21, -23, 33, -50, 9, -20, 15, 18, 38, -33, 22, -17, 60, 10, 7, -16, 2, 51, -38, -54, 52, -34, -43, -33, -5, 20, -55, -6, 6, 20, 43, -22, 39, -31, 20, -9, -9, -21, 6, -67, 36, -9, -38, 0, 6, -22, -11, -35, 33, 44, 17, 20, 27, 55, -7, 25, 4, -6, -37, 40, -7, 45, 63, 73, 25, 1, -41, 36, 1, -8, -7, 21, 25, -55, 8, 32, -91, -25, 7, -38, 41, -22, 26, 56, -27, 38, 5, 7, 21, 5, 36, 41, -25, 33, -29, 9, -25, 2, 23, -9, -31, 25, 36, -32, 65, -30, 18, -19, 46, -2, -56, -48, -44, -6, -6, 63]
4357F3o7k7J0M2j00P8l2O6k7J1j1J9m4N2q8J6J31j11l2N7j4M7o7K5J1K3Ko0L3
4386Fl0K5K4n4L6m5J0k1O3pj3M4p8K0lO7n7P9r0M1p3K8L9NN1m8J1QMJm6L5jn1
4420b0L6m4N2jk0Pn2O0n0K0N3rn0P0o3K1j3JJ1m8M0K4l6QM3q3P9n5K0j8J5j1M2
4453B9k0J0m2K3n6N9nk6N4n2L8MrL1n1Ok5O8n3j1lP1o0Klm1J5O2L9n7o2P2l7j3
4487d3P7l9N0m9L8j0m2J8j5k1J0K8rM4k5m0O6m9M8K6j00K5pK1k3O3k1J3m2J2J1
4518A5Rj5o4L1N7r7J01k4o1Q6q5K5QK2n2L5j5N4qj8j3Kl0OJ09q4J3K2L5l4J2r
4550C3k6l2J7j1M5l7K5l2M5Mm9ORM2q8KL0N3o6j4O0l1KJ2l8M7K9j11N2N5L1r4
4582c0K0K6n3J00m8j9J1mk5P2l5m2j7Q8l5k8nM9k4m5L4o4L9L3Rj4k7N5jm5L4l8
$$ y = [63, -4, -31, -21, 21, -79, -1, -33, 33, 6, 17, 6, 25, -19, 33, -55, -39, 92, -19, -51, 6, -8, 39, -28, -3, 8, 31, 33, -27, 6, -24, 1, 25, -29, 7, -38, -28, -49, 14, 7, -6, 38, -40, -20, -23, 44, -13, 66, -24, 17, -56, -28, 11, 16, 67, 19, 30, 38, 42, 43, -3, 32, 31, -20, 16, -28, 24, 23, 3, 10, -42, 18, -32, -12, 41, 32, -18, 52, -11, 10, -3, -2, 9, -39, 1, 25, -11, -3, 40, -43, 36, -19, 1, -17, -2, -13, 29, 9, 19, -23, 0, -56, 3, -2, -28, 26, -26, 12, 16, 7, 38, -13, -7, -32, 36, -17, -28, -31, 40, -20, -18, -21, -62, -47, 15, 54, -3, -65, 7, -30, -43, 34, -5, 45, -4, 34, 24, -18, 0, -15, -36, -26, 2, -7, 37, 12, -28, 38, -11, 37, 63, -37, -12, -19, 2, -21, 42, 21, 34, -8, 4, 15, 24, 9, -55, -24, 33, -64, 37, 13, -48, 38, -47, -22, -14, 8, -44, -9, -24, 30, 22, 4, -9, -7, -37, -31, 78, -6, 7, 29, 64, 30, 42, 33, 7, -25, -8, -19, 26, -11, 14, -18, 27, 31, -18, -12, -3, 39, -49, -47, -17, 36, -30, -44, 16, -15, -13, -1, -39, 8, 37, -74, -22, 33, 64, -30, -10, 16, -37, 63, 15, -4, 7, 3, -22, 50, 15, -27, -44, 44, 9, -19, -24, 25, 1, -44, -10, -74, -35, -2, 7, -7, -34, 21, 20, -25, 9, -29]
4614b9L2m0K8%L4J1m3m7O6l9O2n0K6j7P1q5pJ2j7N1l6Q4j5o8M8J8j4j2j5J0Ml4
4646a1K8J5j4j9J9m3L4o5O3Qk4k1M1Np6L1NM2Lm0J7ol2k3nR1M6l0M1q4k5N2J1
4679C4k6k5O1l1J8l7M1j8jl8k9JM0L2Nn0J3Jk7J8K7k1l3R5m8k3l8M6K7ol5K9m8
4712d6P9l8Rk9nL9J1l5QlK5n1L8J8j2J9j1pK5j5L0l1k5Mj9j6M7l9L9Ok6J2ok3
4746b8k3P0k2o0P2Prm0M8j9L1l8rN6Mmj5l0N0k6m7K9K6K3n0J1J9m8m4N7oJ2oo3
4780g2K6M8j0j5o1J14m8lJ7J9k4oL5k6Qk7M4J2mo6J4M3j0pN1j2k8mj4M7q8J1N7
4813B1o6N5n0OLR9o9k6l7M8NM4r1K6J8J2j3nK9l1N9m3j2l7N5l9L9MN0k9m9N7n3
4846b0M2l0JN9k8J1n2J5M6n4mQPk7JN8n1L0k4J3k7K3qo0N3J0rO8m8j1j2K7J7j4
$$ y = [-29, 3, -37, -9, -9, 25, 36, -7, -54, 12, -27, 35, -15, 11, -6, 65, -20, -27, -15, -32, 19, -17, 67, 52, -16, 32, 50, 36, 24, 9, 19, 23, -11, 17, 32, 18, -1, 18, -25, 9, -56, 7, 15, -9, -30, 11, 16, -60, -29, -24, 18, 21, -19, -2, -8, -40, -63, -68, 23, 69, 39, 80, -4, -29, 23, 34, 8, -17, 44, 13, 31, -6, 35, 17, 16, -22, -51, -50, -10, 22, 27, -23, -10, -9, -36, -18, 9, -12, -45, 50, 2, -21, -59, -13, 14, 8, -27, 2, -46, 33, -5, 4, -25, -30, 9, 20, -15, -7, -10, 15, -36, 2, 20, 8, 27, 16, 9, 34, 19, 49, 18, -7, -3, -22, -38, 9, -30, 9, 15, -11, 1, -5, -28, -51, 19, -3, -63, 9, 16, 7, -33, 15, -4, 27, -11, -20, 36, 40, 36, 21, -9, 41, 15, -32, -3, 23, 46, -4, 7, 26, -22, -66, -9, -15, -3, -9, -72, -46, 2, -8, -23, -84, 30, -18, -21, -4, 15, -9, -15, 20, -6, 2, -25, 19, 31, 27, -39, -25, 18, 8, 1, 52, 40, 12, 8, -6, 41, -47, -36, 21, -45, 10, -40, -34, -31, 68, -1, -27, -64, -16, -11, 33, -58, -32, -14, -2, -15, -20, 9, -22, 37, -6, -18, -55, 0, -39, 0, 4, 54, 25, -24, 33, -20, 22, -8, -7, 52, 24, 35, -17, -2, 44, -10, -14, -6, 1, -26, -25, 33, -18, 12, -12, 1, -26, -3, -11, -71, -18, -8, -17, 51, 3, -8, -20, 7, 24, 10]
4880A0l6K7k4L5K6m6k3Q0r4K5ORqJ7J5j6K7j2lmm2K3N6j02K0L2K1rQn5L3l4O8
4913C0m6l3L0M6l3l4J7j6N2KLn2L5O6q1QNj5j1M1j6K1j8L6Op9M7n9J17r0R6q8
4945a3J3K6l4L8l2qoJ8M3p8k5j0O5k7N3K8o3j4K4l4k5P4j4k1N2n8M2J9pn1Q3n3
4977EJ2nRl2O0p7J6N8j9n4L1j8J6J1k5K2r5Q9l5O5k9K7n3n1R2k0Nk6Pk1l9L6M5
5010Gj3j2O2j1m7J2ll7kN6l5j1J02k9Ql7L5j3m8l6K2J9M8k1oJ5l7J4QJ5j3p0P6
5043A8k8j2N5p0N8m0O7k2k0l9P0k5K5on7O0Rk7j9Qj5K8N4o8j3l0k7N6J0OK3n0
5075b1kL7l9N5m7pJ1m5J2K2J2L5j8j9P0p1QK8n0mL5L5o1J8O2L0r0K0L4o1K7m4
5107b8K6k3K3N8m7l2N1kn5j6O4l3J2j8kJ8k9M9j3%K4j1k6K8j9o4O7l1L1K2J0j4
$$ y = [10, -26, 1, -23, 12, 38, -8, -31, 49, -45, -20, -14, -5, -13, 4, 19, 3, 30, 18, 15, 11, -31, -8, 48, -54, -34, -2, 19, 10, 18, -37, -4, -38, 30, -16, -49, -19, 27, -6, -40, -23, -39, 13, 15, 18, -34, 1, 67, -14, -6, -1, -16, -27, 14, -2, 19, 1, 37, 43, -36, 11, -48, 69, -21, 75, -13, 0, 26, -8, 30, -2, -10, -16, 2, 45, -33, -58, -68, -3, -30, 23, 51, -12, -26, -2, -36, -61, 13, -1, -22, 30, -28, 14, 33, 26, -25, 58, 5, 17, 12, 21, -11, 49, -28, -12, 46, 27, -27, 4, -14, 2, 13, -12, 10, -85, 4, -31, 34, 5, 32, -21, -72, 20, 0, 5, -21, -14, -35, -74, -38, 7, -6, -18, 44, 33, -14, -2, -5, -42, -44, 12, -23, -34, 68, 39, 47, 10, 45, 32, -16, -52, -30, -11, 37, 16, 10, 25, -12, 2, 10, 25, 12, -58, 18, -10, -22, 33, -37, 21, -19, 48, 26, 6, -33, 37, 12, 37, 31, -26, 34, 43, 16, -3, 5, -10, 18, 72, 4, -9, -39, -66, -10, 0, 6, 29, -21, -23, 14, -25, 30, -17, -24, -13, -58, -46, -24, -12, 23, 5, -14, 56, -15, -7, 21, -29, -33, 2, 37, -24, -6, 56, 86, -4, 16, 50, -11, 16, -28, -2, -25, -2, 56, 9, -23, 28, 26, -29, -45, 19, -14, -2, -20, -22, -4, -33, 16, 3, 3, 27, 16, -10, 18, -1, -65, 2, -29, 2, 24, 34, 20]
5139B0L2o7l5O1qN5k8jJ5k6QL1Jj3kq7N1j0kj2L5on7L2N0j0n9M9j4k6M8l6k6O3
5173B6%jj6l5J5L7Jk6m5J26o3K2r1P7l0jpK2J2l0P6o1l6P9j8l0N5j05J7K0kk1
5205c3j1Q9k0n0L1l4pN0M8n1nK7J4l3k7J0l6N0L9n4L1k4l3J6PJ1%L9K3k0oOj5
5238C2pl1K9m4K8O0l5m4n8O1QQj5M2m9L3K9q3L7l9oO4k6ON0n1K3j1%m2L3K5l8
5271a1N6q5L9Q8r2qm5Q1K4l3qnNjm4K9L3k8pn9O3KJ4K3k8QM3p2LPM1l6j4QoJ8
5307CJ6L3m7K1L4o9oK8K2ml3m4J21oj7l5qM7Oj6n7J8j1J1l4J2N1k1l9J9ppk5O8
5341B4j7j8J0K4jm9N0J4k1n3N1j2J6kL9k9j8l4O3k4o9M6KL3J0m5KJ9j3J7j8J6
5373A3j2RnK6l1m0O4p9N1O5p8l0M4M5o2K6p7P8Jo4L1J7K2J8Ln1M2L4j3k9k4mJ2
$$ y = [20, 52, -15, -50, 11, 3, 58, 30, 29, 44, 18, 26, 57, 58, 45, 43, -44, 7, -3, -5, -17, 18, 12, -45, -13, 37, 27, -32, 17, 3, -23, 25, -11, -37, 26, 26, 25, 9, -26, -11, 26, 27, 1, -44, 82, 19, 41, -50, 27, -3, -4, -11, 11, 23, -7, 69, 8, -28, 51, 33, 3, 58, -47, -30, -10, -12, -33, -44, 45, 25, -25, 6, -28, -35, 15, 63, 12, 7, 34, 48, 15, -12, -2, -38, 12, 51, -3, 28, 4, -29, -13, -6, 5, 5, 44, 67, 47, 41, 47, 32, 25, -6, 23, -21, 7, 67, 32, -12, -70, -9, -1, 7, -8, 34, -15, 18, 47, -36, 1, -38, -44, 20, -6, 0, 50, -1, 22, 11, 11, -31, 2, 27, -11, 45, -40, -1, 87, -5, -13, -58, 23, 47, 14, 6, 1, 6, 5, -39, -10, 23, -5, -12, -71, -8, -6, 8, 31, 3, 11, 54, -18, -15, -8, 33, -3, -17, -9, -15, 3, 19, 52, 5, 26, 60, -9, -15, 13, 35, 31, -2, -46, 75, 69, 52, 17, 9, 56, 62, 46, -11, 7, -4, 7, -27, -15, 36, 15, -24, -5, -12, -19, -44, 24, 7, -11, -1, 23, 22, -27, 23, 37, 16, -37, 14, 2, 18, 16, 55, 26, 8, -26, 37, 13, -56, -10, -8, 25, 35, -10, -8, 11, -2, 15, -3, 13, 1, 10, 5, 31, 0, -40, 24, -55, -4, 61, -17, -47, -3, 42, -20, 6, -71, 7, 8, -56, -25, -8, 14, 32, 35, -16, 26, 60, 47, 18, -6, -10, 2]
5406BP2n3M2q0l1j4R3m1Pj1PL5nq8J22n1k8K8m1N4k7k3JlQ6k4p8K8k5L4J0l3O8
5439C3n5K3l4O4Mn7K4M4l0L0K1n0j8J0N7n2j1n7J0N2K9l6Mn8L9k0k2pN9RJ8j9
5471Dp0P9l6l2M4J9K8k8k7Pm5M9KK9m5K7L9l5j9K8l0N8M0l4k5j2Oq4J2J9K4k3
5503c1J04q1j0Mk9K6K2Rl8L3l9M0l4J3%j1M2k6PJ9M4q3J9mO6n4j24J26koM1l3
5535A0k6L3l9L2l6J0o3K2M1j6K9JJ0m6R7p1j0k8P3m1k2J5K6QJ4kQr3L9R0q7L3
5567A1K0j1k3LoM2m4M4m5N6k5j1k1k7qJ22n9q3J15m2k0nONO1j02J1O5l6j1%k2
5599d0l2O0M4l9j2%N4k2j8Jn7L7K5k0j3R9o8Oo0J00m0k8J4K0j2%K1k7l0Q9o9m7
5631f4Q5j4J6k1jk7%jO1j7j4n1L8J5L2n9L0Oq0O8m2O3m8L7n4K5L0j3JK7kOm8K3
$$ y = [2, 74, 21, 63, -17, -48, -62, 31, -10, -3, -14, -7, 28, 23, -65, 57, 6, -22, 6, -35, 19, -8, -31, -30, -33, 53, 29, -49, -21, -46, -12, -2, -35, 33, -22, 1, -33, 31, 35, -22, 2, 46, 16, 46, 67, 17, -1, 9, 66, 14, 3, -54, -44, 8, 37, 1, 5, -53, -14, -34, -56, -63, -4, 5, 23, 4, -66, 13, -23, -55, -11, 8, 36, 8, -19, -12, -57, -8, -6, 23, -22, 5, 44, 9, -10, 18, -12, 46, 86, 52, 27, 15, 21, -63, -51, -32, -8, -31, 73, -8, -18, -14, -43, -17, 5, 14, -24, 9, -30, 10, -24, -11, -11, -22, 20, -6, 1, 20, 64, -19, 0, -4, 62, 8, -116, 10, 8, 2, 43, 10, -16, 17, -22, 10, -26, -16, -79, -57, -16, -32, -3, -2, 8, -38, 59, -12, -22, -50, 23, -18, -40, -25, 1, 9, 23, 21, 29, -64, -25, 65, -22, 11, 31, 20, -3, 0, -6, 36, -8, 36, -9, 47, 22, 11, -10, -37, -45, 77, 18, -65, 50, 8, -12, -17, -11, -6, 55, -47, -36, 29, -7, -18, -18, -40, -72, -12, 32, -7, -19, -19, 35, 13, -5, -4, -61, -24, 1, -19, -32, 67, -1, 5, -55, 45, 5, -23, -9, 11, -1, -1, 20, -7, -37, 52, -17, -64, 21, 7, 23, 2, 1, -26, -26, -27, 34, 17, 3, -48, -10, 5, 37, -22, 8, 14, -66, 2, -40, 23, -25, 12, -42, -17, 13, 0, 1, 28, 26, 32, -16, 7]
5665GKJ6%rj9k0M0m8J2J3j7JL6j4k8j5M2J7l0%PM2n7L1L0m9N9n2oN7j7o5K8K9
5699B3k9LN9n1L4m6O9m9oK6n5J9l7J7rM4k4j8J4K4m7oK7n0L8qKK9L3l9K2m1O7
5732C5l4K1m8O3k7k4M1l2kM0n7N9k8k8K5K0n1O4j16O4L5Mj5p3Q5o4K6L9k3K9%
5763B8p6J6J3N7q8L2m1PJ1N3k3Nk2M2Ok4ML6n7Ko6O0K5M8l6K0l2J4PKk2M8p8O1
5797C2K6m1Jk9J2lJ6J7l9k4L1nj1j0MJ3K3L1o0N4n6k3RL9ql7M6lN6o7K0k8%k1
5831c5L7M3J9q4kK5mk6KP4l7qm1N0K9n7L6o1M2j8n2P0Lj2m0O3J1k1n5O8jm0N7
5864C5q8M8Q2o7o1M6J3j7M8q3L7J2NlJ9o0j0L3k7lQ2l1m5M6o3K0N9j9Mn4N7j6
5896ak2L4Nk8j3m8K8oQ8j0n3P1p4P3p2M8j0j2o9O0J9k7k0P8k1o5N7L9m8O4j2n8
$$ y = [7, 9, 25, 25, 16, -3, -23, 17, -31, -19, -6, -23, -22, 14, 0, -28, -43, -1, 16, -14, -14, -7, 35, -22, 9, 39, -10, 49, -3, -9, 48, 31, -34, -6, 23, -6, -3, 56, 5, 39, -7, 62, 13, 7, 33, -22, -3, -40, -23, -32, 12, -12, -30, -16, 8, -39, -45, -18, -68, -30, -38, -36, -7, 26, -13, 9, -32, 35, 1, 22, -26, 37, 10, -14, 27, -5, -7, 33, -24, 35, 7, -21, 4, 24, -27, 37, -79, -15, 20, 24, 9, -64, 21, -43, -17, 22, -1, 28, 28, -48, -32, -19, 38, -50, -18, -59, -52, -41, 12, -11, -6, -28, 14, 20, -4, 0, 36, -21, -19, -85, -25, 0, 48, 12, 32, 0, 14, 21, 23, 1, 49, -29, 32, 58, 17, 18, -11, 1, -2, 14, 31, -8, -32, -1, -6, -17, -27, -23, -10, 13, 44, -16, 38, -18, -41, -32, 7, -1, -38, 8, 5, 61, -6, 14, -14, -14, -35, 2, 45, 64, -20, -22, 3, -1, -27, -25, 49, 12, 4, -37, 13, 42, -15, 21, -40, 2, -16, -68, 2, 5, -7, -47, 16, 27, 6, -49, 19, 18, -22, 35, -53, -5, 77, 10, -51, -5, 8, -9, 39, -44, -7, 5, 10, 7, 26, -34, -44, -11, -38, -41, 41, 10, -35, 11, -52, -32, 27, 8, 12, -42, 15, -1, -23, 11, 16, -12, -25, -73, -45, -51, 37, 27, -26, 45, -29, 44, -28, 20, 10, -2, -71, -11, 8, -19, -39, 39, 18, -47, 10, 49, 1, 65, 53, -5]
5928er2J13n0P0l0PN3r3k2N0Kj9ol7O1J2n0K4J9k8nM5qOj6oO0q0Q4n7K1k3j1J
5962a0k9M1K5l4J4pk1NO7l5Qm0L2m7N6n7L6l4ON5rj4J9j1n6KN3o5J01n2m0L0N5
5995D4n6MK5M4o8k7j8pO8K0k6j3J17k8m4j06J00M0J4j17J00n9l7O7p0ML8j3k8
6024c2m4J30r9J08o6J2j1o1K0N6jj7M4r2O7M4j20M2J9j0N9oo4K2Pj8J5l0P7m0
6054A1l3rM1j7J5P3j39J08o3K5j3J5Jjl1K6m4P8o6K0J6o7M2m5Q5j6n2J6j7K2M1
6085B2j3N3r6O5l3l7O5K0l0j0K5J8o0J3l2J3lOPL6m8L8Kmj7n0j7Q3q7N6j4J6J5
6118BLk6K0m5OO8l4L0l0jk6M6J0kK5m5K1n0J7O3k0J5j6n2l4J2M1l0P8l8o0K6L8
6151A2j0j1K4l7j9qO4m2nN3p3L0L4K5m9j5L0Pn3K6j0k5J06o6k0J00p0N7n6mN0
$$ y = [-5, -97, 16, -34, 36, 6, 13, 66, -27, -49, 1, 3, -16, -22, -59, 2, 14, -36, -12, 7, -21, -26, 19, 11, 17, 1, -5, 55, -25, 59, 2, 23, 0, -11, -10, -39, 2, 27, -7, 7, 0, -21, -16, 51, 16, 24, -16, 16, -31, 25, -32, 4, -30, -24, 31, 22, 8, 27, 16, -40, -38, 15, -50, 51, -1, -41, -11, 44, -12, -8, 17, 61, -7, -34, -52, -59, 9, 29, 3, -10, 107, 79, 35, -71, 29, 69, 83, -34, 66, 7, -30, 37, -33, -29, 9, -4, -32, -76, 54, -45, 63, -3, 9, -2, -63, -43, 13, 12, -5, 39, -53, 14, 58, -62, -20, -1, -11, 48, 42, -22, 0, 7, -11, 4, -26, 51, 11, -22, -31, 10, -7, 8, 81, -58, 50, -13, 12, -1, 14, 15, 14, -17, 9, -35, 43, -23, -3, 13, -54, -12, -57, 28, 12, -40, -24, -41, -19, 22, 9, 62, -34, 31, -2, -39, 26, 46, 16, 6, 31, 49, -11, 2, -30, -17, -20, -14, -7, 29, -19, 19, 21, 17, 0, -50, -67, 16, -71, -15, -29, -13, 2, 5, -21, -1, -46, -40, 28, -6, 24, -6, -7, -33, 13, 23, 21, 46, 1, 22, -28, -11, 52, 32, 47, 31, -21, -55, -43, -2, -32, 46, 8, -52, -26, 12, 2, -9, 15, -22, -41, -49, 15, -27, -32, 21, -52, -22, 12, 37, -12, -27, 3, 10, -43, -17, -27, -52, 54, -12, -32, 68, -2, 55, -1, -5, 45]
6182D5q1M6o1K7pN5k1q4Q5k0ljOL6n8K1J9k1M9m8J5j8M4q6J0M8k4j8M7rK4K5n0
6215hM3nJ5o3RK5j6j5n2N5O2l5j2nl5J9k0L3oJ8oJ8j5k2M9n2J4k9j1N7mj9K3K6
6249C6m1j6J3Nm0L0L8rn1M2J7m9N3K7k6o8K0M0l8J5J1qk8QK8M9r4N8L8p6PrJ8
6282@MK3Kq4P1l8L0l3j4L6N3n1K0%M6o9l1J5N8j9k3L1K6k6rl3J5n6N5M5n7J5J4
6315A6Oo3N3%%k2J8l1L2om3LM7k4Km9L6j7O8q1L2j6J5N8m4M4JK9r5L2K1N3q0R
6349Dk5M4j0rj7l8M5k7J8O1m8rK7l5L5r3M0QN2k7k7qL0l9lO7k5J0m1O1k3PN1n8
6383bN1k2JoK0o2N7q1LL3J5j8M2j3m6M7j2p4P7j0m1N0l1j1L3K1l5M6k9J9k9j3
6415b0jK4l6j1L0KmJ9j0j2N7m0on0M3k4M2J7pK0k6Jm3K8L4l1pN3l9l8K7K2l7K2
$$ y = [45, -36, 10, -51, -24, -31, 24, 3, -81, 4, -16, -19, -20, -14, 22, -36, -15, 4, -17, 32, -16, -1, -19, 25, -61, -51, -3, -27, -45, 2, -7, 17, 42, -8, 35, 30, 45, -18, -9, 16, 0, -15, -67, -12, 50, 15, 3, -2, -37, -18, -38, -5, -11, 7, 1, 19, 4, -18, 31, -21, -7, -36, -47, 10, 6, -13, 10, 36, -5, -21, -8, -3, -43, -13, 25, 16, -35, 7, 24, -25, 28, 55, 29, -39, -19, 21, -17, -2, 9, 1, -27, -19, 9, 58, -36, 22, 60, -16, -9, -18, 0, 4, 27, 29, -55, 16, -22, 8, -25, -39, -3, 50, -1, 19, 19, 65, -4, -35, -20, 38, 19, -4, 27, 53, 27, 18, -15, 0, -56, -1, 44, -13, 2, 16, 22, -41, 12, 12, 12, -10, 8, -23, 9, 3, -40, -37, 10, -14, -12, -61, -25, -42, 26, -55, -23, -39, -24, 34, -10, 34, 35, 64, -31, 1, 22, 75, -5, 4, -21, 23, 13, 4, -13, -51, -6, -33, -15, 46, -2, -11, 16, -19, 16, -77, -37, -29, 23, -4, -31, -39, -9, -48, -51, 16, -9, 1, -40, 21, -2, 5, 56, -2, 49, 27, 28, 22, 42, -20, 37, -44, -41, -8, 7, -11, 31, 18, -28, 19, 7, -67, 10, 0, -41, 9, -22, -33, 0, 21, -14, 32, 3, 22, -7, -20, -21, 3, -33, -44, -14, -12, -16, 3, -7, -19, 38, -2, -8, -58, -15, -39, 3, 20, 13, 33, 7, 8, -35, -7, 27, -4, -11, 42, 3, -35, -8, 14, -23, -1]
6449aj2L5J8k5m1%J7m1M3k5M7Ll0M1k1Rk5J6M8o1pj3J4K5M4n6j0NJ2j4O6ko0K2
6483B1l0m5M1N4m5J5k6K7j1J1o3M8l0O0l0MNj4N4k8l8k3R5p1M3k6M1l6K9n5O1
6514C8j8j7j4N1j1Pk2l9L9k0M5o3j8K3K6ml4O0Jo1L4J6m7M2o3R2q6N6l2j4M8k4
6546iJ2j0m0M4%l9J2jK3K0j6J3O6j04LL6j7K7kPk3k0l0L1N6o2K8kN8k2m5k0jJ1
6580a6M1n6M7j2p6Q1j9J3j5lK1l3K8l7j4N6%j1qK0JN0r2N6Jk5K7oK3n5M5j8k6
6613a2rnM9K0k5JK2n7RKn2L4k2Q1k7M1n1J0p1N2N1r2O6N5k6m4n2O0J4m0J9j2J2
6646Al5R2k1n0K3M2m2j1K0J7m4L3o8L4o2QN1l0K6O8q2K9M%k2L1k8k8M2N4n2nL8
6679C3k5mJ07j08j4Km2J13m1rpk6O1l4op1O1j7j0N2m1K3pK7o3mQN7j2k8pK9j2
$$ y = [-1, -13, 22, 40, 15, -26, -26, -9, -50, -7, -32, 15, 18, -12, 29, 8, 17, -8, 8, 56, -5, -12, -25, -11, 14, 58, 2, -8, -3, 9, -5, 61, 59, -1, 21, -9, -54, -13, 41, -4, 11, -15, 12, 1, 12, -51, -3, -33, 27, -3, 1, 6, -8, 46, 18, -20, -43, 52, -19, 24, -2, 39, 3, 32, -23, 38, 20, 3, -11, 40, 29, 36, 14, -25, 14, -6, 39, -24, -42, -19, 7, 3, -31, 29, 30, -31, 3, 19, -28, 14, -49, 43, -43, 13, -19, -33, 15, -9, 3, -7, -47, -3, -3, -42, -30, -31, -8, 12, -4, 9, 75, -29, -26, 10, -7, 20, 18, 25, 2, -18, -48, -17, 39, -23, 5, 3, 61, 39, -6, -26, -27, -16, 25, -31, 16, 4, -72, 9, -10, 3, -12, -15, 6, -27, 1, -36, -50, 6, 6, -5, -13, 7, 8, 58, -34, 22, 23, -2, 25, 19, 42, -13, 32, 14, -12, -21, -26, 23, 43, 18, 19, 41, -16, -7, -5, -57, -23, -45, 36, 9, 50, -1, 9, -62, -10, 41, -51, 15, 70, 44, 0, -52, 8, 22, -18, 1, -11, 1, -34, 58, 37, -13, 10, 52, 10, -1, 19, 36, -8, 25, -43, -9, -71, -63, -12, -42, -16, 52, -30, -1, 3, 3, -19, 12, -16, -44, -2, 52, 0, -5, 33, 8, 4, 111, 3, -11, -9, -51, 62, 21, 12, 5, -21, 40, 6, 0, -71, -10, -27, -37, 15, -26, -3, -10, 17, -46, -50, -42, 15, 3, -25, -32, -3, -15]
6712a5O6m3M5n6J1m8Q2p5J6K7Kk4K4m3J0M1rK9m9K8m3K5l4O0n9k5O9K3m6J5L8
6743D2q1P8k4j1K7k3j6J1M3m3rJ8k5L8o6O1k7Kn5L2j4O3N3o8l2K6J4J1l9M3k6
6774CN5l0j5N6o2LM0l2K5l2l9O2p9J9k0KJ08l7n7N0oJ4j4j7ql6k4NM8lO0m9k0
6807c0JO9n3m6P6j6M3r1L2N5j6L6n0K6nol1J8M3j00L1jK1j4j5k2M6L9o3k2N1k9
6839b3J8Pl6ON8j6m1K1m2R5ro7lJ2N3j5j1j9P0K7q3J4j5L0J3q4k8P3K9n7N9k6
6871A0p4L4mK9o2Q1o8R4j6q9M9kL1LL5l3Jl9%m3M0R5l2l6k1P2r1L9j5J0K2M0o5
6904eL7p5M1L7n8mN6n7j0K5Pl0m0J12j8k2o3N9K8lp3Q4l7M8J3m8J2m5J5M2r7M0
6936b9J1O0oo4j6O0k0O0m2k4P5l3k5K0n3M8rk6R7j16N4j9L9q9N4K4o5j2J3lK3
$$ y = [-15, 51, 8, 53, -3, 8, -40, 42, -33, -17, 10, 12, -12, 12, -31, -21, 20, 11, 40, -9, 19, -24, 1, -33, 27, -32, -57, 12, 35, -11, 4, 42, -39, 39, 15, 4, 31, 8, -8, 3, 46, 3, -6, 12, -13, 25, -41, 20, -7, -5, -60, -28, -42, 21, 74, 6, -26, 0, 14, 25, -14, 29, 3, 58, 28, 13, 69, 7, 10, 50, 18, 43, 11, -28, 34, -45, -26, -46, -44, 64, 27, -30, 20, 14, 28, 14, -3, -11, -47, -71, -66, -18, -21, 39, -10, -30, -29, 40, -13, -59, 17, 1, 44, -47, -15, 40, 24, 60, 10, 36, 31, 25, -6, 12, 55, -45, -14, -15, 6, -8, -23, -45, 1, 40, -23, -45, 6, -23, -5, 2, -34, -28, 30, 14, -27, -6, -48, 47, 38, -29, -32, -20, 33, 18, 7, -12, 58, 85, 2, 16, 1, 31, 44, -40, -68, 5, 34, -23, 36, 10, -64, -30, -34, -5, -67, 14, -54, 40, 24, -65, -16, -18, 13, 16, 51, 18, 19, -20, -20, -63, -23, 72, 40, 4, -17, 55, -36, 3, -12, -2, 20, 60, -5, 32, -43, -2, 35, -23, -27, 29, -28, -38, -13, -6, -36, -76, 36, 18, -4, -67, -8, 20, 17, -56, 28, -9, 39, 52, 4, 16, -29, -14, 28, -69, -29, -18, 42, 36, -28, -44, 16, -4, 56, 14, -10, 65, 32, 7, 27, -26, 22, 13, -13, 84, -32, 22, 3, 42, -47, 7, 31, -34, -46, -33, -36, -13]
6967a3m6K2J2M8l6J4M1o7O3o4L2km6P4j02Q8m2L6J8k3L5m5J3M2o3M1j5k7K1j8
6997iL6o1l4O3Q4n7k2k4M3K5q5K4Q1o3Nj7L8J2n1k3L7lLkK9o3RN4l2Pj4O9k4q9
7031e4P6j5l3L4l4K0oJ4J5nk1K9pNK3m8K1k6j0j1J6Om1k2R7k1L2J6n2K6MnPNr
7066B6m0J5K1rRJ7n0N6m5rJ7j0Pj3J6N6l2J9n9K9Jk0K2m6Kk8OL4M1l9K9l6j5J7
7100a1N4k8k7j4N6j0j0O4j12K0m6N9j4J0J2M6j9k2L7q4O8pOJ0m0j6O9m5j9L5o2
7131d0O3m8M2mM1n4m1MN0l5k7P8m5k3O7kl3LL5n3pR6r1L3j2kM0l9L0lL9r4k3J03
7165D8m1n2Q9j2j0pp7O3Qj7Km3K2qO0J9m6k6R8o3P8j65M0QK6Q4m8rK2k9J2r4O5
7198cN9o6K6l3K0j6N2j8p0K9R8k1j5n7NJ1lJ9RL6q4M2k4J1q1N7M4k2L0l7l1J8
$$ y = [-13, -59, -37, -25, 23, -13, 1, 42, -25, 38, -26, 6, 4, -42, 32, -70, 18, -24, 12, 30, 7, 42, -3, 10, 52, -11, 30, 15, -12, 9, -9, 27, -34, -68, -5, 79, 22, 0, -24, 19, 44, -41, -17, 64, 1, 6, -11, 27, 39, -12, -35, 2, -1, 2, 0, 29, -34, -25, 29, -3, 4, -10, 59, 35, -54, 22, 7, -26, 8, -26, -6, -12, 2, 17, 12, -9, 20, 13, 18, 41, -7, 14, -12, -22, -33, -17, -11, -52, -74, 23, 2, 34, 50, -2, 24, 28, 23, 30, 35, 26, -14, 1, 22, 13, 22, 39, -11, 45, 0, -9, 8, -2, 5, -8, 8, 64, 32, 51, -8, 21, 22, 2, 24, -22, -20, -48, -42, -8, 33, -6, 23, -13, -28, -11, 43, 15, -12, -26, 30, 20, 10, 74, -38, -18, -64, -5, -19, -9, 3, 49, 30, 8, 45, -39, 29, 22, 28, 38, -2, -18, 51, 6, -13, 22, -40, 23, -25, 17, 13, 54, 0, -41, -37, 13, -22, -49, 29, -16, -39, 28, 26, -7, -4, 31, -22, -29, 67, -24, 9, -3, -5, 35, -4, 26, 23, 62, -32, -55, 48, 7, -45, 44, 32, 22, 15, -62, 1, 9, -8, -6, -49, -27, -35, 25, 44, -2, -28, 70, 7, 85, -80, -40, -32, -6, 78, 30, 21, 43, 14, 26, -68, -3, 56, -10, 16, -17, 3, -13, 39, 21, -49, -20, 78, 57, 42, -15, -10, 1, -2, 17, 26, 62, -22, 20, -4, 7, -74, -17, 27, 5, 35, -2, -33, -15]
7230a5lM3j5M4p3jO0k9Mj9L3n1J1J2kM7j3j04O2k2J0M8l3NLO7p5L4pk6jK2j6K1
7264B1k9L0Ml1j8jlL3LJj4N1l1Pnk7M4J6l0p5O8k9K7m3oJ06l1m3k8P2K6j8l8l2
7298b3L3l6K2nL7j8Mj8J2n9L1J6n3J13q1nL1j9J01j19P7q0P5j0l8L1j8j6j3rL5
7329bJ8j3J8ol5K5j7l2L2K2o8M8l3O0jJ0l5L2j%qMk5%JK5KJ4%n2P0n3j7jL2k9
7365a5J2lL5m4J6M2K5%k9p3PM0j3jJ3m1N5n8P3p8M5l5JQ4p5O9l5j31Q2P0m6K3
7397A5l6j5K6J2o4QM6J01j34Q4j1l4N4l9N1o6l2L8lJ1L0n2O3l3Nk8m4M2L3l8k7
7428c7M5k4L2j5J2j6K0k8L3m4LJ9O0n0M0k4k9M3l8L1k3JMJ1omJJJ5KMM3q7l8K4
7463a9N3l6j8J8N8o7J1J6k5K9jj1m2M9L1p5OQLJ3LNRk6J9k9K3plj6J4K4k8K8n5
$$ y = [-15, -18, 25, 10, 54, -19, -20, 40, 11, 15, -4, 29, -22, -11, 1, -1, 46, 33, -71, -9, -31, -21, 27, -6, -1, 2, 69, -6, 28, 21, -5, -6, 16, 0, 21, -8, 22, 26, -5, -23, -24, -27, 6, 9, 10, -4, 47, 16, 23, 18, -9, 35, 51, 21, -54, 14, -15, 12, -31, -37, 69, 38, -5, -33, 39, 65, 47, 9, -23, 10, -26, -4, -9, 28, 10, 14, -4, 8, -51, -20, -4, -57, 56, -25, -30, 1, -18, 83, -36, 41, -39, 36, 26, -12, 19, 1, -15, -28, -37, -2, 16, 3, 21, 15, -20, 5, -12, -44, -12, 10, -58, -10, -43, 17, 16, 26, -9, 23, 22, 22, 14, 18, -7, -7, -6, 19, 21, 35, 35, -17, 53, 0, -17, -18, 14, -15, -3, -6, 29, -15, 1, 43, 68, 68, 39, -34, -27, 13, 0, -1, 12, -29, 26, -32, 41, -37, 8, -27, -26, 58, -17, 52, 17, -114, -32, 38, -8, 15, -21, -36, -10, 2, -62, -54, -8, 93, -41, 43, 32, -2, 52, 13, 64, -2, -34, 4, 1, 12, 42, -10, 53, 20, 25, -3, -47, -5, 28, -10, -37, 8, -16, 16, 1, 13, -3, 17, -11, 22, -22, -19, 0, 60, 10, 50, 26, -3, 40, 2, 33, 10, 11, 15, 26, 20, 16, 17, 18, 33, 35, 39, 82, -5, -43, -19, 34, -2, -20, -2, 56, -11, 0, 16, -9, 20, 19, 8, -34, 15, 46, -29, -23, -15, -12, 1, 4, 9, 18, -8, 11, -18, 5, -2, -5, -21, -7, 17, -11, 17, -38]
7498c8K2J1j5N6l4L2n3j5j9R3m2K5k8LPm1k8N2N4n2J1nRj6P4n8m2R6q1J6J8N5
$$ y = [-38, -16, -5, -20, 36, 2, 34, -19, -34, -53, 40, -2, 23, -5, -2, 5, -36, -64, -12, 42, -10, 1, -4, 5, -11, 63, 5, -37, 59, -22, -6, 12, 67]
$$ [...]
8191F
##END NTUPLES=NMR FID
##END=
