##TITLE=1H_IG-EtCHO
 200.13MHz, CDCl3
 8 sc
 
 19ns.26.2.2025
##JCAMPDX= 6.0         $$ Bruker NMR JCAMP-DX V2.0
##DATA TYPE= NMR FID
##DATA CLASS= NTUPLES
##ORIGIN= UXNMR, Bruker Analytische Messtechnik GmbH
##OWNER= pz
$$ XWIN-NMR		Version 3.5
$$ Wed Feb 26 14:51:14 2025 Russian Standard Time (UT+4h)  new_Human@DPX200
##.OBSERVE FREQUENCY= 200.1313
##.OBSERVE NUCLEUS= ^1H
##.DELAY= (6, 6)
##.ACQUISITION MODE= SIMULTANEOUS
##.ACQUISITION SCHEME= undefined
##.AVERAGES= 8
##.DIGITISER RES= 18
##SPECTROMETER/DATA SYSTEM= spect
##.PULSE SEQUENCE= zg30
##.SOLVENT NAME= CDCl3
##.SHIFT REFERENCE= (INTERNAL, CDCl3, 0, 14.3821)
##AUDIT TRAIL= $$ (NUMBER, WHEN, WHO, WHERE, WHAT)
$$ ##TITLE= Audit trail, XWIN-NMR		Version 3.5
$$ ##JCAMPDX= 5.01
$$ ##ORIGIN= Bruker BioSpin GmbH
$$ ##OWNER= new_Human
$$ C:/Bruker/XWIN-NMR/data/yarkov/nmr/H-C/1/audita.txt
$$ ##AUDIT TRAIL=  $$ (NUMBER, WHEN, WHO, WHERE, WHAT)
(   1,<2025-02-26 14:48:52.31 +0400>,<new_Human>,<DPX200>,
      <created by zg, POWCHK disabled, PULCHK disabled
       configuration hash MD5:
       00 E9 B6 7A A2 85 ED C7 34 08 36 98 17 FE 4E 26
       data hash MD5: 16K
       5C 65 74 A5 2F F3 4E 64 EF 77 4D 91 05 27 AB 84>)
$$ ##END=
$$ 
$$ hash MD5
$$ FD 2A FC C4 21 4D EF D6 8F 5B 71 6A 45 91 D3 47
##$RELAX= 
##$RELAX= 
##$RELAX= 
##$RELAX= 
##$RELAX= 
##$RELAX= 
$$ Bruker specific parameters
$$ --------------------------
##$DU= <C:/Bruker/XWIN-NMR>
##$EXPNO= 1
##$NAME= <H-C>
##$PROCNO= 1
##$TYPE= <nmr>
##$USER= <yarkov>
##$AMP= (0..31)
100 100 100 100 100 100 100 100 100 100 100 100 100 100 100 100 100 100 
100 100 100 100 100 100 100 100 100 100 100 100 100 100 
##$AQSEQ= 0
##$AQ_mod= 1
##$AUNM= <au_zg>
##$AUTOPOS= <>
##$BF1= 200.13
##$BF2= 200.13
##$BF3= 200.13
##$BF4= 200.13
##$BF5= 200.13
##$BF6= 200.13
##$BF7= 200.13
##$BF8= 200.13
##$BYTORDA= 1
##$CFDGTYP= 0
##$CFRGTYP= 5
##$CHEMSTR= <none>
##$CNST= (0..31)
1 1 145 1 1 1 1 1 1 1 1 1 1 1 1 1 1 1 1 1 1 1 1 1 1 1 1 1 1 1 1 1 
##$CPDPRG= <>
##$CPDPRG1= <>
##$CPDPRG2= <>
##$CPDPRG3= <>
##$CPDPRG4= <mlev>
##$CPDPRG5= <mlev>
##$CPDPRG6= <mlev>
##$CPDPRG7= <mlev>
##$CPDPRG8= <mlev>
##$CPDPRGB= <>
##$CPDPRGT= <>
##$D= (0..31)
0 0.7 0 0 0 0 0 0 0 0 0 0.03 0 0 0 0 0 0 0 0 0 0 0 0 0 0 0 0 0 0 0 0 
##$DATE= 1740566931
##$DBL= (0..7)
120 120 120 120 120 120 120 120 
##$DBP= (0..7)
150 150 150 150 150 150 150 150 
##$DBP07= 0
##$DBPNAM0= <>
##$DBPNAM1= <>
##$DBPNAM2= <>
##$DBPNAM3= <>
##$DBPNAM4= <>
##$DBPNAM5= <>
##$DBPNAM6= <>
##$DBPNAM7= <>
##$DBPOAL= (0..7)
0.5 0.5 0.5 0.5 0.5 0.5 0.5 0.5 
##$DBPOFFS= (0..7)
0 0 0 0 0 0 0 0 
##$DE= 6
##$DECBNUC= <off>
##$DECIM= 32
##$DECNUC= <off>
##$DECSTAT= 4
##$DIGMOD= 1
##$DIGTYP= 9
##$DL= (0..7)
0 120 120 120 120 120 120 120 
##$DP= (0..7)
150 150 150 150 150 150 150 150 
##$DP07= 0
##$DPNAME0= <>
##$DPNAME1= <>
##$DPNAME2= <>
##$DPNAME3= <>
##$DPNAME4= <>
##$DPNAME5= <>
##$DPNAME6= <>
##$DPNAME7= <>
##$DPOAL= (0..7)
0.5 0.5 0.5 0.5 0.5 0.5 0.5 0.5 
##$DPOFFS= (0..7)
0 0 0 0 0 0 0 0 
##$DQDMODE= 0
##$DR= 18
$$ [...]
##$SUBNAM0= <"">
##$SUBNAM1= <"">
##$SUBNAM2= <"">
##$SUBNAM3= <"">
##$SUBNAM4= <"">
##$SUBNAM5= <"">
##$SUBNAM6= <"">
##$SUBNAM7= <"">
##$SUBNAM8= <"">
##$SUBNAM9= <"">
##$SW= 18.0517328524113
##$SWIBOX= (0..15)
0 0 2 0 0 0 0 0 0 0 0 0 0 0 0 0 
##$SW_h= 3612.71676300578
##$TD= 16384
##$TD0= 1
##$TE= 0
##$TE2= 300
##$TE3= 300
##$TEG= 300
##$TL= (0..7)
0 120 120 120 120 120 120 120 
##$TP= (0..7)
150 150 150 150 150 150 150 150 
##$TP07= 0
##$TPNAME0= <>
##$TPNAME1= <>
##$TPNAME2= <>
##$TPNAME3= <>
##$TPNAME4= <>
##$TPNAME5= <>
##$TPNAME6= <>
##$TPNAME7= <>
##$TPOAL= (0..7)
0.5 0.5 0.5 0.5 0.5 0.5 0.5 0.5 
##$TPOFFS= (0..7)
0 0 0 0 0 0 0 0 
##$TUNHIN= 0
##$TUNHOUT= 0
##$TUNXOUT= 0
##$USERA1= <user>
##$USERA2= <user>
##$USERA3= <user>
##$USERA4= <user>
##$USERA5= <user>
##$V9= 5
##$VALIST= <valist>
##$VCLIST= <CCCCCCCCCCCCCCC>
##$VD= 0
##$VDLIST= <DDDDDDDDDDDDDDD>
##$VPLIST= <PPPPPPPPPPPPPPP>
##$VTLIST= <TTTTTTTTTTTTTTT>
##$WBST= 1024
##$WBSW= 4
##$XGAIN= (0..3)
0 0 0 0 
##$XL= 0
##$YL= 0
##$YMAX_a= 172281
##$YMIN_a= -102354
##$ZGOPTNS= <>
##$ZL1= 120
##$ZL2= 120
##$ZL3= 120
##$ZL4= 120
##$ABSF1= 10
##$ABSF2= 0
##$ABSG= 5
##$ABSL= 3
##$ALPHA= 0
##$AQORDER= 0
##$ASSFAC= 0
##$ASSFACI= 0
##$ASSFACX= 0
##$ASSWID= 0
##$AUNMP= <proc_1d>
##$AZFE= 0.1
##$AZFW= 0.1
##$BCFW= 1
##$BC_mod= 2
##$BYTORDP= 1
##$COROFFS= 0
##$CY= -3
##$DATMOD= 1
##$DC= 2
##$DFILT= <>
##$DTYPP= 0
##$F1P= 0
##$F2P= 0
##$FCOR= 0.5
##$FTSIZE= 0
##$FT_mod= 4
##$GAMMA= 1
##$GB= 0.15
##$INTBC= 1
##$INTSCL= 1
##$ISEN= 128
##$LB= 0.25
##$LEV0= 0
##$LPBIN= 0
##$MAXI= 10000
##$MC2= 0
##$MEAN= 0
##$ME_mod= 0
##$MI= 1.114404
##$NCOEF= 0
##$NC_proc= 0
##$NLEV= 6
##$NOISF1= 3.799351
##$NOISF2= 2.8
##$NSP= 1
##$NTH_PI= 0
##$NZP= 0
##$OFFSET= 14.38212
##$PC= 1
##$PHC0= -1267.691
##$PHC1= 13.59225
##$PH_mod= 1
##$PKNL= yes
##$PPARMOD= 0
##$PSCAL= 0
##$PSIGN= 0
##$REVERSE= no
##$SF= 200.129724274929
##$SI= 16384
##$SIGF1= 3
##$SIGF2= 2
##$SINO= 400
##$SIOLD= 16384
##$SREGLST= <1H.CDCl3>
##$SSB= 0
##$STSI= 0
##$STSR= 0
##$SW_p= 3205.1282051282
##$SYMM= 0
##$S_DEV= 0
##$TDeff= 0
##$TDoff= 0
##$TI= <>
##$TILT= no
##$TM1= 0
##$TM2= 0
##$TOPLEV= 0
##$USERP1= <user>
##$USERP2= <user>
##$USERP3= <user>
##$USERP4= <user>
##$USERP5= <user>
##$WDW= 1
##$XDIM= 8192
##$YMAX_p= 0
##$YMIN_p= 0
$$ End of Bruker specific parameters
$$ ---------------------------------
##NTUPLES= NMR FID
##VAR_NAME=  TIME,          FID/REAL,        FID/IMAG
##SYMBOL=    X,             R,               I
##VAR_TYPE=  INDEPENDENT,   DEPENDENT,       DEPENDENT
##VAR_FORM=  AFFN,          ASDF,            ASDF
##VAR_DIM=   8192,          8192,            8192
##UNITS=     SECONDS,       ARBITRARY UNITS, ARBITRARY UNITS
##FACTOR=    0.0002768,     1,               1
##FIRST=     0,             0,               0
##LAST=      2.2672688,     0,               0
##MIN=       0,             -102354,         0
##MAX=       2.2672688,     172281,          0
$$ Real data points
##PAGE= N=1
##DATA TABLE= (X++(R..R)), XYDATA
0@%%%%%%%%%%%%Qj6J6j6K4l2L2m0M8n6P2q8J04j20J36j53J77k08K40k72L06l46
$$ 0 0 0 0 0 0 0 0 0 0 0 0 0 8 -8 8 -8 16 -16 16 -24 24 -32 40 -48 56 -64 72 -81 96 -112 128 -144 162 -184
34a84L92m42M99n59O24o97P77q64R58j061J174j298J433j581J741j916K112k328
$$ -184 208 -234 265 -294 330 -367 410 -454 504 -557 617 -681 752 -829 912 -1004 1108 -1220
52a220K566k831L126l459L833m261M759n340O032o872P916r258J1052j3581J7435
$$ -1220 1346 -1485 1641 -1818 2015 -2246 2513 -2827 3205 -3667 4249 -5009 6043 -7538 9897
67I897k4083L8605j22796P5199J69650k48826R8073J32844j76756n398J44893
$$ 9897 -14186 24419 -98377 -23178 146472 -102354 -4281 128563 -48193 -53591 91302
78I1302j36093j0381J15400r3563k2567J28800o8408l0837P5751p3250j2244J02269
$$ 91302 -44791 -55172 60228 -33335 -55902 72898 4490 -26347 49404 -23846 -36090 66179
90F6179j01556l2038J48987p5550j01692J56869o38j28697Q8306K6722j14789
$$ 66179 -35377 -67415 81572 6022 -95670 61199 60561 -68136 20170 46892 -67897
101f7897O4166M7149r4115M6890O6037q2624O447N1874n6408o94L4381l9485K6897
$$ -67897 -3731 43418 -50697 -3807 62230 -20394 -13947 37927 -18481 -19175 15206 -24279 2618
114B618L4774o4061J6697N5065o5864r014O7273l9050k3384N0137l2453k1862
$$ 2618 37392 -26669 -9972 45093 -20771 -29785 37488 -1562 -24946 25191 -7262 -29124
126b9124N6091j8530l2738M0692o138k3919K5656j6705j6475L4782j7856j3894
$$ -29124 26967 8437 -24301 16391 10253 -13666 11990 -4715 -21190 13592 -4264 -18158
138a8158N0492k0951m3352M4133j950m0164M4202N225n1985L6740K1231n3238
$$ -18158 32334 11383 -31969 12164 10214 -29950 14252 19477 -32508 4232 25463 -27775
150b7775K6163L6035n1957J165L6457l1725M993L1817m2232n340M6873k4649j3301
$$ -27775 -1612 34423 -17534 -16369 20088 -11637 -6644 25173 -17059 -22399 24474 -175 -13476
163a3476M1519k4930l1640L3815m802j5709L6173j1706l2458L5043K952l6992
$$ -13476 28043 3113 -28527 5288 486 -15223 20950 9244 -23214 11829 14781 -22211
175b2211K5752J3765l5353J3616J8148k4881J3976J6663l4612M272L0521k2312
$$ -22211 3541 17306 -18047 -4431 13717 -11164 2812 19475 -15137 -10865 19656 -2656
187b656q892K3989j3678j2051J9404l192n246J3398j2171j0908J8500j925j3365
$$ -2656 -11548 12441 -1237 -13288 6116 2924 -2322 11076 -1095 -12003 6497 4572 -8793
200h793J0425O61q216J0380J112q780O515l002j1527J0970R133q983j210J545
$$ -8793 1632 2293 -5923 4457 5569 -3211 3304 302 -11225 -255 8878 -105 -1315 230
214B30m279M201K979l714K693j604o530N986M541n648O86Km142O733L652p614
$$ 230 -4049 152 3131 -583 2110 506 -6024 -38 4503 -1145 -459 -457 -4599 2134 5786 -1828
230a828J086J784o816M061P136m597l69P86p029M090P882o454j468M733o767k21
$$ -1828 -742 1042 -5774 -1713 5423 826 457 1243 -5786 -1696 6186 -268 -1736 2997 -3770 -3991
246c991R664l461n012L744l820j152R449q94o262J847k817k259Q115O32n359K915
$$ -3991 5673 2212 -2800 944 -2876 -4028 5421 4527 -1735 112 -2705 -4964 3151 3783 -1576 1339
262A339j567m456P364K600p921Q48K601m427L324N112n091j990L312j331Q03K744
$$ 1339 -228 -4684 2680 5280 -2641 -1793 808 -3619 -295 4817 -274 -2264 1048 -283 520 3264
278C264l823k914J446M3K978L901l192k811J449j823m90L818j646l951K431K846
$$ 3264 -559 -3473 -2027 -1984 994 4895 1703 -1108 341 -1482 -1972 1846 200 -3751 -1320 1526
294A526K39J665o49m534k225J352K408J918m52j499k33J86J370K136j651m163
$$ 1526 1765 3430 2781 -1753 -3978 -2626 -218 1700 1248 -251 -484 -298 1072 3208 1557 -2606
310b606q45J469J209K202J477j657j844P28J154q01j953j103N4J103L053K783
$$ -2606 -3451 -1982 -773 1429 2906 1249 -595 133 1287 486 -1467 -2570 -2516 -1413 1640 4423
326D423j298l545j382J76K87J378P96j675j089J964K517L10j562k078j711l38
$$ 4423 3125 -420 -1802 -1626 -1339 39 835 -840 -1929 35 2552 2862 1300 -778 -2489 -2827
342b827K031K503m61k058L04J441P1N34K93l063k800J677K527J030J457l13k967
$$ -2827 -796 1707 1246 -812 -508 933 1004 1538 1831 -1232 -4032 -2355 172 1202 2659 2346 -621
359f21p86J473J19m09o39j241J176K487K73J58q68l762K58M125j098k140K250
$$ -621 -1407 66 185 -224 -863 -2104 -928 1559 1832 1990 1122 -2640 -2382 1743 645 -1495 755
376G55j337k348M596K061l822M06j9m373K036M626k290p42J947k630N13L774k923
$$ 755 -582 -2930 1666 3727 -95 311 292 -4081 -2045 2581 291 -451 1496 -1134 -621 3153 230
393B30k126K134l111Q9P402j628n729L443k2m108N198J764o820J888L430n094
$$ 230 -1896 238 -2873 -2784 4618 2990 -2739 704 682 -3426 1772 3536 -3284 -1396 2034 -3060
409c060K492O261n528l373M574j713j272M234l040l172N075k30k578N182j045
$$ -3060 -568 5693 165 -3208 1366 -347 -1619 2615 -425 -3597 1478 1248 -1330 3852 2807
424B807p709K233M432k216J532J418m966Q10M473l242j070M662k653m700L479
$$ 2807 -4902 -2669 1763 -453 1079 2497 -2469 -1659 2814 -428 -1498 3164 511 -4189 -710
439g10K631j781M44l31j872K340J362l293L38K219l586j310N954J574m439p45
$$ -710 1921 140 584 253 -1619 721 2083 -1210 -872 1347 -2239 -3549 2405 3979 -460 -1205
455a205P85j103K215J090m344Q71M785l529k411O293p43o742K471L297k554J900
$$ -1205 -420 -1523 692 1782 -2562 -1691 3094 -435 -2846 3447 2704 -4038 -1567 1730 -824 1076
471A076L51n180L387M230o178J302P067p029n385P540J95k865N324l264n459Q418
$$ 1076 1427 -3753 -366 3864 -2314 -1012 6055 -974 -6359 1181 1376 -1489 3835 571 -4888 3530
487C530L00r839N866N519r587J057Q096m601q84L487o808J279Q842p235m275J0114
$$ 3530 3830 -6009 -143 5376 -4211 -3154 4942 341 -543 2944 -3864 -2585 6257 -978 -5253 4861
503D861l667p747R142J928p112M602j228q231R364N543j2832J455J0602p333m041
$$ 4861 1194 -6553 2589 4517 -2595 2007 779 -7452 1912 7455 -5377 -3922 6680 -653 -4694
518d694Q752j813n348K539j709K91P280l067o652M906J789n080K028K585k162
$$ -4694 4058 2245 -3103 -564 -2273 -1982 5298 2231 -4421 485 2274 -2806 -778 1807 -355
533c55R65j284l329O275L803r414j935R468j804p590M703M337n306qM002l039
$$ -355 610 -674 -4003 2272 6075 -3339 -5274 4194 2390 -5200 -497 3840 -1466 -1474 2528 -511
549e11j19L734n759k802R842m4r651M728O301p432j624N477k173j72J665n484
$$ -511 -630 3104 -2655 -5457 4385 4341 -5310 -582 5719 -1713 -3337 2140 -33 -205 1460 -4024
565d024L253Q101q173m660R636l052o438Q357o24o737P479j402q989J1458M445
$$ -4024 -771 7330 -843 -5503 4133 1081 -5357 3000 2376 -4361 3118 1716 -7273 4185 8630
580H630j6171L259J1279r951j323J0309o378k710P886o776k515J1014o408q477
$$ 8630 -7541 -4282 6997 -2954 -4277 6032 -346 -3056 4830 -1946 -4461 6553 145 -8332
594h332J1184J164p747O293k45p453P005Q50q866P855M533j2388K645R758p080
$$ -8332 2852 4016 -3731 2562 2317 -5136 1869 2719 -6147 1708 6241 -6147 -3502 6256 -824
609h24j348O498o455j577P766n298l185R392l091p653P424K602o628K337J129
$$ -824 -2172 4326 -2129 -3706 4060 -1238 -4423 4969 1878 -5775 1649 4251 -2377 -40 1089
624A089n101L936L528n536J647M708n702k290N980n11l521J641j38r18K827m39
$$ 1089 -4012 -76 3452 -2084 -437 4271 -1431 -3721 2259 1748 -1773 -132 -270 -1188 1639 1200
640A200k825K217J208l283M63K853j756j916J273O08Q77J480k210k130K375J27
$$ 1200 -1625 592 1800 -1483 -1020 1833 77 -1839 -566 42 919 2399 189 -1941 434 561
656E61k795K022K619k847j188K576j9n95O93k037j075K780m6j906J960P24k587
$$ 561 -2234 -212 2407 -440 -1628 948 929 334 1027 -1010 -2085 695 649 -1257 703 1427 -1160
673a160N28J915p38m43n61j720J431K267j462l43J936j265j756J472K91j241M47
$$ -1160 -632 1283 545 102 -459 -2179 -748 1519 57 -286 1650 385 -1371 101 392 -849 -402
690d02k8l66J942O89k080k86Q35j165k25J637M6r25Q9qL50J178m31j675P9O58
$$ -402 -430 -796 1146 1835 -245 -531 304 -861 -1086 551 597 -328 -239 -247 103 1281 850 -825 -746 -88
710h8n50K92J232l94r54N98N35m18j42m54r22N77J348j55l84L96m39o07O82K71
$$ -88 -638 -346 886 492 -462 136 671 253 111 -343 -1265 -688 660 505 121 517 78 -529 153 424
730D24p02j53p9JJ186L91j170j7L14r45M80J322j133q41J048m12k40J910k55j979
$$ 424 -278 -431 -510 -509 677 1068 -102 -119 195 -750 -270 1052 -81 -922 126 -286 -526 1384 1129 -850
750h50N31L32j075J172J002j509n8Q69o92N63Q62j611n24J052n98K99J496j158
$$ -850 -319 13 -1062 110 1112 -397 -455 414 -278 285 1147 -464 -988 64 -534 -235 1261 103
768A03r89J397l25p86J332m49j546J096P00q43P31K50j285L70P49o22K53R8j159
$$ 103 -886 511 186 -600 732 283 -1263 -167 533 -310 421 671 -614 -244 505 -117 136 234 -925
787i25L90J062l40L20L43j419l45J088k10j11P39o13n69Q43J68m04J28m02l89
$$ -925 -535 527 187 507 850 -569 -914 174 -36 -147 592 -21 -590 253 421 17 145 -257 -646
806f46O10L06o8J94n14m86O12K67l03K50j48o22M05N77l33j44P7k53J09M37j36
$$ -646 -36 270 202 396 -118 -604 8 275 -28 222 74 -548 -143 434 101 -43 34 -219 -110 327 191
827A91l37r2J2L01L85j58l96k36j62K05O81K96m76l94r1j12K09M79q2m19Q8K45
$$ 191 -146 -238 -226 75 460 302 -94 -330 -492 -287 394 690 214 -180 -271 -383 -174 305 223 -196 -108 137
849A37RP3j23m90j04M26L11N1j57j78p0o7J29L71j22m68rK00J17J85m4j41K0j52
$$ 137 146 219 96 -394 -498 -72 239 290 133 -45 -115 -182 -53 318 196 -272 -281 -81 36 221 177 36 56 -96
873i6qL64l15n39M53K29L7P17m07j239N04M66q12P66Q51j315j04R37q33K15J084
$$ -96 -104 260 -55 -594 -141 88 125 842 435 -804 -300 166 -646 120 971 -344 -448 489 -344 -129 955
894I55j410l11J591j106o41K020q86j445K056k01j732J890j04k604J959J430k532
$$ 955 -455 -766 825 -281 -922 1098 212 -1233 823 622 -1110 780 676 -1928 31 1461 -1071
911a071J073J684k719K71K226k234j23K415k215o27L168j610j706K792j225k112
$$ -1071 2 1686 -1033 -762 1464 -770 -893 1522 -693 -1320 1848 238 -1468 1324 99 -2013
927b013L309k33l045K687N85l589K359K360l503L70K281k807J25K880k303o76
$$ -2013 1296 1063 -1982 705 1290 -2299 60 2420 -1083 -713 1568 -1239 -1114 1766 -537 -1213
943a213L078j783j714K860p33k067K156j73j652K322k35k655K336J118l251J060
$$ -1213 1865 82 -1632 1228 495 -1572 584 411 -1241 1081 846 -1809 527 1645 -1606 -546
959e46K381k444n54K084j098k55J728j541j023K231m50j853J492Q76j567j53R75
$$ -546 1835 -609 -1163 921 -177 -432 1296 -245 -1268 963 513 -1340 152 1028 -539 -692 283
976B83K25J2o97p23Q70O37r04j53J112l2j306r2J284J25r94M5L59r5L59m01p25
$$ 283 508 520 -177 -900 -30 607 -297 -450 662 630 -676 -768 516 641 -353 -308 51 -44 315 -86 -811
997h11J515M44k433N36K417j763j447K151k6j092J191p53j001K085o72k163K598
$$ -811 704 1148 -1285 -749 1668 -95 -1542 609 583 -509 682 -71 -1072 1013 341 -1822 776
1014G76Q59l228J025J966k040N05J285k498Q24K526l000m97L801k115k516L442
$$ 776 1635 -1593 -568 1398 -642 -137 1148 -1350 -526 2000 -1000 -1497 2304 189 -2327 1115
1030A115l8k600K235R4k578K309Q27l112J769K009l175K16K426k130k64K301j843
$$ 1115 1077 -1523 712 806 -1772 537 1364 -1748 21 2030 -1145 -929 1497 -633 -897 1404 -439
1047d39n23K640j765j684K956m35k407K240N35k519J494J082k521J154K040k681
$$ -439 -962 1678 -87 -1771 1185 750 -1657 583 1118 -1401 93 1175 -1346 -192 1848 -833
1063h33m41K601j393j179K330o40j684J876m1j882J821P11k636P70J959j711k12
$$ -833 -1274 1327 -66 -1245 1085 445 -1239 637 596 -1286 535 1246 -1390 -620 1339 -372 -584
1080e84J624j270m42J576j286o46K344r27k016K197N83k261J095J021j874P44
$$ -584 1040 -230 -672 904 -382 -1028 1316 389 -1627 570 1153 -1108 -13 1008 -866 -122
1096a22J109k032O42J978k271n74K801j082j807J903j58j480J623m5j581J833
$$ -122 987 -1045 -403 1575 -696 -1270 1531 449 -1358 545 387 -1093 530 485 -1096 737
1112G37K74k555J365J777k327j18J879j379l59J702j127n47J829j178j374K154
$$ 737 1011 -1544 -179 1598 -729 -847 1032 -347 -706 996 -131 -678 1151 -27 -1401 753
1128G53pj986J305Q55j558O36P70j409M89J022j539k1J657r82q27J475j62j039
$$ 753 746 -1240 65 920 -638 -2 768 -641 -152 870 -669 -690 967 -15 -842 633 471 -568
1146e68P50m0p94Q45J79r88O97N94j106J70Q98p26l29P23m62k93Q81k29n92P80
$$ -568 182 142 -652 193 372 -616 81 675 -431 -261 637 -89 -418 305 -157 -450 431 202 -390 390
1166C90lr88M86N51p38Q9O02n33m3O68m81l68O60k38n51O40J35o19L92K97n71
$$ 390 387 -601 -115 436 -302 -213 389 -144 -187 481 0 -368 292 54 -497 143 278 -341 51 348 -223
1187b23K18L59o65PN91m04j55O82k49m87M44Mm17M04J10n73K84M15m55M0M20m27
$$ -223 -5 354 -311 -304 287 -117 -272 410 161 -326 118 122 -295 109 219 -354 -70 345 -110 -70 350 -77
1209g7k14M46j46k34M15n5l42K94P3l69J92K02l25N2K40k15K4J86k24LK48k28
$$ -77 -291 155 9 -225 190 135 -207 87 160 -209 -17 185 -140 -88 152 -63 -39 147 -77 -74 174 -54
1231e4j49K59m7p6K26o3k75J32P5j28J49Q8j95j3J12p5KJ32k6j02l6KN3M6O3o
$$ -54 -203 56 9 -67 159 96 -179 -47 28 -100 49 137 -58 -71 41 -34 -32 100 74 -28 -64 -62 -9 37 100 94
1257I4j56j9J04m6j7J36j00p2J51o6j24J72nj69J67Kj83J69Q3k49J05J11k20J18
$$ 94 -62 -81 23 -23 -40 96 -4 -76 75 9 -115 57 52 -117 50 52 -131 38 121 -128 -23 88 -132 -14
1281a4J76k28J0J57k38MK64j32j0J98k10j45K36q4q7K51p4j92J92o3j79K24L5
$$ -14 162 -66 -56 101 -137 -133 131 -1 -11 187 -23 -168 68 -16 -103 148 74 -118 74 11 -168 56 91
1304I1j73J53Rk48J47O8j75J53J51j95M1L4k51M4K07r9N4J61j73p0J03r7l4J22
$$ 91 -82 71 80 -168 -21 47 -128 25 176 -19 22 56 -195 -151 56 -43 11 172 -1 -71 32 -65 -99 23
1328B3o7j1J26o8k5J10p5q6P2J7k6M7j5r0QN3J09N4p9q4j39j16J94J67o6J18L6
$$ 23 -44 -55 71 3 -22 88 13 -73 -1 16 -10 37 22 -68 -60 -7 102 156 77 -7 -146 -262 -68 99 33 151 187
1355A87k91j3J41j77L3K57j26j9J62k49n4L33j91j55L18j79k37M42q1l76M29L8
$$ 187 -104 -117 24 -153 -120 137 11 -8 154 -95 -149 184 -7 -162 156 -23 -260 182 101 -275 154 192
1377A92m42M19J30p06K47M30n14J91N30n22r3M55n44j37O90l83k35P51l37n62
$$ 192 -250 169 299 -407 -160 270 -244 -53 477 -45 -138 317 -227 -364 326 -57 -292 459 122 -440
1397d40O99j45o69P68J40q17N88L15r88L92P02q31P9Q20p37l17P61m59k94R01
$$ -440 259 114 -555 213 353 -464 124 439 -549 -157 545 -286 -207 613 -124 -441 320 -139 -433 468
1417D68k65n34O55k61o05P45N6p02O24J91p73M45L76q31K71O27p44rP93n66l86
$$ 468 203 -331 324 63 -542 203 259 -443 181 372 -401 44 420 -411 -140 487 -257 -266 527 -39 -425
1438d25P16k63m84O73R5n28K78Q9m98K07L44k75Q6K74l50j73K91p4j09L22p9l07
$$ -425 291 28 -456 217 312 -216 62 151 -347 -140 204 -71 15 289 -61 -234 57 -17 -126 196 117 -190
1460a90K00J07l30J75L55m11p5N10k99m77N58P1n57M58L18p02K13N20p36o2P36
$$ -190 10 117 -213 -38 317 -94 -169 341 42 -435 123 194 -363 95 413 -289 -76 444 -292 -354 382
1481C82n10k08Q40m04n50P48j88o49P67O0q01O90K38r94N49O10j031K89Q88j041
$$ 382 -128 -336 504 100 -450 298 110 -539 228 288 -513 177 415 -579 -30 580 -451 -162 726 -315
1501c15j89J082p23m71J206l32q03R76j54j038R13L09j050O19O17j054K48P29
$$ -315 -504 578 -145 -616 590 258 -545 431 277 -761 152 461 -589 30 647 -407 -159 570
1519E70r22L6Q85q21k19J081o02o05J088k27r48Q90K15r47N80M12r80L72P30q92
$$ 570 -352 -316 569 -252 -471 610 8 -597 491 264 -684 206 421 -526 54 466 -514 -142 588 -304
1539c04PR12o75m45Q32k87n02P60l8o03N66K7p56N08M32p22J13O37n76j74N82
$$ -304 -297 615 -60 -505 327 40 -462 298 260 -343 223 250 -506 2 434 -288 -175 462 -114 -288 294
1560B94l20k87O20j85n03N55J12o82L04M44n73J2N35l65j89N09l04l81O13j8o00
$$ 294 -26 -313 307 122 -381 174 286 -396 -92 352 -221 -209 326 -39 -228 281 -23 -404 209 191 -409
1581d09N15K79p05J95N02o18N0O22n70j99P79m43n18Q98r6p64P03J46r07N28M31
$$ -409 106 385 -320 -125 377 -241 -191 431 -139 -338 441 -2 -520 378 282 -482 221 367 -540 -12 419
1602D19r05M27P38r79j4R21q14l27J041n03n31J004l40p51R90m3j021Q16L39j039
$$ 419 -486 -59 679 -300 -314 607 -207 -534 507 4 -527 477 137 -614 376 333 -688 128 467 -572
1622e72N44N61r65L09P07r41O8R20q37k74R90n14n13R05k19o02P82r8p88O42J86
$$ -572 -28 533 -432 -123 584 -357 -289 631 -206 -480 510 -4 -517 388 169 -433 349 251 -537 105 291
1643B91p50M76M52p04J26M36n63M3M98m27p5N04l44k53M79r4l19L29j8k94K32
$$ 291 -459 17 469 -235 -109 327 -236 -193 305 -122 -197 307 -37 -290 189 95 -224 105 87 -207 25
1664B5R0k92J55J81k40kK59j50j77J61L2j19J05P5j57K9J41j43q8K14p8j51K05
$$ 25 115 -177 -22 159 -81 -83 176 26 -151 10 42 -77 28 103 -54 -25 116 -27 -115 99 21 -130 75
1687G5L9k26J15P2k15J29J61k30N5J87k81l7K96j51q6K75j89k14L12n1k11K97
$$ 75 114 -112 3 75 -140 -11 150 -80 -25 162 -119 -156 140 -11 -97 178 -11 -225 87 36 -175 122
1709A22J6l47J96J49k75J49J71k96O8J91k45K8K35k09m5K47j68p6K39j42j42K32
$$ 122 138 -209 -13 136 -139 10 181 -115 -47 144 -101 -73 162 -47 -92 155 -13 -89 150 8 -134 98
1731I8r9j57K34Jj71J83k0k21J42O6j42J43K1j91P9R8j28R7O9k05N1J16j67Q3
$$ 98 -1 -158 76 77 -94 89 69 -152 -10 56 -86 57 78 -113 -34 64 -64 33 102 -103 -52 64 -103 -20
1755b0J51j89J1J68j85j5J81j60l6K05r5o3J83j46j22K13p6r6J99p9j70K05nj60
$$ -20 131 -58 -47 121 -64 -79 102 -58 -94 111 16 -47 136 -10 -132 81 5 -91 108 29 -141 64 59 -101
1779a01J86k7k16J56P2j81J49Q2k53J06J33k11J09J39k67J9K12j66M4K16k36j01
$$ -101 85 58 -158 -2 70 -111 38 120 -133 -27 106 -105 4 143 -124 -105 107 -59 -15 201 -35 -136
1801a36K16j31l0K43j37j48K16p4j41K32n4j84K06j6j97K01J8k18J93O7k46J21
$$ -136 80 -51 -81 162 25 -123 93 19 -122 110 56 -128 78 62 -135 66 84 -134 59 126 -120 1
1823AQ0k36J40J82k57M6J77k56L8K54k17o5K18j55o6K69j30j62K30o1j96K43L8
$$ 1 81 -155 -15 167 -90 -44 133 -123 -85 169 -48 -113 105 -50 -116 153 23 -139 91 30 -166 77 115
1846A15k24J29M5j88J33J12j93O6R5j81N5J63j35n8R6p3K1J14j01p0J02l1k7R5
$$ 115 -109 20 65 -123 10 122 -71 -5 90 -91 -36 127 -8 -66 30 -43 -22 92 -9 -79 23 -8 -35 60
1870F0j6j13MK8L7O3m3m9rNK6J5pL1m8q0J23O6j21J5O6j33M6J47j66MK14k10p9
$$ 60 44 -69 -65 -37 0 63 20 -29 -38 -33 -7 8 1 32 -16 -96 27 93 -28 -13 53 -80 -34 113 -53 -49 165 -45 -124
1899a24K93j32k01K76q1k19L03nl28K89J00l97K12K40m21Q4L18l34L5L95m18j53
$$ -124 169 37 -164 112 31 -188 115 110 -218 71 171 -226 -14 226 -195 -111 207 -127 -92 303 -115 -268
1921b68N21k26k81M77j40l96M34Ql62M34K6o10L50L59n55J23M31m67oM24m03m2
$$ -268 253 27 -254 223 83 -313 121 129 -233 201 227 -383 -33 326 -229 -106 325 -142 -148 276 -127 -169
1943a69N25m63k91P12j38n21M45Q0m65L60J12m58L48J79o33K48N69n44j90N08
$$ -169 356 -107 -398 314 176 -345 100 180 -285 75 187 -271 77 256 -377 -129 440 -104 -294 214
1963B14j98j96L61j89j97M25k11l71N83J31o25J21L77k84k1K35k22L2K09l26n1
$$ 214 16 -180 181 -8 -205 220 9 -362 221 352 -273 -152 225 -59 -80 155 -67 -35 174 -152 -203
1984b03N31j91m33L13J91l08M1J21j51J23O5k80J84L10m26k28N01J2l55J79Q4
$$ -203 328 137 -296 17 208 -100 -59 62 -89 34 99 -181 3 313 -113 -341 160 172 -183 -4 80
2005H0k06J82P2l14K03K28m72j4N62k14l60L03M5k13K34k9k92K98M1m36K72M01
$$ 80 -126 56 128 -186 17 245 -227 -241 321 107 -253 50 95 -118 116 87 -205 93 134 -302 -30 371
2027C71m27j17L41k26p2L36k82j51M82k03m07N44J00n94K16K96l65J55K17m53
$$ 371 -56 -173 168 -58 -130 206 -76 -227 255 52 -355 189 289 -305 -89 207 -158 -3 214 -239
2047b39J01M78m30j61N77k37m37M05P9k78K89n2l87M50J54n96K18M11n19o9M93
$$ -239 -138 340 -90 -251 326 89 -348 57 136 -142 147 95 -292 158 312 -284 -66 345 -174 -243 250
2068B50k18j23K99l13j50N76k02m80M67J50n37K08L32l12JJ60k95J56L18m15j33
$$ 250 32 -91 208 -105 -255 321 119 -361 106 256 -281 -73 259 -53 -52 108 -187 -31 287 -128 -261
2089b61M67j47k81L20N9k73J04%j53K85N6m19J40L65l15r7L36j20k36J87Lj06
$$ -261 206 59 -222 98 157 -116 -12 -12 -165 120 176 -243 -103 262 -53 -150 186 66 -170 17 20 -86
2111h6K52q7l50K84K15l36jL08k44j56K70l6j01K12j70j99L52K1l58J83J74l05
$$ -86 166 79 -271 13 228 -108 -109 199 -45 -201 69 33 -68 144 -26 -225 127 148 -210 -27 147 -158
2133a58J02K37k29J8J63k98M6L78k52k40L56n9k39L02K2k83J70M5k84K53J92l94
$$ -158 -56 181 -48 -30 133 -165 -119 259 7 -233 123 64 -175 127 149 -134 36 81 -203 50 242 -152
2155a52L3K82k15kK41k14j22K35j40p0L03r8k66K25O0k19J54M3k14J12J16j71
$$ -152 -119 163 -52 -54 187 -27 -149 86 -54 -124 179 81 -185 40 100 -119 35 78 -136 -24 92 -79
2177g9Q2J34k28k8K29q1o9J12r9q4J73Pr9J08m9j52J09J19j14J6Pq3O3R0o4j3
$$ -79 3 137 -91 -119 110 29 -40 72 -27 -111 62 69 -30 78 29 -123 -14 105 -9 7 14 -69 -6 84 20 7
2203GJ2q2MJ17pn5Kn4J2Q4pl4Ml6j9P1Pk6j0l0K2N6pl6qj8OO7J5m6pm3NP8J1m9
$$ 7 19 -63 -59 58 51 -4 -2 -56 -44 40 33 -1 3 -33 -52 19 26 0 -10 -40 -18 38 31 -5 -13 -31 -25 42 57 11 4 -39 -34 44 55 6
2239Fj9k1k3Q2M3o3kk3k7O4N6q2j9J1k8M1R2p3n2J6rK0N6l4m8J7mJ4P0m0m8J3
$$ 6 -13 -34 -57 25 68 5 3 -20 -47 17 73 -9 -28 -17 -45 -4 88 15 -37 -21 -30 -10 46 12 -36 -19 -23 -9 61 21 -27 -14
2271a4j1K9N6k7p0L0j6M8O1l3q9oJ1J0R0j1q3Nj4J0P6nr1J1J0j8Q7J6q7k1L7k0
$$ -14 -25 4 60 33 -37 -7 -23 25 86 53 -36 -42 -31 -21 69 58 -25 -20 -34 -24 52 47 -44 -33 -23 -41 46 62 -25 -46 -9 -29
2303b9L9O3r9m3O6j2K6N8p5m7L7J3MM4m5n3N1K8oL1m8n7L5K7K1L2m8o5K8L0J7
$$ -29 10 73 -26 -69 -3 -15 11 69 -6 -53 -16 -3 1 45 0 -53 -2 26 20 51 3 -54 -19 8 29 61 13 -52 -24 6 23
2334B3K4n3m6J4OL0Q4o9r8P9L1n3P8k1j09P1L7o6J02K5j69J0J35p1mR5j34l3J60
$$ 23 47 -6 -52 -38 -32 -2 82 13 -85 -6 25 -28 50 29 -80 -9 28 -38 64 89 -80 -70 65 -6 -10 85 -49 -82 78
2363G8o5m3J38j19j49K11M7j48R1pj65J57J13j91N5R1k37L2K62j15j11J31j11
$$ 78 13 -30 108 -11 -160 51 98 -50 41 34 -131 26 139 -52 3 94 -143 -111 151 36 -75 56 -55
2386e5o2K38p0j58J61k6j88J91J25k19K3R7j26O7J41j76n9J79q5j02K19j4k02
$$ -55 -117 121 51 -107 54 28 -160 31 156 -63 -40 57 -69 -2 139 -37 -96 83 -2 -104 115 101 -101
2409a01O3P4p0Q6K6j81K7J78j07m2J61q7j68J30P3p3O8m6j65J38J65j98j6J80
$$ -101 -38 36 -34 52 78 -103 -76 102 -5 -47 114 27 -141 -11 62 -11 57 11 -154 -16 149 -49 -65 115
2433A15j47j28K21M1j51R6o8j30K51P0l06J04K01k49j9K74j33j33J60j22m5L24
$$ 115 -32 -160 61 102 -49 47 -21 -151 100 170 -136 -32 169 -80 -99 175 42 -91 69 -53 -98 226
2455B26j65l16L27Q9l26J76J89l05NJ70j74J17K26l78j01M31j37k44L07k0k70
$$ 226 61 -255 72 161 -165 11 200 -105 -100 70 -104 13 239 -139 -240 191 54 -190 117 97 -173
2476a73J84M3j56K41j5l90K15L13l28m2K66j88r6K28j10k7K09k18k01L93O6l71
$$ -173 11 54 -102 139 124 -266 -51 262 -66 -108 158 -30 -126 102 -8 -35 174 -44 -245 148 214 -157
2498a57J25J41j89O0J28j69N8J07k54L1L51j67k62K05N1j19J17Jj23J03jj92J82
$$ -157 -32 109 -80 -20 108 -61 -3 104 -150 -119 232 65 -197 8 59 -60 57 58 -65 38 37 -155 27
2521B7J99k69j32K38Lr2R6n9o4J13m4j20K13M5k88K6K52q1r1N7p7J8J16r3p3K06
$$ 27 226 -43 -175 63 66 -26 70 11 -53 60 16 -104 109 154 -134 -108 144 63 -28 29 -48 -30 86 -7 -80 126
2547A26p5k42J79J93j82p2P1o7P8Q8j52PJ61j75j07K77K5j99K2M6m3J24j1j77
$$ 126 51 -191 -12 181 -1 -73 -2 -69 9 97 -55 -48 113 -62 -169 108 133 -66 -44 2 -41 83 72 -105
2571a05J23R4k19N9K22j50j41J17J3kJ08j35r2J96k5j72J65O5k08NJ26l2L6Rj61
$$ -105 18 112 -107 -48 174 24 -117 0 13 11 119 -16 -108 88 63 -109 56 121 -87 -82 44 12 48 57 -104
2596a04M9J64j04p1J51o5j34R8P3l1L0q2q5J32R0j28kQ9p3o0J12Lm0Nn7rJ30m
$$ -104 -55 109 5 -66 85 20 -114 -16 57 26 56 -26 -111 21 111 -17 -19 70 -3 -63 49 52 12 17 -40 -49 81 77
2624G7j27L4O7q0KJ07n7o5J9j0L2Q5o2j20Q3O5r7N8O0j13j3P6m0L7P0j38o0J59
$$ 77 -50 -16 51 -29 -27 80 23 -42 -23 -33 -1 84 22 -98 -15 50 -47 11 71 -42 -55 21 -19 18 88 -50 -110 49
2652D9j1p8Q9j7j19P9O3o4O0jj46O5J28p9k7N9p9k5J21l2m9O3q3m9J44Jr7L5m
$$ 49 38 -40 49 32 -87 -8 55 -9 51 50 -96 -31 97 18 -9 50 -29 -54 67 35 -14 49 -34 -83 61 62 -35 0 -4
2681dn8Q0N8j00KL1o6N9Q5q2m8M2j5MP9l0n9J7mlO8j5p4J0J7NL6Lm4j8J8PL0J4
$$ -4 -62 18 76 -24 -22 9 -57 2 87 5 -43 -1 -16 -12 67 37 -22 -5 -9 -12 56 41 -33 -23 -6 -1 35 38 -6 -24 -6 1 31 45
2715D5m7l6K2K1K5qm5nJ6J7J8jm3oJ2K3J0J0m4k2K1M0OMm4mLK6K3Ol4k9J8QK5
$$ 45 -2 -38 -16 5 30 22 -23 -28 -12 5 23 22 -21 -27 -15 8 18 28 -16 -38 -17 23 29 33 -11 -15 -12 14 37 43 9 -20 -2 6 31
2750C1Ol5l0J8K4J3Pk4l8J1K7PJ6l6l4K4K1PJ0k9k4J2L1L%k0m0J1O2knl0j5oL7
$$ 31 37 2 -28 -10 14 27 34 10 -28 -17 10 17 33 -3 -37 -13 8 15 25 -4 -28 -16 15 18 18 -2 -42 -31 31 29 24 -6 -21 -27 10
2785A0L2j5pl5mK7L4j6j6j6k1L5L4j5k6qj3QM9pl6qkJL1J0k5k1J1mK4K2l5k3J0
$$ 10 42 27 20 -15 -19 8 42 26 10 -6 -27 8 42 27 1 -7 -20 -12 37 30 -6 -14 -16 -15 16 26 1 -20 -9 -13 11 33 -2 -25 -15
2820a5K0JJ8j1m8J5M9lmRm0j4M9QoLl1l7M7L9l9lNm9L2N0l3k5K8n0%P9j6m4kJ8
$$ -15 5 6 24 13 -35 -20 29 26 22 31 -9 -23 26 34 28 31 0 -37 10 49 10 7 12 -37 -5 45 12 -13 15 -35 -35 44 28 -16 -18 0
2856@l3M6K4o1RK3m0K9N9n2m8M8Q%M7m1n6M1J8l1N3J7r2KN4mqK8o0j7O7j2l5N1
$$ 0 -33 13 37 -24 -15 8 -32 -3 56 4 -44 4 12 12 59 18 -38 3 21 -10 43 60 -32 -30 24 20 12 40 -20 -37 30 18 -17 34
2890C4j2r1O3N4m3qOl4K1O2o0j2N9m9m7Q8K8q9L4Pm2O8K2r2J8N9p1J6Q1l8o7L0
$$ 34 22 -69 -6 48 5 -3 3 -31 -10 52 -8 -20 39 -10 -57 31 59 -30 4 11 -31 37 59 -33 -15 44 -27 -11 70 32 -35 -5
2922eNLN3m2p2O4M0p5M3N6r3j9N4j9J2M2q8k9J15or4Q1J1j11M8N3k7K6jq8N2Q5
$$ -5 0 3 56 14 -58 6 46 -29 14 70 -23 -42 12 -7 5 47 -41 -70 45 39 -55 26 37 -74 -26 27 0 26 25 -63 -11 74
2954G4o8l9P5l1n2P1Kl9L2l2o6J17M5j33LP1n6LQ3n0l1M8n3l1J23k5j16O1O4o3
$$ 74 6 -33 42 11 -41 30 32 -7 25 -7 -73 44 89 -44 -41 30 -26 -23 60 10 -21 27 -26 -57 66 41 -75 -14 50 -13
2984a3J6K7n9K4J7o1M6R1r4q3J30ro0N2j2m6O0kn8P4L3j43K4J19m6n9L4k1j1P5
$$ -13 3 30 -29 -5 12 -49 -3 88 -6 -89 41 32 -28 24 12 -34 26 24 -34 40 73 -70 -46 73 27 -32 2 -19 -30 45
3014D5l7l8Q4m4j05Q0J01j04j7M7k7K1M2p2JO6o9k2J03%j00K3L3j9M4op1M2N7
$$ 45 8 -30 54 10 -95 -15 86 -18 -35 12 -15 6 48 -24 -23 43 -26 -48 55 55 -45 -22 11 -8 36 30 -41 1 58
3043E8j01L3Q8o5q0P4J9j3L4o3l1O9Po4M5M7r5j6Q5prrn8K4P0k9n3P0Jq5M1O4
$$ 58 -43 -10 78 13 -67 7 26 13 47 -16 -47 22 29 -35 10 57 -38 -54 31 24 15 6 -52 -28 42 13 -40 30 31 -54 -13 51
3075E1l8k3jk2L5N3n7k6N2j7l9N0K9n3qQrN3ko9pO7k7k4O3j5n8J8J8j6M6k3q4
$$ 51 13 -10 -11 -33 2 55 -2 -28 24 7 -32 18 47 -6 -14 -6 -15 38 36 -33 -40 27 0 -24 39 24 -34 -16 2 -14 32 9 -75
3108g5N0P9o7jM2m8k3N5%j3K4m4l2Q9Qp4K8J9m5L2M4m1lJ9o1J6Q2m9o2O3pk7M2
$$ -75 -25 54 -13 -14 28 -20 -43 12 12 -1 23 -21 -53 36 44 -30 -2 17 -28 4 48 7 4 23 -38 -22 60 11 -51 12 5 -22 20
3141B0Qo6J8L3n2N1L6p2k6O9l0JM7m8l5M2Mj6N0k0o7L1N6l9ML1n9J5L0omK0l8
$$ 20 28 -38 -20 13 -39 12 48 -24 -50 19 -11 -10 37 -11 -46 -4 0 -16 34 14 -53 -22 34 -5 -1 30 -29 -14 16 10 6 26 -12
3174a2k4M8J9k6Pj5j7K7J3k6lRl1J3M4rn0J1P%L2%k7rOKL5J4m0k3J3J4RJ5j5l3
$$ -12 -36 12 31 5 12 -3 -20 7 20 -6 -9 0 -31 -18 26 17 -33 -22 -15 -15 17 17 -10 -19 -13 -11 24 38 -2 -25 -12 2 11 26 11 -22
3210b2K6lOK3j7l3NK4NMll1nK9J0k0J0j4k8L1K0j6lj6j4K3K6j6j0J0l3J9L8j3
$$ -22 4 1 7 30 13 -20 -15 9 14 18 15 -16 -21 8 18 -2 8 -6 -34 -3 17 1 -2 -18 -32 -9 17 1 -9 1 -32 -13 25 12
3244A2k6OqqM5Ok8j3%pL8J5k7k0J5j2L1K3m1j5QoJ7K2j4m6K2K3pJ3nm4J8J5kK2
$$ 12 -14 -8 -16 -24 21 27 -1 -14 -14 -21 17 32 5 -15 0 -12 19 42 1 -14 -6 -12 5 27 13 -33 -11 12 5 18 13 -31 -13 2 0 22
3280B2j1l5oK9J2OKl5j3J9L0j0Pj3k6J5L7nj1Kk6oL7J6l3j7JjL1L1m4j5NJ0nJ8
$$ 22 11 -24 -30 -1 11 17 19 -16 -29 -10 20 10 17 4 -22 -7 30 25 14 16 -10 -16 21 37 4 -13 -12 -13 18 49 5 -10 -5 5 0 18
3316A8rm1RJ2mL3Ln5J3L2qoL1m2k7N5J1k3L1j5o7M6M7m0NPm3J2O5m5oK2l9k6Q5
$$ 18 9 -32 -23 -11 -15 18 21 -34 -21 11 3 -3 28 -14 -41 14 25 2 33 18 -49 -3 44 4 9 16 -27 -15 50 5 -1 21 -18 -44 41
3351D1po4N5j5n6P0K9q6K0M2p4K4R0p7l5O4l6nP9n8o6P9Jp1Q6K2r4K0M0m6M1O0
$$ 41 34 -30 25 10 -46 24 53 -33 -13 29 -45 -21 69 -8 -43 21 -15 -20 59 1 -65 14 15 -56 30 52 -42 -22 18 -28 13 73
3383G3r9pR3o9j8R0l3q0O5Pl5M7j3q5O4N9q9J6N8p2j8O4pk1L2n1k4J03pr2L3N1
$$ 73 -26 -33 60 -9 -27 63 30 -50 15 22 -13 34 21 -64 0 59 -30 -14 44 -28 -46 18 11 -10 22 -29 -53 50 43 -49 -16 35
3415C5o5PP4l5l4K5m0KJ01m0r3O4K5o3N0M4o7JK9n4N4O5j02n8J32k0q6P9Kr5N9
$$ 35 -30 -23 51 16 -18 7 -33 -31 70 30 -63 1 26 -37 13 57 -10 -9 20 -34 20 85 -17 -75 57 37 -49 30 32 -63 -4
3446dJ0m9O0L9j52M7J28p7n5R0m3l3P9l0l9J02o9j14J46O7j37J7P1r0K9O9j07
$$ -4 6 -43 17 56 -96 -49 79 2 -53 37 -6 -39 40 10 -29 73 4 -110 36 103 -34 -17 54 -36 -7 62 -45
3473d5L4R9j46l1J93n1j26P8K4p2P1mj05J10J5j48R0J28j65k6J08l8k1P4p0m5
$$ -45 -11 88 -58 -89 104 53 -73 5 29 -43 28 24 -81 29 44 -104 -14 114 -51 -77 31 -7 -28 46 -24 -69
3499f9J33p0q2J39J8j65O6Q6p2L8J8j04N3R1j12nJ33r0j12J23L8p5M2j1q6J00
$$ -69 64 -6 -88 51 69 -96 -30 56 -16 22 40 -64 -11 80 -32 -37 96 6 -106 17 55 -20 22 11 -75 25
3525B5L2j13N9P5j16k6J19l0n6L4k2pP9l8r6J12J6j18N3R0q4k2M8m3K6P6r3m4
$$ 25 57 -56 3 78 -38 -64 55 25 -31 3 -19 -26 53 15 -81 31 47 -71 -18 72 -12 -34 14 -29 -3 73 -20 -64
3553f4J20l0r5R0M7j08J7M9m5M2L2j08J2J04p1m3R8l5o6O4Nm3O6k4j04R8N6j05
$$ -64 56 26 -69 21 68 -40 -23 26 -19 23 55 -53 -41 63 -8 -51 47 12 -54 10 15 -28 38 14 -90 8 64 -41
3581d1%R7o6m4R0k4k9N2m9n4J16Qj04N8L7r1L6O7o9J2L2o8PJ05o7o4Q8j0p0N8
$$ -41 -41 56 -10 -54 36 12 -17 35 -14 -68 48 56 -48 10 47 -44 -8 59 -10 2 34 -34 -27 78 11 -53 35 25 -45 13
3611A3K5q3M0K4p2N8N9j14PP8m8j4N8m1l8O6k0k2O7l2p4O4N2o9QK8m7lO2l2oM6
$$ 13 38 -45 -5 19 -53 5 64 -50 -43 35 -13 -27 31 -10 -48 18 -2 -24 43 11 -63 1 53 -16 -8 20 -27 -30 32 0 -6 40
3643D0m3l9O6J8n5J8Ol2J5K7l2KK3n2J5N4k7k7K1mk9M2J9l9j1L3l6K1M6m3k4M5
$$ 40 -3 -42 24 42 -13 5 11 -21 -6 21 -11 -9 14 -38 -23 31 4 -23 -2 -6 -35 7 26 -13 -24 9 -27 -6 40 -3 -27 18
3675A8Ll4L6k0k2J8K8l2L1Mo1J6M4k5NL5n2k1N1pl5M9j4n7N2K7n7K2Pl6K1K5k5
$$ 18 21 -13 23 3 -19 -1 27 -5 26 30 -31 -15 29 4 9 44 -8 -29 22 15 -20 29 15 -42 10 37 -20 2 9 -27 -6 19 -6
3708fOJ6m5PN4k5k6L8k5j3M2ok5K6nl0L2K5m2%OrJ5J5k4j3J3j6J6K5j3k8PkLK1
$$ -6 0 16 -29 -22 32 7 -19 19 -6 -19 23 17 -8 18 13 -17 15 40 -2 -2 4 -5 10 25 1 -12 1 -15 1 26 13 -15 -8 -10 -7 14
3744A4oj1lKJJOk0%J6kJ1Nk3LOpK1j1qJ1pJ6Jj0Mj7MJ9jj2Ljk0K5OKl7K1j8LK4
$$ 14 8 -3 -6 -4 -3 -2 4 -16 -16 0 -2 9 14 -9 -6 0 -7 14 3 -5 6 -1 15 16 6 10 -7 -3 16 15 3 6 5 -15 10 16 18 -19 2 -16 -13 11
3786A1pk0RJ1j1J8%k0NPp%L6l3pK8j8j0L1k2l4M8Pm3M0J1n3L4J1k9J6Ll4J5L9
$$ 11 4 -16 -7 4 -7 11 11 -9 -4 3 -4 -4 32 -1 -8 20 2 -8 23 1 -33 15 22 -21 19 30 -23 11 22 -7 9 12 -22 -7 32
3821C2l0j3M6l7l0N1k2j2K4%n1N0J4n8K3K6l7J2N8m9oM5m8j8P5l3m3N7j2l0M4
$$ 32 2 -11 35 -2 -32 19 -3 -15 9 9 -42 8 22 -36 -13 13 -24 -12 46 -3 -9 36 -12 -30 45 12 -31 26 14 -16 28
3852B8jn2K2L0m6J0N8o0k2N9k4l5O6k3m9N7Oo2M9J9o2ON6m7%O1o9j7O7j7n6P9
$$ 28 27 -25 -3 27 -19 -9 49 -11 -33 26 2 -33 33 10 -39 18 24 -38 11 30 -32 -26 30 -17 -17 44 -25 -42 25 8 -48 31
3884C1%q4M6N2p2L0L7p1J6Q1p7k9R7m7o0R5rr0Q6rp6P0M4j20L4R1r7lR8o3n6R4
$$ 31 31 -53 -7 45 -27 3 40 -31 -15 66 -11 -40 57 10 -50 45 36 -54 32 23 -53 17 61 -59 -25 66 -31 -34 64 1 -55 39
3916C9m2n1J10k8j13J02L7j17O4O1j08J9Q1q3MR6r0m8J45m7r9R9Qj06Q7L4r2O5
$$ 39 -3 -54 56 28 -85 17 54 -63 1 62 -46 -27 54 -29 -25 71 -19 -67 78 31 -68 31 39 -67 20 54 -38 27
3944B7M4j27M0J06j07m1J32o5o8J11l9o2R0j3j02R8M9j40L4R6j00KR2o5m9J20
$$ 27 71 -56 -16 90 -17 -58 74 9 -59 52 13 -49 41 28 -74 24 73 -67 -33 63 -37 -35 57 -8 -57 63
3970F3o5p0J29k6j14R5N9j34M7R4j13K4Q8j08nJ17q1q4J56l7j06J11J0j20Q7N2
$$ 63 -2 -72 57 31 -83 12 71 -63 -16 78 -35 -11 77 -31 -36 81 0 -84 72 35 -71 40 50 -70 17 69
3996F9j41O6R1j48PJ46j19l7J34q1o4J31l7r4J12J8j45R8O3j34N4P3j06J4J07
$$ 69 -72 -6 85 -63 -56 90 -29 -66 68 -13 -77 54 17 -77 35 53 -92 6 69 -65 -11 62 -44 -30 77
4021G7j05j9J24r2m9J26k6r6R6Kr5P8L4j17O8O7j17OJ03q1l7J01m5n0R3l7o9Q4
$$ 77 -28 -47 77 -15 -64 62 36 -60 36 38 -57 21 55 -62 6 73 -44 -38 65 -16 -53 48 3 -47 46 9 -60 24
4049B4K1r4N7M2j01K5Q0p5JP3o2l2Q4l2m9P2Nq2O9K7q2L6K9o6K5M9o4j8Q7l8n9
$$ 24 45 -49 8 50 -51 -26 54 -21 -20 53 -9 -41 43 11 -38 34 39 -43 26 53 -29 7 36 -30 -5 44 -20 -38 49 11 -48
4080d8P8j5n6N7J7p1L2M7q2K5O5p2j3P3l7m1P1l2n1Q2j3o5O8J5o2K4N0p1J1O0
$$ -48 30 15 -41 16 33 -38 -6 41 -41 -16 49 -23 -36 37 0 -41 30 -2 -53 29 16 -49 19 34 -28 -4 46 -25 -14 46
4110D6o2jN2m9k5P9k9n6O5Km6L1K8o1K5L2o0K1K9l6jM0k3k4M9k5l2L9On0M6Om0
$$ 46 -16 -17 35 -14 -39 40 11 -45 20 22 -24 7 35 -26 -1 31 -29 -8 21 -15 -16 24 1 -23 26 1 -31 8 14 -36 10 16 -24
4143b4J7K2l2LM4k2k2K5opK6kl0J5J4l3RJ8j9lK1k2J0Pj9KJ9j2j6J7Oj6J2Qj5
$$ -24 -7 15 -17 -14 30 8 -14 11 5 -2 24 22 -8 7 21 -12 -3 15 -4 -7 14 -8 2 9 -10 -8 11 -1 -17 0 6 -10 2 10 -5
4178ejJ8k4jK4oj5K1nk0K0J0j4%J0k3J3J6k7MJ6qnK1k3lK8k2rJ1J5m1K9J9m6O
$$ -5 -6 12 -12 -13 11 5 -10 11 6 -14 6 16 2 2 12 -11 2 18 -9 -5 11 3 -2 19 -4 -7 21 -1 -10 1 16 -25 4 23 -23 -17
4214a7L2l0jK4j5j8L6k2qK5kj6J4Kj9J8Pj9J5J0k7J8J8l3J2J3k4PJ2j0qJ1Kj5
$$ -17 15 -15 -16 8 -7 -25 11 -11 -19 6 4 -12 2 4 -15 3 10 -9 6 16 -11 7 25 -8 4 17 -7 0 12 2 -6 5 7 -8
4248hPPmJLj1PPk1J5Pj5l%Rj4J6mrJ0olJ2Mj1JK0j5j%kkK0j8LkJ0j0OMj2mJ8j5
$$ -8 -1 6 2 3 6 -5 2 9 -12 3 10 -5 -8 -8 1 -13 3 -1 -10 0 -6 -9 3 7 -4 -3 17 2 1 1 -1 -3 17 -1 2 0 10 0 6 10 -2 -6 12 -3
4292cnJ0j2nK8j1j9PRj6RJ4j7LQj3OJ1j9KK7j6qK2%k5K7pj9K9oj7NJ7l0J0K8k0
$$ -3 -8 2 -10 -15 13 2 -17 -10 -1 -17 -8 6 -11 -8 0 -13 -7 4 -15 -13 14 -2 -10 12 12 -13 14 7 -12 17 11 -6 -1 16 -14 -4 24 4
4330Dj5K6j8k0L5j0k0K1j4rK6%l0K3K6n1J4K8m2J0L5l3oL5j4j3L4qm0M6Qm5K3
$$ 4 -11 15 -3 -23 12 2 -18 3 -11 -20 6 6 -24 -1 25 -26 -12 16 -26 -16 19 -14 -20 15 1 -12 22 14 -26 20 28 -17 6
4363FJ8l2lL2k2LK6k8j6N7l6l0N1j1m1K9K1m6J6L7n6J3L5l4j8N4k4l1M5j8k9L8
$$ 6 24 -8 -11 21 -1 2 28 0 -16 41 5 -25 26 15 -26 3 24 -22 -6 31 -25 -12 23 -11 -29 25 1 -30 15 -3 -32 6
4395FNl1M3Ro2J7O0n4j3N9l2k5N5l8k7P3k4n0N4Pn5K7L7n5JL4l0j1N4n0k3O0j6
$$ 6 11 -20 23 32 -30 -13 47 -7 -20 39 7 -18 37 -1 -28 45 21 -29 25 32 -23 4 41 -14 -13 21 -9 -20 34 -16 -39 21 5
4428Em7N7mn6N2J6n9J7N9o8MO4m5k1N0j8k8M0lm3N6%n8M3K7n8K4L5m8j3N5m2k9
$$ 5 -42 15 11 -45 7 23 -36 -19 40 -28 -24 40 -5 -26 24 6 -22 18 15 -28 28 28 -30 13 40 -18 6 41 -7 -20 35 -7 -36
4461c6Q3l5o1P0Po4L8K4n0J6M0p6L5M5n3j4O0l1l5M8lm9N4lm3M8K0o3K6N2o0j1
$$ -36 47 12 -49 21 28 -36 2 26 -24 -8 32 -44 -9 36 -17 -31 29 -2 -37 11 8 -41 13 10 -33 15 35 -28 -2 50 -10 -21
4493b1O1m0j6N7k5l4N1j5m9N6No3K6M4o0J0M4n6NL9l8j8O4k0n0N7Kn5L8J5l3K0
$$ -21 40 0 -16 41 16 -18 33 18 -31 25 30 -33 -7 37 -23 -13 31 -25 -20 19 -19 -37 27 7 -43 14 16 -39 -1 14 -19 1
4525AJ4m0J8M6m6j9M7j4k8M1j5k5M1Nn4M5J9n8J4M2l4j7M0k5j8M2j5l3M0pm9M5
$$ 1 15 -25 -7 39 -7 -26 21 7 -21 20 5 -20 21 26 -28 17 36 -22 -8 34 0 -17 23 -2 -20 22 7 -26 14 7 -42 3
4557CJ4n1K3J4k1J5J7k4j5M7k8j5M1j1k9K2J0l4L2Nl5K0L5m8J1L9k8k4K7jj4J7
$$ 3 17 -34 -11 3 -18 -3 14 -10 -25 22 -6 -21 20 9 -20 2 12 -22 10 15 -20 0 35 -13 -2 37 9 -15 12 11 -3 14
4589A4pk9L8kl0K5Ll2J0L1k1lJ4k4OK1j5j1J5Jk5K1J3k6J0J6j7J7Pj9KPlj3K4
$$ 14 7 -22 16 14 -16 9 12 -20 -10 21 0 -3 11 -13 -7 14 -1 -12 3 4 -21 0 13 -13 -3 13 -4 13 20 1 3 10 7 -6 18
4624A8j6oPjj9J9Qj6QJ4k0NNoj0PNj0RqoQPoMkmJJ3pqJ2j1kJ8lj4J5J3j7J2%j2
$$ 18 2 -4 3 2 -17 2 10 -6 2 16 -4 1 6 0 -10 -3 2 -8 1 -7 -13 -5 2 -4 0 -2 -6 -5 8 1 -7 5 -6 -8 10 7 -7 8 21 4 16 16 4
4667DnQojNJ1pj4J2JMmj8JJ2nkJ4j5KKNnKko%MNjRj7LMPqj0J2JJ0jqllpJ7qMl
$$ 4 -1 7 1 0 5 16 9 -5 7 8 12 8 -10 -9 3 -2 -4 10 -5 -3 -1 4 -1 1 -1 -7 -7 -3 2 1 10 -7 -4 0 7 -1 -11 1 2 12 11 3 0 -3 -10 7 -1 3 0
4716@J1k0%ROqJjJ0Kj7mOJkJ3lqNJ2j3JkMo%KRnopQJ2mQj2lJ3j3MOkj9J6omJ5
$$ 0 11 -9 -9 0 6 -2 -1 -2 8 10 -7 -11 -5 -4 -6 7 4 -4 1 13 0 1 -1 3 -3 -3 -1 8 3 -3 -10 -2 10 6 14 2 -1 12 -1 3 9 7 -12 4 -2 -6 9
4763Ij8JJ0Rj2nLpjNJ4rj0JMQLMj5MjLJ1oM%jKLnk%Mj1MJjpOMpLJj3J8Nj3pJ7
$$ 9 -9 -8 2 11 -1 -6 -3 -10 -11 -6 8 -1 -11 -10 -6 2 5 9 -6 -2 -3 0 11 5 9 9 8 10 13 8 6 6 10 -1 3 4 3 -4 2 6 -1 2 3 -10 8 13 0 -7 10
4812A0qj3K4j9j2J3nlJ5Kj5J5kjNMj3%J5k1QJ8Jj4%J4k2OjmNoJlJ7j4nJ7nlNj1
$$ 10 2 -11 13 -6 -18 -5 -10 -13 2 4 -11 4 2 1 6 10 -3 -3 12 -9 -1 17 18 4 4 18 -4 2 1 -3 2 -4 -3 -6 11 -3 -8 9 4 1 6 -5
4854emJ5Qk9J5Nk8J9J5j0rK0j7OPj1JJ1jj3J5J7k8MJ2j8J2J3k2jJ2j2jJ3pkjj
$$ -5 -9 6 14 -15 0 5 -23 -4 11 1 -8 12 -5 1 8 -3 -2 9 8 -5 10 27 -1 3 15 -3 9 22 0 -1 11 -1 -2 11 4 2 1 0
4892@j1J6p%qQj0kK3nj0J3k1LQrkJ0J5k4J4J7j9JJ3j8J4%j2pK9j8rK2j0oJ0%j2
$$ 0 -11 5 -2 -2 -10 -2 -12 -14 9 4 -6 7 -14 -11 -3 -12 -14 -4 11 -13 1 18 -1 0 13 -5 9 9 -3 -10 19 1 -8 14 4 -2 8 8 -4
4931dJK3k9J0J6k9jK5k2lJ4Qk4K0j2oK4Lk1qK8j6lJ3qpJ9j5qL5j5k5K0Qk5J8K2
$$ -4 -3 20 -9 1 17 -12 -13 12 -10 -13 1 9 -15 5 -7 -13 11 14 -7 -15 13 -3 -6 7 -1 -8 11 -4 -12 23 8 -17 3 11 -14 4 26
4968B6k4pJ6j5lJ9j2j2J7J1k5OMj3K1nj7J5Lj9LK8rj5Jj2QJ9nj2J6Jk6J7K2m4
$$ 26 2 -5 11 -4 -7 12 0 -12 5 16 -9 -3 1 -12 9 4 -13 2 5 -14 -11 17 8 -7 -6 -18 -10 9 4 -8 8 9 -17 0 22 -22
5004b2J2J4RkLj6PNkj6K0mj9J7Kj0M%k1J0K7k6kK0j6j6K8%qKlmPjj0J5J0k8MJ8
$$ -22 -10 4 13 11 14 -2 5 10 8 -8 12 8 -11 6 8 -2 2 2 -19 -9 18 -8 -10 10 -6 -22 6 6 -2 0 -3 -7 0 -1 -11 4 14 -14 -10 8
5044Hm%Nj6%K8j5j3K3rj6J1J1j3mJ3j9oL3l5qK9j0j0K1kj3J7mj1J6J0l9OL8l9
$$ 8 4 4 9 -7 -7 21 6 -7 16 7 -9 2 13 0 -4 9 -10 -16 17 -18 -26 3 -7 -17 4 2 -11 6 2 -9 7 17 -22 -16 22 -17
5080a7J7J5j1nKQj5J9j3j5K5J3j6MJ0k5RJ4j2nLj4kL2k2oJ5pj1MJ3j2rPnQJ4q
$$ -17 0 15 4 -1 1 9 -6 13 0 -15 10 23 7 11 21 -4 5 19 7 2 5 -9 -11 21 -1 -7 8 1 -10 -6 7 -5 -14 -7 -12 -4 10 2
5118Bj6J5mjJ4j2j0J0RmOJk2kL4j3okNj6J6%QQrk2J9Mj8J2lj1RPNj4noqK1%j1
$$ 2 -14 1 -3 -4 10 -2 -12 -2 7 3 9 10 -12 -14 20 7 1 -1 4 -12 4 4 12 20 11 -11 8 12 -6 6 3 -8 1 8 13 -1 -6 -12 -20 1 1 -10
5160a0J1onJ9Lj1Ljj2J9QqqkkNJ4koj5MnJ9Nj8Rp%lKKrJJPPj1j1KK5j3pJjLJ5
$$ -10 1 -5 -10 9 12 1 4 3 -9 10 18 10 2 0 -2 3 17 15 9 -6 -2 -7 12 17 -1 8 1 1 -2 0 2 -7 -6 -5 2 9 -2 -13 -11 14 1 -6 -5 -6 -3 12
5206A2j0j1QKj0K1ppKNoJ8Kj4j0%QqK9oj3j4J1KmJ7j4j3KJJ4Kj7j1K1j2J0Rjk2
$$ 12 2 -9 -1 1 -9 12 5 -2 0 5 -1 17 19 5 -5 -5 3 -5 24 18 5 -9 2 4 0 17 3 -10 -8 -7 7 9 -8 -19 2 -10 0 9 8 -14
5246a4%J9KNkk0NJ8olKomJ8Jj3J7k0pJ3MNlj7oJ6Q%j1qpJ1J8j6j3LoQQJ0j0ql
$$ -14 -14 5 7 12 10 -10 -5 13 7 4 6 0 -4 14 15 2 19 -1 -8 5 9 14 11 -6 -12 4 12 12 1 -7 -14 -3 15 -1 -14 -11 -17 -9 -1 9 -1 -9 -12
5289a2NJ7Mk3kJ1lK6mj5omRKRmk4PJ3J4kpk6NJ6%KRk2j5K6jklj1JOJ5j5OQl4Q
$$ -12 -7 10 14 -9 -11 0 -3 23 19 4 -2 -6 3 5 14 10 -14 -7 6 20 18 11 -15 -10 6 6 8 17 -5 -20 6 5 3 0 -11 -10 -4 11 -4 2 10 -24 -16
5332a6L2mj4%%LJ5pmJ2j3j9L0Rj6nj0J5lK1k3j9K5qoK2Kk9LJ5j3K0nl8K6J1k1
$$ -16 16 12 -2 -2 -2 1 16 9 5 17 4 -15 15 24 8 3 -7 8 5 26 3 -16 9 1 -5 17 19 -10 -7 8 -5 15 10 -28 -2 9 -12
5369a2J7Nj3j6K1NjQl0rK3K1k6J5Ol6OK9qJ5qj8NL0j5j4K2j8j3J6J2j7Qj2j4J6
$$ -12 5 10 -3 -19 2 7 6 14 -16 -25 -2 19 -7 8 14 -22 -16 13 5 20 12 -6 -1 29 14 0 22 4 -9 7 19 2 10 -2 -16 0
5405@L2k8k6K4j0kJ9jj9J3rjK5%l6JL3j2mJ8k3jJ9rQK6k7l0K6J3k0JJ2k6K2Qj8
$$ 0 32 4 -22 2 -8 -10 9 8 -11 2 -7 -8 17 17 -19 -18 15 3 -1 17 -6 -7 12 3 11 37 10 -20 6 19 -1 0 12 -14 8 16 -2
5442bJ0Ol7%L4J7m5J6nj5L1%k1J8oj7J1L8j8l1J1OJK2j6j6J7j2j8M4Qm5JL0j3
$$ -2 8 14 -23 -23 11 28 -17 -1 -6 -21 10 10 -11 7 1 -16 -5 33 15 -16 -5 1 2 24 8 -8 9 -3 -21 23 31 -14 -13 17 4
5477DLJ2k6qK9rj7M5j7m3K9J0Rpok2J1J8j9QJ0k5j6M9j2j4PrrL4lj5PLj6NK8o
$$ 4 7 19 -7 -15 14 5 -12 33 16 -27 2 12 21 14 8 -14 -3 15 -4 4 14 -11 -27 22 10 -4 3 -6 -15 19 16 1 8 11 -5 0 28 22
5515B2l5J9oLL4k6j7K1%j8J5L0m6pJ4nJ3J1k8j4K9k1kL1j3l1J5J0lJ8pl3J6K4
$$ 22 -13 6 0 3 37 11 -6 15 15 -3 12 42 -4 -11 3 -2 11 22 -6 -20 9 -12 -14 17 4 -27 -12 -2 -5 13 6 -27 -11 13
5549A3j9KK8k1j4K8%kjok9L1K0l6J3Ok4kL0j7jRk4NL3qk6K0nk1J9J7j9j7K1k1
$$ 13 -6 -4 24 3 -11 17 17 15 14 8 -21 10 30 -6 7 13 -11 -13 17 0 -1 8 -16 -11 22 14 -12 8 3 -18 1 18 -1 -18 3 -18
5585a8J9J5j5k4K6lk1L9ok0J1oKJ4mj5RJ4j0KJ6k3LJ2m%nkj9J4J5mrnj1RJ3pJ
$$ -18 1 16 1 -23 3 0 -21 18 12 -8 3 -3 -1 13 9 -6 3 17 7 9 25 2 5 17 13 13 8 6 -13 1 16 12 3 -2 -13 -4 9 2 3
5624CmlKRKj4J0j4MlJ5j2JJ0qQJ6k2j5J0R%J7lj7KjlK2rk0PJ2j2J8%j4j2LpJ5
$$ 3 -1 -4 -2 7 9 -5 5 -9 -5 -8 7 -5 -4 6 -2 6 22 0 -15 -5 4 4 21 18 1 3 2 -1 21 12 -8 -1 11 -1 17 17 3 -9 -6 -13 2
5665BJ0k0m%J8JJkj2mJ3Qkj1j2J1J5MnJj3OMJ6j5lj%nJ4Kj4NlkJ4j0pj8J0J3p
$$ 2 12 -8 -12 -12 6 7 8 6 -6 -10 3 11 9 -2 -14 -3 12 16 11 12 -1 5 9 25 10 7 6 6 1 15 17 3 8 5 3 17 7 0 -18 -8 5 -2
5707bmp%oJK4Lj0k1J3J5jj0J0j7OQKLLj5qK6%lpjj1J0NjjqnJ4JJ0j8k%jQnM%j7
$$ -2 -6 -13 -13 -19 -18 6 9 -1 -22 -9 6 5 -5 5 -12 -6 2 4 7 10 -5 -13 13 13 10 3 2 -9 1 6 5 4 -4 -9 5 6 16 -2 -4 -4 -5 3 -2 2 2 -15
5753a5RJ8j6lkpKK1J1k0qJ3j3J4J7k3mPkkK1j3j1N%J3nJ0k0lNJ1j1Kj3nJ2jJ2
$$ -15 -6 12 -4 -7 -9 -16 -14 7 18 -2 -10 3 -10 4 21 -2 -6 1 -1 -3 18 5 -6 -1 -1 12 7 17 -3 -6 -1 10 -1 1 -12 -17 -5 -6 6
5792F%jj3kJ2mlMj6J3J3j0lKqNR%Pmj4oK7jmn%mJ2qNKj5jNJ5qk1nK5j4J4rMml
$$ 6 6 5 -8 -10 2 -2 -5 -1 -17 -4 9 -1 -4 -2 -10 -5 4 4 11 7 -7 -13 14 13 9 4 4 0 12 4 9 11 -4 -5 0 15 7 -14 -19 6 -8 6 -3 1 -3 -6
5838fKJ2Mk1KJ7j5MJ4j2j3K1j3QJ3Mk8PJ4%Lj0njJ6JkMj3j6J4J2j7LnJ3oQj8J3
$$ -6 -4 8 12 -9 -7 10 -5 -1 13 1 -12 9 -4 4 17 21 -7 0 14 14 17 7 2 1 17 18 16 20 7 -9 5 17 0 3 -2 11 5 13 -5 8
5878Hjj9MK0nj8Nj2J6J6pj1QLj8J7J1j6Poj0K3kj5oJ8poK4j7oJKkK2nl1J3J6o
$$ 8 7 -12 -8 12 7 -11 -6 -18 -2 14 7 -4 4 7 -11 6 17 1 8 2 -8 15 13 -2 -8 10 3 -3 21 4 -2 -1 1 -1 21 16 -15 -2 14 8
5918Hj5J2j3mR%lRqj6K3Kj5OOj4LK7j6jPj7LK8nk0J3lj1J0J3j4lMj0J8Lrj1J1
$$ 8 -7 5 -8 -12 -3 -3 -6 3 -5 -21 2 4 -11 -5 1 -13 -10 17 1 0 7 -10 -7 21 16 -4 9 6 -5 5 18 4 1 5 -5 13 16 7 -4 7
5958GNk1J3JmRj2nK3oj2pJ5j2Rjlj5K0Kj0J4j0j9J0K9k7MJ1lmOj2kK4k1nJ3J3
$$ 7 12 -9 4 5 1 10 -2 -7 16 10 -2 -9 6 -6 3 2 -1 -16 4 6 -4 10 0 -19 -9 20 -7 -3 8 5 1 7 -5 -7 17 -4 -9 4 17
5997A7j7mJ0k1J7Rj4JJ2k2LK7j6j1J5ooJ2ollJ1j6J8Rj8mQpLJ1j7LJ1NmPRl9J5
$$ 17 0 -4 6 -15 2 11 -3 -2 10 -12 -9 18 2 -9 6 0 -6 6 0 -3 -6 5 -11 7 16 -2 -6 2 -5 -2 9 -8 -5 6 11 7 14 23 -16 -1
6037aOJrK1k6MOj4LJ3lj7J7j2K1j0%j3J1Rj2J4Ok4LJ5nmPoqK2j1j2ROqJ0Nk4O
$$ -1 5 6 -3 18 -8 -4 2 -12 -9 4 1 -16 1 -11 10 0 0 -13 -2 7 -5 9 15 -9 -6 9 4 0 7 1 -7 15 4 -8 1 7 -1 9 14 -10 -4
6078dQ%jLj1KQ%JJqqMJpJlnJ6LpNo%KPlNj4J4j1LNqMJ2j5jJ7j6J1Jj0oJ2nj3K1
$$ -4 4 4 3 6 -5 -3 5 5 6 7 -1 -9 -5 -4 -11 -10 -13 -18 -2 1 -6 -1 -7 -7 -5 2 -1 4 -10 4 -7 -4 1 -7 -3 9 -6 -7 10 -6 5 6 -4 -10 2 -3 -16 5
6126EmlQj0j1J6lj1J1Pjj3LJPPlj5QjjLmmJJ3%LPj1mlLNmmlPNqjJj6RJ3lj1Mm
$$ 5 1 -2 6 -4 -15 1 -2 -13 -2 5 4 -9 -6 -5 2 9 6 -9 -1 -2 -3 0 -4 -8 -7 6 6 9 16 5 1 -2 1 6 2 -2 -5 2 7 -1 -2 -1 -17 -8 5 2 -9 -5 -9
6175iNKmoLPplJ2jnNqRMqL%%kK2nk5QMPP%j1nMpLMl%PnkKrlOnMOmj5PJ2rJ6qR
$$ -9 -4 -2 -6 -12 -9 -2 -9 -12 0 -1 -6 -1 -9 0 4 -4 -1 -1 -1 -3 19 14 -11 -3 1 8 15 15 4 -1 3 -4 -1 3 0 0 7 2 0 2 -7 -10 -4 -9 -5 1 -3 -18 -11 1 -8 8 0 9
6229Ij4J0j2mMJ2j2%J0mKkMnNNj0J1ljNjkomJ2j1KlJ3lj5PJ3mj4jjJ7n%mLjrO
$$ 9 -5 5 -7 -11 -7 5 -7 -7 3 -1 1 -1 3 -2 3 8 -2 9 6 5 10 9 7 1 -3 9 -2 0 -3 10 7 -8 -1 12 8 -6 -7 -8 9 4 4 0 3 2 -7 -1
6275aJ1lnmJ1kljKNj3J2rJ0j0QmJkMkKk%KpqkK0j4%lQJPmmrQOjJo%MjjLkloJ9
$$ -1 10 7 2 -2 9 7 4 3 5 10 -3 9 0 10 0 8 4 5 3 7 5 7 5 5 7 0 -8 -10 10 -4 -4 -7 1 2 9 5 1 -8 0 6 5 6 0 0 4 3 2 5 3 0 -6 13
6327A3plmOmm%MQk2JKRkJ3qqPqJ0molJ3mlKKj7J4pPmOLoJ8j2rLj%J0MnNrkmJ1
$$ 13 6 3 -1 5 1 -3 -3 1 9 -13 -12 -10 -1 -3 10 2 -6 1 -7 3 -1 -7 -10 3 -1 -4 -2 0 -17 -3 -10 -3 -7 -1 2 -4 14 2 -7 -4 -5 -5 5 9 4 9 0 -2 -6 5
6377EMj5J4oj0%J3qMrnLPmmNPl%oKPj3J4%nj0RKjRqQlljQKj1j1QRlLo%OLj2KJ6
$$ 5 9 -6 8 2 -8 -8 5 -3 1 -8 -13 -10 -3 -7 -11 -6 1 -2 -2 -8 -6 1 -12 2 2 -3 -13 -4 -2 -3 6 -2 6 3 0 -1 7 9 -2 -13 -5 4 1 4 -2 -2 4 7 -5 -3 13
6428A3k1MkJ0j2J2j5KJ7j6mJ3nnPpOkJ0lRoj2QJ8nj0Qj0%JJ2l2J2J1k0K0lJoO
$$ 13 -8 -4 -6 4 -8 4 -11 -9 8 -8 -12 1 -4 -9 -2 -9 -3 -5 5 2 11 5 -7 1 19 14 4 12 2 2 3 15 -17 -5 6 -14 6 3 4 -2 4
6469Dj3jJ1%j2QnoRMqJ4%j0%LLkK0k9P%MJPrJ1j1J9mok%pRKj9J7jj%ooJ7jj8P
$$ 4 -9 -10 1 1 -11 -3 -8 -14 -5 -1 -9 5 5 -5 -5 -2 1 -1 19 -10 -3 -3 1 2 9 0 11 0 19 15 9 7 7 0 9 11 -8 9 8 7 7 1 -5 12 11 -7 0
6516@Pj2J3qmoOQlLqMJKpPjMrNJ1klmOmRj8QPk0K0oKqNqnJ3qmJMkLkk%MRoj2O
$$ 0 7 -5 8 0 -4 -10 -4 4 1 4 -4 0 1 3 -4 3 2 6 -3 2 13 11 8 4 10 6 15 -3 5 12 -8 12 6 8 0 5 -3 -8 5 -3 -7 -6 -2 -4 -1 -3 -5 -5 -1 8 2 -10 -4
6569dJ2qnkJ2pMj1J5pJ1jrKOj6J6J4k3KOpMmNlNJj0MLoRj8LOLkrK2k3RJ3j4KM
$$ -4 8 0 -5 -7 5 -2 2 -9 6 -1 10 9 0 2 8 -8 8 22 -1 1 7 0 4 0 5 2 7 8 -2 2 5 -1 8 -10 -7 -1 2 0 -9 13 -10 -1 12 -2 0 4
6615Dj1NRKj4J2Mj4P%PrMjjLjjj2J0JJ1Lj6lRj1lJ2rKL%Kl%j0QlPoO%LQj3OJ1
$$ 4 -7 -2 7 9 -5 7 11 -3 4 4 11 2 6 5 4 7 6 5 -7 3 4 15 18 2 -1 8 -3 -6 6 -3 -1 2 2 4 1 1 -9 -1 -4 3 -3 3 3 6 14 1 7 18
6663A8mJ0j6Lj1MkL%KLj1LM%kJ1j3MJj3J1Jj0%J0rOqlQn%ONj3NKJJOrkNL%Oj7
$$ 18 14 24 8 11 0 4 2 5 5 7 10 -1 2 6 6 4 15 2 6 7 -6 5 6 -4 -4 6 -3 3 -5 -8 0 -5 -5 1 6 -7 -2 0 1 2 8 -1 -3 2 5 5 11 -6
6711fJ2lNpjOnJ2mjqmlMKOj4LOkOj7QRo%MJ1j5J0qNqlJ2mJOKj2nJ0kJ6pkkLj2
$$ -6 6 3 8 1 0 6 1 13 9 8 0 -4 -7 -3 -1 5 -9 -6 0 -2 4 -13 -5 4 -2 -2 2 13 -2 8 0 5 -3 -6 6 2 3 9 11 -1 -6 4 2 18 11 9 7 10 -2
6760bPrJ8j0Mj%rNpjk%MjNj3OLoJ8j0Lljj0K1j2nQkkNkPnj0QMlmJ9j4nPpLJ1m
$$ -2 5 -4 14 4 8 7 7 -2 3 -4 -5 -7 -7 -3 -4 1 -12 -6 -3 -9 9 -1 2 -1 -2 -12 9 -3 -8 0 -2 -4 1 -1 6 1 -9 -1 3 0 -4 15 1 -4 3 -4 -1 10 6
6809Fmj1J0Rk0LJ4nJpoJ7nnpJ8j4J7j0j%LMj1PNpMoJLOmmkj1J1N%jkkmMLkMnp
$$ 6 2 -9 1 10 -10 -7 7 2 3 -4 -10 7 2 -3 -10 8 -6 11 1 0 0 3 7 -4 3 8 1 5 -1 0 3 9 5 1 -1 -12 -1 4 4 3 1 -1 -5 -1 2 0 4 -1 -8
6858hJ8j5J4j6Pj1Pnj0QJ0knOLOj0KlJ3NmqNnjPkjPnj0MPolMomPjlRnJkJmNNK
$$ -8 10 -5 9 -7 0 -11 -4 -9 -19 -11 -1 -3 -8 -2 1 7 -3 -1 -4 9 14 10 2 7 2 1 8 6 5 12 7 -3 1 8 2 -1 3 -3 -7 0 -1 -4 5 0 1 -1 0 -4 1 6 8
6909H%k0MkJ7klJpLJ0jj3J3MoOqRlj0OJkpK1j2j1KkjkJ3j6K%QKKoKLnmJ3Jj5J0
$$ 8 8 -12 -8 -10 7 5 2 3 -4 -1 9 8 -5 8 12 6 12 4 13 10 0 6 7 5 -2 19 7 -4 -2 -4 -5 -7 6 -10 -8 -8 0 2 4 -2 0 3 -2 -6 7 8 -7 3
6957COj5J4j0KjOmnJ1kK%j2R%OqLR%pj5JRj0PnQjkLmLjKqQKj4J2LlqJ4J1j6JQ
$$ 3 9 -6 8 -2 0 -1 5 1 -4 7 5 7 7 -5 4 4 10 2 5 14 14 7 -8 -7 2 -8 -1 -6 2 1 -1 2 -2 1 0 2 -6 2 4 -10 2 5 2 -6 8 19 3 4 12
7006A2j3MLrJ1kj2jJ3q%Rp%Qj0%OJj4J5nj0JKJ3j1Lj0J0j2J5JolRj5J7ljjqOR
$$ 12 -1 3 6 -3 8 6 -6 -7 6 -2 -2 7 0 0 8 -2 -2 4 5 -9 6 1 -9 -8 -6 7 -4 -1 -11 -1 -13 2 3 -3 -6 3 -12 5 2 1 0 -8 -2 7
7050Gj5jJ6j0KJ4j8lNLmpRmNNqoLJ0j5J2oLj%N%KjqqRJOooK0j6lKnJ5Jkj1J5m
$$ 7 -8 -9 7 -3 -1 13 -5 -8 -3 0 -4 -11 -2 -6 -1 4 -4 -10 -7 3 -12 0 -6 -3 -4 -4 1 1 3 2 -6 -14 -5 -4 2 -4 -10 10 -6 -9 -7 -12 3 4 2 -9 6 2
7098BrJ6j1mMJLKj1Pj1J0%onJ7mrOjJrMj0Qj0J7j4J1oRqKjRpNMnjJ1mrMNomMM
$$ 2 -7 9 -2 -6 -2 -1 2 4 -7 0 -11 -1 -1 -7 -12 5 1 -8 -2 -3 -2 -11 -7 -17 -9 -19 -2 -16 -5 -11 -2 -10 -8 -9 0 -7 -2 2 -3 -4 7 3 -6 -2 3 -3 -7 -3 1
7147Aj2J3j1J3%j6QLj0jMOj4J0jLmQnNLjLj2%KNojL%mJ8j9J3qPPk0NJ1%Lnj0N
$$ 1 -11 2 -9 4 4 -12 -4 -1 -11 -12 -8 -2 -16 -6 -7 -4 -8 0 -5 0 3 2 5 -7 -7 -5 0 -6 -7 -4 -4 -8 10 -9 4 -4 3 10 -10 -5 6 6 9 4 -6 -1
7193aMlPoMjpOl%rOqPNLpmNj0J3NnQlLj2JK0rj2qJ2JlQJj7J7j0kqJ1OjqJ1%k0
$$ -1 3 0 7 1 5 4 -3 3 0 0 -9 -3 -11 -4 1 4 -3 -7 -2 -12 1 6 1 9 6 9 -3 -2 18 9 -3 -11 1 2 -1 7 8 -9 8 -2 -4 -12 -1 5 4 -4 7 7 -13
7242a3J0KmJ3Jj0qOmOjonJ0%oPNlJPpnJ2MorMJkjKqJ3j1oRNOPk0JL%KJ%o%Oj4
$$ -13 -3 -1 -5 8 9 -1 -9 -3 -7 -1 -2 -8 -13 -3 -3 -9 -2 3 0 1 8 1 -4 8 12 6 -3 1 2 0 -1 1 -7 6 -5 -11 -2 3 9 16 -4 -3 0 0 2 3 3 -3 -3 3 -11
7293a1J2jqPMqrJ9j4OkR%nQj0OJKnJ1opKnONj1NJLj0nKRj2OKnMjoPRqQ%mlnlJ3
$$ -11 1 0 -8 -1 3 -5 -14 5 -9 -3 -5 4 4 -1 7 -3 3 4 6 1 12 6 -1 1 -4 2 7 -4 1 2 5 -5 -10 -8 1 -11 -5 -3 -8 -4 -5 -11 -4 5 -3 5 5 1 -2 -7 -10 3
7345Cj0QjmRj7K2rNm%nL%MJnOqQrNLmnlJ1j0RJj2JQj2KJ4nqPJkJlOLkNMqj3J9
$$ 3 -7 1 0 -4 5 -12 10 1 6 2 2 -3 0 0 4 5 0 6 -2 6 -3 2 5 1 -4 -7 4 -6 3 4 -8 -7 1 -11 -9 5 0 -8 -1 0 -2 -1 -4 2 5 3 8 12 4 -9 10
7396A0j1kKMoNkqJ1pkOnOKpLkJ8j0j7%J6qpJ2qkJ8lrJpjJ2Oj0QMnj0PmPjj2J6
$$ 10 -1 -3 -1 3 -3 2 0 -8 3 -4 -6 0 -5 1 3 -4 -1 -3 15 5 -12 -12 4 -4 -11 1 -7 -9 9 6 -3 -2 -9 -10 2 8 -2 6 10 5 -5 2 -2 5 4 -8 8
7443HkqJKnJ5j3%oMKLJ0rj1%J3j0KJ2j9QLq%J2mnJ1mmJ0j0%oJ0qNJ%kJMj0PMj5
$$ 8 6 -2 -1 1 -4 11 -2 -2 -8 -4 -2 1 11 2 -9 -9 4 -6 -4 8 -11 -3 0 -8 -8 4 0 -5 6 2 -2 8 -2 -2 -8 2 -6 -1 0 0 -2 -1 3 -7 0 4 -11
7490a1J0onJ6noJPLj2joJ1J1oj2K1j8KJ3%oj6OjJ6Jj1qOlJ0nNj1QKjOlrJJ8k1
$$ -11 -1 -7 -12 4 -1 -7 -6 1 4 -8 -9 -15 -4 7 1 -11 10 -8 -6 7 7 1 -15 -9 -10 6 7 -4 -12 -6 -9 1 -4 1 -10 -2 0 -1 5 2 -7 -6 12 -9
7534inJ3J0j8OooNJJj0J4LoRmj9J8mJ5nj1KJ4qplOOlLnLk%LNrmKLJJ1k3jK0j3
$$ -9 -14 -1 9 -9 -3 -9 -15 -10 -9 -8 -18 -4 -1 -7 2 -2 -21 -3 -7 8 3 -8 -6 8 0 -7 -10 -4 2 -1 2 -3 0 -2 -2 1 6 -3 -7 -5 -2 -1 10 -13 -14 6 -7
7581gJ5lMj1OrJ2pNlr%%J4Jj2Oj0JJ3jNpmJ2nj9J4nMNrKJ5j2pNjk%MnNOqJj1J7
$$ -7 8 5 9 -2 4 -5 7 0 5 2 -7 -7 -7 7 8 -4 2 -8 -7 6 5 10 3 -1 11 6 -13 1 -4 0 5 -4 -2 13 1 -6 -1 -2 -4 -4 0 -5 0 6 -2 -1 -12 5
7629EoJqJ5j5OqMJ1knlJ0pJ2p%nqJ4KOj0Nj2QKKlmRj4jOqQRj3oJ2olPKomPj5J4
$$ 5 -1 0 -8 7 -8 -2 -10 -6 5 3 -2 -5 5 -2 10 3 3 -2 -10 4 6 12 2 7 -5 3 5 7 4 0 9 -5 -6 0 -8 0 9 -4 -10 2 -4 -7 0 2 -4 -8 -1 -16 -2
7678bj1J0qJ6qmJ0qKKonJ6mqJ2LnkJ0opMQpLj0mPjLJjLj0OMjnjmJ0%qJ2nLj1J9
$$ -2 -13 -3 -11 5 -3 -7 3 -5 -3 -1 -7 -12 4 0 -8 4 7 2 0 10 4 -3 1 9 2 5 -5 -9 -2 -3 0 1 0 3 -7 -1 3 2 -3 -4 -8 2 2 -6 6 1 4 -7 12
7727A2Jlj2LLqLkL%kRlLrkPJ3qj7OJ7j3oQJmk%JRr%K%Pj5jLMmPMNrlOMrQj0NO
$$ 12 13 10 -2 1 4 -4 -1 -3 0 0 -2 7 4 7 -2 -4 3 16 8 -9 -3 14 1 -5 3 4 0 -2 -2 -1 8 -1 -1 1 1 8 -7 -8 -5 -1 -5 2 6 11 2 -1 5 9 0 8 -2 3 9
7780Ij2MPj0mLJ0knoOpKJ0j8K8j1rNJ0qjkj1J4lOj0kjNNQj5QjJ2opkJ0ok%RKj6
$$ 9 -3 1 8 -2 -6 -3 7 5 0 -6 0 -7 -5 5 -13 15 4 -5 0 10 2 1 -1 -12 2 -1 5 -5 -7 -8 -3 2 10 -5 3 2 14 8 1 -1 9 3 1 1 10 12 -4
7827dQJMj5JLOnkjMpK%j1K4poKmMRj0Lj2J2L%OrqJ8qJJqNkOJ0rqJ4Kj0NqlJ0q
$$ -4 4 5 9 -6 -5 -2 4 -1 -3 -4 0 -7 -5 -5 -16 8 1 -5 -3 -7 -3 6 -4 -1 -13 -1 2 2 8 -1 -9 9 1 2 3 -5 0 -2 4 14 5 -3 11 13 3 8 0 -3 7 -1
7877aJ3j0Npj0JJ0Qj3RjlrJ5mj1RrJ5kKq%NonR%pjJ2J0j0moN%oNRkOMoo%j0KJ2
$$ -1 12 2 7 0 -10 -9 1 9 -4 5 4 1 -8 7 3 -8 1 -8 7 5 7 -1 -1 4 -2 -7 2 2 -5 -6 6 16 6 2 -4 1 1 -5 0 9 7 13 17 11 5 5 -5 -3 9
7926Ilj0rJ1JQr%Lj3OQLj5OjMOqRkj0LJ0nKj4JJ0LLpPknR%pmjkLMmj2J5Qj6On
$$ 9 6 -4 -13 -2 -1 7 -2 -2 1 -12 -6 2 5 -10 -4 -5 -1 5 -3 6 4 -6 -3 7 2 4 -10 -9 1 4 7 0 7 5 0 9 9 2 -2 -3 -5 -2 2 -2 -14 1 9 -7 -1 -6
7976fnPLjJ5j3kkOKKLo%qQRj1%%oJ4nj9J7J1j7J2Kjj6jlNJ1nPj0kJ2j5ONrKQN
$$ -6 -11 -4 -1 -2 13 0 -2 -4 2 4 6 9 3 3 -5 3 12 1 1 1 -5 9 4 -15 2 13 -4 8 10 9 -7 -8 -11 -6 5 0 7 -3 -5 7 -8 -2 3 -6 -4 4 9
8023Ik3RLnPJkmJlRjJJ1j9RoJ0kjPjj1jJ2j8NLpOj0KOKMjMmj0QmJ1nrRLj3KQo
$$ 9 -14 -5 -2 -7 0 1 -1 -5 -4 -7 2 1 2 13 -6 3 -3 7 5 4 11 10 -1 -2 10 -8 -3 0 -7 -1 -11 -9 -3 -1 3 2 6 2 -8 0 -4 7 2 -7 2 5 -8 -6 2 -4
8073dj0J2jRJj0LNkmQqnJ1LkjNj7NKKj7KJlMLKrJ8qqJ3J%%mrJ4JOjpMrPnRnj5
$$ -4 -14 -2 -3 6 7 -3 0 5 3 -1 7 -1 -6 5 8 6 5 10 -7 -2 0 2 -15 -13 -12 -15 -11 -8 -6 -15 3 -5 -13 0 1 1 1 -3 -12 2 3 9 8 1 5 -4 3 -2 7 2 -13
8124a3J3Mj0MpQRkkqMnRj2nJ2ooQJlJoJ0kN%j3J0Pj1LOqPJrK3j5KOj0KKj1%J0
$$ -13 0 4 -6 -2 -9 -1 8 6 4 -4 0 -5 4 -8 -13 -1 -7 -13 -5 -4 -7 -6 -12 -2 -4 1 1 -12 -2 5 -6 -3 3 -5 2 3 -6 17 2 4 10 0 2 4 -7 -7 3
8171Ck2J6NkqRj7J5mLMpKJ4j2kJQqN
$$ 3 -19 -3 2 0 -8 1 -16 -1 -5 -2 2 -5 -3 11 -1 -3 -2 6 -2 3
8191C
$$ Imaginary data points
##PAGE= N=2
##DATA TABLE= (X++(I..I)), XYDATA
0@%%%%%%%%%%%%%%%%%%%%%%%%%%KoQrJ3j6J6j8K2k4K7l4L9m3N0n6O2p1P9q7R7
$$ 0 0 0 0 0 0 0 0 0 0 0 0 0 0 0 0 0 0 0 0 0 0 0 0 0 0 0 2 -4 4 -5 8 -8 8 -10 12 -12 15 -19 20 -23 27 -29 33 -38 41 -46 51
47E1j09J21j32J47j62J76j92K09k27K48k69K87l07L23l33L33l07K35o4l42J410
$$ 51 -58 63 -69 78 -84 92 -100 109 -118 130 -139 148 -159 164 -169 164 -143 92 28 -314 1096
68A096m961L2414J43732k19426k2040K10501j59032q3139J65719p7992p3217J53708
$$ 1096 -3865 28549 172281 -47145 -69185 141316 -17716 -100855 64864 -13128 -86345 67363
80F7363m6206q0231J17875l1030q3800R0676k6475o0396R2748m6268o9565J45770
$$ 67363 21157 -59074 58801 27771 -56029 34647 8172 -52224 40524 -5744 -75309 70461
92G0461j9497j42674J18509N2088j50275N6541Q1811j20047J7280R0396p9364
$$ 70461 50964 -91710 26799 78887 -71388 -14847 66964 -53083 -35803 54593 -24771
103b4771J0967Q7770q2473m0516P1922l1382j8060N5330l0492j3031M2645m3702
$$ -24771 -13804 73966 -8507 -49023 22899 -8483 -26543 28787 -1705 -14736 27909 -15793
115a5793l707O7316n2245m4021P1016j1383m0725N3092j1678m7837M7696O527
$$ -15793 -19500 47816 -4429 -48450 22566 11183 -29542 23550 11872 -35965 11731 18258
127A8258m1183L6351P520m4867J6818Q521j7590L3232l195l5002L5042J032m6413
$$ 18258 -22925 13426 20946 -23921 -7103 1418 -16172 17060 13865 -21137 13905 14937 -31476
140c1476L6955J8293n3062K4383L0919m6231J9021L5354n6571Q66N3851l6366
$$ -31476 5479 23772 -29290 -4907 26012 -20219 -1198 34156 -22415 -21549 32302 -4064
152d064j6338M3645k6891j9622M1407j8202j7689M4925j8341l6657M0148l10l7205
$$ -4064 -20402 23243 -3648 -23270 18137 -65 -17754 27171 8830 -27827 12321 12011 -25194
165b5194K9588P913l0481K7476R502l5450K1539J2434m3059J6005L4017l0479
$$ -25194 4394 12307 -18174 9302 18804 -16646 4893 17327 -25732 -9727 24290 -6189
177f189j966K3792k4842O53K8896k4348j0155K9659j7431j7713L1362r70k2541
$$ -6189 -8155 15637 -9205 -8552 20344 -4004 -14159 15500 -1931 -19644 11718 10748 -11793
190a1793J3303J727j0403J5703j588j7659J0458K015j3558J4172J0788j3852q24
$$ -11793 1510 3237 -7166 8537 6949 -10710 -252 1763 -11795 2377 13165 -687 -1511
203a511J398q352R412P017j2437J660P445q667Q88R449m312l986N04k960N262
$$ -1511 -113 -8465 947 7964 -4473 -2813 4632 -4035 -3147 6302 1990 -1996 -1492 -4452 810
218H10N143o830j073K642m975L103O743m428j238J232o488L191Q273o083l395
$$ 810 5953 -877 -1950 692 -4283 -1180 5563 1135 -103 1129 -5359 -2168 6105 22 -3373
233c373M994l053P68O158n903l538N317l647R9R491m902q129N502j48k688P992
$$ -3373 1621 -1432 -664 5494 -409 -3947 1370 -2277 -2178 7313 2411 -5718 -216 -364 -3052 4940
249D940q63q029L458J143l831N630R65p160K281K479k969N257J620q511R07M179
$$ 4940 4077 -3952 -494 649 -3182 2448 3413 -3747 -1466 1013 -1956 3301 4921 -3590 -2683 1496
265A496m371K812N463o734k911N663q63m13M052l834m757K788J198L19K614k204
$$ 1496 -2875 -63 5400 -1334 -4245 1418 555 142 4194 360 -4397 -1609 -411 -92 2522 318
281C18k381L023O12o51J532l901m653L823L944kK100n76n361p64L123L59o34m95
$$ 318 -2063 960 1572 921 2453 -1448 -6101 -2278 1666 1664 3764 3188 -2173 -2937 186 545 -89 -584
299e84j359L43K403K168N95k606l420L4J335L88J351M33k136oL000J180j436j908
$$ -584 -1943 -1600 803 2971 3566 960 -2460 -2426 -1091 -703 648 1081 -1055 -1061 1939 3119 1683 -225
317b25k177j423J314L392J926j221j515M09L06n54j11j208k341O31L727K255l71
$$ -225 -2402 -3825 -2511 881 2807 1586 71 480 786 232 121 -1087 -3428 -2797 930 3185 2814
334B814j236k043j822O01K259P42j783j587O91J642J521J524q06m102k167K110
$$ 2814 1578 -465 -2287 -1686 573 1315 -468 -2055 -1364 278 1799 3323 2517 -1585 -3752 -1642
350a642J692L0Q31k08j579J326K337j357k376r35q76R80K977R56p39q78j718L81
$$ -1642 50 80 911 703 -876 450 2787 1430 -946 -1881 -2757 -1777 1200 2156 1417 539 -1179 -798
368g98K247j162j601J226j499j128N043J641m513j50J098k680K270L323m567k161
$$ -798 1449 287 -1314 -88 -1587 -2715 2328 3969 -544 -694 404 -2276 -6 3317 -1250 -3411
384c411L628l38O28M008k904m435J552n24m4M935j434m191L823K16m384M500K062
$$ -3411 217 -121 507 4515 1611 -2824 -1272 -1796 -1840 3095 1661 -2530 1293 1509 -2875 1625 3687
401C687o938J015M166l903J822M802o230k075P071j998l796M391j880m637M613
$$ 3687 -3251 -2236 1930 -1973 -151 4651 -1579 -3654 3417 1419 -2377 2014 134 -4503 110
416A10J822k516L393j074n887L885L483n415P53L841m156l54M959j723j369K211
$$ 110 1932 -584 2809 1735 -4152 -267 3216 -2199 -1446 2395 -1761 -2115 2844 1121 -248 1963
432A963m266k291O893J259n395P79J681k462J542K998j673j042m15k904J562M984
$$ 1963 -2303 -4594 2299 3558 -1837 -1058 623 -1839 -297 2701 1028 -14 -429 -3333 -1771 3213
448C213j953l730L208J645l645M08K396k341q96J796j273J502M443m299n585N460
$$ 3213 1260 -2470 738 2383 -1262 -854 1542 -799 -1695 101 -1172 330 4773 474 -5111 349
464C49L028n204J371L144m695k70M134j878J198K939p175j750R138k294o602N915
$$ 349 3377 -1827 -456 2688 -2007 -2277 1857 -21 1177 4116 -3059 -4809 4329 2035 -4567 1348
480A348Q75n850M994K114n918M206J050j0240M665J0462p789l759P635l829l495
$$ 1348 2223 -3627 1367 3481 -2437 1769 2819 -7421 -2756 7706 -83 -3842 3793 -36 -3531
495c531O505l039l004O960m640n747J1040N85j1132N409M987p561L213L463q785
$$ -3531 2974 -65 -3069 3891 -749 -6496 4544 5129 -6003 -594 4393 -3168 45 3508 -5277
510e277L863P576j0014k93J2632o662r666Q336K417n538L331L46l533M533k23
$$ -5277 -1414 6162 -3852 -4145 8487 1825 -7841 495 2912 -2626 705 1051 -2482 2051 1828
525A828n599M871K960p433l10N417m56Q3l34m336K953M884o384k402Q766j579
$$ 1828 -3771 1100 4060 -3373 -3683 1734 1278 1361 1027 -3309 -356 4528 -1856 -4258 4508 2929
541B929r403M532P797m650l217L291k343j334N264k275m627O629J222r039M085
$$ 2929 -6474 -1942 5855 1205 -2012 1279 -1064 -2398 2866 591 -4036 2593 3815 -5224 -1139
556a139Q746p857n858O409O59j143L334m056j550O589m896n187J0417n6j0622
$$ -1139 7607 -250 -6108 301 960 -183 3151 -905 -2455 4134 -762 -5949 4468 4412 -6210
571f210N338M115o598N585K554j0910N475P955j3194L35J4262q665p469J1736
$$ -6210 -872 3243 -3355 2230 4784 -6126 -651 7304 -5890 -5555 8707 42 -7427 4309
585D309j655o374P485l783o823J0371n38r752R124L776j1127L686N396p210L291
$$ 4309 2654 -3720 3765 -18 -6841 3530 2992 -6760 2364 6140 -4987 -1301 4095 -3115 176
600A76L358r510M487R028j0019j703J0312o463n262R120k009n084O341l082n456
$$ 176 3534 -5976 -1489 7539 -2480 -4183 6129 -334 -5596 3524 1515 -3569 2772 -310 -5766
615e766R679J322r556M144L990p548J526N454m285L80L731n028J77O444m229m848
$$ -5766 3913 5235 -4321 -177 3813 -3735 -2209 3245 -1040 -660 3071 -1957 -1780 4664 435 -4413
631d413N238R72l841K305J509k585Q60N90j976K188J727m174j231L580J10j450
$$ -4413 825 1797 -2044 261 1770 -815 45 635 -1341 847 2574 -1600 -2831 749 859 -591
647e91J427pj312P87l67j041K046o2l772J252M286j279k050J536q37j847J615
$$ -591 836 829 -483 304 -63 -1104 942 880 -2892 -1640 2646 1367 -683 853 16 -1831 -216
664b16M89q66J601n35k621K081K527k275r99J241j053m21J184n23L25J410j505
$$ -216 273 -593 1008 473 -2148 -67 2460 185 -814 427 -626 -1047 137 -386 -61 1349 -156
681a56o27K542o79k936O17J116m43J175P19j405R6N68j261L71J453j520j523J516
$$ -156 -783 1759 1080 -1856 -1239 -123 -566 609 1328 -77 19 587 -674 -303 1150 -370 -1893 -377
699c77J235j47K41n41j163L01M63l84N84M54j409m81J750P52p21j93l86j035J70
$$ -377 858 711 952 411 -752 -451 12 -372 212 666 -743 -1224 526 1278 557 364 -22 -1057 -887
718h87R53N5J13M21o65m39J017J54j146k37K66j20O53N93n43j43O8o30N74R36
$$ -887 66 121 234 655 -10 -449 568 722 -424 -661 -395 -515 138 731 188 45 113 -517 57 993
738I93j232q66J013q8j27J521m38j748Q50N93j134Q44O57j870J4J708m39l4Q95
$$ 993 -239 -1105 -92 -180 -307 1214 776 -972 -122 471 -663 181 838 -1032 -1018 690 251 217 1112
757A112j336p75J160l50k41J229p77q65J463p7j013J078l41j569J197Q41j224
$$ 1112 -224 -999 161 -189 -430 799 22 -843 620 543 -470 608 267 -1302 -105 736 -488
774d88N30N90j341M68J286r04l80L29q99K06J266l94k50M17q57l6J225n19p87
$$ -488 42 632 -709 -241 1045 141 -239 90 -809 -603 663 269 19 436 -421 -457 768 249 -538
793e38N25m44k90J417L14r48l6k49n59P30O07l81l5j72l24N33K33m68Q5j6m13
$$ -538 -13 -457 -747 670 984 36 0 -249 -808 -78 529 148 113 -59 -383 150 383 -85 0 -16 -429
814d29M92M72o04j86K88k35J42N65k93n29J5J07K09M16o4m30k46k1K27M16j0m18
$$ -429 63 535 -69 -255 33 -202 -60 505 212 -317 -302 -195 14 430 366 -64 -310 -331 -104 312 302 -116
836a16n1J73K4J42J00m91m01L90M80J26J19k11o44k01L82K30J46J12k42k66J05
$$ -116 -167 6 30 172 272 -219 -620 -230 250 376 495 284 -360 -561 -179 51 197 309 67 -199 -94
857i4K38O8k53k74K11K27r7NNk28P7L50J14p4m82m50L95L72m6L91n6p36K35K83
$$ -94 144 212 -41 -315 -104 123 26 31 36 -192 -115 235 349 275 -207 -657 -262 110 64 455 399 -337 -102 181
881A81o24M65M93j197J20J401o04m38Q44r79n75J431l68o29J358q39j416J959
$$ 181 -443 22 515 -682 -562 839 235 -203 641 -338 -913 518 150 -479 879 40 -1376 583
899E83K99j767J386L31k275J316J257k356R21J978k463J8K573k139j075K431j372
$$ 583 882 -885 501 832 -1443 -127 1130 -1226 -305 1673 -790 -772 1801 -338 -1413 1018 -354
916c54r55K944j110k055K587n67k358K817L47l083K047R68l159K053K167l693
$$ -354 -1309 1635 525 -1530 1057 490 -1868 949 1296 -1787 260 1228 -1931 122 2289 -1404
932a404N05L034l001o37L369j986j535K951j167j580L168p66k971K339N84k431
$$ -1404 -899 2135 -866 -1503 1866 -120 -1655 1296 129 -1451 1717 951 -2020 319 903 -1528
948a528J841R54k376J272R37k535J429J906l230r5L202j658j457K299o69j340
$$ -1528 313 1267 -1109 163 1100 -1435 -6 1900 -1330 -1425 1777 119 -1338 961 292 -1048
964a048J849m21j448J789p4k284J333J776j465o32R47j35l32p6k07P22M25j136
$$ -1048 801 380 -1068 721 647 -1637 -304 1472 7 -625 322 187 -145 -221 -428 294 719 -417
982d17l21J286K65j236l01J083J45r78J63P32l04j46n2m56J023O38k205j30K664
$$ -417 -738 548 813 -423 -724 359 504 -474 -311 421 117 -29 -81 -537 486 1124 -1081 -1211 1453
1001A453j013j961K000N54j852Q54M11j246J403M4k420J863J942k993k7K511j911
$$ 1453 440 -1521 479 1033 -819 35 446 -800 603 647 -1773 90 2032 -961 -988 1523 -388
1018c88o98K200j456m03K528k239j685L891o00l397K827J074l366J472J665k631
$$ -388 -1086 1114 -342 -745 1783 -456 -2141 1750 1150 -2247 580 1654 -1712 -240 1425 -1206
1034a206J122J738l025N96K896k672j064K962j324j336K570r06j706K398o30k241
$$ -1206 -84 1654 -1371 -775 2121 -551 -1615 1347 23 -1313 1257 351 -1355 1043 413 -1828
1050a828K662O00l074J385J680k428O61J904k408j19K515j865j152K821p27k213
$$ -1828 834 1434 -1640 -255 1425 -1003 -342 1562 -846 -965 1550 -315 -1467 1354 627 -1586
1066a586K037M52j997J436P33k266R15J528k202J54K385j500j240J871n12j078
$$ -1586 451 903 -1094 342 1075 -1191 -276 1252 -950 -796 1589 89 -1151 720 208 -870
1082h70J545n41j270K005n7k341J638J350k413L75J814j689k48J622j451j59K276
$$ -870 675 134 -1136 869 812 -1529 109 1459 -954 -579 1235 -454 -702 920 -531 -690 1586
1099A586j598j551K595k57k312J774Q36k008Q84Q00j648J173J076k510L69K263
$$ 1586 -12 -1563 1032 775 -1537 237 1073 -935 -51 749 -899 274 1350 -1160 -791 1472
1115A472j909p98K383p73j356J636m10j157J708l68j832J729P52k172Q10J508
$$ 1472 -437 -1235 1148 375 -981 655 245 -912 796 428 -1404 325 1077 -1095 -285 1223
1131A223j605j22J281j124j75J311j139n30J829m81j340J244K27j350O13O25q55
$$ 1223 -382 -504 777 -347 -522 789 -350 -880 949 468 -872 372 599 -751 -138 487 -368
1148c68L87M30r82L71R93r42l30R09n61n93R40K8n64O08n6q05O24M08r44J92P27
$$ -368 19 449 -533 -162 831 -111 -441 468 -93 -686 254 282 -282 326 270 -535 89 497 -447 -255 472
1169D72o59j78P90k97l80N91k74n74O32Q7o38M89L95o46J23M28n68j4N58m30k05
$$ 472 -187 -365 425 128 -252 339 65 -509 123 210 -428 61 456 -190 -67 361 -207 -221 337 -93 -298
1190b98O17k83l98O66M9o18K60J49n20K90M25m56O8M23m89k05N49j54l24M03l3
$$ -298 319 36 -362 304 353 -265 -5 144 -376 -86 339 -117 -49 374 -115 -320 229 75 -249 154 121
1211A21m02L41J65l64J65J72m16O3L24k47k5L00j68j24K12j61j06K76p7k04K48
$$ 121 -281 60 225 -139 26 198 -218 -155 169 -78 -103 197 29 -95 117 -44 -150 126 49 -155 93
1232I3J5k34J62O2k14J27J16k28J9J70j05kJ34j27j28J27M4l3KPl1%L7L3n8l2
$$ 93 108 -126 36 98 -116 11 127 -101 -82 88 -17 -19 115 -12 -140 -13 31 -2 0 7 -24 -24 13 46 -12 -44
1258d4P8o2n4J26mr6J42l3j81J29O6j55J11R9j97P3J06k43M4K37j36pJ76k58j24
$$ -44 34 -28 -82 44 40 -56 86 53 -128 1 67 -88 23 122 -75 -2 104 -139 -95 142 6 -1 175 -83 -207
1283b07K67o0n9K55j50k13J90l8j29K67j9k54J70M5k00K00O7k66J01J14j91J30
$$ -207 60 0 -59 196 46 -167 23 -15 -144 123 104 -150 20 65 -135 65 132 -134 -33 81 -110 20
1305B0J18k57N2J60j70P2K15j91p8R2k04NK88l7l4J34j68j75J24k1k8J88k2q4
$$ 20 138 -119 -67 93 -77 -5 210 19 -59 33 -171 -166 122 85 51 185 17 -158 -34 -55 -83 105 83 -1
1329aM7p3o9J50Qj02L6rq0P5N9l0J8K1Kj5q1l7j6j3J54J36j22rO8k22o6K00r8
$$ -1 46 -27 -96 54 62 -40 -4 -13 -93 -18 41 11 29 50 52 37 -44 -81 -97 -110 44 180 58 49 117 -105 -171 29 -69
1358f9m6K90m4j49J45j70j75L16l2k45L10ml54K98R1m26L11K80n07J37K65o09
$$ -69 -115 175 131 -18 127 -43 -218 98 66 -179 131 127 -227 71 162 -264 47 327 -180 -43 222 -387
1380c87Q0P11l53j58N28m71l70N80k05l04O74j44n34O07j4p02N75K03p82M78M47
$$ -387 -307 404 51 -107 421 -50 -420 160 -45 -349 325 181 -353 254 240 -462 113 316 -466 12 459
1401D59q18K52O43q75J6Q88o57k99R12m41o55Q01j01n71Q11L8q02M67J07p29N68
$$ 459 -359 -107 536 -339 -323 565 -92 -391 521 80 -575 226 125 -446 365 403 -399 68 175 -554 14
1422A4M31p57L27M61q18J06O42o67k9Q28n66l98Q16l14n97P36O6o55M86K71o52
$$ 14 445 -312 15 476 -342 -236 406 -261 -290 538 -28 -426 390 76 -521 215 281 -374 112 383 -269
1443b69J30L51m21P5M19k76j13L09k17k42L07L2k16K23M9l03J27K01l05J9L74
$$ -269 -139 212 -209 -134 285 9 -104 205 -12 -254 53 85 -131 92 141 -162 -35 166 -139 -120 254
1464B54k53k38M87j48n66M50L27n42K37M67o70j22O56m88k78Q30k18n32O79j18
$$ 254 1 -237 250 102 -464 -14 313 -229 8 475 -195 -317 339 -149 -427 403 185 -347 332 214
1484B14p55O44K33p60N01L53q74L67O04q92J58Q50q99j81J060o92n83J155k98
$$ 214 -541 103 336 -424 77 430 -444 -77 527 -365 -207 643 -256 -437 623 -69 -652 503 205
1503B05q81J058R2j073P20L24j120N50P31j012K19R09r25k30R26o53l56J028m30
$$ 205 -676 382 474 -599 121 445 -675 -125 606 -406 -187 722 -203 -433 493 -160 -516 512 82
1522H2o09R98k33r05R29K33j096N93O00j036K02P64q17OR20p08m12R65l72p17
$$ 82 -527 471 238 -667 262 495 -601 -8 592 -444 -242 522 -295 -289 631 -77 -489 476 104 -613
1542f13Q32R3p40N69K39p32L36L55p15K14O32o56j47P60l78m29N77r3m67N43R2
$$ -613 219 312 -428 141 380 -352 -16 339 -376 -162 470 -186 -333 427 49 -380 197 104 -363 180 272
1563B72o01L76L00o91J13O25m23k07N57k34m28M76j9m63N00J92o79K53M81o31
$$ 272 -329 47 347 -344 -231 394 -29 -236 321 87 -341 135 116 -347 153 345 -334 -81 400 -231
1583b31k1O53m41k78O49l19m46P61j10p19P04K16r20M47N15q60K21O95q04NR37
$$ -231 -252 401 -40 -318 331 12 -434 327 217 -502 202 418 -502 -55 460 -400 -179 516 -288 -283 654
1604F54p51m10J006m66p03J038n3q20Q35O2r97O97M02j063M90P36j054J11Q74
$$ 654 -97 -507 499 33 -670 368 315 -505 330 392 -605 92 494 -569 -79 657 -397 -286 588
1623E88q37r2R36p10l66J002n14o45J019j02q24P88J41q51N38K74q31M16N40p82
$$ 588 -249 -341 595 -115 -481 521 7 -638 381 279 -545 243 384 -467 71 345 -486 -70 470 -312
1643c12J53O53o33j48O27m06k35N49k42k47N28j45m57M11Q6m06K62J74l41R2J83
$$ -312 -159 494 -139 -287 340 -66 -301 248 6 -241 287 142 -315 96 182 -224 38 212 -129 -37 146
1664A46k82O6K85k21j07K28r6k11J79J23j47L9J02j59l2J57q9r5J95J2k15J11
$$ 146 -136 -70 215 -6 -113 115 19 -192 -13 110 -37 2 104 -55 -87 70 -19 -114 81 93 -122 -11
1686a1J12k07O0J75j89jJ83j94k9K57j62j69K83o2j84K79l3l06K30O6k75K21J60
$$ -11 101 -106 -46 129 -60 -61 122 -72 -101 156 -6 -175 108 46 -138 141 108 -198 32 98 -177 44 204
1709B04l42N2K48k72L4K79k39p9K48j76r9K80j24j46K49n7j88K18n6k14K21N6
$$ 204 -138 -86 162 -110 -76 203 -36 -115 133 -43 -142 138 14 -132 117 60 -128 90 34 -180 41 97
1731I7j96J71O0k74J10J18j76R1J27k05L7J31j41M5J48j80l2J26j23K5J67j60
$$ 97 -99 72 132 -142 -32 86 -90 1 128 -77 -40 91 -50 -5 143 -37 -69 57 -66 -41 126 -34
1753c4l9J66j21l3J93j32j37J85n1r1K10m7j73J69m7j75J90K8j76J74L7k12J29
$$ -34 -73 93 -28 -61 132 0 -137 48 -3 -94 116 69 -104 65 18 -157 33 61 -115 59 96 -116 13
1776A3P7k16J23J24k17O5J26k12Q4K08k01j6J55k06rK49j58p6K22j50j02K58j20
$$ 13 90 -126 -3 121 -96 -31 95 -117 -33 175 -26 -42 113 -93 -102 147 -11 -87 135 -15 -117 141 21
1799B1j68K42p1j72K41pk13J91Jk30J96P8k41J44Q5k30J44J42k57O3J64k35O6
$$ 21 -147 95 24 -148 93 86 -127 64 65 -165 31 109 -132 12 97 -133 11 153 -104 -41 123 -112 -46
1822d6K09k22k4K08j95j4K76j80j37K17j15j30L03m8k24J74l4k00K65O0k71J16
$$ -46 163 -59 -83 125 -70 -84 192 12 -125 92 -23 -153 150 102 -122 52 18 -182 83 143 -128 -12
1844a2R0k06J22J38k00QJ47j74K4J85j62n4J88q7q9J36l2q1J11l1o1R1k0j18Q8
$$ -12 78 -128 -6 132 -68 -60 87 -87 -63 122 -40 -94 94 7 -82 54 22 -59 52 21 -40 51 31 -87 1
1869AN5o1kJ6k1J4K3j3K2k2m1k2M4O7J2j04J3O0j09L4J47j20p2J30j08rK26j30
$$ 1 56 -5 -7 9 -12 2 25 12 34 12 -29 -51 -7 60 72 -32 -19 41 -68 -34 113 -7 -79 51 -57 -66 160 30
1897C0k06K41Ok24K43M1l16J99J62l04J52J97m15L1M17l00q3L65k96j52M47j93
$$ 30 -176 65 71 -153 90 131 -185 14 176 -128 24 221 -194 -163 254 -46 -129 236 -60 -212 235 42
1919D2k87M74j24m66M36J41m32K71J47m78K61L01n24J37M59n37j08O02k86k42
$$ 42 -245 229 105 -361 75 216 -216 55 202 -276 -15 286 -238 -101 358 -179 -287 315 29 -213
1939b13M28k64k47N44j70m54N94M8o47L74L46n37J13K92m12J82L68n68k9O34l77
$$ -213 215 -49 -296 248 78 -376 218 266 -381 -7 339 -198 -85 207 -205 -23 345 -223 -252 382 5
1960El29N86p7m54K93L5k33L91n6n08L67L02n49M7M99l10k37K89n7n2K34k50k08
$$ 5 -324 262 185 -269 24 59 -174 217 161 -347 20 322 -227 -180 319 9 -228 61 4 -48 186 -64 -272
1983b72M65j6m45K58K61l71o3K89q7J8P2k62N1L77k86l01M25R2m09J53K81k60
$$ -272 193 177 -268 -10 251 -120 -183 106 19 37 109 -153 -102 275 -11 -312 113 205 -204 -51 230 -30
2005c0rR9k44J44L42l95k02M84p5m08L57J88l70M8J06k25K51J99m65M1M60l28
$$ -30 -39 60 -184 -40 302 -93 -295 189 114 -294 63 251 -119 -71 35 -190 61 260 -205 -164 296 -32
2027c2k01M22j30k95L14m9k12M37p5n42L97L23n68N2M30l60p7L99k80q7M47l30
$$ -32 -233 189 59 -236 78 29 -183 254 179 -363 34 357 -211 -159 271 -89 -166 233 -47 -134 313 -17
2049a7l56O09Qn47K95J90l60J96J90l62J77K23n65R4O17l59l22M63j14k78L78
$$ -17 -373 236 244 -303 -8 182 -178 18 208 -154 23 246 -319 -225 392 33 -289 174 60 -218 160
2070A60q8k97L99n4n05M26L62n86k6M47k62r8K83k19p3L16k40j89M82m7m75K53
$$ 160 72 -225 174 120 -385 41 403 -183 -209 238 -24 -122 161 -58 -131 185 -55 -244 238 191 -284 -31
2092c1K28k62M2Q8k17J38J83k96M1L64l21k82M22P2k83J23L6k05J97J11k88J39
$$ -31 197 -65 -23 65 -152 -14 169 -127 -86 278 -43 -325 97 169 -114 9 45 -160 37 148 -140 -1
2114aK29l87p4M29q0k84K11Nj58K17Nk81K07R2l55J70L29l06j01K69j55m8K46
$$ -1 228 -159 -233 196 116 -168 43 48 -110 107 112 -169 38 130 -225 -55 274 -32 -133 136 -19 -67 179
2137A79k22j67L53j00k59L53M7m06J70J81k26J22J43l55P6K83k50j5L22k13k36
$$ 179 -43 -210 143 43 -216 137 184 -222 -52 129 -97 25 168 -187 -111 172 -78 -93 229 16 -220
2158b20K79l5j18K13r2k27K69O7k58J59R7k98Q7J98j53K2J24k11jK48j39j07J86
$$ -220 59 24 -94 119 27 -200 69 136 -122 37 134 -164 -77 121 -32 -10 114 -97 -98 150 11 -96 90
2181I0q7j50J85M1j28O4nj18J38R4j80kP6q4L9J35o5p5L1n4QJ35m6r4M9j8j0P8
$$ 90 3 -147 38 79 -49 15 10 -108 30 124 -56 -58 18 -66 -27 108 43 -32 -1 -55 -47 88 42 -52 -3 -21 -31 47
2209D7Oo7JpkP4op3jJ6QO0%o1j8nlO5J2o9k4K2J6M9mo7j8K0RO6Oq4j2K7rO6M0
$$ 47 53 -14 -13 -20 -22 52 46 -27 -28 -12 -4 56 56 -5 -23 -28 -31 34 46 -23 -47 -25 -9 40 36 -31 -49 -29 -20 46 52 -32 -44 -17 -26 40 80
2246H0j03k3K0j2N1N9o2n7L4%PN9l5o7L5J5J0M7m0n9J9J0K3L1l9o4K1K7K0M1k4
$$ 80 -23 -46 -26 -38 13 72 10 -47 -13 -13 -6 53 18 -49 -14 1 11 58 18 -41 -22 -12 11 42 3 -61 -40 -13 7 48 24
2277B4p8J1M1OL8k5p5K6M6j1N8l0r8J4N6MM6K0j01k5O7nK0L7r7l5Q4LoM3o9m4
$$ 24 -54 -43 -2 4 42 17 -58 -32 14 3 61 31 -67 -53 3 7 53 73 -28 -53 14 9 29 66 -31 -66 18 21 15 58 -11 -55
2309e5P0MqJ6n5m2O9M5k3K6n7o6N2O4j7lk8o0L7P0pNm8o4M7M5K5J5o0p5Q3M4l9
$$ -55 15 19 11 27 -28 -70 -1 44 21 47 -10 -76 -24 40 23 20 -8 -68 -31 39 32 37 -11 -75 -28 17 42 57 -3 -78 5 49 10
2342A0M4j8j27N2P7l4K5K1j33M6J27q8l4J03j23n7J64j6q2Q5p1r9K10Rj88R4M7
$$ 10 54 36 -91 -39 38 4 29 50 -83 -37 90 2 -32 71 -52 -109 55 39 -43 42 -29 -128 82 91 -97 -3 44
2369D4j65J03J49j60nP9j60O5K23j76j21J92p0r6J94j3j84J07J5j45K03Q3k91
$$ 44 -121 -18 131 -29 -34 45 -115 -50 173 -3 -124 68 -2 -98 96 83 -101 6 21 -124 79 162 -129
2392a29M6J79j44NJ73j43r8J55n0p4K06q4k28J65J25j55M8P2j47J5J30o0qJ02
$$ -129 -83 96 -48 -43 130 -13 -111 44 -6 -80 126 42 -186 -21 104 -51 -3 69 -78 -63 67 7 -1 101
2416A01j56j08K42N2j69K8M2j04P1J04j16J6Q8j91j9K79n0k39J20O3j24J14O4
$$ 101 -55 -163 79 131 -38 -10 32 -72 -1 103 -13 3 91 -100 -119 160 110 -129 -9 54 -70 44 108
2439A08j91P1Q0k13Q8K88k40j98K61Qj39J58o1j80K38mk53K49J57m19K8L48j64
$$ 108 -83 -12 68 -145 -57 231 -9 -207 54 62 -77 81 20 -160 78 74 -179 70 227 -192 -164 184 20
2462B0q7J89k00m9L11j86j63L75j21l81L00K08k83M9Q7k24J49J83l17O2L15l37
$$ 20 -67 122 -78 -127 184 -2 -165 210 89 -292 8 216 -67 -18 69 -155 -6 177 -140 -78 237 -100
2484a00j44M10n4k51J51k9j09K63n6k85K38J17l43J20K97k34j28J69q4M4J91k29
$$ -100 -244 166 112 -139 12 -17 -126 137 81 -204 34 151 -192 -72 225 -9 -137 32 -52 -8 183 -46
2506d6j24K93n6k28K35J00k67pJ45p0J00L5k52M7K44j63j21K32k4k06Q9Q5l7O1
$$ -46 -170 123 67 -161 74 174 -93 -100 45 -25 75 110 -142 -95 149 -14 -135 97 73 -133 -44 41 4 65
2530F5o3j71J65J67k21m3J96p8j49J56N6p7K3r0o6K36L7k69N7J79j41m8J77m2
$$ 65 2 -169 -4 163 -58 -101 95 17 -132 24 80 3 26 -64 -130 106 143 -126 -69 110 -31 -79 98 56
2554E6q0L4q4L5K18j23k27J76R5j70M8J09j33J3L6q4J34J17k68o6K51l3j39J30
$$ 56 -24 10 -74 -39 179 56 -171 5 100 -70 -22 87 -46 -33 3 -81 53 170 -98 -164 87 54 -85 45
2578D5mj20Q0J7p8J58l0k27J01K12j50o3J06p7j6J11o6j0J04j34j06K20O4j76
$$ 45 41 -79 1 18 -60 98 68 -159 -58 154 4 -59 47 -30 -46 65 -1 -11 93 -41 -147 73 137 -39
2602c9J1M8n7N1M2q8L4L3j19L0J71n9j43M4L7j7M8ro9L7K1p0P6R6j22r2R7M8l6
$$ -39 -28 20 -37 14 56 -32 2 35 -84 -54 117 58 -85 -41 -4 -21 27 18 -51 -14 7 -63 13 109 -13 -105 -8 40 4
2631DM1l5p8P3K7o4P0K9j46rJ50k4l7K7o6l0J16j7p3Q5m1j11J11R2j06qL1q8N6
$$ 4 45 10 -68 5 32 -32 38 67 -79 -88 62 38 1 28 -38 -68 48 31 -42 43 2 -109 2 94 -12 -20 11 -77 -21
2660b1J02j11j6Q1p7l8J57k4j08O0j9l7J14j3j14O2J8p7Q0O2j07k2N4k9L6P9j07
$$ -21 81 -30 -46 35 -42 -80 77 53 -55 5 -14 -51 63 50 -64 -2 16 -61 19 81 -26 -48 6 -23 13 92 -15
2687a5n3R1j8l0P6m0q4N3K9j6M6k0q3K9M7%K1Lp1j4N1MK1nm2j8M5K9k1Mm5lK3
$$ -15 -68 23 5 -25 51 11 -73 -20 9 -7 39 19 -64 -35 12 12 33 36 -35 -49 2 6 27 22 -20 -38 7 36 15 19 -26 -29 -6
2720fL4nln1KL5K0Mk2k7rK6K6Pj8l1j7K6K5J7k3l5rL4K1mKm9k2L2L4Rj5k4k9L4
$$ -6 28 23 20 -31 -29 6 26 30 8 -19 -28 -2 24 31 13 -18 -35 -9 16 33 10 -25 -34 0 21 17 19 -30 -52 -20 14 23 8 -16 -45 -11
2756a1L4Knl2k0K6L5kj4j3l3K0M4j2lj9k5J1N4rl7%j9KN1jj9k0jj2N1Rl2j6j7
$$ -11 23 25 20 -12 -32 -6 29 27 13 0 -33 -13 31 19 16 -3 -28 -17 37 28 -9 -9 -28 -26 25 24 5 -15 -16 -28 23 32 0 -16 -33
2791c3RK9K8l7j2mNJ8L5j0m5OJ4nL6j1l8nK6OJ0Kl4j5J5K9Mj1j2m0K0M3jk2Kk6
$$ -33 -24 5 33 -4 -16 -20 -15 3 38 28 -17 -11 3 -2 34 23 -15 -20 6 12 22 24 -10 -25 -10 19 23 12 0 -40 -20 23 22 0 2 -24
2827b4mM3K0l2j6oj9N2K3l8k2J6k6K2N4k1l4J0j2RN7j7p0L1K2l5M7J7o4oL9k3
$$ -24 -28 15 35 3 -13 -19 -38 14 37 -1 -23 -7 -33 -11 43 22 -12 -2 -14 -5 52 35 -35 -4 18 -17 30 47 -17 -23 16 -7
2859gK3L8p3l6P1Km2N8l1n8M1K7j6K0%p1K6P5m3k6N4m8l3P3Ql3K1k1o3Q2M1o6
$$ -7 16 54 -19 -55 16 18 -24 34 3 -55 -14 13 -3 17 17 -54 -28 47 4 -22 32 -16 -49 24 32 -1 20 -1 -64 18 59 -7
2891glL3m3NO4l3k6L1m3OQ7k2r6L5M7n9L7K7p7PL9m1L4P4r0o9R1J9m9M2qn9M2
$$ -7 -10 23 -20 -15 49 16 -10 21 -22 -16 71 49 -47 -12 35 -24 13 40 -37 -30 9 -32 2 76 -14 -83 8 27 -22 20 12 -47 -5
2924eK9n5O2J2j07J2J09m1l0L4l4l3P9j2m9P4k6r9Q5Q0r2k4N0l6RN5o7oP0o0m7
$$ -5 24 -31 31 43 -64 -52 57 16 -14 20 -14 -47 32 20 -29 45 19 -80 5 85 -7 -31 19 -17 -8 47 -20 -26 44 -16 -63
2955f3J19Lr5OL7k9M9Rq8L2O4q4J6J01n5r0O6K8k2N5m9o6Q6J4p7L6P6j03k9P6
$$ -63 56 59 -36 -30 7 -22 27 36 -52 -20 44 -40 -24 77 22 -68 -2 26 4 59 10 -56 30 44 -33 3 79 -24 -53 23
2985B3kjJ5p0mJ02m4q2R0J2j04M6O6m0lko9O0Q5j04k6R4l7o4P6K2n5K1j8l4J02
$$ 23 21 20 35 -35 -39 63 19 -63 27 39 -65 -19 47 7 4 2 -67 -7 78 -26 -52 42 5 -59 17 39 -16 5 -13 -47 55
3016E5J4j26K9R1p7k5Q8l6m2L4k9J8R3o7j03R3N9j04K9M4n7qM4m1L7M5j13j9J26
$$ 55 69 -57 -28 63 -14 -39 49 13 -29 5 -24 -6 87 20 -83 10 69 -35 -6 38 -19 -27 17 -24 13 58 -55 -74 52
3045E2kr1N5ln1L6K6l4L8nr4M8J11o4m1L5j9%L4k1JK7n8l5Q4L9q9j5N7j7rM0l7
$$ 52 50 -41 14 11 -40 -4 22 -12 26 21 -73 -25 86 22 -19 16 -3 -3 31 10 11 38 -20 -55 29 68 -21 -36 21 4 -5 35 -2
3078bkK3m4j4P9nq8J4P3l0MNl9J9L1l7J1N2n4n5O8L4m2%Nl7M4K2m6J8M1q0qQ4
$$ -2 -4 19 -25 -39 40 35 -53 -39 34 4 8 13 -26 -7 24 -13 -2 50 -4 -59 9 43 1 1 6 -31 13 35 -11 7 48 -32 -40 44
3112D4no6K8pj4N1Pn7K8Pn6K8O4m9l8M1j3j1O0n6m3P7k0l2P3Oq4J3M6l0K5K5p2
$$ 44 39 -27 1 -6 -20 31 38 -19 9 16 -40 -12 52 3 -35 6 -7 -18 42 -14 -57 20 0 -32 41 47 -37 -24 22 -8 17 42 -30
3145c0RN4k7j0O2n4n4N5K2k5K4l0l6M0M3n4RK4n2%M7j0k3J5l0QM7%m8J4Nk0M1
$$ -30 -21 33 6 -4 58 4 -50 5 27 2 26 -4 -40 0 43 -11 -2 22 -30 -30 17 7 -16 -1 -31 -23 24 24 -24 -10 -5 -25 16
3178A6Rk6%Jk0K4M6m0l1K2L%K6J5n2LKJ3J1Ql7j7L0RkOj0k0OJ9KLj0l8J7K8Kn
$$ 16 25 -1 -1 0 -20 4 50 10 -21 1 4 4 30 45 -7 -4 -2 11 22 30 -7 -24 6 15 13 19 9 -11 -5 14 16 19 9 -29 -12 16 18 13
3216A3pk3qL6J8k2j1Jj3K9K7l1k4J8j2K9J9rl8J3j1J6L8l6l0KJ7nL3Jn2JK6nJ8
$$ 13 6 -17 -25 11 29 7 -4 -3 -16 13 40 9 -15 3 -9 20 39 30 -8 5 -6 10 48 12 -18 -16 1 -4 29 30 -22 -21 5 0 18
3251A8Lk3oLlJ2K0l1j0J5jPK2l4j6K3J5j4K3j1m0K1L2mqLl9J0M0Lpj0k8j7L9J9
$$ 18 21 -2 -8 -5 -8 4 24 -7 -17 -2 -3 4 26 -8 -24 -1 14 0 23 12 -28 -7 25 21 13 16 -23 -13 27 30 23 13 -15 -32 7 26
3287B6qj7oj0K4K8l0j7Oj8KL8Jl7oJ8qK6J5l2j9J7J1jK0k2k9K3J9LKJm0J7L0p
$$ 26 18 1 -5 -15 9 37 7 -10 -4 -22 -20 18 19 -18 -24 -6 -14 12 27 -5 -24 -7 4 3 23 1 -28 -5 14 17 19 20 -20 -3 27 20
3323B0oJ6m8j3N7%l3J3km6M3M2n1NK4n2MP0k5l8J8k1pP2k2n9M9Ln4N9L6q9K6K9
$$ 20 14 30 -18 -31 26 26 -7 6 4 -42 1 43 -8 -3 21 -31 -27 43 18 -20 -2 -23 -30 42 20 -39 10 13 -41 18 54 -35 -9 20
3357B0m9K8P4q5l8Q4j8m4P9k7p6O7Kl4O7Lj21M8R1q1RN2p7j1P7l7k4R2o9q5J07
$$ 20 -29 -1 73 -12 -50 34 16 -28 51 24 -52 15 17 -17 50 53 -68 -20 71 -10 -1 51 -26 -37 40 3 -21 71 2 -83 24
3388B4K9q5N7Lp2N7L9o5J1N5q4oJ09m2p1N7j2j5M9Np2M9J0q3N1R1q3n6N6Nj7M5
$$ 24 53 -32 25 28 -44 13 52 -13 -2 53 -31 -37 72 30 -41 16 4 -11 38 43 -29 20 30 -53 -2 89 6 -50 6 11 -6 39
3420C9k6n5O4j3n1O8M7j26LQ3k3nL4p1pQ7m8m7J09j6j36Q3P8q6J3M0p8M0Q4j03
$$ 39 13 -42 22 9 -42 26 73 -53 -50 33 10 5 39 -32 -39 48 0 -47 62 46 -90 -7 71 -15 -2 38 -40 0 84 -19
3450a9j0J10p8p5J24Lr0M1on1R7Qj27P6O7j33J8J38j01l6P5o8oJ41j09j02J58
$$ -19 -29 81 3 -72 52 55 -35 6 0 -51 46 54 -73 3 70 -63 -45 93 -8 -44 31 -37 -43 98 -11 -113 45
3477D5jj22Q5O8j10J0N8p3O7O2j72K6J58j00p5J44l5r1Q6j2n7J12l9j39J20R1
$$ 45 44 -78 7 75 -35 -25 33 -40 27 89 -83 -57 101 1 -74 70 35 -56 30 18 -39 73 34 -105 15 106
3503A06j57K0R3r5j6Q4n2J4P1j12n3J67j5j34Q2L4r5N2N2p1M7J9j10M2J40j04
$$ 106 -51 -31 62 -33 -49 35 -17 -3 68 -44 -97 70 55 -79 3 37 -58 -6 46 -25 22 41 -69 -27 113 9
3529Iq5J12%p2N8J0n4N4j8o8R9M5j29pJ02n1k5N4l7m4P8m0l8J13k0j40O9Q7p8
$$ 9 -76 36 36 -36 22 32 -22 32 14 -54 45 90 -39 -46 56 5 -20 34 -3 -47 31 -9 -47 66 46 -94 -25 62 -16
3558a6j2N1n4oP2n9PQ2o3q3J16J6q1L6J9p2N4M8r4M3O3j02rJ17l2r2P6j2o0P7
$$ -16 -28 23 -31 -37 35 -24 -17 65 2 -81 35 51 -30 6 25 -47 7 55 -39 4 67 -35 -44 73 41 -51 25 13 -47 30
3588C0Jq3O1L0r9N8Q3r9l3Q0l6j3P7p4m2J01m0o4J15J0j15M3N1n3RN5q1QQ0o6
$$ 30 31 -52 9 39 -60 -2 81 -18 -51 29 -7 -20 57 -17 -59 42 2 -62 53 63 -52 -9 42 -11 -2 53 -28 -20 60 -6
3618fj8Q1m4o2P1J9m3K3qo0N9K6p1L3L1o0oO8k2k9L9l5j6O2on6K5J9n0L3N1m3
$$ -6 -24 57 13 -49 22 41 -2 21 13 -47 12 38 -33 0 31 -29 -35 33 11 -18 21 -14 -30 32 26 -30 -5 14 -36 -3 48 5
3650Ek5K9k7J7L8k9l5L8Nl6L6J8m2OK5j8NJ9l8j1N4k2k2L4j1m9L6K8l5%K4n2K0
$$ 5 -20 9 -18 -1 37 8 -27 11 16 -20 16 34 -8 -2 23 5 10 29 -9 -20 34 12 -10 24 13 -36 0 28 -7 -7 17 -35 -15
3683a5M9m6mN6n2k1N4jm0L2pl9N4J9n4J9L0n3K2L9l5j8L4l0jM8k4l9M8j0k6L3
$$ -15 34 -12 -16 40 -12 -33 21 20 -20 12 5 -34 20 39 -15 4 34 -19 3 42 7 -11 23 -7 -8 40 16 -23 25 15 -11 22
3715B2Qo1K7Qk0L7Nm6RK0k0JL5k3l1J8RNJ3j8k3K3J0j7K6pk9J3K8k3N%j9RJ6J
$$ 22 30 -31 -4 4 -16 21 26 -20 -11 9 -11 -10 25 2 -29 -11 -2 3 16 -2 -25 -2 8 -9 17 10 -19 -6 22 -1 4 4 -15 -6 10 11
3751A1j3Rj0OLJ1j4lj5MJ8KppKj6K1Ojk0jjJ5J4mj1j7J1R%J0Rl4QK0nJ1j0k0L
$$ 11 -2 7 -3 3 6 17 3 0 -15 -11 7 9 2 -5 -3 -19 2 8 7 -13 -14 -15 0 14 10 -1 -18 -7 2 2 12 21 -13 -5 15 10 21 11 -9 -6
3791fJ8pRJ7k9j8K9j1jJ5j1k2K9jl8K5Ql2K3K3l4PJ2k4NK9j4j6L2k3k4O4k9l1
$$ -6 12 5 14 31 2 -16 13 2 1 16 5 -17 12 11 -27 -2 6 -26 -3 20 -14 -7 5 -19 -14 15 1 -15 17 -6 -30 34 5 -26
3825b6L8km0M3K8n7J0K2l4J1N3n0j8M7k6k6O5k5n1N8j0n5N4J0n2K8K8m6J1N3n9
$$ -26 12 10 -30 13 41 -16 -6 16 -18 -7 46 -4 -22 25 -1 -27 38 13 -38 20 10 -45 9 19 -33 -5 23 -23 -12 41 -18
3856a8nM7k4k9N4j9m5N1J0m7L4L0q1L0O5o2j0N5l6l6O8k2l7N9oo5N8M0q7J5N9
$$ -18 -23 24 0 -29 25 6 -39 12 22 -25 9 39 -42 -12 53 -9 -19 36 0 -36 32 10 -27 32 26 -39 19 59 -28 -13 46
3887D6o8j4R0o9k5Q1m3n3R8j1q4N7M2q5L6N0r3K6P8r0pJ15p9o5J27k1q3R3j5r1
$$ 46 -22 -36 54 -15 -40 41 -2 -55 43 32 -52 5 47 -38 -2 48 -45 -19 59 -31 -38 77 -2 -67 60 39 -44 49 34 -57
3917e7Q0K7j12O7P6j25J4J02p8l5J01o6m2J13n3p9J25j9j30R8O5j19L1O6q5K0
$$ -57 23 50 -62 5 81 -44 -30 72 -6 -41 60 -6 -48 65 12 -67 58 39 -91 7 72 -47 -16 50 -35 -15
3943a5Q3j09j9J45q9p6J32qj14R0J8q5O8M2j20M7J02j26nJ27p8p0J14k4p7J08
$$ -15 68 -41 -60 85 -4 -80 52 44 -70 20 38 -47 21 63 -57 -10 92 -34 -39 88 10 -60 54 30 -47 61
3969F1l1r6R4M5j52P3J03j41kJ08q0k7J11p6o4J45l9j22J46J5j50R3N7j16L9Q0
$$ 61 30 -66 28 73 -79 -6 97 -44 -46 62 -18 -45 66 -10 -74 71 32 -90 56 71 -79 14 71 -45 -6 74
3995G4j19K1J25j19n5J61o8q5J19mj11R9J2j29J02N6j49N6J04j39RJ27j07m4J18
$$ 74 -45 -24 101 -18 -73 88 20 -65 54 50 -61 38 50 -79 23 79 -70 -14 90 -49 -40 87 -20 -64 54
4020E4o9o0J24m0j05J23K8j18P2N0j05L5P1j01J6J03j06k4J13m8p9J14j0q9Q5
$$ 54 -15 -75 49 9 -96 27 55 -63 9 59 -46 -11 60 -41 -25 78 -28 -52 61 13 -66 48 38 -51 34
4045C4J2j00P1L4r5K9P8p5k2Q9o4m1R9k3p4Q1j3q5P5L6r2K3O0o9OP5n4qO8m6n3
$$ 34 46 -54 17 51 -44 -15 63 -12 -34 55 -9 -50 49 26 -48 33 20 -65 10 46 -46 -23 37 -32 -26 49 -5 -13 55 9 -44
4076d4P8np2N2M4p6K8M5p4J6O2o9RO3m8m7Q8k8n0O2oo2N5K1q1L4N4p3JO7n1k3
$$ -44 34 29 -43 9 53 -23 5 50 -24 -8 54 -15 -6 57 9 -38 50 22 -28 34 28 -34 21 42 -39 -5 49 -24 -23 44 -7 -30
4108c0O4l8m3P0k0m1O2Lo2N0J3n3K5L9n9J6L4m4j3O8k1l9N2j1m6L8J2m8L1K5n4
$$ -30 34 -4 -47 23 3 -38 24 27 -35 15 28 -25 0 39 -20 -4 30 -14 -27 41 20 -19 33 22 -24 14 26 -22 9 34 -20
4139b0J7K3m1QM6l5j6L9k6k0M2j3l2K5J1l0J5K6m1OL7k8kL4k2mK4j5j4J1Nj2O
$$ -20 -3 20 -21 -13 33 -2 -18 21 -5 -25 17 4 -28 -3 8 -22 -7 19 -22 -16 21 -7 -9 25 3 -1 23 8 -6 5 10 -2 4
4172DL0l9J0J4j7jJ4nl0L7Jl2J8J3k5J1J5k6LJ9k6j3K8j0pK2j6lJ3kj3QJ8k8J0
$$ 4 34 -5 5 19 2 1 15 10 -20 17 18 -14 4 17 -8 3 18 -8 -5 14 -12 -25 3 -7 -14 8 -8 -11 2 0 -13 -5 13 -15 -5
4207eL4m3PK7k8J1K3k2qJ4lj8L1Mk2KJ0j5JJ6k0RQk7MJ9pj7J7j9KK0mk6K5Mk3
$$ -5 29 -14 -7 20 -8 3 26 4 -4 10 7 -11 20 24 2 4 14 -1 0 16 -4 5 13 -14 -10 9 2 -15 2 -17 -15 5 1 -25 0 4 -19
4244a9K6jj7J5J0j8J2jj7J8Oj3jK1k6J2NLrMj6JLKolJ8j2lNMkJ3j5qJ0qrJ4rm
$$ -19 7 6 -11 4 14 -4 8 7 -10 8 14 1 0 21 -5 7 12 15 6 10 -6 -5 -2 0 -6 -9 9 -3 -6 -1 3 1 14 -1 -9 1 -7 -16 -2 -11 -15
4285a5OJ5j0oK6j5j5J5J3j3MMqJ2lj3MQ%j5J8j1JRj6lJ0pj4J8Ok2J7J3k6PK1l0
$$ -15 -9 6 -4 -10 16 1 -14 1 14 1 5 9 1 13 10 -3 1 9 9 -6 12 1 2 11 -5 -8 2 -5 -19 -1 5 -17 0 13 -13 -6 15 -15
4323a5RK0k8oL0j6j2L5j9pK6rj9RK2m3L5J5l0QK9l6kL7k6k1M7k1l7M0qk9K4Ol5
$$ -15 -6 14 -14 -20 10 -6 -18 17 -2 -9 17 8 -11 -2 20 -23 12 27 -3 5 34 -2 -4 33 7 -14 33 12 -25 15 7 -22 2 8 -27
4358b7K0K2l9J5K6l4KL0k3j6M2k3k5N0qm1L2K8n2K1K6l2jK8k7j0N3l3k8N4pl9
$$ -27 -7 15 -24 -9 17 -17 -15 15 -8 -24 18 -5 -30 20 12 -29 3 31 -21 0 26 -6 -7 21 -6 -16 37 4 -24 30 23 -16
4390a6L1Pm0K1K0l8J1K8n6J2N5m0k4N4k3l2M8jn2M5Qn3K8M2o4QN7m7oN6k6l6N5
$$ -16 15 22 -18 3 23 -15 -4 24 -32 -20 35 -5 -29 25 2 -30 18 17 -35 10 18 -35 -7 35 -29 -21 36 -11 -17 39 13 -23 32
4423C2k9l9N8J1o6M4J9n7J3N6n7j4O2l5k8P3l2n2N3Pn6M5K0n9K8L2o4K0N6o2q
$$ 32 3 -36 22 33 -33 11 30 -27 -14 42 -15 -29 33 -2 -30 43 11 -41 12 19 -37 8 28 -31 -3 29 -35 -15 41 -21 -29
4454b9N7l6k2N8k5l6P0lp4N6J8o0J8N1n7J5M3n8mN9m2k1P0j7o9N4J2n4K9K4n6
$$ -29 28 -8 -30 28 3 -33 37 34 -40 16 34 -26 -8 43 -14 1 44 -14 -18 41 -1 -22 48 31 -38 16 28 -26 3 27 -29
4485b9J6M9o7J4O1m7l9O5j2m4L3%l7M4J8o4L4L9n5RN4l8k1M6k0k3M9k6l8O2Rp9
$$ -29 -13 36 -31 -17 44 -3 -42 23 11 -33 0 0 -37 7 25 -39 -5 34 -21 -12 42 4 -17 29 9 -14 35 9 -29 33 42 -37
4517c7N2K8o5K4L4m0lL7m2j4N2k9m4N8Ll6L1K1n5K6J9m6K9K4n0mN9l0k4M7k1k9
$$ -37 15 43 -22 2 36 -4 -7 30 -12 -26 26 -3 -47 11 14 -22 9 30 -25 1 20 -26 3 27 -23 -27 32 2 -22 25 4 -25
4549b5M7pl6M6Om5J5K4k8qL8k2j7L1j3k2M1k3k9L8J5n0K0K1l9J0L5l6jK8l4MM0
$$ -25 22 15 -21 25 31 -14 1 25 -3 -11 27 5 -12 19 6 -16 25 2 -27 11 26 -24 -4 17 -22 -12 23 -13 -14 14 -20 -16 24
4582B4j7k7K3mk4L5J6l6K3Rk5J1J6j6j7K5j5j4L3j5j9L0rj8K8J3m0rN6l8pJ3j3
$$ 24 7 -20 3 -1 -25 10 26 -10 13 22 -3 8 24 8 -9 16 1 -13 20 5 -14 16 7 -11 17 30 -10 -19 37 -1 -8 5 -8
4615hNLojK2k2qJ8Jj6J3Mj6jK4rJQj9KK4lk2J3%j6J4Kj3MojJ2Pj0Njlj0J1jj0
$$ -8 -3 0 -6 -7 15 -7 -15 3 4 -12 1 5 -11 -12 12 3 4 12 -7 -5 19 16 -6 7 7 -9 5 7 -6 -2 -8 -9 3 10 0 5 4 1 -9 2 1 -9
4657iRNj0PQj1pJJ%Rlj3J3nj2K2qNpJ5%oJ0qkJ6j8RqpJ4lKjKqjjL%nKj3J3Nj5
$$ -9 0 5 -5 2 10 -1 -8 -7 -6 -6 3 0 -13 0 -5 -17 5 -3 2 -5 10 10 4 14 6 4 20 2 11 3 -4 10 7 9 8 10 2 1 0 3 3 -2 0 -13 0 5 -10
4704a0J1kpQnNjKnLoJ7k0J1OnJ2lQj7J3j4J4oJk0J5MoRj0KlMoqQOj3MOj5RpjR
$$ -10 1 -1 -8 0 -5 0 -1 1 -4 -1 -7 10 -10 1 7 2 14 11 19 2 15 1 15 9 10 -10 5 9 3 12 2 4 1 5 -1 -9 -1 5 -8 -4 2 -13 -4 -11 -12 -3
4750ckoPLnKPqKmJ6j0NKj0J8j4j1K3J1k7OQJj1Ojj2PNPOj3nL%LQlj2j1J0lJ0J
$$ -3 -5 -11 -4 -1 -6 -4 3 -5 -3 -7 9 -1 4 6 -4 14 0 -11 12 23 -4 2 10 11 0 6 5 -7 0 5 12 18 5 0 3 3 6 14 11 -1 -12 -2 -5 5 6
4795FopPNj0RqLMPmLRk5J2J5okoj1J2nJ0j4%J1j6LJ3j2jPJj3K4j6j5ORp%J2j1
$$ 6 0 -7 0 5 -5 4 -4 -1 3 10 6 9 18 -7 5 20 14 12 6 -5 7 2 12 -2 -2 9 -7 -4 9 -3 -4 3 4 -9 15 -1 -16 -10 -1 -8 -8 4 -7
4838gkJ5kLQj5pJ2JrJ2Pk2J8Qj1JRj6MJ4j7oOrlJ8rnJ2lrJ1kj7OMj1J0Qj6J3J
$$ -7 -9 6 4 7 15 0 -7 5 6 -3 9 16 -6 12 20 9 10 19 3 7 21 4 -2 4 -5 -8 10 1 -4 8 5 -4 7 5 -12 -6 -2 -13 -3 5 -11 2 3
4881CokJ8j0k3L1j%mLjrJ9q%J0k6MJ7j5nJ7%j6J6%k6J6J0l3J8K3j4j5J8j6kJJ1
$$ 3 -3 -5 13 3 -20 11 10 10 6 9 8 -1 18 10 10 20 -6 -2 15 0 -5 12 12 -4 12 12 -14 2 12 -21 -3 20 6 -9 9 -7 -9 -8 3
4920Cj8J4J5k3J3Ok2OJ7poJ2r%J3j2oK9j4rK0jk1J8%j4OJ2k5PJ7j4j2J1%j5J0
$$ 3 -15 -1 14 -9 4 10 -12 -6 11 4 -2 10 1 1 14 2 -4 25 11 2 22 21 0 18 18 4 10 22 -3 4 21 7 -5 6 6 -9 1
4957Alk0L0rj6J5Rj0qK1j3jK0k9KK9j8j9K2njK0lj0lPj1J4J8k6rK2j5j1J7Kj5
$$ 1 -2 -22 8 -1 -17 -2 7 -3 -11 10 -3 -4 16 -13 -11 18 0 -19 3 -2 -3 17 14 4 1 8 -3 11 29 3 -6 16 1 -10 7 9 -6
4994fNOj5J8Rl7NJ6j0oK3j1k1K8j4J2Nrj0K6Jk9J7Pk1J2J7j3LJ2j4j3K9%k6J4
$$ -6 -1 5 -10 8 17 -20 -15 1 -9 -15 8 -3 -24 4 -10 2 7 -2 -12 14 15 -14 3 10 -11 1 18 5 8 20 6 -7 22 22 -4 10
5030A0%j0J5nj8J3Pj7QJ2j4j5K3j0lK1j6j2ORj5J1K0l6QK1j8J6Jj9jJ5Mj3L0j6
$$ 10 10 0 15 10 -8 5 12 -5 3 15 1 -14 9 -1 -4 17 1 -11 -5 4 -11 0 20 -16 -8 13 -5 11 12 -7 -8 7 11 -2 28 12
5066A2k3J9Rk1K3pj9JJ8pnPj9lJ5J6k1Jjj3K1jKLnj3J0J6j5j2J4j5K0Ppk6K3%
$$ 12 -11 8 17 -4 19 12 -7 -6 12 5 0 7 -12 -15 0 16 -5 -4 -5 -18 3 2 4 7 2 -11 -1 15 0 -12 2 -13 7 14 7 -19 4 4
5104Dk2K9jmj7K0LkQj0rNQqMOk5LJ8j1Mjk1K2Rj8JJ1j1k4K8J6k4J4oqJ7Jj1NJ1
$$ 4 -18 11 10 6 -11 9 12 10 18 8 -1 4 12 4 8 14 -11 -8 10 -1 3 2 -19 3 12 -6 -5 6 -5 -29 -1 15 -9 5 -1 -9 8 9 -2 3 14
5145A4j2jK3j5rJ0j6QJ7njn%j5J0K6l6J2m%QNj5k%kJ1%j3RjmkKRk4MJ2J3n%oO
$$ 14 2 1 24 9 0 10 -6 2 19 14 13 8 8 -7 3 29 -7 5 1 1 9 14 -1 -3 -3 -5 6 6 -7 2 1 -3 -5 -3 6 -18 -14 -2 11 6 6 0 6
5188FJJOj0j0oJ9Q%j1j0J2mJ4kk2J3kj2J4J2j8j1NoJ4J1j6%kKJkN%k0J7mK1j2
$$ 6 7 8 14 4 -6 -12 7 15 15 4 -6 6 2 16 14 -8 5 3 -9 5 17 -1 -12 -7 -13 1 12 -4 -4 -6 -4 -3 -5 0 0 -20 -3 -7 14 2
5228BpmK5j1K0j1j7RLNkNj2nJ9j0KOpj8J7Qj3Or%j1K6j9l%%KJ6j4oJMoK0Mj0r
$$ 2 -5 -9 16 5 25 14 -3 6 9 14 12 17 5 0 19 9 11 17 10 -8 9 17 4 10 1 1 -10 16 -3 -6 -6 -6 -4 12 -2 -8 -7 -3 -9 11 15 5 -4
5271dJ0%ORj0j0jOjQMj4MoJJ8Kk6rJ4nPKqj7ROjJ1j2j5L0q%lJ0j6j2K4Qk1J0q
$$ -4 6 6 12 21 11 1 0 6 5 13 17 3 7 1 2 20 22 -4 -13 1 -4 3 5 -3 -20 -11 -5 -6 5 -7 -22 8 0 0 -3 7 -9 -21 3 11 -10 0 -8
5314hkJ5J3j1Jqj1K3nJj3RoJ3K5k9rLKpJ6pk0LQj2L0mk0j4K8jkJj1j4J4J3oL1
$$ -8 -10 5 18 7 8 0 -11 12 7 8 -5 4 -2 11 36 7 -2 1 3 -4 12 5 -15 -12 -4 -16 14 10 -10 -24 4 3 1 2 -9 -23 -9 4 -2 29
5354B9l9j5L0K6k8J3jj8%J2o%J0j9oM2j0j0noj0K7Jk4K0kl4J7K8nk6Nj3J0J9j0
$$ 29 -10 -25 5 31 3 16 15 -3 -3 9 3 3 13 -6 -12 30 20 10 5 -1 -11 16 17 -7 13 11 -23 -6 22 17 -9 -4 -17 -7 12 2
5390Bj3J9k0j5K9J1k9JQLJ3K2m1J3J8k8NK7ql1J6J7j3Qj2k4L2Jk3MK0j8k8L2M
$$ 2 -11 8 -12 -27 2 13 -16 -15 -7 -4 9 31 -10 3 21 -7 -2 25 17 -14 2 19 6 14 2 -22 10 11 -12 -8 12 -6 -34 -2 2
5425BMMk3mJ9Pk1OJ6l6LM1j0j1pmQK8j6j3K4j2rJ1K8l8jQj6K5K1l5k2M1k1pJ9
$$ 2 6 10 -13 -17 2 9 -12 -6 10 -26 -23 18 8 -3 -10 -14 -6 22 6 -7 17 5 -4 7 35 -3 -4 4 -12 13 34 -1 -23 18 -3 -10 9
5462Ikl3J2J1j7K3Ll9J4L2k9OL3m3j2L5jkJ4j8l2M8J4l7J0J0j4JK8k9NJ1k9nM5
$$ 9 7 -26 -14 -3 -20 3 6 -33 -19 13 -16 -10 23 -20 -32 3 2 0 14 -4 -36 12 26 -11 -1 9 -5 -4 24 -5 0 11 -18 -23 22
5497B2nl7K0J0k7L2Nj7j0%j9M2Mk3l1L6j3j2K8jk2J2kpK4Om1J7K1j7MQpjJ6j0
$$ 22 17 -20 0 10 -17 15 20 3 -7 -7 -26 16 20 -3 -34 2 -11 -23 5 4 -18 -6 -8 -15 9 15 -26 -9 12 -5 -1 7 0 -1 15 5
5533EqL0j7l9K5K6k1OKk5K0Qj6OPk3j4M5j0j4nj0LK1Kj6Rkk0J4L5l4j3J5p%K4
$$ 5 -3 27 10 -29 -4 22 1 7 9 -16 4 12 -4 2 9 -14 -28 17 7 -7 -12 -22 -19 2 4 -12 -3 -5 -25 -11 24 -10 -23 -8 -15 -15 9
5570Ij0j3POj7L2J3l1j5K7nqJJj5K2j0LK9k9k1J0RlJ9j9k1MK0pjK1pl1K5nnJ3
$$ 9 -1 -14 -7 -1 -18 14 27 -4 -19 8 3 -5 -4 -3 -18 4 -6 -3 26 -3 -24 -14 -5 -8 11 -8 -29 -25 -5 -12 -13 8 1 -30 -5 -10 -15 -2
5608bj4mK3Nk0J1Pj7J5J2Pk0mj4J3K2k0Pj1Lj5J8Oj3rJ6j3J2mkj7J2JMQKk3%J1
$$ -2 -16 -20 3 8 -12 -1 6 -11 4 16 23 3 -1 -15 -2 20 0 7 -4 -1 -16 2 8 -5 -14 2 -11 1 -3 -5 -22 -10 -9 -5 3 5 -18 -18 -7
5647gJL%oqNROMk3jJ2J1PJj7j0K0PqJnj3KK2j1j7J1m%MJ1k3OroPL0k0Mj4J1KP
$$ -7 -6 -3 -3 -9 -17 -12 -3 3 7 -16 -17 -5 6 13 14 -3 -13 7 14 6 7 2 -11 -9 13 2 -15 -4 -8 -8 -4 7 -16 -10 -19 -25 -18 12 -8 -4 -18 -7 -5 2
5691BnoQqjJ5J2k9OMMJnKrRJ5knpj7J2J3oRj1rPJ4j1lrllK0j4Pnlj4J6J1j1Rn
$$ 2 -3 -9 -1 -9 -10 5 17 -12 -6 -2 2 3 -2 0 -9 0 15 13 8 1 -16 -4 9 3 12 1 -8 -1 13 2 -1 -10 -13 -16 4 -10 -3 -8 -11 -25 -9 2 -9 0 -5
5736ej2J6J7%k9J5j4J6RonklLJ1Rj7j0KOJJmKq%J2J2j3j5jPJ%Jk0J3kOJ0Qk9j
$$ -5 -17 -1 16 16 -13 2 -12 4 13 7 2 0 -3 0 11 20 3 -7 -5 1 2 3 -1 1 -7 -7 5 17 4 -11 -12 -5 -4 -4 -3 -23 -10 -12 -6 4 12 -17 -18
5779a8K4Kn%j6J0RJoRj4j8K1K1kj2ok%PqJjMpJ1J0j0j9QjLNqpK0k4J2J4rojJ7
$$ -18 6 8 3 3 -13 -3 6 7 1 10 -4 -22 -1 20 18 6 0 -2 -2 5 -3 -2 -3 1 -6 5 15 5 -14 -6 -7 -4 1 -7 -14 6 -18 -6 8 -1 -7 -8 9
5822ILpLj5LmKOJ1k0LJ3Porj2RK0kj1mlpNKKQj1j7J8J7j3j1Qj8OQPj3J1j7KK6
$$ 9 12 5 8 -7 -4 -8 -6 0 11 -9 -6 7 14 8 -1 -13 -4 16 14 3 -1 -4 -11 -6 -4 -2 6 -5 -22 -4 13 0 -11 -3 -21 -15 -7 0 -13 -2 -19 -17 9
5865IpmMKj4kL0k5J0j3rK2J6j4j5J7noJ6j0j1ON%jRk2%K2j6L%j1kNJlJ4Mk6J2
$$ 9 2 -2 2 4 -10 -12 18 -7 3 -10 -19 3 19 5 -10 7 2 -4 12 2 -9 -3 2 2 1 10 -12 -12 10 -6 -3 -3 -14 -16 -11 -10 -13 1 5 -21 -9
5906iK0k1J7rlJ5opRRj6j2J9J2j6Ojj0QKj1QNk7KK7nj4NlOJ1j6j7K4jk1K1jj3
$$ -9 11 -10 7 -2 -5 10 4 -3 6 15 -1 -13 6 18 2 8 7 -3 5 7 -4 4 9 -18 -16 11 6 -8 -3 -6 0 11 -5 -22 2 1 -20 1 0 -13
5946a3oPKjJ7j1oK0pqK2Jl3K2Nj2%MN%Qj4mJ5k2j2J7J0j5LolJ6%joJ6k9OK8k1
$$ -13 -19 -12 -10 -11 6 -5 -11 9 2 -6 16 17 -16 6 11 -1 -1 3 8 8 16 2 -2 13 -9 -21 -4 6 -9 -6 -12 -15 1 1 0 -6 10 -19 -13 15 -6
5987flRk4J1K7j3k7K4J3k2J6Oj5LQj4RJ3j8kJ0J0j4RNj6Mj3J0jJ7l2J4JOpQj4
$$ -6 -9 0 -24 -13 14 1 -26 -2 11 -11 5 11 -4 -1 7 -7 2 15 -3 -5 5 15 1 10 15 -1 3 -10 0 -1 16 -16 -2 -1 5 -2 6 -8
6025hlJ2qOMlk4J6J3j3KOrNJ7rj%j1J3lJ2k1JRj1J3NmlNqNK%k9J5k%J2lrjLpJ1
$$ -8 -11 1 -7 -1 3 0 -24 -8 5 -8 -6 0 -9 -4 13 4 3 3 -8 5 2 14 -7 -6 3 -8 5 10 6 3 8 0 5 7 7 -22 -7 -9 -9 3 0 -9 -10 -7 -14 -3
6071cj1%KK0j2Lllj2J9oKK3j7j4OJ8%rNpkMPK%j2pK0okqklMjjK%oPKonLJpJ6O
$$ -3 -14 -14 -12 8 -4 -1 -4 -7 -19 0 -6 -4 19 2 -12 -6 12 12 3 8 1 -1 3 10 12 12 0 -7 13 7 5 -3 -5 -8 -4 -5 -6 -4 -4 -10 -3 -1 -7 -12 -9 -8 -15 1 7
6120Gj6%O%J8j4KQoj1J6prJ5nOlmjrJ2ojJ1j3j1PJ6o%j2KmJ2m%%m%NQmmmJ6j5
$$ 7 -9 -9 -3 -3 15 1 3 11 5 -6 10 3 -6 9 4 10 7 3 2 -7 5 -1 -2 9 -4 -15 -8 8 2 2 -10 -8 -12 0 -4 -4 -4 -8 -8 -3 5 1 -3 -7 9 -6
6166fK6j7jLJkNQroRj1M%KjkJlRj6Pj5J7j9JJ5j7OJ4j2RlnPOJpokLOllJ1nkJM
$$ -6 20 3 2 5 6 4 9 17 8 2 11 0 4 4 6 5 3 4 1 10 -6 1 -14 3 -16 -15 0 -17 -11 3 -9 0 -3 -8 -1 5 6 -1 -7 -9 -6 0 -3 -6 5 0 -2 -1 3
6215CRknJpNNolRl%nJ2j3nPj1J3j7LjMQJ1j1mLnmJ0nkNKJMj1OQj5J5JJj5PJQl
$$ 3 12 10 5 6 -1 4 9 3 0 9 6 6 1 13 0 -5 2 -9 4 -13 -10 -11 -7 1 12 1 -3 0 -5 -9 1 -4 -6 -1 1 2 6 -5 1 9 -6 9 10 11 -4 3 4 12 9
6264IorJ0NnJ1j6N%nmOnLm%J0j3mJ4j1MkQqpJ5JkLmqJ4lKJ4j1j2QpLOmPpNrJ0
$$ 9 3 -6 4 9 4 15 -1 4 4 -1 -5 1 -4 -1 -5 -5 5 -8 -12 2 -9 -5 -7 1 -7 -14 1 2 0 3 -1 -9 5 2 4 18 7 -5 3 -4 -1 5 1 8 1 6 -3 7
6312GOnj6J1NnoLj1JOrJ1LljkJjJ0j0%Mj1LJ0MmKKOmj2J6nJlKppRLnoJ4j3LJ0
$$ 7 13 8 -8 3 8 3 -3 0 -11 -10 -4 -13 -2 1 -2 -3 -5 -4 -5 5 -5 -5 -1 -12 -9 1 5 1 3 5 11 7 -5 11 6 7 4 6 -1 -8 1 4 -1 -7 7 -6 -3 7
6360Gj8NQj1qJ1pJ3j3J5lj0PJmJOrPLrLRlPknoK2j4jRlj0J3Mj2Kj0JJJ0j0JNj7
$$ 7 -11 -6 2 -9 -17 -6 -13 0 -13 2 -1 -11 -4 -3 -7 -6 0 -9 -2 1 -8 -5 4 1 8 6 1 -5 17 3 2 11 8 -2 11 15 3 5 -5 -4 -3 7 -3 -2 3 -14
6406a4OJ7j5nQrPNLplJ1pjPrRjrJ0RokPj2jRj0OPpkKjnMJJj4J7j0lKpNMj1rJ7
$$ -14 -8 9 -6 -11 -3 -12 -5 0 3 -4 -7 4 -3 -4 3 -6 3 2 -7 3 12 6 4 11 -1 -2 7 -3 3 10 3 1 3 2 -3 1 2 3 -11 6 -4 -7 -5 -12 -7 -3 -14 -23 -6
6455fNnJLNKJlJ1jk5QJ0mjPmJpKKLOj9J1L%rKJj2K0j6J6j1Lj6J1Pj6lJ1%lLLo
$$ -6 -1 -6 -5 -2 3 5 6 3 14 13 -12 -4 6 2 1 8 4 5 -2 0 2 5 11 -8 3 6 6 -3 -1 0 -12 8 -8 8 -3 0 -16 -5 2 -14 -17 -6 -6 -9 -6 -3 -9
6502iJ2pKJ4jk0OPj2J9j0mRJ0rjm%jnJ3j0Po%J7j3rPMj8JJ8oj8LkJ4mnjJ7jkj
$$ -9 3 -4 -2 12 11 -9 -3 4 -8 11 1 -3 6 16 7 6 2 2 1 -4 9 -1 6 0 0 17 4 -5 2 6 -12 -11 7 1 -17 -14 -16 -2 -6 -11 -12 5 4 2 1
6547AJj4J6nmMnOMjNj%krPnJ6mPj7lRj1LlmKLOpQnj5RLMj3J1%JjJ6kpmJKJnPl
$$ 1 2 -12 4 -1 -5 -1 -6 0 4 3 8 7 7 5 -4 3 -2 14 10 17 0 -3 6 -5 -2 -5 -9 -7 -4 2 -5 3 -2 -17 -8 -5 -1 -14 -3 -3 -2 -3 13 11 4 0 1 3 4 -1 6 3
6599C%NkmmJ1nNmJnJRk3J0rjJ3plKMqlJNpJ5j3OQ%j2RJ3k1Rk%MJ1j4QkKj1J1L
$$ 3 3 8 6 2 -2 9 4 9 5 6 1 2 11 -12 -2 -11 -12 1 -6 -9 -7 -3 -11 -14 -13 -8 -15 0 -13 -7 1 1 -11 -2 11 -10 -1 -3 -3 1 12 -2 6 4 6 -5 6 9
6647IjqqMPLp%Nj3jJ1%qoJ7nrKloOOlRrJ9lj7QRkpJ6j3pQLKlrOJ1mj3NlnLLmM
$$ 9 8 0 -8 -4 3 6 -1 -1 4 -9 -10 1 1 -7 -13 4 -1 -10 -8 -11 -17 -11 -5 -8 1 -8 11 8 -9 -1 8 6 -1 15 2 -5 3 6 8 5 -4 2 13 9 -4 1 -2 -7 -4 -1 -5 -1
6699aJj0J0mNNoNj5Pj3PlLJ%JlJ1Ll%Ok%krJ0Mn%OJKjLj1jj1QnPlj0MJMJNj0P
$$ -1 0 -10 0 -4 1 6 0 5 -10 -3 -16 -9 -12 -9 -8 -8 -7 -10 1 4 1 1 7 5 5 3 -6 4 8 3 3 9 10 12 11 14 3 2 -9 -1 -6 1 -2 -12 -8 -7 -3 -2 3 -7 0
6750@%jmlQj4J1JoKNrPK%JJnJ2lnKNqMkRkKrKlkKmJ3j5nOokRm%KLrJ0klmKnJ1
$$ 0 0 -1 -5 -8 0 -14 -3 -2 -8 -6 -1 -10 -3 -1 -1 0 1 -4 8 5 0 2 7 -1 3 1 10 8 10 1 3 0 -2 0 -4 9 -6 -11 -5 -11 -13 -4 -8 -8 -6 -3 -12 -2 -4 -7 -11 -9 -14 -3
6804cJ1plLRKrJ0j0JnNNl%KMrNMj5OkmNKj1JJ7j0j6J8jmoLmMJlmkRlRmoOJ5k5
$$ -3 8 1 -2 1 10 12 3 13 3 4 -1 4 9 6 6 8 12 3 8 12 -3 3 1 -3 2 4 -7 -6 11 1 -15 3 2 -2 -8 -5 -9 -5 -4 -7 -11 -13 -4 -7 2 -2 -8 -2 13 -12
6854a2J3%j1J6lpOJ1pnJ0j2lJ2j4J0okjQj3NMkj2QNj1MLRqlJJJ1Nj0Mk%%%Mj4
$$ -12 1 1 -10 6 3 -4 2 13 6 1 11 -1 -4 8 -6 4 -2 -4 -5 3 -10 -5 -1 -3 -15 -7 -2 -13 -9 -6 3 -5 -8 -7 -6 5 10 0 4 2 2 2 2 6 -8
6899hKJ2%MmqMkLj0rJ5lNj6OMNpJ0j4pR%JNLj1J5j1KMLjjQmnmORolKoJmJ1JrK0
$$ -8 -6 6 6 10 6 -2 2 0 3 -7 -16 -1 -4 1 -15 -9 -5 0 -7 3 -11 -18 -9 -9 -8 -3 0 -11 4 -7 -5 -1 2 1 0 8 4 -1 -5 1 10 4 1 3 -3 -2 -6 5 6 -3 17
6950A7lj3J0j9KLpMrQjj2J4koJ3Jj2J2jllOjKPkJMJpKpOj0RmjRnKPLj7QomRrJ
$$ 17 14 1 11 -8 -6 -3 -10 -6 -15 -7 -8 -20 -6 -8 -14 -1 0 -12 0 -1 -4 -7 -1 -2 0 7 5 6 10 11 4 6 -1 5 -5 4 0 -1 8 3 5 12 15 -2 6 0 -4 5 -4 -3
7000c%mLmPrPj3J0MnPj0PNj5J2%MLjrJ1kmjmLMk%pJ2o%Rj1MjJQoj3J1omMlMjj1
$$ -3 -3 -7 -4 -8 -1 -10 -3 -16 -6 -2 -7 0 -10 -3 2 -13 -1 -1 3 6 5 -4 7 5 1 0 -4 -1 3 1 1 -6 6 0 0 9 -2 2 1 2 10 4 -9 2 -4 -8 -4 -7 -3 -4 -15
7051a5J7rKj%JQpLLKkKKoPPkj1KLNqOpRqRj1J1lj1J3j9kMqJ2qOnJ1rLN%mrJ4k1
$$ -15 2 -7 -5 -6 -6 -5 3 -4 -1 2 4 2 4 6 0 7 14 12 1 3 6 11 3 9 2 11 3 12 1 12 9 -2 11 -8 -10 -6 -14 -2 -10 -4 -9 2 -7 -4 1 1 -3 -12 2 -19
7101a9J3NoQLLKlJmkKJkNNj7MkKOKrNnrjkMLmj0J4NJKjNj1Oj8J2jRpJ0lqjQJJ2
$$ -19 -6 -1 -7 1 4 7 9 6 7 3 1 3 4 2 7 12 -5 -1 -3 -1 5 7 -2 3 -2 -11 -12 -14 -10 -7 -11 -21 -7 -2 -1 1 0 5 -6 0 -18 -6 -7 2 -5 5 2 -6 -7 1 2 14
7153A4j0%NmMj3J5j0Kj%rJ3Kj1NJrlP%Pj1mJOk%nJ2JmJMj2QjMKJ0j4J1jj2Okn
$$ 14 4 4 9 5 9 -4 11 1 3 2 2 -7 6 8 -3 2 3 -6 -9 -2 -2 5 -6 -10 -9 -3 -5 -5 -10 2 3 -1 0 4 -8 0 -1 3 5 15 1 12 11 -1 5 3 -2
7200bQpk%JmLJ5j2%Rnj3KnMlJjRmpRlJ1oKKnNJj2J1jlOkOnNrJ8j1Pj1Pj3mKPp
$$ -2 6 -1 -3 -3 -2 -6 -3 12 0 0 9 4 -9 -7 -12 -8 -11 -10 -11 -2 -6 -13 -4 -7 4 -2 0 2 -3 2 3 -9 2 1 -2 4 2 8 3 8 -1 17 6 13 2 9 -4 -8 -6 1 -6
7251fJK0j8KLknm%LkMj2J3kmLLj1K2oj0nJ2LkLj3NNQkJ%lmMKnmjJ1kqkM%lK%j3
$$ -6 -5 15 -3 -1 2 0 -5 -9 -9 -6 -8 -4 -16 -3 -5 -9 -6 -3 -14 8 2 -8 -13 -1 2 0 3 -10 -5 0 8 6 7 7 4 0 4 6 1 -3 -4 7 5 -3 -5 -1 -1 -4 -2 -2 -15
7302a5NQj1RlLJkqQMonKJJ0RrkmJ4kLPj4N%rOkmNkJ%Ojj7LLoJ4j3JrQ%kPOj5K2
$$ -15 -10 -2 -13 -4 -7 -4 -3 -5 -13 -5 -1 -7 -12 -10 -9 1 10 1 -1 -5 9 7 10 17 3 8 8 -1 5 3 -1 4 2 3 3 9 8 -9 -6 -3 -9 5 -8 -7 -16 -8 -8 -10 -3 3 -12 10
7354A0j7Q%KlnLqJ1%mJ2%%j1JQj1NMnmOomP%j%oQnn%Po%JooK1%okRKnOpPLj8j
$$ 10 -7 1 1 3 0 -5 -2 -10 1 1 -3 9 9 9 -2 -1 7 -4 1 5 0 -4 2 -4 -8 -1 -1 -2 -2 -8 0 -5 -10 -10 -3 -9 -9 -8 -14 -20 1 1 -5 -7 2 4 -1 5 -2 5 8 -10 -11
$$ [...]
8191C
##END NTUPLES=NMR FID
##END=
