##TITLE=31P_DE-81
 200.13MHz, CDCl3,
 8 sc
 
 19ns.20.2.2025
##JCAMPDX= 6.0         $$ Bruker NMR JCAMP-DX V2.0
##DATA TYPE= NMR FID
##DATA CLASS= NTUPLES
##ORIGIN= UXNMR, Bruker Analytische Messtechnik GmbH
##OWNER= pz
$$ XWIN-NMR		Version 3.5
$$ Fri Feb 21 14:14:58 2025 Russian Standard Time (UT+4h)  new_Human@DPX200
##.OBSERVE FREQUENCY= 200.1313
##.OBSERVE NUCLEUS= ^1H
##.DELAY= (6, 6)
##.ACQUISITION MODE= SIMULTANEOUS
##.ACQUISITION SCHEME= undefined
##.AVERAGES= 8
##.DIGITISER RES= 18
##SPECTROMETER/DATA SYSTEM= spect
##.PULSE SEQUENCE= zg30
##.SOLVENT NAME= CDCl3
##.SHIFT REFERENCE= (INTERNAL, CDCl3, 0, 14.3821)
##AUDIT TRAIL= $$ (NUMBER, WHEN, WHO, WHERE, WHAT)
$$ ##TITLE= Audit trail, XWIN-NMR		Version 3.5
$$ ##JCAMPDX= 5.01
$$ ##ORIGIN= Bruker BioSpin GmbH
$$ ##OWNER= new_Human
$$ C:/Bruker/XWIN-NMR/data/yarkov/nmr/H-C/1/audita.txt
$$ ##AUDIT TRAIL=  $$ (NUMBER, WHEN, WHO, WHERE, WHAT)
(   1,<2025-02-21 14:09:52.06 +0400>,<new_Human>,<DPX200>,
      <created by zg, POWCHK disabled, PULCHK disabled
       configuration hash MD5:
       00 E9 B6 7A A2 85 ED C7 34 08 36 98 17 FE 4E 26
       data hash MD5: 16K
       B8 32 4F 9E 67 10 33 C8 9D 21 ED 6D C5 79 67 B7>)
$$ ##END=
$$ 
$$ hash MD5
$$ CC B5 29 71 B3 EE 5D 36 A9 7C 59 41 C7 3A 1D 8F
##$RELAX= 
##$RELAX= 
##$RELAX= 
##$RELAX= 
##$RELAX= 
##$RELAX= 
$$ Bruker specific parameters
$$ --------------------------
##$DU= <C:/Bruker/XWIN-NMR>
##$EXPNO= 1
##$NAME= <H-C>
##$PROCNO= 1
##$TYPE= <nmr>
##$USER= <yarkov>
##$AMP= (0..31)
100 100 100 100 100 100 100 100 100 100 100 100 100 100 100 100 100 100 
100 100 100 100 100 100 100 100 100 100 100 100 100 100 
##$AQSEQ= 0
##$AQ_mod= 1
##$AUNM= <au_zg>
##$AUTOPOS= <>
##$BF1= 200.13
##$BF2= 200.13
##$BF3= 200.13
##$BF4= 200.13
##$BF5= 200.13
##$BF6= 200.13
##$BF7= 200.13
##$BF8= 200.13
##$BYTORDA= 1
##$CFDGTYP= 0
##$CFRGTYP= 5
##$CHEMSTR= <none>
##$CNST= (0..31)
1 1 145 1 1 1 1 1 1 1 1 1 1 1 1 1 1 1 1 1 1 1 1 1 1 1 1 1 1 1 1 1 
##$CPDPRG= <>
##$CPDPRG1= <>
##$CPDPRG2= <>
##$CPDPRG3= <>
##$CPDPRG4= <mlev>
##$CPDPRG5= <mlev>
##$CPDPRG6= <mlev>
##$CPDPRG7= <mlev>
##$CPDPRG8= <mlev>
##$CPDPRGB= <>
##$CPDPRGT= <>
##$D= (0..31)
0 0.7 0 0 0 0 0 0 0 0 0 0.03 0 0 0 0 0 0 0 0 0 0 0 0 0 0 0 0 0 0 0 0 
##$DATE= 1740132591
##$DBL= (0..7)
120 120 120 120 120 120 120 120 
##$DBP= (0..7)
150 150 150 150 150 150 150 150 
##$DBP07= 0
##$DBPNAM0= <>
##$DBPNAM1= <>
##$DBPNAM2= <>
##$DBPNAM3= <>
##$DBPNAM4= <>
##$DBPNAM5= <>
##$DBPNAM6= <>
##$DBPNAM7= <>
##$DBPOAL= (0..7)
0.5 0.5 0.5 0.5 0.5 0.5 0.5 0.5 
##$DBPOFFS= (0..7)
0 0 0 0 0 0 0 0 
##$DE= 6
##$DECBNUC= <off>
##$DECIM= 32
##$DECNUC= <off>
##$DECSTAT= 4
##$DIGMOD= 1
##$DIGTYP= 9
##$DL= (0..7)
0 120 120 120 120 120 120 120 
##$DP= (0..7)
150 150 150 150 150 150 150 150 
##$DP07= 0
##$DPNAME0= <>
##$DPNAME1= <>
##$DPNAME2= <>
##$DPNAME3= <>
##$DPNAME4= <>
##$DPNAME5= <>
##$DPNAME6= <>
##$DPNAME7= <>
##$DPOAL= (0..7)
0.5 0.5 0.5 0.5 0.5 0.5 0.5 0.5 
##$DPOFFS= (0..7)
0 0 0 0 0 0 0 0 
##$DQDMODE= 0
##$DR= 18
$$ [...]
##$SUBNAM0= <"">
##$SUBNAM1= <"">
##$SUBNAM2= <"">
##$SUBNAM3= <"">
##$SUBNAM4= <"">
##$SUBNAM5= <"">
##$SUBNAM6= <"">
##$SUBNAM7= <"">
##$SUBNAM8= <"">
##$SUBNAM9= <"">
##$SW= 18.0517328524113
##$SWIBOX= (0..15)
0 0 2 0 0 0 0 0 0 0 0 0 0 0 0 0 
##$SW_h= 3612.71676300578
##$TD= 16384
##$TD0= 1
##$TE= 0
##$TE2= 300
##$TE3= 300
##$TEG= 300
##$TL= (0..7)
0 120 120 120 120 120 120 120 
##$TP= (0..7)
150 150 150 150 150 150 150 150 
##$TP07= 0
##$TPNAME0= <>
##$TPNAME1= <>
##$TPNAME2= <>
##$TPNAME3= <>
##$TPNAME4= <>
##$TPNAME5= <>
##$TPNAME6= <>
##$TPNAME7= <>
##$TPOAL= (0..7)
0.5 0.5 0.5 0.5 0.5 0.5 0.5 0.5 
##$TPOFFS= (0..7)
0 0 0 0 0 0 0 0 
##$TUNHIN= 0
##$TUNHOUT= 0
##$TUNXOUT= 0
##$USERA1= <user>
##$USERA2= <user>
##$USERA3= <user>
##$USERA4= <user>
##$USERA5= <user>
##$V9= 5
##$VALIST= <valist>
##$VCLIST= <CCCCCCCCCCCCCCC>
##$VD= 0
##$VDLIST= <DDDDDDDDDDDDDDD>
##$VPLIST= <PPPPPPPPPPPPPPP>
##$VTLIST= <TTTTTTTTTTTTTTT>
##$WBST= 1024
##$WBSW= 4
##$XGAIN= (0..3)
0 0 0 0 
##$XL= 0
##$YL= 0
##$YMAX_a= 543784
##$YMIN_a= -827822
##$ZGOPTNS= <>
##$ZL1= 120
##$ZL2= 120
##$ZL3= 120
##$ZL4= 120
##$ABSF1= 10
##$ABSF2= 0
##$ABSG= 5
##$ABSL= 3
##$ALPHA= 0
##$AQORDER= 0
##$ASSFAC= 0
##$ASSFACI= 0
##$ASSFACX= 0
##$ASSWID= 0
##$AUNMP= <proc_1d>
##$AZFE= 0.1
##$AZFW= 0.1
##$BCFW= 1
##$BC_mod= 2
##$BYTORDP= 1
##$COROFFS= 0
##$CY= -3
##$DATMOD= 1
##$DC= 2
##$DFILT= <>
##$DTYPP= 0
##$F1P= 0
##$F2P= 0
##$FCOR= 0.5
##$FTSIZE= 0
##$FT_mod= 4
##$GAMMA= 1
##$GB= 0.15
##$INTBC= 1
##$INTSCL= 1
##$ISEN= 128
##$LB= 0.25
##$LEV0= 0
##$LPBIN= 0
##$MAXI= 10000
##$MC2= 0
##$MEAN= 0
##$ME_mod= 0
##$MI= 1.114404
##$NCOEF= 0
##$NC_proc= 0
##$NLEV= 6
##$NOISF1= 3.799351
##$NOISF2= 2.8
##$NSP= 1
##$NTH_PI= 0
##$NZP= 0
##$OFFSET= 14.38212
##$PC= 1
##$PHC0= -1092.035
##$PHC1= 5.592253
##$PH_mod= 1
##$PKNL= yes
##$PPARMOD= 0
##$PSCAL= 0
##$PSIGN= 0
##$REVERSE= no
##$SF= 200.129724274929
##$SI= 16384
##$SIGF1= 3
##$SIGF2= 2
##$SINO= 400
##$SIOLD= 16384
##$SREGLST= <1H.CDCl3>
##$SSB= 0
##$STSI= 0
##$STSR= 0
##$SW_p= 3205.1282051282
##$SYMM= 0
##$S_DEV= 0
##$TDeff= 0
##$TDoff= 0
##$TI= <>
##$TILT= no
##$TM1= 0
##$TM2= 0
##$TOPLEV= 0
##$USERP1= <user>
##$USERP2= <user>
##$USERP3= <user>
##$USERP4= <user>
##$USERP5= <user>
##$WDW= 1
##$XDIM= 8192
##$YMAX_p= 0
##$YMIN_p= 0
$$ End of Bruker specific parameters
$$ ---------------------------------
##NTUPLES= NMR FID
##VAR_NAME=  TIME,          FID/REAL,        FID/IMAG
##SYMBOL=    X,             R,               I
##VAR_TYPE=  INDEPENDENT,   DEPENDENT,       DEPENDENT
##VAR_FORM=  AFFN,          ASDF,            ASDF
##VAR_DIM=   8192,          8192,            8192
##UNITS=     SECONDS,       ARBITRARY UNITS, ARBITRARY UNITS
##FACTOR=    0.0002768,     1,               1
##FIRST=     0,             0,               0
##LAST=      2.2672688,     0,               0
##MIN=       0,             -827822,         0
##MAX=       2.2672688,     543784,          0
$$ Real data points
##PAGE= N=1
##DATA TABLE= (X++(R..R)), XYDATA
0@%%%%%%qJ6j6K4m0N6p2Q8j12J44j76K16k72L36m08M88n84O96q16R60j124J305
28G01j509J736j996K285k600K950l340L772m248M771n344N973o660P411q232R130
44D800j0109J1176j2340J3612j5006J6531j8204K0042k2072K4323k6824K9625
56A5554l2783L6368m0480M5254n0870N7593o5818P6151q9586J07885j34539J77740
68A02469k64261P05576o23998J26517L15159p31571L99117p40986Q39986n16844
78c88836K62003R494j20495O63995m79695J42644L27458k50268j65784J59927
88A60443l85330M4014K35100m55566L76412R6927K09553n30073L94608K54928
98D01016p32093M96840k71062K17602j33719k18892K96515n0698N9600m33415
$$ plain form
0 0 0 0 0 0 0 0 -8 8 -8 16 -24 32 -40 48 -64 80 -96 120 -152 184 -224 264 -320 376 -440 520 -604 701
28 701 -808 928 -1068 1217 -1383 1567 -1773 1999 -2249 2522 -2822 3151 -3509 3902 -4330 4800
44 4800 -5309 5867 -6473 7139 -7867 8664 -9540 10502 -11570 12753 -14071 15554
56 15554 -17229 19139 -21341 23913 -26957 30636 -35182 40969 -48617 59268 -75271 102469
68 102469 -161792 543784 -80214 46303 361462 -370109 29008 -711978 128008 -388836
78 -388836 -126833 -117339 -237834 426161 -53534 89110 416568 166300 516 160443
88 160443 -224887 -180873 54227 -401339 -24927 72000 281553 -248520 146088 401016
98 401016 -331077 165763 -105299 112303 -21416 -240308 56207 5509 65109 -368306
108c68306P25220k67304k69782L75614k35230L6138k73655L84823l90485L31578
118D8611K52863n80873O49343k88128l0265l1404m6340J09950k20826R1243k14185
129b60011L52132j18012k56233M03768J58566l87210J23250L72059n37450J62587
139A3446j18314m5822R1490j61038K74324j78362L88092k50756N3712L12307m81531
150a02452L49437k40135j41882J07459p1202j61721m3497M28435l19485Q6548
160a08495L43737n1911j16388O5908M6444k05094J12675k70228J50003O5114l01222
171b69457K28608O9514p531j01719K91862j21339j63957L11978l08365k0506J27356
182C6444q3951j42047J55758Q7941j76183J85247o5026P8231K1315j50672Q3097
$$ plain form
108 -368306 356914 89610 -180172 195442 -39788 -3650 -277305 107518 -282967 48611
118 48611 301474 -279399 369944 81816 51551 20147 -26193 83757 -137069 -45826 -260011
129 -260011 92121 -25891 -282124 121644 280210 -107000 16250 388309 -149141 13446
139 13446 -104868 -150690 -59200 -220238 54086 -124276 263816 13060 66772 379079 -102452
150 -102452 246985 6850 -135032 -27573 -98775 -260496 -303993 124442 -195043 -108495
160 -108495 235242 183331 66943 132851 179295 -25799 86876 -183352 -33349 31765 -269457
171 -269457 -40849 28665 21134 -80585 211277 89938 -74019 237959 -70406 -90912 36444
182 36444 -47507 -189554 -33796 54145 -122038 63209 -1817 76414 97729 -52943 30154
193C0154O1850j17845j52724L33186j15286j87253K71249o4132j21986N5589O5034
204E7836j44528P7643J4825j25768J17555l2655K810N9932L5841l9340J04977
215A29128m6939j87432K28046j43918j84957J96396M6077j52914N2292K20645
225A56424j71240K4456J14093q8020M9597n8135n4585J8540m8134j20819R5459
236h2364N8243j23661J81423P6267j22376R5743Q8574j77353k741J43242j66069
247c1072l4147R8285o5254m3721K7441R773L0604L4719o4347R3939L4673j79368
259h8475O1168Q5243j45184Q787J73806q3885m7104J50521q1803p3538Q4899l0449
271A3986m8435M8780j0885l4215J9490o1295K9402Q2755q3389N4736J27538j28874
$$ plain form
193 30154 92004 -25841 -178565 154621 39335 -147918 123331 59199 -62787 -7198 57836
204 57836 -86692 -9049 5776 -119992 -2437 -35092 -32282 27650 63491 24151 129128
215 129128 82189 -105243 122803 -21115 -206072 -9676 36401 -116513 -64221 156424
225 156424 -14816 9640 123733 35713 85310 27175 -27410 -8870 -57004 -177823 -82364
236 -82364 -24121 -147782 33641 109908 -12468 83275 171849 -5504 -8245 134997 -31072
247 -31072 -65219 33066 -32188 -75909 -48468 -38695 -8091 26628 -37719 56220 90893 -88475
259 -88475 -27307 57936 -87248 -78461 95345 11460 -35644 114877 33074 -40464 44435 13986
271 13986 -34449 14331 3446 -30769 -11279 -72574 -43172 39583 -43806 10930 138468 9594
283I594o2612J23018q1340j10974J38202J9838r5834P6917K0678o2538K1315J874
295a862M232L5584k4831k946M9276q1069n2162J13082n0884n6808J49138j5812
307F4938j21464O4593J8109j22925L3923P8285m8117K2526L3883j3034J9254k3747
319F224J804O9441k9657n2411P6020l9453j34445O9502K9034j04268O8676R1566
331E2033p4694k955P2841m1653k0965M0504n840L761j2013k2232L8463k4195o1643
344e8588P0492K4517q4679N8494O5874j04656j1239P7258o6903k7567P9062n573
356A6492k9067K2803M972j5175k868j5114K9051R514n9707M7741K8645q2211J4272
369c0652P6199n3151k6419J05418l4963o3520M6812l328m4532L214L3260j6544
$$ plain form
283 9594 -53018 70000 -11340 -122314 15888 35726 -60108 16809 37487 -25051 -3736 -1862
295 -1862 2370 37954 13123 10177 59453 -21616 -73778 39304 -11580 -68388 80750 64938
307 64938 -56526 8067 26176 -96749 -62826 15459 -32658 -10132 23751 10717 29971 6224
319 6224 8028 77469 47812 -4599 71421 31968 -102477 -32975 -3941 -108209 -39533 52033
331 52033 -22661 -25616 47225 5572 -15393 25111 19271 23032 11019 -11213 27250 3055 -58588
344 -58588 11904 36421 -48258 10236 76110 -28546 -39785 37473 -29430 -56997 22065 16492
356 16492 -12575 10228 15200 25 -2843 -17957 11094 20608 -39099 8642 37287 -44924 -30652
369 -30652 45547 -7604 -34023 71395 36432 -27088 19724 16396 -28136 -24922 8338 -8206
381h206l529j1817J7572K2199n6230L5791L9948m6628j3279P1578k7020o5688
393d5309Q3842j7479m6616L6485K5585l6189k3384M3746l3729L0j0471J7378K0280
406A4169n9589M1090K9758j9107l9650O6014Q29q9538P6010K217l3940p882M2385
419B2766j3245l7780O1493l0661J2533j9044J1443J6889m9468K4944m133o096
431a0359n4670O7491J7188o8387O8473J0715k2084m3666P1744q461m7959M9657
443B9682j9570J9180o2480K8483J3416l8390K0828K493L8660o8362M3835K939
455A0714m8656L4167J9307P763n0226P7126m3057l3663K0449N463K0809p9687
467e9491R0275k5918j2998l071M702O5952j15085Q4017J933j7767o669j7418M6114
$$ plain form
381 -8206 -11735 -23552 -5980 16219 -40011 -4220 35728 -10900 -24179 47399 20379 -45309
393 -45309 38533 21054 -25562 10923 36508 319 -23065 20681 -13048 -13018 -23489 -6111 14169
406 14169 -45420 -4330 25428 6321 -33329 32685 33514 -56024 19986 22203 -11737 -19619 22766
419 22766 9521 -28259 33234 2573 15106 -3938 7505 24394 -25074 -130 -4263 -10359
431 -10359 -65029 2462 19650 -48737 19736 30451 8367 -35299 36445 27984 -19975 29682
443 29682 10112 29292 -33188 -4705 8711 -29679 -8851 -6358 32302 -36060 7775 10714
455 10714 -37942 -3775 15532 23295 -26931 50195 7138 -26525 -6076 -613 20196 -59491
467 -59491 30784 4866 -8132 -11203 -6501 59451 -55634 28383 30316 12549 5880 -11538 34576
480C4576j01976O2819j4701J045J8576k671K6964o3719O8084l4561Q683p412L0650
493B6357K2248r4204P8977l0130l389m1279N2002M2335r5898O4646k7215J7666
505A2116p0528L2094M5660n7151N7039l8089O5029o8317L4080J7013n8033Q8901
517E9814p3664N4061n9434K8753N110r7364R4597l2986L9487n0439M6666M0006
529E4607r8673L0517K0972K5427o9286N7298P749k3066k3176j3000O7441q7508
541e0698P4114l2995K2527R921o5764Q2867r7849R2367k6894k0706N6635m2317
553A208M2724j10062Q1368o09n8907K3712J9345L3808r4618O3457L972J3416l3343
566a4529J2209Q2970q9440K9127k7571L5977n2332j4951O7300p4435P0997m2644
$$ plain form
480 34576 -67400 -4581 -19282 -18237 339 -2332 24632 -39087 28997 -5564 3119 -4293 26357
493 26357 48605 -45599 33378 3248 -141 -41420 10582 52917 -42981 21665 -5550 12116
505 12116 -58412 -26318 19342 -37809 19230 -18859 46170 -22147 11933 28946 -29087 59814
517 59814 -13850 40211 -19223 9530 14640 -82724 11873 -21113 18374 -32065 14601 54607
529 54607 -44066 -13549 7423 32850 -36436 20862 28611 5545 -17631 -30631 36810 -50698
541 -50698 23416 -9579 12948 22869 -42895 39972 -57877 34490 7596 -13110 43525 1208
553 1208 43932 -66130 15238 14629 -44278 -20566 -1221 32587 -62031 1426 5398 18814 -14529
566 -14529 -2320 80650 -8790 20337 -7234 28743 -23589 -38540 28760 -45675 25322 -17322
578a7322P681N524P674L569m6262Q2902m6530J5140l9037L6224K1942q1328N9365
591I542p017N1052r5540M2652O4954j09747M3210j8321M7832n0050j043M8251
603B5775m3399K9990l6167L2676k942k135l916R44O162j7279K6308o0304O6415
616B2128l635l8499K0762J4985K7740j02860Q1428M181n1973K6210k2492N6728
628C4703n7749M222K5461O998j6083k5326O5682m7285k327J6451q40j4769J5894
641E032J0870n0272O4882k3715j4190J3338O775O224n1875L8456j1062R508k5354
654b1383K601O1764o0624l4K9544J2394m9702J7131M1442n1508J9192l956J061
667b078o179R948M586p790L1133l0331J6452j5831j1515K3991l0704n032K2907
$$ plain form
578 -17322 -9641 -4117 3557 7126 -39136 43766 -2764 12376 -26661 9563 31505 -49823 9542
591 9542 2525 53577 -41963 689 65643 -44104 -894 -19215 28617 -21433 -22476 25775
603 25775 -17624 12366 -23801 8875 5933 3798 -118 826 6988 -10291 16017 -44287 22128
616 22128 18493 -20006 756 15741 43481 -59379 22049 26230 -25743 467 -22025 34703
628 34703 -23046 -18824 6637 13635 -2448 -27774 37908 -9377 -11704 4747 3907 -10862 5032
641 5032 15902 -34370 30512 6797 -7393 5945 12720 18944 -32931 5525 -5537 3971 -21383
654 -21383 -18782 42982 -17642 -17676 11868 24262 -25440 -8309 33133 -18375 817 -3139 -2078
667 -2078 -8257 1691 6277 -1513 29620 -711 15741 -90 -11605 12386 -18318 -23350 -443
680d43J7371n7464L1305M1281n6765J3732L2145K798k6375J5562qj6680K893k2003
694b2651L2010k024k0239J8473M245k6088M503K7503l7934J9019K8896l4852m455
707a3594L1611j0277l5162L7763M018j5140M400o432J5032j7635j9226J8053K3602
720A7013l0652R07M9352l4394j5777L1242j2232k3823K7314K296k9560K7363r409
733c60k1990J3049K303O668O163J3K250J3113l1653j0562M6957k5673k3561M7822
747B4539j738m4753K1099J4631l0191R542J0790o895K547k844j0469Q934l65j2148
761a7321L2926k722j6149L4466j6649l0940K7569L240l9913J8377K8711l9454
773a7859j253K6399j7502j574J2285K259J4486o015j6097J9019p042l3074K4909
$$ plain form
680 -443 16928 -40536 -9231 32050 -24715 -10983 21162 23960 -2415 13147 13139 -3541 -648 -22651
694 -22651 9359 7335 -12904 5569 9814 -16274 -11771 15732 -22202 -3183 25713 -9139 -13594
707 -13594 18017 7740 -27422 10341 14359 -781 3619 -2813 12219 -5416 -24642 -6589 17013
720 17013 -13639 -12732 36620 2226 -13551 17691 5459 -18364 8950 11246 -18314 9049 -360
733 -360 -22350 -9301 -6998 -330 5833 5846 8096 21209 -10444 -21006 25951 278 -23283 24539
747 24539 22801 -21952 -853 13778 -16413 -6871 3919 -2976 -429 -3273 -13742 -4808 -5173 -17321
761 -17321 15605 12883 -3266 31200 14551 -16389 11180 14420 -25493 -7116 21595 -17859
773 -17859 -19112 7287 -10215 -11789 496 2755 17241 11226 -4871 14148 7106 -25968 -1059
786a059J6867l4153J5594K4189l6765J893L0603k5182k707L1573j5928r869J4446
799I502j0469j715J797q596J5283N412k6461J2912K1198m1926L660M1327l0512
812h588p226L6999j3672j8197K2229k423j5465J4649n145o218J0191j5754J263
825g357J3937k2892M203L0508k5037o245L8041k2143k4781L4110k822l0047K4425
838C900Q413k2980J1685K355o429J0016o974j208J7379j6637j3435K8731j7180
851b364k2936L5050m039k9531K7716J1494l2496J8469J6337k3731P677O086j0752
864c020M529j175p471J5844o627j9252K8517l805k7615K8125J0556l5941J4718
877b617K1378l4845O471K1172j7278j504J5224p458l224J0221j5780J3854K389
$$ plain form
786 -1059 15808 -18345 -2751 21438 -15327 -13434 17169 -8013 -10720 20853 4925 -4944 9502
799 9502 -967 -2682 -885 -9481 5802 11214 -15247 -2335 18863 -23063 -19403 21924 -8588
812 -8588 -15814 21185 7513 -10684 11545 9122 -6343 8306 3161 -3057 7134 -8620 -7357
825 -7357 6580 -16312 -12109 18399 -6638 -12883 25158 3015 -21766 12344 9522 -20525 3900
838 3900 12313 -10667 1018 3373 -3056 6960 -14 -1222 16157 -480 -13915 14816 -2364
851 -2364 -25300 9750 5711 -23820 3896 15390 -17106 1363 17700 -6031 1646 7732 -3020
864 -3020 1509 334 -7137 8707 2080 -17172 11345 7540 -20075 8050 18606 -17335 -2617
877 -2617 18761 -16084 -9613 11559 -5719 -7223 8001 543 -2681 7540 -8240 5614 8003
890H003k2583K4135K069k5423R787K1999l2713R91L6789l0322m43K2150j2660
903A779j2199J2266j367r418J7225j4350Q914O614k4163J3141J0446j7053j677
916i842L4999k7508j2267L6723k6537q873K0786K612j9307J4812L903k1625J5909
929C785j5735N288J0510j3842O585J5510j1039j8461L7947j7863j7382L5528q588
942A2243j8353R516R469l2569J3509P387j5563J8130p591M897J622l135q210J9219
956A0571j645k5269M0845j7682k1796J7470L658k1264K196L3138l2644J4146Q333
969A0057j7401J1042q688N518J6R272j6084J3456L719l2571K8553l147j6912J0045
983c125K2137k8838l074L1163l3887R733Q498L923m335K666N292j4728J8821l2251
$$ plain form
890 8003 -14580 9555 11624 -13799 -4012 17987 -14726 -13735 23054 -7268 -7711 14439 1779
903 1779 -10420 1846 479 -8939 8286 -6064 2850 9464 -14699 -1558 8888 -8165 -9842
916 -9842 25157 -2351 -14618 22105 -4432 -13305 7481 10093 -9214 5598 9501 -12124 3785
929 3785 -11950 -6662 3848 -9994 -3409 12101 1062 -17399 20548 2685 -14697 20831 12243
942 12243 -6110 3406 12875 -19694 -6185 1202 -14361 3769 -3822 1075 2697 -438 -8648 10571
956 10571 8926 -16343 24502 6820 -14976 2494 6152 -15112 -12916 20222 -12422 1724 10057
969 10057 -7344 3698 -4990 528 544 9816 -6268 7188 10907 -21664 6889 3742 -13170 -3125
983 -3125 19012 -9826 -12900 18263 -15624 -5891 2607 6530 2195 4861 10153 -4575 14246 -18005
997a8005K1807Q677l1352K4423k429p933j3507K9786j6736j0142L8607k7095M552
1010F53O093k192j2763P157N857j1626J8405k0693J5139K578k0575P910J4214
1023A0157q619k2044M0869k0610j6580K2386p124l141J72J8331k0301J6589m044
1036F041j5498K1058k2023J1151j133P2n740J0719O86k8382M2323j6958j5027
1049a2711K2865J314j5717o167K3193k2763P316P38j785J2134j4331L455O000
1062C541O141k4828K2950K575k6121K6261j0174l496M97J3893j7822k221K8241
1075A9437l1315J1195K541k317j030o833R272j590P955k1396K3470N641k9041
1088a4011J6449P963r799j5380K5827j2746r055J9104j5941J0578m31j027l308
$$ plain form
997 -18005 3802 12479 -18873 5550 3121 -4812 -18319 11467 -5269 -15411 23196 -3899 653
1010 653 6746 4554 -8209 -1052 4805 -6821 11584 -9109 6030 8608 -11967 -4057 10157
1023 10157 1538 -20506 20363 -247 -16827 5559 -1565 -4706 -4534 13797 -6504 10085 6041
1036 6041 -9457 11601 -10422 729 -404 -332 -6072 4647 5333 -23049 19274 2316 -12711
1049 -12711 10154 11468 -4249 -10416 12777 -9986 -2670 -1932 -3717 8417 -5914 -2459 3541
1062 3541 9682 -15146 7804 10379 -15742 10519 345 -3151 -2654 11239 -6583 -8804 19437
1075 19437 -11878 -683 1858 -459 -1489 -8322 950 -640 7315 -14081 9389 15030 -14011
1088 -14011 2438 10401 602 -14778 11049 -1697 -10752 8352 -7589 2989 2558 1531 -1777
1101a777O612k318p919J2898j7514J1273O71j5398R392J4924j1564j1711L4531
1114B2100j8584j2727J5519k098l310p188J0342p648M642q875p81J9701j8897
1127g804N622J0772n864p946J1258l740j3644K1174r864p321J1902L370j3934
1140f019O10J4084j4675N139j843L746O598j4720M341R099l374j5812K0929L939
1154A2042k1154J2996j06j0013k061J0194p324L285J1073j3932R001k764k097
1167h60M795m190K541K663p52j5524J3112L515k1120J3921J2144j2497k849J3960
1181H859q137o627N404j635L606j457J35K156J752p542K817P876j2591Q805M720
1196H141j3287J850P371j0410o852J7966l313o757R892J610m740l355K353J676
$$ plain form
1101 -1777 4835 2517 -5402 7496 -10018 1255 1926 -13472 -4080 10844 -720 -12431 22100
1114 22100 3516 -9211 6308 4210 900 -6288 4054 -3594 1048 -7827 -8608 11093 -7804
1127 -7804 -2182 8590 2726 -5220 6038 2298 -11346 9828 -36 -7357 4545 7915 -6019
1140 -6019 -5409 8675 -6000 -861 -2704 1042 7640 -7080 -2739 6360 2986 -12826 8103 12042
1154 12042 -9112 3884 3778 -6235 -8296 1898 -5426 -2141 8932 -5000 4001 1237 -860
1167 -860 3935 -255 2286 4949 4197 -11327 1785 5300 -15820 -1899 10245 -2252 -5101 8859
1181 8859 722 -5905 -501 -2136 1470 13 148 2304 4056 -3486 -669 7207 -5384 3421 8141
1196 8141 -5146 -3296 4075 -6335 -13187 4779 1466 -5291 4601 6211 1471 -1884 469 2145
1210B145J986p934L747Q310j6292J354J0654p192k589J1662j451q752R596k504
1224B740r573P264L177n842L103K296k004n70p110N681M376q933J624J0074l283
1239C020j3047J3337L507j3682R459M054m681j096R55k470l485J611j963L266
1253a215N20p57M884m306k070P908j991q191J0737K259j4583M224P080p624l664
1268f789R053J710n052J780L99J528l815l732P626j155o858N814K606p525L322
1283a088N852o246K36P647n783m930P654k170n531K786K756j18l518J424N228
1298D199k411o290N201M884r783r0R104n037n257P863L85n634L945J061k501j60
1314e21J374K0k254N34J231L6l426L124N178o991m92P578m777p283P334K490p654
$$ plain form
1210 2145 4131 -3803 -56 8254 -8038 -6684 3970 -3222 -5811 5851 4400 -4352 5244 2740
1224 2740 -6833 431 3608 -2234 869 3165 1161 591 -6519 -838 3538 -5395 -3771 6303 3020
1239 3020 -10027 3310 6817 -6865 2594 6648 1967 871 1826 -644 -4129 -2518 -4481 -1215
1253 -1215 -695 -1452 3432 -874 -2944 4964 2973 -5218 5519 7778 -6805 -2581 4499 -3125 -6789
1268 -6789 2264 3974 -1078 702 1101 2629 -1186 -4918 2708 1553 -5305 509 3115 -4410 -1088
1283 -1088 4764 -1482 -1246 6401 618 -4312 3342 1172 -4359 -1573 1183 1065 -2453 -1029 4199
1298 4199 1788 -4502 699 5583 -4200 -4290 4814 -223 -5480 2383 2768 -2866 1079 2140 -361 -521
1314 -521 853 873 -1381 -847 384 420 -3006 118 5296 -1695 -2187 5391 614 -6669 665 3155 -4499
1331d499K356N586k434l757L753J598k378j039J256K911n916J66M716m450j273
1346c404M914J804n606M249L754p874J06L696k446l968L584K859l255r02L122
1361F33K614m635J151N838k244m860K864J857q407J128N310k976j393M724J069
1376B673n108K091K342j759j849L008K042m616K82K215m89n107L757M817o015
1391a716J326K889j522o141L173M288n147L276K643M11m914J125L209n325J242
1406a183J911J805n477J063L714n669J074L472L595m888K542L471p207m37J290
1421i24K562m732K522M217m856m57J086K864n079K180L751k992j338J18L456o664
1437d286K227M648j205p31J235M192q929J625K697l351p64P51M701o701K317K727
$$ plain form
1331 -4499 -2143 3443 1009 -2748 1005 2603 225 -814 442 3353 -2563 -2397 2319 -2131 -3404
1346 -3404 1510 3314 -2292 1957 5711 -2163 -2057 1639 -807 -4775 -1191 1668 -1587 -2489 633
1361 633 3247 -1388 -237 5601 3357 -1503 1361 3218 -5189 -4061 1249 -1727 -3120 1604 2673
1376 2673 -2435 -344 1998 239 -1610 1398 3440 -1176 -894 1321 832 -4275 -518 4299 -1716
1391 -1716 -390 2499 977 -5164 -1991 2297 -2850 426 3069 3480 -1434 -309 2900 -2425 -1183
1406 -1183 728 2533 -2944 -1881 1833 -3836 -2762 710 4305 -583 1959 5430 -1777 -2214 -924
1421 -924 1638 -3094 -572 3645 -1211 -1668 -582 2282 -2797 -617 3134 142 -1196 -1078 2378 -4286
1437 -4286 -2059 2589 1384 653 1888 6080 -2849 -1224 1473 -1878 -2642 -1891 2810 -3891 -1574 1153
1453A153j150o91M35O123n520M14J644j540m670K76N992n649K516K739j39m537
1469b604J509M578o111L454L88J249m002l70M750n427J675L81M335n057n60O309
1485D497p195L2J570L635n221K489N111o393K482j029K619l947L66K980l580Q04
1501g80k416N861n773J91O706l286o8L16M677q739J323M445m566J269p72M354
1517B742n144J221K853m46N61l467N974n341j740L334n25k385k46O305o748K165
1533h87M130k247j387J414K682o152K202n89R53j466j602O646l955j025N37M551
1549C805n107j676Q569p458J55J545N46k243Q22M037m556L338j474J016r48k182
1565a811L194k459p96L73N338n700n43O734m850j633K504M107o803J154L485m312
$$ plain form
1453 1153 3 -688 -253 5870 350 764 2408 868 -3802 -3526 2466 -3183 -667 2072 1933 -2604
1469 -2604 -1095 3483 -2628 826 1214 2463 -1539 -1909 2841 -2586 -911 -530 3805 -1252 -1812 4497
1485 4497 -2698 -2666 -1096 2539 -2682 -193 4918 -1475 1007 -22 2597 -1350 -984 1996 -1584 -780
1501 -780 -3196 2665 -3108 -2917 3789 503 435 751 5428 -3311 -1988 2457 -2109 -840 -1612 2742
1517 2742 -2402 -1181 1672 1226 1787 -1680 4294 -1047 -2787 547 22 -2363 -2609 3696 -3052 -887
1533 -887 3243 996 -391 1023 3705 -2447 -245 -834 119 -1347 -2949 3697 -258 -1283 -746 3805
1549 3805 -1302 -2978 5591 -1867 -1712 -167 379 -1864 -1042 2995 -1561 1777 303 1319 371 -1811
1565 -1811 1383 -1076 -1872 -1499 3839 -1861 -2404 4330 -520 -2153 351 4458 -2345 -1191 2294 -2018
1581b018J520k018M171j055j178J729N67n97m514N845l610j973N201j572k253
1596a755J551M107p023K831M159m285K84k87K070l655q28J203K179p28l160Q067
1612D730j704m868L125J892m694n58N228m609K88J375j981k18J318J379j016K364
1628B051j230J168j807l045M398j314l082K767M906o596j014O599m729j742K988
1643C18K045l249K74J024j776J924l011L529J539l156K127K39k405k029M460l681
1659a828j743O871l450k367L699R25l916J381K797j502k07j436J451j71l393O62
1675b227M586k405k816O720k739l688L576k82k864J397L041m057J584K032k909
1690a051J280l38J018N57j688j09K143k516l985N616N8m636M280L201m571j03
$$ plain form
1581 -2018 -498 -2516 1655 600 -578 1151 1718 1121 -3393 2452 -1158 -3131 2070 498 -1755
1596 -1755 -204 3903 -3120 -289 3870 -415 -131 -418 1652 -2003 -2831 -1628 551 -177 -3337 4730
1612 4730 3026 -1842 1283 3175 -1519 -2077 3151 -1458 -1170 205 -1776 -1994 -676 703 -313 2051
1628 2051 821 1989 182 -2863 1535 221 -2861 -94 4812 -1784 -2798 3801 -928 -2670 318
1643 318 2363 -886 -612 412 -1364 560 -2451 1078 2617 -539 1588 1827 -578 -2607 1853 -1828
1659 -1828 -3571 3300 -150 -2517 1182 2107 -1809 -428 2369 867 660 -776 675 504 -2889 -2227
1675 -2227 2359 -46 -2862 3858 1119 -2569 1007 725 -2139 -742 2299 -1758 -174 1858 -1051
1690 -1051 229 -109 909 1466 -222 -331 1812 -704 -4689 927 985 -3651 629 3830 -741 -844
1706h44L771l350m13J880j226L32l84q44O04j56j178L043N14l165L376N72n517
1723b985J676M279m969k66N077k728j840J885Q69j068J11N6L42Q79l682K340J825
1740A801m308K070K613k739m36M037l161k348M797k245k515K914N79k408O09J294
1756E54l4N80k399J938J813m478M03L989k582l207N116l49l786L632J37k318J682
1773F91N76j856O17Q9j643J052l26M74K018j933q51L528k028l449N433k1n253
1790b882K699K141l640j94L133j161j31O64o83J461j454j554K231n06k266K894
1806G52N91l404K701J258l816J833L026l784m72L308k262j296J222J33K5l72o3
1823f20K262R8l709K522J532m474J570L345k815j381L423k197j630L248j239n56
$$ plain form
1706 -844 2927 -423 -836 1044 -182 150 -234 -1078 -474 -630 -1808 1235 1749 -1416 1960 2532 -2985
1723 -2985 -1309 2970 -1999 -2265 2812 84 -1756 129 998 -70 41 97 439 1318 -2364 -24 1801
1740 1801 -2507 -437 2176 -563 -999 3038 -123 -2471 2326 81 -2434 480 1059 -1349 -740 554
1756 554 520 1100 -1299 639 2452 -2026 -1623 2366 -216 -3423 1693 1344 -2442 1190 1327 -991 691
1773 691 1267 -589 28 117 -1526 -474 -800 -326 1692 -241 -1092 2436 408 -3041 2392 2371 -2882
1790 -2882 -183 1958 -1682 -1876 1257 96 -35 629 -54 1407 -47 -1601 630 124 -2142 752
1806 752 1343 -2061 640 1898 -1918 -85 2941 -843 -1315 1993 -269 -1565 -343 -210 -185 -557 -620
1823 -620 1642 1740 -1969 553 2085 -2389 -819 2526 -289 -1670 1753 -444 -2074 1174 -65 -621
1839f21J358j67q87L42m62qJ346k299K015K299m054J19L044k841k284M589m69
1856A020l129K607K12j615O28P84o7O82q02j30J425k653m17K276j942r32L846
1873A793q78k970L466k94l206K190J820k258J00J272j513K19o37L15J728j495
1889c48l35K322p42l274L036L63l599L010J278k461J45K085k021n35K325j312
1905f3M20l28l40Q60r95p98J675N40l129K932J427l664J305J792k409j049L358
1922A534j325r51J807j148n0m36K16N29K88j211Q15J451l659J760J903k616M27
1939f66K810j216k588L119j289j858J801j1j02l94M08k12M97r81O09K093k792
1956g72N15K011k039j521K824o45k653L077Q8j686P45R34j070j55P44n45J104
$$ plain form
1839 -621 737 570 -317 25 -437 -445 901 -1398 617 2916 -1138 -1019 2025 -816 -3100 1489 1020
1856 1020 -2109 498 710 -905 -277 507 440 1122 320 190 1615 -1038 -1455 821 -1121 -2053 1793
1873 1793 915 -2055 1411 1117 -2089 101 1921 -337 -237 1035 -478 -259 -896 -581 1147 -348
1889 -348 -683 1639 897 -2377 659 1022 -2577 433 1711 -750 -605 1480 -541 -1076 1249 -63
1905 -63 357 29 -311 549 -446 -1244 431 971 -2158 774 2201 -1463 -158 1634 -775 -1824 1534
1922 1534 209 -742 1065 -83 -133 -569 -353 176 464 -747 68 1519 -2140 -380 1523 -1093 -666
1939 -666 2144 928 -1660 1459 170 -1688 113 102 0 -394 14 -198 299 -682 -73 2020 -772
1956 -772 -257 1754 -285 -1806 1018 373 -2280 797 885 -801 -56 878 -192 -347 397 -148 956
1973I56j807L44J561j974j07K085j63k839L058J17l072K298M33j236n31J855j082
1990a04o28J267r22J259j342R5J343j351p88J555Q45k997K379J055k911R14J404
2007A073j100j122K152r40p55O59n50R24q20L31R95J5j618J026J250l360J600
2024b40J475k063k01K095p96j921K507o39n36O84q9N21j076j33K51N98j623R29
2042b57J959k511M24J700j245j488K173k11j839J731m4p37k26Q15k25k28M26P7
2060B94J025k046M72J272k058j34J870J0k220K172M41k279J042O77m47m67J075
2077F99m00j50l23n32J311j353N22J354p78j178J078M15k693K167J027j811O42
2094cR18n24j399J305P4m20j05MJ009j524m05J214L0j204J283J375k113N05R88
$$ plain form
1973 956 -851 -507 1054 -920 -1027 1058 895 -1944 1114 1231 -1841 457 890 -346 -877 978 -104
1990 -104 -732 535 -387 872 -470 -375 968 -383 -1171 384 1229 -1768 611 1666 -1245 -331 1073
2007 1073 -27 -1149 1003 63 -692 -33 -583 341 -479 -148 847 862 -756 270 1520 -1840 -240
2024 -240 1235 -828 -1029 1066 270 -1651 856 217 -319 365 276 797 -279 -412 -161 437 -1186 -257
2042 -257 1702 -809 -385 1315 70 -1418 755 544 -1295 436 392 -345 -571 244 19 -209 217 294
2060 294 1319 -727 -255 1017 -1041 -1175 695 705 -1515 657 1098 -1181 -139 538 91 -376 699
2077 699 299 149 -174 -706 605 -748 -226 1128 350 -828 250 665 -2028 139 1166 -645 -3
2094 -3 915 391 -1008 297 371 -49 -154 -150 859 -665 -1070 144 174 -1030 253 1628 -485 20 1008
2113A008j302m25J239k63j080J067j29l81j63M04M46n78j33Q92M93k145Q69J218
2131A037k180L05J690j55j561J291L20j617Q43J21J01l29j34N06l42l79L85O89
2149E91j169N53J177j228m60J203l10j739J497N76j195K23O71J21j111M58N48
2166D06k19n26J66J240j384l14J076n04p76J072Q22j688P38M37j256J43P66K70
2184D69r01N70K04m57j89J19J128j085n09J292l79j198O67J038j294j4J277m36
2202C02o66O15K01p46K33K11%n75Q2P78o79j68Q48J80j236M87J182j306l47J122
2222E18k71j068N91O94o94j08M47L02n37O1N53k99n75J84P07r81J67J134j022
2241a97m54Q69K36j049N18R69r89l86O48K57q01q8R21r8o64J63Q42j000l89R73
$$ plain form
2113 1008 -294 -719 520 257 -823 244 115 -266 -429 -25 421 -157 -290 602 1095 -1050 -181 1037
2131 1037 -1143 -838 852 697 -864 427 747 -870 -27 94 195 -134 -268 238 -104 -483 -98 591
2149 591 -578 -25 1152 -76 -536 667 357 -1382 115 691 -504 -281 390 511 -600 -142 406
2166 406 187 -339 -173 1067 -317 -631 445 -59 -835 237 1059 -629 109 546 -710 -567 199 469
2184 469 -432 138 342 -115 -304 -185 943 -142 -651 641 262 -936 -269 769 -525 -539 738 302
2202 302 -364 251 452 -294 -61 150 150 -425 -343 435 -244 -412 436 616 -620 -133 1049 -257 -604 518
2222 518 247 -821 -230 464 -230 -338 109 411 -126 -65 488 189 -386 -202 505 -476 -309 825 -197
2241 -197 -651 218 454 -595 -77 892 -97 -483 165 422 -379 -467 454 356 -308 -145 697 -303 -692 281
2261B81q1n24L23O45j053J01P23n53n6M48K12q03N7O24l73n42L21R28p62m24J036
2282E28O0j222K29J098p96l58Q78K7p34m2O25m26m9L98M7k09j55L75n30l17P03
2303A30J37n89L53P42q19o74R37K55r50L89Q81p06o96L52M92o43m6Q62L7n90j5
2324a61O42o65k31P37j09l52K29L38r52J17P27n12j59N79M02q94j3O42l06m92
2344d33K62R15p21m98P58Mq06K9R75n54l07P00o6n44R3N11m09m4M53j02m15Q1
2366a18M13m73k58O03K44p03P3Q71p06m93P07K97q06J59P90n66l68L19K39m20
2386a96r5O30j44l97J13L96n66j80P98j88n16M23M14r11Q6P56m37l59N03L55o95
2407b10j8L81l4m49R6P85n95k90N41R2o75J20Q81p73o4O04k25m90K01M99o14J2
$$ plain form
2261 281 200 -324 -1 644 -409 -308 415 -138 -194 254 466 -337 -280 344 -29 -571 -250 678 -84 -508 528
2282 528 588 -634 -405 693 -103 -461 417 444 -290 -332 293 -133 -182 216 263 54 -101 274 -256 -573 130
2303 130 267 -322 31 773 -46 -720 217 472 -478 -89 792 86 -610 -258 234 -409 -455 407 444 -146 -161
2324 -161 481 -184 -415 322 213 -139 90 428 -524 -407 320 -192 -351 228 630 -264 -277 365 59 -433
2344 -433 -171 744 23 -475 283 287 -519 -490 485 -69 -376 324 258 -286 -193 318 -91 -135 318 216 -199 -118
2366 -118 295 -178 -436 167 411 -292 -219 652 -54 -547 160 457 -349 -190 600 34 -334 -15 224 -196
2386 -196 -291 339 195 -202 -89 307 -259 -439 359 171 -345 78 492 -419 -333 423 -14 -373 130 485 -210
2407 -210 -228 153 119 -330 -234 551 -44 -334 207 299 -376 -256 625 -148 -212 392 167 -323 -122 377 -237 -225
2429b25M08kl27j39O75l97l67N32K87p06j37R29o45l16O71N1o48J43O15n03m6
2450a47L28P5m04j22M84j67l46K68N33o71k13Q46l50n63N27M15p81J14N55m21
2470d0k61K01L98m11n6L91m2m50n2P67n51l12Q00j07o23K24O91q73J1O30k73k47
2492a85J37L65m94j19L07J95k70j40P42l88n31M45K53p21J00Q66p25j61N35m3
2512A68n57J74N63l92L8J15J63l89l55O72j23l97L21N53p88k22Q72n06l57N77
2532A30K11n33Q5M44m31q7N9L69j58k68N22n2o32m2P13n64j84R05j84o85M14L51
2554C83p38J51N12j25k32n0K69l87j68K96L75l14k16P98o06m25N67J68n57K17
2574h2O81q14JM13j44k12M0M13k96r2L2L41l79m39Q93k05n38N75L74q12o5P35
$$ plain form
2429 -225 183 181 -146 -285 390 -7 -374 158 445 -261 -398 531 -114 -430 241 292 -356 -213 402 -101 -147
2450 -147 181 256 -148 -270 214 47 -299 -31 502 -169 -382 464 114 -449 78 493 -288 -174 381 -40
2470 -40 -301 -100 298 -113 -169 222 180 -270 -322 445 -106 -418 382 275 -348 -124 567 -306 -295 335 62 -185
2492 -185 -48 317 -177 -296 11 206 -64 -204 538 150 -381 64 317 -404 -304 562 -163 -324 211 168
2512 168 -389 -215 348 -44 -6 109 272 -117 -472 200 77 -320 1 554 -234 -456 416 -90 -447 130
2532 130 341 -192 -107 337 -94 -181 -122 247 89 -179 343 291 -341 -383 330 -234 -418 487 303 -382 32 383
2554 383 -355 -204 308 183 -49 -99 170 -217 -385 -89 286 -28 -244 554 -52 -477 90 258 -299 -82
2574 -82 599 -215 -214 199 55 -157 -117 296 0 -92 -60 281 -98 -537 356 151 -387 188 562 -250 -315 420
2596D20n57k16N32J7l02l4K88k19r6J8M65j99m10N64q3o11K17O41o72r7Q62m31
2618I7m19L82K81n09k1M14j69j56j34M57j01m93M14L31n38o8Q02n80m77O89j24
2639G8m76L62L88n28L0L07j12r0j28M27j35m13K21M28n74k63Q97k92n16N67K01
2660C79n89K1N67m63j12K32L1r4j89L86m2k49KM50k96n13Q34j54o15M35L55n83
2682b07k12Q52m23k70L67O6j35l32L30P8k66p6M73J5o85N75J84o88K23N61n03
2703g3k73O69k86l67L15K10k02j16L04J00l05k54M75n8n89M49M21n71j39O64l76
2724bm06N89M1l90J20L22l27k00K07O9j8k39M25J47o39J92M27m33l41P71o7o12
2746c64M67K08m89m9M99j98q5Q2P2q5l61K58J58k75N6N00k65n23O50r5o12M20
$$ plain form
2596 420 -137 -353 179 196 -106 -140 148 -71 -167 -149 316 117 -293 271 188 -423 -206 435 -237 -334 528 97
2618 97 -322 60 341 -168 -189 225 56 -100 -234 223 122 -371 43 374 -164 -232 570 -10 -487 202 78
2639 78 -398 -36 352 -176 -146 161 49 -41 -169 258 123 -290 -69 359 -215 -478 419 127 -389 178 379
2660 379 -210 -189 378 -85 -197 35 66 -28 -217 169 127 -122 -120 330 34 -479 355 201 -414 21 376 -207
2682 -207 -419 433 10 -260 107 173 38 -294 36 114 -152 -228 245 260 -425 150 334 -354 -131 430 -73
2703 -73 -346 323 37 -330 -15 195 -7 -123 181 281 -24 -278 197 139 -450 -1 420 -151 -290 374 -2
2724 -2 -408 181 222 -168 -48 274 -53 -253 -46 23 5 -234 191 338 -301 -109 318 -115 -456 315 248 -364
2746 -364 103 311 -178 -227 272 74 -11 71 143 58 -303 -45 113 -162 -106 394 129 -394 256 161 -451 -31
2768c1M51m86k11N17j86l36J08L02Ql37K53K13k92l27M63J12o29N55K16n03P1
2789f9L24k96k79N26n3l29K44P7j60k76K04L14j99k49N48K2p29K15N00m70k69
2810d04P03r5m89K78J29k39m1K40K4j22m1J60j04l12L96P8l90J62M72l90m03P19
2832C31j57n46L16L68l07k56M03rk45n5K69J24m31J72L16l79k49M92p1m05M80
2853A61M8m15Q9L25k74j75M03k1k58mK50J3l98J95L91l64k77N44O0o77L39L78
2875C33m32j17M50r9k78K05O8j58r9J64P5k60M4K69j09l60M06J62n44J92M14l64
2897c8k75N41q9m39J79L24k14j85K71J07k41j18L31J1m36K63K11l11q8M38j43
2918I9m16M55Pk86P7K95j17l10K47M5j91j34L29J45n06K17K86l10k43M30J02n18
$$ plain form
2768 -31 420 -66 -277 240 54 -282 -174 128 136 -201 52 265 -27 -354 109 221 -408 147 363 -140 -69
2789 -69 255 -41 -320 206 153 -176 68 145 -15 -291 -87 227 28 -221 327 349 -380 -165 335 -135 -404
2810 -404 299 204 -285 -7 122 -117 -158 82 106 -16 -57 103 -1 -313 83 161 -229 -67 405 15 -388 331
2832 331 174 -372 -56 312 5 -251 152 143 -102 -157 112 236 -195 -23 293 -86 -335 157 86 -319 161
2853 161 209 -206 -117 208 -66 -241 162 141 -117 -121 129 142 -256 -61 330 -34 -311 233 293 -384 -45 333
2875 333 -99 -216 234 135 -143 62 130 -28 -127 37 112 -148 -104 165 56 -304 102 264 -280 -88 326 -38
2897 -38 -313 228 139 -300 -121 203 -11 -196 75 182 -59 -177 154 165 -271 -8 203 -108 -196 242 99
2918 99 -317 138 145 -141 -64 231 114 -196 51 96 -95 -229 100 245 -261 -44 242 -68 -311 119 221 -297
2940b97L36K05m14j9L09n0k14J93J22j88j95K38J26l43O1L88j68l26M21M3m75
2961b47J48L41k38k07L88l0l12N4J52j6k04K72J63k73j50K70k3m11L45K61l99
2982a16j0L57k24l20L64J29k84L7K40j01k91J57J40r4j70L34P3m20K08K05l10
3003i6j76M47J9m44L48Q0k43j53L17Lk66J96J31j30k52K04J46l49J55L18j68l32
3025b45L20Q9m66K24K31j21k05K79K5k99Q5J65J3j93J40J83l15r2K71j4l82L12
3047EK69l78J0L37j87k87K74N3j45m3K12l6k98J55J60j14j29K89M6m53K30J82
3069A52k41j38L77%l71K73J09j92j21J86J04l05J34J41p1k00J93K04m08J34K57
3090B17j72k77K80J02l84J91K03j93j28K57M3k59P3J56nl06K16J80l64j2K55J9
$$ plain form
2940 -297 39 244 -170 -189 120 70 -144 49 171 -17 -212 26 152 -191 -130 258 90 -236 185 228 -247
2961 -247 -99 242 4 -203 185 155 -157 -103 49 33 -171 101 264 -9 -159 111 88 -323 22 283 -116
2982 -116 -126 231 7 -313 51 180 -104 -67 173 72 -219 -62 78 -16 -186 148 221 -199 9 214 -96
3003 -96 -272 175 194 -250 98 178 -65 -218 99 102 -164 32 163 33 -219 -15 131 -218 -63 255 87 -245
3025 -245 75 164 -302 -78 153 32 -173 106 131 -168 -83 82 95 -98 42 225 -90 -182 89 75 -307 5
3047 5 274 -104 -94 243 56 -231 43 96 -49 -92 120 84 -214 -59 101 -13 -142 147 193 -260 -30 152
3069 152 -89 -227 150 150 -221 52 161 -31 -152 34 138 -167 -33 108 37 -163 30 234 -174 -40 217
3090 217 45 -232 48 150 -234 -43 160 -33 -161 96 139 -120 -47 109 104 -202 14 194 -170 -182 73 92
3112I2l53L04J64l54O0K00o1k07J22J71k75L1J72J8k06P6K57k34j41K85Pk89J39
3135b2K71l34n7K71k4l12K27J40j70j07J68L3k21K2K10n4k18K17J53l49Q9K29
3157A62j55j83K45O6l23J59J43j38j21J81J20k36N7J47l5k65Q7K96l26K2L15r5
3179A23l34K05J75l19J10J85k7k24O0J11j82LJ38J03k12M3K41k58j51K55M2k74
3201a87J66K08k94m5K23Mj89J28J98k06n8P0O6k05j5K70q2j48J82J12l45L2K75
3224A60j81r2K31Pk68J6K11r4q3J30J55k31r8K21p2j89J19K39k71l5L01j40j84
3247a48J97J27k67M3J65p7j42P5J48j83o8J94R7k36N0K86l16j22K40L2k43J29
3269a9K43l11m8J71L2j08jJ72j24j19P6J23j75n2K84j25j25K04N2l07M3K83j86
$$ plain form
3112 92 -261 43 207 -147 -87 113 52 -155 -33 138 -137 -106 66 84 -122 -46 211 -23 -164 121 128 -161 -22
3135 -22 249 -85 -142 129 105 -207 20 160 -10 -117 51 84 -137 -115 95 41 -177 40 193 -156 -67 162
3157 162 7 -176 69 135 -188 -29 114 -24 -145 36 156 -80 -23 124 89 -176 -89 207 -119 -97 218 123
3179 123 -211 -6 169 -150 -40 145 118 -106 -46 65 -117 -114 24 127 -85 -42 199 -59 -210 45 87 -187
3201 -187 -21 187 -107 -152 71 75 -114 14 212 6 -52 18 84 -121 -136 134 52 -96 86 198 -147 -115 160
3224 160 -21 -113 118 125 -143 -127 84 -10 -93 37 192 -39 -137 84 12 -177 -58 181 -90 -125 176 36 -148
3247 -148 49 176 -91 -48 117 40 -102 -27 121 -62 -130 64 161 -75 -25 261 -55 -177 63 95 -148 -19
3269 -19 224 -87 -135 36 68 -40 -41 131 7 -112 -36 87 -88 -140 144 19 -106 98 150 -157 -114 169 -17
3292a7j19K44j7j74j0J95p2r8O8J85j89j37K37rk74J36K23k55k5K82r8j87J39
3315B8M2j56RJ48q7q7L8J97j58j08K37O1l19Q6K53k24j08K42nk18R7J59j43n4
3339g0J32J8r1p7J44j2j36J06J08k25lK52j58j43K53M8k65L2K10j90o9J04J23
3362I1j48p7K31l5j59K7K23j81j23K41k8k04J41J23j89PJ92r8p3P5Q4j44p0J42
3386D8J5j76O7K05j17k05K51Mk53R1K37j94j03J86Lj84O8J46o0m9M5M9j46r2K15
3411E1l8j41J47J06k13k0K65j86p4J66O9j73k5J67q0j42Q1J49o7j14J79J0k40
3434a23Q3J64j54q3K43o7j78Q0P3j26nK00m5j09%J11r2j17J83N6j46qK12j57j27
3459a32K07qj40M4J67j32o2J22k0n9m0J49m2j48J21P0j73o6K47p3j61J94N6k25
$$ plain form
3292 -17 -136 108 91 -83 -93 102 30 -68 0 185 -4 -141 96 87 -187 -51 172 -83 -108 174 76 -111 28
3315 28 70 -86 -77 71 -16 -103 -65 132 -26 -134 103 164 -155 -69 184 -40 -148 94 89 -129 -32 127 -16 -70
3339 -70 62 80 -11 -88 56 44 -92 14 122 -103 -106 146 -12 -155 98 146 -119 -87 123 -67 -136 -32 91
3362 91 -57 -134 97 62 -97 -70 153 -28 -151 90 62 -142 -1 122 -67 -60 132 34 -39 36 120 -24 -94 48
3386 48 63 -113 -46 159 42 -163 88 92 -161 -70 167 -27 -130 56 59 -125 -57 89 29 -20 25 74 -72 -164 51
3411 51 13 -128 19 125 -88 -108 157 -29 -103 63 132 -41 -66 101 21 -121 -40 109 42 -72 107 117 -123
3434 -123 -40 124 -30 -113 130 63 -115 -35 38 -88 -93 107 62 -47 -47 64 -28 -145 38 94 -52 -60 152 -5 -132
3459 -132 75 67 -73 -29 138 6 -56 66 46 -13 -53 96 54 -94 27 97 -76 -142 105 32 -129 65 121 -104
3483a04PJ76q9p3Q8O8j08n1J02l2o6L7J60j19q7K02n5j61O6J42j44j9J59n6j20
3508g7N6J21q8o9J63l8q6p7J92r3j25J66M7j56L1J64j28j14J74j6q5J4R1n7j31
3533a21J27L1p7n1J71m9j61J23P1j12k6J97r1j18J33K9j12j3J08k5n6K6Q5r2q1
3558h4J71k7j35M8J18j31o8K20m1j69P6P1p3l9J29l2p8j2R9l9j11J33N8j27k5
3583f8J80r3p4J18jj25L0J21r5p2Q9N8r9j3J27l4r1N0O1j01n8J81l6j55P8O8l2
3610A4j03J70n9j50J52L9n4q9J13j1j12O7Q5q1p2J26M4j43P2J20j76n8J75j8r3
3635d2N2M5k3r0Q6L5o9OJ11j01j20J20K9j01RJ37o7j10J12j9n0k0J42o6j01J09
3661A4K7j12l5J41J9j33J11N9r7l4R9Lj57J38L7q2m0J11n6q2N9O2m8m8J20Mj86
$$ plain form
3483 -104 -97 79 -10 -83 5 73 -35 -86 16 -16 -82 -45 115 -4 -91 111 56 -105 -39 103 -41 -60 99 43 -77
3508 -77 -21 100 12 -57 106 68 -18 -95 97 4 -121 45 92 -64 -33 131 3 -111 63 47 -38 -24 67 10 -121
3533 -121 6 37 -40 -91 80 31 -130 -7 64 -48 -74 123 32 -86 47 76 -36 -49 59 34 -22 4 89 -3 -84
3558 -84 87 60 -75 -27 91 -40 -108 112 71 -98 -22 49 -24 -63 66 34 -44 -56 43 4 -107 26 84 -43 -68
3583 -68 112 19 -55 63 62 -63 -33 88 -7 -79 10 68 -31 -44 83 49 -42 8 69 -32 -90 91 55 -100 -22 46 14
3610 14 -89 81 22 -128 24 63 9 -80 33 22 -90 -23 62 -19 -91 35 79 -64 8 128 -48 -106 69 51 -42
3635 -42 10 55 32 -58 28 63 -6 0 111 10 -110 10 39 -62 -53 84 17 -93 19 0 -50 -70 72 6 -95 14
3661 14 41 -71 -106 35 54 -79 32 91 -6 -40 59 62 -95 43 80 -2 -42 69 13 -69 -10 52 4 -44 76 80 -106
3688a06R0P7p8l9J17j9j47Q5P3q4o4J36K0j06K0N8rq4Q9O2j50N1P5r2m8J15K8
3715G0j30O1Q8n1q9N5N6q5j1P7j1p4K0R7j02n0J36j9j04P8K6r3kR5k7p6O0M5o3
3744b3m6J08j6r4L4J17r1p8J60k4j47Q1J01p7m2R7Jj29N4M8m9l1M4P5j02J8P6
3771F5n1p6J02K8j38L4R7p6o9Q7N5j16NQ9m5k9PR4j05j4Q1Jr7O6O0j03k2J18k3
3800B5p3L7O4q0k5R2j4q8N7R0r0k6P3kj16L2J03p0p5J31j2j07J6R0l1m6O9J0p4
3829d0j3R1n8m3M2N0p5K7R4n0q3P9L2j23K8R6m4n1N7M7q1l2Q9K3j02J2J28j48
3857d8j4J04kj04N7R1j17lO3j4p4J8P1m9j9P1j1q2K2J06p7n6J19J8j42M1J09j03
3885b5k8R3J5p3J1M8n1n6O3P6o6n0O9n0o6R8P5j27L2R4q5o7O8L9r5K2N4J6q9L7
$$ plain form
3688 -106 -16 61 -17 -56 61 42 -105 -20 53 -31 -95 41 61 -45 -25 33 24 -60 29 91 -59 -8 67 -25 -73 42 70
3715 70 -60 1 89 38 -51 4 60 -25 -36 41 30 -44 -24 73 -29 -79 57 38 -66 12 38 -55 -57 38 11 -65 -5 40 -23
3744 -23 -69 39 23 -71 -37 80 -11 -89 71 47 -100 -19 82 5 -37 60 61 -68 -14 34 -15 -46 -2 73 -29 -11 65
3771 65 14 -62 40 68 -70 -36 61 -15 -84 3 58 -58 -53 36 -9 -38 -31 63 -42 -56 25 26 -71 -5 55 -48 -70 48 25
3800 25 -48 -11 53 -27 -52 40 26 -62 -5 85 -5 -31 42 40 -76 -44 59 -11 -86 45 33 -74 -58 32 1 -45 24 34 -40
3829 -40 -53 38 -20 -63 -21 29 -46 -19 75 25 -58 21 53 -70 -42 54 10 -41 16 63 -18 -50 39 62 -40 -28 100 -48
3857 -48 -62 42 40 -64 -7 84 -33 -36 27 13 -61 -43 28 -21 -40 31 20 -62 -40 66 -11 -67 52 70 -72 -31 78 -25
3885 -25 -53 40 55 -18 -7 41 -10 -66 -3 73 7 -43 26 -24 -90 8 83 -44 -12 82 -3 -70 -2 37 -58 -36 18 34 -55 -18
3915a8P0p5n2J13J3r0K9P1j18J6J00j6q3P8J9n2k1K8lm2pR3l9l2L1N5j43L7J00
3944F2q5k0O1J9j29Q2L2o9K4J8O5r3mO9k9n8K8P2o6k3J30p5p2Q6K2j04N6Q0r2
3973a3k0M0Rj3k4M6K3p8JO8o4n6R3K0q6L4O2o4l8O2K3q1O5K2m5k0K9K6o4nR9j7
4005C4q4Q3N5j44L2R3l6o8O2j8n6N3O6m5p4L3M3k0l6P6l8q7O8M4q6J4J05l9r6
4034f6O1L6o9J1N0k5l4J2Q6q4l7P0N4q2J2Q6j16PP2k1r5O9K8l3qM2k2m2j1Q3Q
4065D2j22O7O3p7j6R1m7p1J04rr3N5M7o1k7N2Lk7k5Q7j1q2L4O2n9n1J20j1r1N8
4095EL3m4ON5k4o2N5J3l5j4L2Nm6lQ9q6l7Q8po7N3M6j01QM6j2m3O4J3l5l2N0O
4128A9p0J9P4l2l7P0Lr7J8R7o9k4Q5k5m8nM9j8k8M0Prm8N9l5n0O6K4p5M1K8k7
$$ plain form
3915 -18 52 -23 -75 38 51 -39 -10 61 -57 -41 59 43 -40 38 57 5 -16 12 9 -33 -40 53 14 -18 13 68 -75 -38 62
3944 62 -23 -43 18 37 -92 -10 22 -47 -23 -5 60 -33 -37 32 3 -55 -27 45 -21 -44 86 11 -61 25 47 -57 -1 79 -13
3973 -13 -33 7 16 3 -21 25 48 -30 -29 39 -25 -81 12 32 -54 -20 42 -22 -60 2 25 -56 9 31 -14 -34 -5 21 -43 -48 51 34
4005 34 -50 33 88 -56 -24 69 33 -35 27 9 -47 6 72 27 -47 -14 29 9 -27 49 11 -76 -8 36 -50 -36 69 30 -66
4034 -66 -5 31 -38 -27 23 -2 -36 -24 62 -22 -59 11 65 -17 -5 81 -35 -28 44 23 -72 -3 25 -8 -16 26 4 -38 -49 34 42
4065 42 -80 -13 50 -27 -43 48 1 -70 34 25 -68 -13 34 -27 -54 -2 1 -26 -51 36 25 -57 -23 39 -20 -71 49 38 -53 5
4095 5 38 -6 0 55 31 -31 24 37 2 -12 20 25 -21 -24 65 -21 -58 30 23 -44 9 55 -46 -38 8 -4 -47 17 30 -5 -37 13 19
4128 19 -51 -32 42 10 -27 43 46 -51 -33 64 -5 -29 56 31 -17 -22 27 9 -19 21 28 19 -29 30 -5 -55 11 35 -40 1 29 2
4160Bn1O9Ml5%J9k5nl1R5o3oP8j3p0L9P2r9pP4k1n8K1O4o2m2Q6l2J0l2Q0n3m6
4193c8O8j1n1j0R4o9m0O8k5m0L9N4l7n6M9lmj0M6j0n0L9L1m9j7P2k0o5Q0J5q1
4224c1J9N7k1n8L2J6k7l1O7ql6K3K0l9l5Q4J1j16L4R0r2k4Q4l1k5mN5k7l4N4K6
4255C3p5jQ4l7o0R5Jj08M7R5r0l5R3qn8J3L3l9J4jN1k8k5M6l1o9O8Mp0K8O5l0
4287Ep5R3k1nK9Kl6m4K8O2l5l2P0n1j1K9N8p6k8R3m4n7N0K7m2j2P3l7m3J8M3j9
4319A2n6K0P1r4K2P3m1m8P5k1n2L6K6n4OL0K4k6n1P3k5m6K7O1l8k5M9qm4L6K6
4350C8pl3L4l8l0J1J9J6k1N4m3Mj4N3l8m4N9pr6J00J1r0J1M4Ll9M4J1k5J4j5L2
4382A8m4M0L3o0j3M4j8m2M6L7l7l6O0pm1L2J4m4mK2N2l4m0L0ro2M8L2k5j5L5o
$$ plain form
4160 2 -49 20 24 -11 -11 8 -17 -22 -53 42 -21 -27 51 38 -32 7 79 -20 -27 47 26 -32 -11 53 -9 -51 35 3 13 -19 61 8 -38
4193 -38 30 19 -32 -42 52 -17 -57 11 -14 -54 -15 39 2 -54 -5 -8 -12 -22 24 14 -36 3 34 -15 -32 40 20 -45 35 50 -31
4224 -31 -12 45 24 -34 -2 14 -13 -44 23 15 -21 2 22 -17 -52 32 43 -73 -39 51 -41 -65 19 -12 -37 -41 14 -13 -47 7 33
4255 33 -42 -43 41 4 -56 39 40 -68 -21 74 -16 -51 42 34 -24 -11 22 -17 -3 -4 47 19 -6 40 9 -60 8 12 -58 -30 35 5
4287 5 -70 23 2 -3 26 28 -8 -52 -24 38 3 -29 41 -10 -21 8 66 -10 -38 55 11 -46 4 31 -11 -23 50 13 -30 -12 31 12
4319 12 -44 -24 47 -47 -25 48 7 -41 34 13 -39 -3 23 -31 -25 5 29 3 -48 25 0 -46 -19 42 4 -21 28 20 -24 12 38
4350 38 31 -2 32 -6 -36 -25 -6 10 -11 43 0 4 -10 43 5 -39 20 13 -83 17 28 -62 -51 -7 -4 -43 1 12 -13 1 -14 18
4382 18 -26 14 47 -13 -26 18 0 -42 4 41 4 -32 28 21 -20 12 26 -18 -22 0 52 18 -22 8 -1 -63 -15 17 -8 -23 12 6
4414Fp8Q5ll8J2J3l2LJ7Nnl4P4j3j7nQ7j01j7J06m6k0J3j4rJ0M1j1m5N6j5no5
4447d5L7L2j7j9L5k5m8O5k7l7O5jm4J6L7j4n1L2J5nj8M4l0pJ0L7k9m1M6J4n6L1
4479BL3l4j0K9Rj4k0J6pm2N2J2mn1N3j7n9N0L4o8LN5lo9O3Ol3MK3j7nKO7q5MM6
4515B5J8n1j6N4k0k4J3K3l0K0K9l7k8M6pk1oK3%m7K2K2k3J2K6l5J1L0k1k5J7J5
4547A5m6j0N4k3K1l0K3J4k9J5K1k0n3P7Ln4K9J7m1K7L6l7Qk3OJ6o0M6J7k9j4K4
4579@j5k9O3k8k1J7OnJ5J3l0j7J5j3N6l9LJ1m8N3Qk2m4R3op5J1M1k1J3Ok5j1L
4613b2K7%k6J3K9m4j2L6Lk1M1kk8j5N0l5k1O9l6l4J7L7l6pK3pJ2l3M7ok1QL4m2
4647bk9P1k6l9K1L6j7Oj1J2k7pJ2j5J3%ko7O4N1o2lJ9J5n1N1j2j4J4j3K1l3J0
$$ plain form
4414 6 -72 13 10 -28 -16 -3 -35 -32 -15 -10 -15 -49 25 12 -5 -10 77 -24 -41 65 19 -1 12 -2 -11 -1 40 29 -16 40 25 20 -45
4447 -45 -8 24 7 -12 23 -2 -50 15 -12 -49 16 15 -29 -13 24 10 -41 -9 6 1 -17 27 -3 -10 0 37 8 -33 13 27 -29 2
4479 2 35 1 -9 20 29 15 -5 11 4 -38 14 26 22 -29 24 7 -52 -2 32 -36 -33 22 19 -50 13 19 -14 -10 13 -4 -9 -7 60 -25 -21 25
4515 25 43 -8 -24 30 10 -14 -1 22 -8 12 41 4 -24 22 15 -6 -12 11 11 -36 -14 8 -15 -3 23 -12 -1 29 8 -17 0 15
4547 15 -31 -41 13 -10 11 -19 4 18 -11 4 25 5 -48 29 32 -22 7 24 -17 10 46 9 17 -6 0 16 -44 2 19 -10 -24 0
4579 0 -15 -44 19 -9 -30 -13 -7 -12 3 16 -14 -31 -16 -29 27 -12 -9 2 -46 7 15 -7 -51 42 36 -39 -28 13 -8 5 11 -14 -25 -22
4613 -22 5 5 -21 -8 21 -23 -35 1 4 -17 24 22 -6 -21 29 -6 -27 42 6 -28 -11 26 -10 -17 6 -1 11 -22 25 19 -2 6 40 -2
4647 -2 -31 40 14 -25 -4 32 15 21 10 22 -5 -12 0 -15 -2 -2 -4 -71 -7 44 -18 -21 -2 13 -38 13 1 -13 1 -12 9 -24 -14
4680a4K2J3k8KK8k0j4N4k6l5K5N0n1J3M0m1m5J8L0k9K7Jnp0M5M1n2lO0k6k3LJ6
4713Fk9l1O0j0j5QM2k1l3K0J3lk7O4l5l9O4jp0N8K5l3j7L6j5m2L5K2n9k0M9k4
4745b2j7L2Qj0j5J0K5l9RO4r8K0O4l0j5N2k8k3JMK8rm6O4l7l1N6j8K3m3L5k4J8
4778HK0oo7K4J2j8mj2N2k1PqK2m4J2M2l9j1L3km5L8%j8J2J0KKl7N5j0j6QJ2k8
4813a5qO3m4j2PPoKK7k3oRK6k5j4k7N6n9L3L5o8L5jJ3n4M0lk2K8%J3l3%M3mk6
4849a3K9j4Kj5L4k7k9K4M3k6Pkm2J4J0lO%K1n0J4Qj8K8l6M8m2J8Qj2l1K3J9Ol
4884aOJ3o4L0K9j5k2K7K7m1K3kKj7J5K5m2J4N8q3j4P5n3J6Nj2j3NqL0k4k6M9J3
4918B5n7j1M2j0n5P9l0l1N3qLk7J6J5nJkJ2j1qK9k2j3N2m7J8oK5o5N0M0l7j0j4
$$ plain form
4680 -14 8 21 -7 -5 23 3 -11 43 17 -18 7 57 6 19 59 18 -27 -9 21 -8 19 20 15 -55 -10 31 -21 -24 36 10 -13 -10 6
4713 6 -23 -54 6 -4 -19 -11 31 10 -23 -3 10 7 -20 44 9 -30 34 33 -37 21 46 13 -4 32 17 -25 10 32 -27 -47 2 -22
4745 -22 -39 -7 1 -9 -24 -14 11 -28 -19 45 -53 -33 31 1 -14 38 10 -13 -12 -8 20 11 -35 29 -8 -39 17 -1 22 -21 14 -10 8
4778 8 28 22 -45 -21 -9 -27 -31 -43 9 -12 -5 -13 9 -35 -23 19 -20 -31 2 0 -45 -7 -7 -25 -13 -3 -1 1 -36 19 9 -7 1 13 -15
4813 -15 -23 40 -4 -16 -9 -2 -8 -6 21 -2 -8 1 27 2 -12 -39 17 -42 -9 26 -42 -7 -8 5 -49 -9 -12 -34 -6 -6 7 -26 -26 17 13 -13
4849 -13 16 2 4 -11 23 -4 -33 -9 34 8 15 13 -29 -15 -5 -8 -2 -2 19 -31 -17 -9 -27 1 -35 13 -29 -11 -3 -15 -46 -23 -4 2 -1
4884 -1 5 18 -46 -16 13 -2 -24 3 30 -11 12 10 12 -5 10 35 -7 7 65 -18 -32 43 -10 6 11 -1 -14 -9 -17 13 -11 -37 12 25
4918 25 -32 -43 -1 -11 -66 13 -17 -48 5 -3 0 -27 -11 4 -1 0 -2 10 -1 -9 20 -2 -15 37 -10 8 2 27 -38 12 52 15 5 -9
4952iL2j0l5L5j4j5j0K9l5kL2qk5L8mj1oMK2j4L7k5l5M8jRl8J1L3j1l4J8Rl0L5
4987B0K7l9k0K5jn1L5J1l7k4N3rj7L1K3k0k9LRj7LK0l6jN1j1j2j3K3mK3kRj6j1
5022dK6l5k5M2Jj4K6L7n9LJ7m2N4j4jj2kML1m9k5L9k0K1pM7m2Ql1pJ7J5nMk8K1
5058iL6m2mL9qLnJ5n1K4L9k9qN2n5k4P1k9m8K8QJ8m2J7J4l0nJ3J5n0J8M3l7l2
5092e5M3L7n7J3J4j3j0J6M0m1J7Pkm0M6J0m3kO2m3oK6Nk3jKOrj1Rk5K0K1l7L1
5127Gk4L3k9l7N7ml3LM2k3nJ0lk7nM9l7K0j6L5NpjlqkK2j9j1N2m4%K3j9k7%L0
5164Dk9pJ1K8k6k6J7J8j5LK7m7K9L2k1k2M7k2jj4K5k2OmL4ql3L9Nl2%M5l1j8L2
5199B4j8Pk6LqoN4m4nk1J7j5kL6J0n8J8N4m6k7N3jj8K6l5K0l6L8rK4k8L8omK3
$$ plain form
4952 -9 23 13 -22 13 -1 -16 -26 3 -32 -34 -2 -10 -35 3 -1 -12 -18 -14 8 -6 31 6 -29 19 18 27 -11 0 33 22 -12 6 15 -15 20
4987 20 47 8 -12 13 12 -39 -4 7 -30 -54 -1 -10 -27 4 27 7 -22 -19 -10 -27 -24 -4 -40 -41 10 -1 -13 -26 -3 -7 16 14 23 7 -4
5022 -4 22 -13 -38 4 5 -9 17 54 -5 -2 15 -27 27 13 12 0 -2 2 33 -16 -41 -2 -22 -1 -8 39 -3 5 -26 -33 -16 -1 -6 -2 -30 -9
5058 -9 27 -15 -19 20 12 15 10 25 -26 -2 37 8 0 52 -3 -27 44 15 -33 -5 3 21 -21 -4 10 -20 -25 -12 3 -47 -29 14 -23 -55
5092 -55 -12 25 -32 -19 -5 -18 -28 -12 28 -13 4 11 9 -31 15 25 -18 -20 42 -1 -7 19 24 1 0 2 8 -1 -12 -3 -28 -8 13 -24 7
5127 7 -17 16 -13 -50 7 3 -30 -27 15 -8 -13 -3 -6 -33 -38 11 -26 -6 -22 13 18 11 10 7 -1 -3 19 0 -11 41 -3 -3 20 1 -26 -26 4
5164 4 -25 -32 -21 7 -19 -45 -28 -10 -25 -22 5 -42 -13 19 -2 -24 23 1 0 -14 11 -11 -5 -9 25 17 -16 23 28 -4 -4 41 10 -8 24
5199 24 6 13 -13 -10 -18 -24 30 -14 -19 -40 -23 -38 -40 -4 6 -52 -34 20 -26 -53 0 -1 -19 7 -28 -8 -44 -6 -15 9 -19 19 13 9 32
5234C2k6kJ5N0q1J9j0Oj3ML7m4j5K5Rj7pK2Nj6lJ5k4ML4j8k7JM9m8MM4k5j6K2
5269ENj4MkL0l6K3MJ3n0L4Qpk1L6l6pK5%ll9M2n0J3K3Nj4j9K0L2m5J7lk1j6K2
5305b2J5j3L1l1Jj1N0j1k2J9%K3k0J4Nl4PL8n2j1L9l0K3pJ4j8j9N7j5l7QKJ3l1
5339b5K0J1l3K3K4j4l4J9L5n1L9Ml2LK4j8j2J6Kj2J8lK3k2j7N4l8j3L9k3k7RO9
5372E8q0K6%j5K1Lj2K2o2K8L3j7l9N4l3lJ6j1k0LL3j7pK2rl3L1M%j9J8L9m2PR
5407HK2l4mL7j8j4K4m2J5j9J6J6j5LJ8k9l1L7K3m7M3mk5pK3pk1K3J1j6j1L3j2
5440dk1M0m4M1lQ%l7K5O5q3LL2m3jK3K9l6%pK4m0jQK2n7L8M3p5K8%qPL3k2J8j1
5477fL9l2j9OL8j1qJ7kk7j8M5l9jM4k0k6M4rj4QK0k5k9J9J0j1Ok9K4k1NK1l8k
$$ plain form
5234 32 6 4 19 69 -12 7 -3 3 -10 -6 31 -13 -28 -3 6 -11 -18 4 9 -7 -10 5 -19 -15 19 1 -26 -25 24 -24 -20 24 -1 -17 5
5269 5 10 -4 0 -2 28 -8 15 19 32 -18 16 24 17 -4 32 -4 -11 14 14 11 -28 14 -36 -23 0 5 -9 -28 -8 24 -21 -4 -7 -28 -44 -22
5305 -22 -7 -20 11 -20 -19 -30 20 9 -13 6 6 29 9 23 28 -6 1 39 -13 -24 15 -15 8 1 15 -3 -22 35 20 -17 -9 -7 6 -25
5339 -25 -5 6 -27 -4 20 6 -28 -9 26 -25 14 18 -14 -11 13 -5 -17 -1 1 -11 7 4 27 5 -12 42 4 -9 30 7 -20 -11 58
5372 58 -22 4 4 -11 10 13 1 23 -39 -11 22 5 -34 20 -13 -16 0 -11 -31 -28 5 -12 -19 3 -6 -39 -8 -4 -4 -23 -5 34 -8 -1 8
5407 8 30 -4 -8 29 11 -3 21 -21 -6 -25 -9 7 -8 -5 13 -16 -47 -10 13 -34 9 5 -20 -27 -4 -11 -32 -9 2 -14 -25 8 -4
5440 -4 -25 15 -29 12 9 17 17 -20 5 70 -13 -10 22 -21 -22 1 30 -6 -6 -13 11 -29 -30 -22 0 -57 -19 24 -51 -23 -23 -31 -24 9 -13 5 -6
5477 -6 33 1 -18 -12 26 15 7 24 22 -5 -23 22 -17 -18 26 6 -20 24 15 1 9 29 4 -25 -6 4 -7 -1 -30 -6 -27 -22 -1 -39 -41
5512d1K5K2n1PN2j9J7k1Lj0KJ3Kj3KL3j0oM3p6L1L0j9j6l0L8j0l2P2m1m4N5lj7
5546a2k1K7KLk7L0%l0K0J4m6K5N0o0J4J1rk7L8NMj5j8RJ7k0K2Om1J5J4j8RN2n0
5581gk3K9k6J9NK3m7OJMQj8JJ3l1qM6Kk4J2M9l9lQol4L0J2jMPj1NKJ7Lm8M2j2
5620A0j8L1k1k2J0L2l9k1K1j0qMj0M6k3OJ4k7oK0j7RNJj7jM8k2LQJ4n0L6k9L0
5655Gm4L3K9k3j9K9J8k6k6M8l5j8N4rj9Rj6J8m3J6ln0J3M0L7m8kN0l5j1J9kk8
5688c7K7j2QjK1k2J3KKJ1k1M0m1LpRj0J7J2j1k6L8%l1K7Rjm4K2L3m9j3O6n9JL1
5724Gl1J4m1N5lj1m6P6m1RQJ1k2%J2M0k7j5Qkk0K7J2n1L1Jk4K7J0k2k6jL9Ml4
5759b6jL3m1M2K0ok1Jj2lJ0J3k7k5L7jJ9k2Mj8PK8Nk0k7O0k0j1J1Rj4j3L5k4l
$$ plain form
5512 -41 -16 6 -45 -38 14 -5 12 -9 -6 -16 -14 -1 1 -12 -10 23 13 7 50 -26 5 35 16 0 -30 8 -2 -34 38 -3 -47 8 5 -12
5546 -12 -33 -6 -4 -1 -28 2 2 -28 -8 6 -40 -15 35 -25 -11 0 -9 -36 2 7 11 -4 -22 -13 4 -16 6 12 -29 -14 0 -18 -9 43 -7
5581 -7 -30 -1 -27 -8 -3 20 -27 -21 -20 -16 -8 -26 -25 -12 -43 -51 -5 -3 -27 -15 34 -5 -8 0 -6 -40 -10 2 1 5 12 1 6 8 25 28 -20 22 10
5620 10 -8 23 2 -20 -10 22 -17 -38 -17 -27 -35 -31 -41 5 -18 -12 2 -25 -31 -11 -28 -19 -14 -13 -30 -31 17 -5 -2 6 20 -30 6 -23 7
5655 7 -37 -4 25 2 -17 12 30 4 -22 26 -9 -27 27 18 -1 8 -8 10 -33 -17 -20 -70 -57 -17 20 -28 -30 20 -15 -26 -7 -9 -37
5688 -37 -10 -22 -14 -15 6 -16 -3 -1 1 12 -9 31 -10 -7 -14 -5 -15 2 14 3 -23 15 15 -16 11 20 19 -25 -3 30 -19 -32 34 -25 -24 7
5724 7 -24 -10 -51 4 1 -10 -56 20 -21 -12 -4 7 -15 -15 -3 37 10 -5 3 1 -19 8 20 -31 0 1 -23 4 14 -8 -34 -35 4 8 -26
5759 -26 -27 6 -35 7 27 21 0 1 -11 -14 -4 9 -18 -43 -6 -7 12 -10 -6 -24 -17 11 16 -4 -31 29 9 -2 9 18 4 -9 26 2 -1
5794aMK9p2L5KMk7%M0j8m1M3J1l9J9K4n5K7J6K8o8L0j2J2j7K0J6m4K7J2Nj1J0
5827Irok9O5mk1J8j1j1j2L3m5k1N6rm9K5J2j0Oj9N1m4J6J5k6NK1Rn5M5NK9k7j0
5862BJ4lNj8J6j9J9qk0J7J8l0JRJ2j0m0K4K5j8mM3k9j7LJ3o0K5j2ORJ8J8l9K0
5897a0lRl1L7Jl0J2Qlj7L3J4rmJ8k0k6L8Jj0k0KK5qj7J3J0k1J4j0LlJ0j6j6J4
5933a2oj0J5L2k9K0k9J4J9l1L0j2l8L5j7J8J0J3k8oJ1L4nk5jj2j1L2J0l9J2K1
5965A5l8%L4j1j3OJ5ok5L3rj0JMK7l7j4M4l2JmK1k1K8Nj4jMK3l6OL4j6j3L0ll4
6002fOK7j7l3L5j3k5L6pOJj8Pn7M7lj4j2L5mJ0k5M4n2K6RJ7m2K8LMlrJ7nk0K2
6039A5Kl1N3ql4QJ1n1NPJ7J6k9kJ1Jjm1L2%OLj3JJ3pmOL0j0n5M1J1j0L8l3qjK6
$$ plain form
5794 -1 3 32 -40 -5 -3 1 -26 -26 14 -4 -45 -2 9 -30 -11 13 -42 -15 1 29 -39 -9 -21 -9 -26 -6 10 -34 -7 5 10 -1 9
5827 9 0 -6 -35 30 26 5 23 12 1 -11 22 -23 -44 12 3 -46 -21 -9 -19 -13 -32 19 -25 -9 6 -20 -15 6 15 -40 5 10 39 12 2
5862 2 16 13 18 0 16 -3 16 8 -12 5 23 -7 -6 3 15 5 -35 -11 14 -4 -8 35 6 -11 -8 5 -55 -30 -42 -36 -27 -9 9 -30 -10
5897 -10 -13 -4 -35 2 3 -27 -15 -7 -10 -27 6 20 11 7 25 5 -21 17 18 8 -12 -10 15 7 -10 3 13 -8 6 -4 -1 -4 6 -10 -26 -12
5933 -12 -18 -28 -13 19 -10 10 -19 -5 14 -17 13 1 -37 -2 -19 -1 9 22 -6 -12 -1 33 28 3 2 -10 -21 11 21 -18 -6 15
5965 15 -23 -23 11 0 -13 -7 8 2 -23 10 1 -9 -8 -4 23 -14 -28 16 -16 -15 -19 2 -19 9 14 0 -1 3 26 -10 -4 30 14 1 31 28 -6
6002 -6 0 27 10 -23 12 -1 -26 10 3 9 10 -8 -1 -58 -11 -14 -28 -40 -5 -9 1 -24 20 -32 -6 3 20 -22 6 9 13 10 1 18 13 -7 15
6039 15 17 -14 39 31 -3 5 16 -35 -30 -23 -6 10 -19 -21 -10 -9 -10 -51 -19 -19 -13 -10 -23 -22 -9 -16 -20 -14 16 6 -49 -8 3 -7 31 -2 -10 -11 15
6078A5j1l1K1%L%L0Kk9K0k6l6M3J4k7j6L6qj8mL2Kn7M5l4k7K2K2NMj3MOPl1J9
6114a6NK5jl0NK4rK5j5pJ3m8J4M2k3rL0j9k9M7ln4L7j2kpJ1j2k0RM5k0k0pL0k4
6150b5K5mjQj7K2k2K7K6n1J1N5n1Qk3K0Pk5K2Lk8ML3m2QLK6n0L6j7J9k8k3M4m6
6185d6L4J9l8J3K4k3NKL1lm3M3j0n6M7q%J7j9J9K9n7L2%j0KK0j4k3K5J4o1L3K1
6219A9k2j5K1l7J4LL4m2j3J7J5l7K4L1l7QOqo%M2j0l1K9PMj2j3Rj3MK7j4k9Qj2
6255b9N0kjl4J7J9j6J3jl3MmJ3L7m6MklKOjoL1k1k1K2K7j5k3%K5J9k3Lk9L0j5
6292cJ1j2j3L6k7j3K3J8Pm5L6k6j6L1j4k4K7qKJ3l3K0Kj2l0L9j4NqM7j2K5m1J6
6326Gj0OK6k2j4%J6rLPj9j9L3K7k5K9rn5K8K6o2L1kPl0mOK6j8MNj7K4OJ2n2M9
$$ plain form
6078 15 4 -27 -6 -6 -3 -3 27 29 0 20 -6 -42 1 15 -12 -28 8 0 -18 -22 10 12 -45 0 -34 -61 -39 -17 -12 -8 -21 -17 -11 -4 -35 -16
6114 -16 -11 14 13 -17 -12 12 3 28 13 6 19 -29 -15 27 4 -5 25 6 -23 24 21 -33 4 -8 -10 -17 -6 -18 -38 -29 16 -4 -24 -31 -1 -25
6150 -25 0 -4 -5 3 -14 8 -14 13 39 -12 -1 54 3 11 -12 8 15 -10 12 15 -13 -9 24 -18 -10 -7 19 -31 5 -12 7 -21 -44 0 -46
6185 -46 -12 7 -31 -18 6 -17 -12 -10 21 18 -25 18 8 -48 -1 -9 -9 8 -11 8 37 -20 12 12 2 4 24 10 -13 12 26 -35 -2 19
6219 19 -3 -18 3 -34 -20 -17 17 -25 -38 -21 -6 -43 -19 12 -25 -17 -11 -19 -25 -25 17 7 -24 5 12 16 4 -9 0 -13 -9 18 4 -25 -17 -29
6255 -29 21 19 18 -16 1 20 4 17 16 -17 -13 -17 -4 33 -13 -9 -11 -14 -12 -6 -7 -13 18 -3 -24 -2 25 10 -13 -13 12 31 8 11 -18 12 -3
6292 -3 8 -4 -17 19 -8 -21 2 20 27 -18 18 -8 -24 7 -7 -31 -4 -12 -10 3 -30 -10 -8 -20 -50 -11 -25 -20 -28 19 7 32 -9 7
6326 7 -3 3 29 7 -7 -7 9 0 3 10 -9 -28 5 32 7 36 27 -28 0 26 -36 -5 -7 0 -30 -34 -28 -2 -20 -16 -11 -28 -4 2 14 -38 11
6363A1J2o8M1J1Oj9K4Pm0M3k7L1j9j1QnJ6mpk9L8j9Ll3K6Nl5kL5l1RJ9MnkJ7l
6400Gk0J3Pl4kK0J5j7J1MJ8l8J3okQPJLlo%K0j4k8LL2nj1MMk0j6J8Kl4M6qJl9
6440d6O5k0n1N3lrj2J2n%J1J5nOKl7L5K6n2JL8kk1j7K1Pjj5l5K7K1k5J2j3j7J9
6476a5Lk5L4j6jJ0pKNmj6K0k9N0j6J8j3Pj4QJ2%J5l2L3k0j4K3Lj9JJ7ml9K1J4
6512A2l0qK8k1PL0j7mpj7J2k6j1K8J3QkOmJ3j4Mj9M3k2kJ3j1Lj3L3l1J0lj1J7
6548G%RJ3k0j9K7k6P%K7o8K9nRj2j0L4j8J0k0M5l7J7JQm3M0qmJ8j0J2n3O2p%j6
6585ajOkL6j5l1JJ0Jmk6M8j1l5K2qlnK2j4Mj8J4j2OmJ6mPlj2J7Jj1%J0k3M1j3
6624Fj0%%J8ljlJ1j1QLl7L2k9RJj2Mj8L9j5%Mj2K3Jm3K1j1J9Pn4M6onK2%l1RL9
$$ plain form
6363 11 23 -45 -4 7 13 -6 18 25 -15 28 1 32 13 2 10 5 21 17 10 -19 19 0 3 -30 -4 1 -34 -36 -1 -32 -23 -4 0 -5 -7 10 7
6400 7 -13 0 7 -27 -29 -9 6 -11 0 4 22 -16 -3 -9 -11 -3 4 5 8 5 -1 -1 19 5 -23 -20 12 7 -4 0 4 -16 -32 -14 -12 -46 0 -8 -7 -46
6440 -46 19 -1 -52 1 -2 -11 -23 -11 -16 -16 -5 10 5 11 13 -24 11 37 -15 -14 24 22 1 -16 5 12 11 -4 -39 -12 9 -16 -4 -17 -34 -15
6476 -15 -12 -37 -3 -19 -20 -10 -17 -15 -10 -14 -30 -10 -39 11 -5 13 0 7 -7 1 13 13 28 -4 29 9 -5 18 21 2 3 20 16 -23 -2 12
6512 12 -18 -26 2 -19 -12 18 1 -3 -10 -27 -15 -41 -52 -24 -11 -3 -5 1 -3 10 -4 0 -19 24 2 0 13 2 5 -8 25 -6 4 1 -10 7
6548 7 7 16 29 9 -10 17 -9 -2 -2 25 -43 -14 -19 -10 -22 -32 2 -16 -6 -26 19 -18 -1 0 8 -35 5 -3 -7 11 1 13 -40 22 15 15 -1
6585 -1 -2 4 2 38 23 -8 -7 3 4 0 -26 22 11 -24 -2 -10 -13 -18 4 -10 -6 -24 -10 -22 -16 -20 -4 -8 -1 -4 -16 1 2 -9 -9 1 -22 19 6
6624 6 -4 -4 -4 14 11 10 7 18 7 15 18 -19 13 -16 -7 -6 -18 -14 -32 7 -8 -8 -4 -16 7 8 -35 -14 -25 -6 1 -53 -7 -13 -18 4 4 -27 -18 21
6664B1k5jllL5k2J9j6%kLPjl3K8jk3RJ0nK6m6L0nj5okJ1l1K5Pj5J6Kj2M4k4J9
6702B1l0oj8K3R%qPJ1J2Lk3J7jj7K1jLjl7KNJ5mJl5L4j3K3m3%OJ7Rj0ol9M7pM5
6742C2l0k5K9J9l0J9%k5L1Nk3j0kK6okpk0L0NLl2j1L3Rp0M7LQj8J1j8J9mJ5l4
6778b3J8j3K1k9K5NLJ2k9L5l6K2Mj0l0K4Qnk0J1OJ5kj0qJ7pl9L9qNk9L0ok1J6
6814iJ3L3n0k3L5l7L5NJ3k7qNMnK9J5j7k7M3m4qM3mj4k6M9okrk3K9lrOk1K0k7
6851b2Lj3K8k0L5mm0MkJ9rK0k9L1j5J4J3m5L7j6J4qk1L6rOKRk2nL6j3Pk3J5J7
6887C0k4j9K3o6L6NJ9l3K3j2k5J4QQl0L3Kj4J2lLJ0JQk2J5J0Mm1J6K0J0l5M1L
6922C0j7K0j8J0l9K2Kmmj6OJ4k8jkL3j1rpL2l3oJ5j2J9oOPl0L6l7qjL6K0m3K8
$$ plain form
6664 21 -4 -5 -8 -11 24 2 21 5 5 3 6 13 12 -21 7 6 -17 -8 2 -3 23 -23 7 2 -13 -19 -21 -10 -41 -16 -9 -24 -8 -6 -18 26 2 21
6702 21 -9 -15 -33 -10 -1 -1 -9 -2 9 21 24 1 18 17 0 21 20 23 22 -15 -13 -8 7 3 4 -31 3 -10 13 -30 -30 -24 -7 2 -8 -14 -53 -6 -13 32
6742 32 2 -23 6 25 -5 14 14 -11 20 25 2 -8 -10 16 10 8 1 -19 11 16 19 -13 -24 9 18 -52 -5 -2 6 -12 -1 -19 0 -4 11 -23
6778 -23 -5 -18 3 -26 -1 4 7 19 -10 25 -11 11 15 5 -25 -1 7 2 -18 -7 -1 14 12 2 -6 11 4 -35 4 -4 1 -28 2 -4 -25 -9
6814 -9 4 37 -13 -36 -1 -38 -3 2 15 -12 -20 -15 -11 -16 13 28 11 -16 27 -17 -25 18 14 0 -26 23 17 15 6 -17 12 9 0 6 -15 5 -22
6851 -22 -19 -32 -4 -24 11 7 -33 -29 -31 -12 -21 -1 -30 1 -14 0 13 -32 5 -11 3 -5 -26 10 1 7 9 18 -4 -9 27 14 21 -2 13 30
6887 30 6 -13 10 -56 -20 -15 4 -29 -6 -18 -43 -29 -21 -13 -43 -10 -8 -22 -10 -13 -10 0 1 9 -13 2 12 16 -25 -9 11 21 -14 27 30
6922 30 13 33 15 25 -14 8 10 6 2 -14 -8 6 -22 -23 -25 8 -3 -12 -19 13 -20 -26 -11 -23 -4 -10 -4 3 -27 9 -28 -36 -37 -1 19 -24 4
6959Dj2LqmL1l2K8k2K8j0j0K4k4K5j6kj9L2l3K9l7J6%J8lj1kj6L8j3j8J6Kl6L8
6994DPPk5K4omK0j3k3PJ0j2K4nLkNk4J4j2J7k4J0kLj0Rk0j5L4%k0loK0jNk0pJ3
7034a8NNKlJ5J3k8J0j0K8k0J1j3PmJ7nj7MK4nj1lk9QM5k6K8j7Nj7oj1nRjj3J8
7072hk9K0Lj2M9l5K0qOl2K0K0j3K7n0K2J8j6Rk4M0j0j7j0OLk0J9K3j6k%Kk2mK3
7108Bl3M8k7oj4J1PK1l7OJ3rj6K8jj3L1%qJ0MrrK6J6k0k5j7J9Jlj3M2k8J7m0J9
7145gjqJ8k5K5j8j3J4pmlkM2k2j2qM2LmJl1RK5k9Oj2L1J5m9K8kL7l1J5k9j2Q%
7183a0PJpl0K6J3Moj6L1m7MQJ0j3j7L5j6J1J0Pk2j0K3NPk1j2L5pk0J7J8j2j9K7
7219A4Mj8kLj1K6j2l2L7j6J6Ol2K5m3K5jl1J7J7%l8L9RlMl4L0qLOj2nJ9K8l2J3
$$ plain form
6959 4 -8 -5 -13 -17 14 -18 10 -12 16 6 -4 20 -4 21 5 3 -16 16 -17 12 -25 -9 -9 9 6 -5 -7 -23 15 2 -16 0 2 -34 4
6994 4 11 18 -7 17 11 7 27 14 -9 -2 8 -4 20 15 18 16 21 -3 11 -1 16 -8 2 0 3 -7 2 -18 -33 1 1 -19 -22 -28 -8 -9 -4 -24 -31 -18
7034 -18 -13 -8 -6 -9 6 19 -9 1 -9 19 -1 10 -3 4 0 17 12 -5 -1 23 18 7 4 -25 -17 28 2 30 13 18 1 -5 -16 -21 -12 -13 -26 -8
7072 -8 -37 -17 -14 -26 23 -12 8 0 6 -26 -6 14 1 28 -22 0 18 2 11 -13 27 17 0 -10 -4 -1 -21 -2 21 5 3 3 5 -17 -21 2
7108 2 -31 17 -10 -16 -30 -19 -12 9 -28 -22 -9 -18 -34 -6 -7 -20 11 11 3 13 17 8 -1 25 41 21 -4 -21 -2 -1 -4 -17 25 -3 14 -26 -7
7145 -7 -8 -16 2 -23 2 -16 -29 -15 -22 -26 -29 -31 11 -11 -23 -31 11 14 10 11 -20 -11 14 -15 -9 -21 10 25 -24 4 2 39 8 23 -6 -18 -10 -10
7183 -10 -3 -2 -9 -39 -13 0 4 -2 -18 13 -34 -30 -22 -12 -25 -42 -7 -23 -12 -2 5 -17 -27 -4 1 8 -13 -25 10 3 -17 0 18 6 -13 14
7219 14 18 0 -2 1 -10 16 4 -28 9 -7 9 15 -17 8 -35 -10 -11 -42 -25 -8 -8 -46 -7 2 -1 3 -31 -1 -9 -6 0 -12 -17 2 30 -2 11
7256A1qQk0N3k3mj6J6k3K1j2j4K1m5N0nl8K6qj4K6jm2K6J0%j7M3k7k4L4j1J7k8
7290a8MK8j1Jj2qJ6J3k8O3m6j5L7nj5J2Lnnl2M5m6L8l3J2q%L0l2qL9n5PNJ3oj7
7327c9K0M3m0j4K4L0l0J6l0K2Lj5mK3j4JK%OmJ8J7k7Jjj1J6k1K0j3J4nj1J3j3
7362cj7Nj9OJ4J4k4NK5l2M1k2KPOJ0k1jqK7LL0l1qJQm6K4L3l9LL3l0rJ6oj3j9
7400c5L7Ml3J6Oj0K4m7K1l8N2j2pK8l4J0K9pQlk5jM1rj7J8J8l8JKJ2k2J7J4j6
7435Dj7L6n0K6J2mk3j3L4k6j1J6K6k0k3M2Lm6QkK0k2O5l1jJ1j3k1j0L1k1L8k2
7468dJ6k1L9j5j0j9K8k0j4M1k6mqmK7oJ4k6J6m3K2K0k5j5J4MoK6oj1J0k5J0M7
7502B6j5j6kQJ6l5K1jJ2J1k3j1K2lj6M0l8QqJ3J5j2m5K7Om0M5Nl7K2j8J9orj9
$$ plain form
7256 11 3 11 -9 44 21 17 1 17 -6 15 3 -11 10 -35 15 10 -28 -2 -10 -24 2 1 -41 -15 -5 -5 -22 21 -6 -30 4 -7 10 -18
7290 -18 -14 14 3 4 -8 -16 0 13 -15 48 2 -13 24 19 4 16 19 14 9 -23 22 -24 14 -19 -7 -15 -15 15 -17 -25 14 -41 -34 -29 -16 -22 -39
7327 -39 -19 24 -16 -30 -6 24 -6 10 -20 2 5 -10 -14 9 -5 -4 -2 -2 4 0 18 35 8 9 8 -3 13 -8 12 -1 13 8 -3 10 -3
7362 -3 -20 -15 -34 -28 -14 0 -24 -19 6 -26 15 -7 -5 2 8 18 -3 -4 -12 15 18 48 17 9 10 18 -28 -4 29 -10 -7 26 -4 -13 3 -3 -16 -35
7400 -35 2 6 -27 -11 -5 -15 9 -38 -17 -55 -3 -15 -22 6 -28 -18 11 4 12 9 -16 -17 24 15 -2 16 34 -4 -3 -1 11 -11 6 20 4
7435 4 -13 23 -27 -1 11 7 -16 -29 5 -21 -32 -16 10 -10 -33 9 12 -34 -26 -28 -8 -30 35 4 3 14 1 -20 -30 1 -20 18 -4
7468 -4 12 -9 30 15 5 -14 14 -6 -20 21 -5 -9 -17 -21 6 0 14 -12 4 -39 -17 3 -22 -37 -23 -19 -25 1 -5 -16 -6 -31 -21 26
7502 26 11 -5 -7 1 17 -18 3 2 14 25 2 -9 13 10 -6 34 -4 4 -4 9 24 12 -33 -6 0 -40 5 10 -27 -5 -23 -4 -10 -19 -38
7537c8L5k4L6orrL5rlj5j5L5K1o1K7qL7ql2J1QjOj0k4O1o6LmM2Ok8J6l1j7OnL4
7575dJ0j7J0j5j0KJ7j0J1K7Nk0K1k5%J4pnKK6%j5l1K6k3J1K7k7Nj1K2m2M9l7K2
7610Hl6L4l1QnkJ9pMj3j2L0k9L0j4jK2l6M1rJ4j0OJ9l9M0m9lL1JPk6pJ8k4RMN
7648cj5J6j3kL9k3j2NJ9l2qK7k2Nj2K1Rk3NlJ6j9K0j5J3M2l1nOKL3m6J4k5L6r
7684A0j4J4%J3l4QOj1L0m3K4k0MQKj1%j7oJ5j0L1Mj6J3rjJ1oK7j5J1k1LJ9pj5
7721cK7k1Njml9K0N1l3J5l7K7j7oLJ1om6N2j7j1pJ9nnJ6QOqjrK5ml9K4j4K4Lo
7760cK5j0k4NPPok3K6Jj8J4K9l9L1j3NJj1k3J0J7m1QjL3j1Rk2LK7ml4j5M1k1O
7797a4OQK2k8ok8L7L6k8pLOk2L3m1J2J1QoqJ0nj7qJ6MK6m5J7j6Kj0J8K5k2ORj0
$$ plain form
7537 -38 -3 -27 9 3 -6 -15 20 11 8 -7 -22 13 34 -27 0 -8 29 21 -11 0 8 7 13 3 -21 40 -26 -23 -27 15 21 -7 9 -22 -39 -33 -38 -4
7575 -4 6 -11 -1 -16 -26 -24 -7 -17 -6 21 26 6 27 2 2 16 9 4 6 32 32 17 -14 12 -11 0 27 0 5 -6 16 -26 23 -14 8
7610 8 -28 6 -25 -17 -22 -24 -5 -12 -8 -21 -33 -3 -32 -2 -16 -17 5 -31 10 1 15 5 11 30 -9 31 -18 -21 10 11 18 -8 -15 3 -21 -12 -8 -3
7648 -3 -18 -2 -15 -17 22 -1 -13 -8 11 -21 -29 -2 -24 -19 -31 -10 -1 -24 -19 -22 -6 -25 -5 -20 -7 35 4 -1 5 7 40 -6 8 -17 19 10
7684 10 -4 10 10 23 -11 -3 3 -8 22 -21 3 -17 -13 -5 -3 -14 -14 -31 -37 -22 -32 -1 3 -13 0 -9 -10 1 -5 22 7 18 -3 0 19 12 -3
7721 -3 24 3 8 7 3 -36 -16 35 2 17 -20 7 -10 -16 -13 -2 -8 -54 -2 -19 -30 -37 -18 -23 -28 -12 -4 2 -6 -7 -16 9 5 -34 -10 -24 0 3 -3
7760 -3 22 12 -12 -7 0 7 1 -22 4 5 -13 1 30 -9 22 9 14 15 4 -19 -9 8 -33 -25 -26 7 -4 5 -17 -14 13 9 -25 -40 1 -20 -14
7797 -14 -8 0 22 -6 -12 -40 -3 33 5 -2 1 7 -15 18 -23 -11 0 8 2 -6 4 -1 -18 -26 -10 -6 20 -25 -8 -24 -22 -32 -14 11 -11 -5 4 -6
7835foJNKJ5l4L3k2K2rk2K2M%JQj8J6k2L8k0L6o6KK3k5L8k2RlJ6k4l7M6n7N7k7
7872b6M0l6jL0m1K6k0L7j4kj5J9J1Mk0pO5n8K6k1L3m8K1j8J9k3K5k4K7Pj6Op1
7905f5N7J6J3k9j7JJ0rKMol4O5j9j6K0K2j9KqJ3oL0k1rL5j9J3nRk7k4J7oL8k0
7941Hj6jJ7j5Kjk8K5j9L9m9QoQJ6J3j0J%pPk0L8j9L7k0J1k0Nk1K2Nj1OMk2L0m9
7979c2L9rK0m4J9NQmk1RK0jl8J7QkLK2k6Jmj7M6kJk6J8k1J4moK4pk2JNpJ4mK7
8019B4l3kK3jj9K4l5K5nJ8l7ljj1J8J6k0J1kj2J7JKk4L7qj5oK1KpQMj0j7K0%j5
8057a2L6n2L0%kJ4j0k2K2J5mrj3mj6QJ1l8M9Rk8J3r%mj0L2q%k3JJ7jj5kJ3rL0
8095Ij0J9k9L4l0J4j3%PQJNk0jM4l7nK0k3J7j4j1lJ3Qm5M5j0J1Jj9J8J2k0jK1
$$ plain form
7835 -6 -12 -11 -6 -4 11 -23 10 -12 10 1 -21 1 5 5 6 14 -4 12 -10 28 8 44 -22 -20 3 -22 16 -6 3 0 16 -8 -45 1 -56 1 -26
7872 -26 14 -22 -23 7 -34 -8 -28 9 -5 -7 -22 -3 8 12 -8 -15 50 -8 18 -3 30 -18 3 -15 4 -19 6 -18 9 16 0 6 -65
7905 -65 -8 8 21 -8 -25 -24 -14 -23 -21 -17 -23 -57 8 -11 -27 -7 15 -4 -2 -10 3 -3 27 6 -3 32 13 26 21 30 3 -21 -4 -10 28 8
7941 8 -8 -9 8 -7 -5 -6 -34 -9 -28 11 -38 -30 -36 -28 -12 1 -9 -8 -8 -15 -8 -28 10 -9 28 8 19 -1 4 -17 5 10 -1 5 9 -13 17 -32
7979 -32 7 -2 18 -26 -7 -2 6 2 -19 -10 10 9 -29 -12 -4 -6 -3 19 -7 -6 -10 -27 19 17 18 -8 10 -11 3 -1 -7 17 10 -12 -11 -6 -13 1 -3 24
8019 24 -9 -11 12 11 -8 16 -19 6 1 19 -18 -21 -22 -33 -15 1 -19 -8 -10 -22 -5 -4 -2 -26 11 3 -12 -18 3 5 -2 6 10 0 -17 3 3 -12
8057 -12 24 -28 2 2 0 14 4 -18 4 19 15 6 -7 -11 -27 -19 -8 -46 3 12 -16 -3 -12 -12 -16 -26 6 -2 -2 -25 -24 -7 -8 -23 -25 -12 -21 9
8095 9 -1 18 -11 23 -7 7 -6 -6 1 9 10 15 -5 -6 38 1 -4 16 -7 10 -4 -15 -18 -5 3 -42 3 -7 4 5 -14 4 16 -4 -5 16
8131A6n5K0K9l6K0J6kj7nmK4%L1m5K3k3J7j2Qj4M0k0k3K2l3J4j0Rj3L2n%j6J1
8165aJ2j1k2L3%J2m5NkNJ5j6K5J5l4OJ6Ok1MnJ7k2j0M8o0
$$ plain form
8131 16 -39 -19 10 -26 -6 10 8 -9 -14 -18 6 6 37 -8 15 -8 9 -3 5 -9 31 11 -12 10 -23 -9 -19 -10 -23 9 4 4 -12 -1
8165 -1 11 0 -22 11 11 23 -22 -17 -19 -14 1 -15 10 25 -9 -3 13 19 -2 2 -3 14 -8 -18 30 -30
8191c0
$$ Imaginary data points
##PAGE= N=2
##DATA TABLE= (X++(I..I)), XYDATA
0@%%%%%%Qj6J6j6J6k2L0l2M0n1N9p2Q8j04J20j38J59j85K16k46K78l15L55m01
30b13M50n01N60o25O94p69Q50r38J035j140J252j375J510j653J807j978K166k373
48a241K598k848L128l441L797m203M669n209N843o601P521q653J0080j1924J4370
63G886j7736K2582k9977M2230o5321J20711m36353m71844J104327r57277N04198
74a76574k50872M04734K31191m21981N98394m61048N79162l02563k95324M31769
84C36888l28343k59051J43470o7112j62294N07310l54755K12681K69035j08874
94A88955k25442j12153O06801q22774K67684J97358k40820K57560m18660M19643
104A18152o6061J7829k49100L11259K04404p20310N32277j87287n0155o7920J91695
$$ plain form
0 0 0 0 0 0 0 0 8 -8 8 -8 8 -14 16 -16 24 -27 32 -40 48 -56 64 -74 85 -100 116 -130 148 -167 188 -213
30 -213 237 -264 296 -329 365 -404 446 -492 543 -597 655 -720 790 -863 944 -1034 1132 -1241
48 -1241 1357 -1491 1637 -1804 1993 -2210 2459 -2750 3093 -3508 4013 -4640 5440 -6484 7886
63 7886 -9850 12732 -17245 24985 -40336 80375 -355978 -827822 276505 -680772 -176574
74 -176574 -427446 -22712 208479 -213502 384892 -76156 503006 200443 -94881 336888
84 336888 8545 -250506 -107036 -174148 -336442 170868 -183887 28794 297829 188955
94 188955 -36487 -148640 458161 -364613 -96929 100429 -140391 117169 -301491 118152
104 118152 52091 69920 -179180 132079 336483 -383827 148450 -38837 -88992 -156912 34783
115C4783O0480j85464N83087p05323L32525R3006m59857K59832j89209K11024
125C4884k00295Q4408r411J28041J53155l81463L50562J60550l67903j09354M41516
136B84690m34448j15705K85143k27772K93785j62580K29320l6790M3093N6140
146B14876l62355M44189m65473N3372J20493l58375K91556n5208p909k5621L98174
157B47719j07250j91253M16947j63307k02757k7297R1508k17836N0179k4785l8472
168a66604K89450l04021J79854J75362j00195o7194J00966M7101l50327K86355
178I0747j34453j85465K64083p0301p7603R8006J84512k08137R2203N5238r9263
189I567R0683j82555N8898P1400p6559j24753K29899O0308l23258K52828K2720
$$ plain form
115 34783 95263 -90201 492886 -212437 120088 213094 -246763 13069 -176140 34884
125 34884 -165411 -81003 -90414 37627 190782 -190681 159881 320431 -47472 -156826 284690
136 284690 -149758 -265463 19680 -208092 85693 -76887 152433 115643 158736 214876
146 214876 -147479 296710 -168763 -115391 5102 -353273 -61717 -116925 -124834 -150455 247719
157 247719 140469 -50784 366163 202856 99 -27198 64310 -153526 -103347 -128132 -166604
168 -166604 122846 -181175 -1321 174041 73846 6652 107618 154719 -195608 90747
178 90747 -43706 -229171 34912 -35389 -112992 -14986 169526 -38611 53592 108830 9567
189 9567 100250 -82305 -23407 47993 -28566 -153319 76580 136888 -186370 66458 89178
200H9178j98783O4013Q6751r5235r450J22366j39424R5136M8191n5822O7852L586
212G8359m4950o160J8954k07039J47274L4346k40144K26334J07162j43297q77
223c0038K10004j18967j25431J72608j15024k4882k886p7334M3704K792m9961
234a15415P9851J42442j09196Q4652J20175j79185O247Q6904j56603p4984J69207
245E4095j01273r8157J54381k9986n4923N9268L7692N974K7838n0053J2683O2357
257G9896j61687J1800J45017j05458l0386J74376m2602j27914J27909l3352j30413
268i2814R3674J0444o9533M5386J9153m8587K6300o191K896R6657n5447k1419
280E19J11804j09127j13262J27159j0862j21713J26117P6577j24592L9265N9056
$$ plain form
200 89178 -109605 -45592 41159 -54076 -63526 58840 -80584 14552 62743 6921 74773 78359
212 78359 33409 27249 46203 -160836 -13562 20784 -219360 6974 114136 -29161 -30038
223 -30038 179966 60999 -64432 108176 -6848 -31730 -34616 -111950 -68246 -65454 -115415
234 -115415 -35564 106878 -2318 82334 202509 23324 29571 116475 -40128 -115112 54095
245 54095 -47178 -145335 9046 -20940 -75863 -16595 21097 27071 54909 4856 17539 79896
257 79896 -81791 -69991 75026 -30432 -60818 113558 70956 -56958 70951 37599 -92814
268 -92814 860 11304 -58229 -12843 6310 -42277 -15977 -22168 -19272 77385 21938 519
280 519 112323 3196 -110066 17093 6231 -115482 10635 87212 -37380 1885 60941
291F0941q2429R453L2059j3223K2523j7781l0007L3643l8871o1569J08738J1469
303C4946r3433J11723J6485j52105L9480P0111r6752J7548J19777m1236j9240
314G304M9460k9466m216o545j8459M5296k0932p7208M2498M202j18626O1052R9531
327C3891q3396L6258J12550p4280m7716P7723k7044n1418M6158j148k2070j444
339a936k2416K3729L513n3950N0676N2551q1993J6136P9042r0882m4016R8142
351B8596k9639n1271Q5681Q830n4885J6417J2413k2951k150L80J1234K0895m9522
364b5972J7087N1373p0901m019Q3697k9958n7181Q3860q320r8892M6549K1195
376H518m4730N923M2496q857j7428J0145K418K9393m0467P240N4836m6654k4023
$$ plain form
291 60941 -21488 -12035 20024 6801 29324 11543 -18464 15179 -23692 -85261 23477 34946
303 34946 -58487 53236 69721 -82384 -42904 27207 -69545 -51997 67780 26544 7304
314 7304 56764 27298 23082 16537 -1922 43374 22442 -54766 -12268 -8066 -126692 -65640 33891
327 33891 -49505 -13247 99303 25023 -22693 55030 27986 -23432 22726 21578 -492 -1936
339 -1936 -24352 -623 2890 -51060 -384 52167 -29826 -13690 65352 -25530 -69546 28596
351 28596 -1043 -52314 33367 42197 -12688 3729 16142 -6809 -8959 -8579 2655 23550 -25972
364 -25972 -8885 42488 -28413 -32432 51265 21307 -35874 47986 39666 -59226 -12677 8518
376 8518 -36212 -30289 12207 3350 -14078 -3933 -1515 27878 -12589 -5349 49487 2833 -21190
389b1190N3694k23q2228O2061K4400p5665L7797K4816l1331l3792M5857q475k3582
402b7861K4841m457L4224m7442J7180M7223l4422k8522K8645L6222r7611M9191
414b789M5211o3095P711K4786J3084n6535N1318m427k9880J6498k1432L5672m8560
427c2438J4162J7499j2731j5420K8392O2146q7388M4006L0216m7072k3738L4227
439A1861L4352q4825M9117n257j2800j8244j0405O0671n3369K7707O651J9027
451B4486l6148q703N5648o8185L9450J9302o40m4042L0409J1660p9435N9085p101
464d214K6033n5735L8541M0226p6905M6448k7684O6335p8732Q103P4842q5658
476b8400K7983l8672N2616n8128J3005O4038n1983N1739l1191L0402n0150K7923
$$ plain form
389 -21190 32504 32281 -49947 12114 36514 -39151 -1354 23462 -7869 -41661 4196 -4279 -27861
402 -27861 -3020 -7477 26747 -20695 -3515 43708 9286 -19236 9409 45631 -51980 -2789
414 -2789 42422 -20673 -12962 11824 24908 -31627 19691 15264 -14616 1882 -19550 16122 -32438
427 -32438 -18276 -777 -13508 -28928 -536 61610 -25778 18228 48444 1372 -22366 11861
439 11861 46213 -38612 10505 5248 -7552 -25796 -36201 24470 -28899 -1192 5459 24486
451 24486 -11662 -20365 35283 -32902 6548 25850 25210 -18832 11577 23237 -56198 2887 -4214
464 -4214 21819 -33916 4625 44851 -32054 14394 -13290 53045 -25687 -17584 57258 -28400
476 -28400 -417 -39089 13527 -44601 -31596 32442 -19541 32198 1007 31409 -18741 9182
488I182J9417m5689L8790k2110M4610r3610M1287K9248n3684K0366k579P7988
500F3216j07362L0336K4942l2317J450j9517J00175p5846L6701n133K428j56m9223
513c0306Q3789r2073P0174l0526k1978K3768n2479P7548j04367Q2257K2958k6698
525B067J2992k8647P8575j07082J7605M7939L113m1941M474N4414o9046J2727
537a2810k5069P3206m9654N188M7750o2579O5338r0954P1744l0400j121O7112
549E7751j01136Q5991n5863J5747m5452P987Q3357j01931N0306J2320K9482o8140
561b9581J8945O1598m4598J1744l5479Q6395p9393k2718L0965j7869J6815n9628
573f2804R9912n5067J7072K2441m9888N1776k9120K9776n2660N7748p892m2341
$$ plain form
488 9182 28599 -17090 21700 -410 44200 -49410 -8123 21125 -32559 -12193 -14772 63216
500 63216 -44146 -13810 11132 -21185 -19735 -39252 60923 -14923 21778 16645 19073 18917 -30306
513 -30306 53483 -38590 31584 1058 -20920 2848 -49631 27917 -76450 5807 28765 2067
525 2067 15059 -13588 64987 -42095 -24490 23449 26562 -15379 -10905 43509 -25537 -12810
537 -12810 -37879 35327 -14327 -9139 38611 -23968 41370 -49584 22160 -8240 -9361 57751
549 57751 -43385 42606 -13257 2490 -42962 -34975 48382 -53549 -3243 9077 38559 -29581
561 -29581 -10636 50962 6364 18108 -17371 69024 -10369 -33087 -2122 -19991 -3176 -62804
573 -62804 37108 -17959 -887 21554 -28334 23442 -5678 24098 -28562 29186 21294 -21047
585b1047K2161j9814O5111q9750M4446K5330o264k8355l8683J17897j15346J3621
597c0693L8990m733O365n1020P9874m6841Q396j597k378K7861l2228J4245j5611
610i370K0216k5521K3764k5863J5543M6441p6073L7078K045J9763o8400J9396
622b0981P4288r7396M2357p510K6611j4924l6537N9626j7595p83l3890N2226j4811
635A0681l9982M3318j1857k494m821K7974m6115L3050J7328n3853L5504r883J0781
648I631m1739K1471K3643k2789J1451k1729O1709m1799k9318M8773j407l0252
660a2355j0586O0226m7821m716K5168j5205R486m142J7098k0169K0781j8131j3149
673a3515J4083k8374L1835j6518q285K6676J4254l5753J67O3442n4601o389M3979
$$ plain form
585 -21047 1114 -18700 46411 -43339 1107 26437 20173 -8182 -46865 71032 -44314 -30693
597 -30693 8297 3564 9929 -41091 38783 -8058 338 -1259 -3637 24224 -8004 6241 -9370
610 -9370 10846 -14675 9089 -16774 -1231 45210 -30863 6215 8260 28023 -40377 -20981
622 -20981 53307 -44089 -1732 -9242 17369 2445 -34092 25534 7939 7156 -26734 25492 10681
635 10681 -29301 14017 2160 -334 -5155 22819 -23296 9754 27082 -26771 8733 -1150 9631
648 9631 -32108 -10637 13006 -9783 1668 -20061 41648 -151 -29469 19304 17897 -12355
660 -12355 -22941 37285 -10536 -15252 9916 -5289 4197 55 17153 -3016 17765 -366 -13515
673 -13515 568 -27806 4029 -12489 -20774 5902 20156 -15597 -15430 48012 -6589 -12978 31001
686C1001r260k8482r05J6271k6621R732o914J6291J6083l2456J5421Q146j9580
699a1273l540L2895k1779o458M0572l3988j3688L0763o97l6340K6031K2217l3741
712i026O883k997O230m743j8107K1331K2145j9160j6601M5285k1421l7116L5879
725H582k248k7073J8898J6662l3898J5161J1796k9161J9351J1359JL556l883m872
739D231L667j5424j7991M4330o732l8411L9866R180m9825J1129L1947k9161R02
752a2292K2305j0604j933J693o186O233J0271j1214J8716Q505l1914J9626l412
765I794l8921K2720J6676l4453P436L8281l0622j4876L8202r865j1264J9127j65
778A2070J146m426k0309J0386N079k8523J7077K8971l0969o37L2187k8759j1816
$$ plain form
686 31001 21741 -6741 -7646 8625 -17996 -8264 -15178 1113 17196 -15260 161 8307 -11273
699 -11273 -14813 18082 -3697 -10155 30417 -3571 -17259 13504 12807 -23533 2498 24715 -9026
712 -9026 -2143 -5140 1090 -3653 -21760 -429 21716 2556 -14045 31240 9819 -27297 8582
725 8582 6334 -20739 -1841 14821 -19077 -3916 7880 -21281 -1930 9429 9430 12986 9103 4231
739 4231 7898 -7526 -25517 18813 12081 -26330 13536 22716 -27109 -15980 15967 -13194 -12292
752 -12292 10013 -591 -2524 -831 -7017 -784 9487 -1727 16989 25494 -6420 13206 9794
765 9794 -29127 -6407 10269 -24184 -16748 21533 -9089 -23965 14237 4372 -6892 12235 12070
778 12070 13216 8790 -11519 -1133 3946 -24577 -7500 21471 -9498 -10135 22052 -6707 -18523
791a8523L7643j4746j7490L1589r352k3538J7227l510q800R005m733P159Q737
804A0668k1992J566K6703k7911j0420M7841j8260k5196L7496n938k9493J8758
816C822O983k1879R938M849j3981J0376n781o166J8579j1601n432L0700j4406
829F001k1240L4086r510l4603L0186J1420l4192J5529K1063k7208M106J3458j1891
842b795O324p02p856J2475p705j9018K4064k35k8890L0016J0996l3847J7911K2712
856B3450l2592L870K7003k5908l141J5250j2364M73N449p185Q461L079k0648J8921
870D118J0108l1400J7685K0002l4293Q98L1836k7860o970L1858j4686r423J6814
883H687l079j1381J1383p828n76J4207k3735J3252J2714k7037M494K3882j9399
$$ plain form
791 -18523 19120 4374 -13116 18473 9121 -14417 2810 -700 -9500 -495 -5228 1931 10668
804 10668 -11324 -9758 16945 -10966 -21386 26455 8195 -17001 20495 14557 -14936 3822
816 3822 10805 -11074 -1136 3713 -10268 108 -5673 -11839 6740 -4861 -10293 20407 6001
829 6001 -15239 18847 9337 -25266 4920 16340 -17852 -2323 18740 -8468 -4362 9096 -2795
842 -2795 3529 2827 -5029 7446 -259 -19277 4787 4552 -24338 5678 16674 -17173 738 23450
856 23450 -9142 -5272 21731 -4177 -7318 7932 -4432 -3959 1490 -5695 2766 5845 -14803 4118
870 4118 14226 -17174 511 20513 -13780 -12882 18954 -8906 -15876 15982 1296 -8127 8687
883 8687 5608 -5773 5610 -2218 -2794 11413 -12322 930 13644 -13393 -8899 14983 -4416
896d416j4567M1383j9149j9854K9871j0948j5312J1174Q145j3747J2997k495q242
909e160J6316k2326O278J7437j4147o699K6251j0460l1425L9129j1913k2814K6792
922G259L180j8239K404J5956k5296J0512L333q138K0631j3563K145J2432n840
935F776k0587K5370L723l5277L3523j408k7271P021J3722k1541K01K8041k0846
948h553J3367K129p151O941o848j728O111J0573l0468K4328L858l8467K4124P072
962E288j3137m880L3781j9265j2683K8156k6442R358j40p97M747M39n255n377
976f207J8040l1795J7185J5692k5036J0471J6426j5027k0485L8930k1191q543
988a1540K6070r000O68r048J1146j7618J0799q842n243L2460l8689J7153J0060
$$ plain form
896 -4416 -18983 22400 3251 -16603 13268 2320 -12992 -1818 6327 -7420 5577 3082 -5160
909 -5160 11156 -11170 -4892 12545 -1602 -8301 17950 7490 -23935 15194 3281 -19533 7259
922 7259 10439 -7800 -5396 10560 -14736 -4224 -891 -9029 11602 -1961 184 12616 6776
935 6776 -13811 11559 15282 -19995 13528 12120 -15151 -8130 5592 -15949 -15748 12293 -8553
948 -8553 4814 6943 -208 6733 -115 -1843 4268 14841 -15627 8701 12559 -25908 -1784 5288
962 5288 -7849 -12729 21052 1787 -10896 17260 -9182 176 36 -761 3986 4425 -830 -6207
976 -6207 11833 -19962 -2777 12915 -12121 -1650 14776 -251 -20736 18194 -2997 -11540
988 -11540 14530 5530 6198 -2850 8296 -9322 1477 -7365 -12608 19852 -18837 -1684 8376
1001H376j4960l418J5888P436l0136L8938j5758j7196J9058r640m229j130J6743
1014I972j6277J1975o232n566J7988k5458R010J2505k856k2648K6351L957l6891
1027b4170L1616k637o805J317J2694j0104o183J5668k7946K1851q906l922J4153
1040F626j0507M687k712J2803k7580K5057Q338l6255K8384j36j4469r061K3240
1053H415r529r639J8703j2104J3515j1383j354Q303J989j4356L408K2074l4675
1066a6633J9393M697j5861Q657L782k481j6813L1806k0504q086K1359j3950O035
1079A401q132J0902r54K304r394L111K0582l5031J0898J4796j2135j2123J6643
1092B868N938k4424K4854r187j868R129r191J900r13N015j3098J1997o824k239
$$ plain form
1001 8376 -6584 -10002 5886 13322 -16814 22124 6366 -10830 8228 -1412 -5641 -6771 9972
1014 9972 -6305 5670 -562 -6128 11860 -13598 -4588 7917 5061 -17587 8764 12721 -24170
1027 -24170 7446 4809 -1996 -679 12015 1911 -4272 11396 -16550 5301 -3605 -7527 6626
1040 6626 -3881 806 -1906 10897 -16683 8374 16712 -19543 8841 8705 -5764 -14825 8415
1053 8415 -1114 -10753 7950 -4154 9361 -2022 -3376 4927 6916 -7440 -4032 18042 -16633
1066 -16633 2760 7457 -8404 253 4035 1554 -15259 16547 -3957 -12043 9316 -4634 1401
1079 1401 -6731 4171 3217 5521 -3873 -762 19820 -15211 -4313 10483 -1652 -13775 2868
1092 2868 8806 -15618 9236 49 -1819 7310 -1881 19 -894 4121 -8977 3020 -3804 -6043
1106f043J4011j7410R320J2852o503j7427K4941l426k9363K2936r99n775m834
1119g720P780J45m867M788q131K0817j1660o899J6939r024p606N515N483j6731
1133a1171J5617J941j6554J4075K226j0596m517J7387r912l924R316m996Q835
1146G727j2652M58J1204l354j1986J0113J3629k6606P294Q942j2369Q18R908L65
1160C491o076J3785j2327l51O841r268P405m173L64J413j251r513N048J3638j9848
1175a0822P938J7411j3906p539J2978k902j2040R352Q38N05N09k271K051j82l885
1190a965j707J0206r358k56J0183j3916m57R792m877p281J6237L112j3729Q672
1204D656K121p604l071L284K124l12m009j463J0056j1279l594J5553m811n401
$$ plain form
1106 -6043 7968 -9442 -122 12730 6227 -11200 13741 10315 -19048 3888 2889 -2886 -7720
1119 -7720 60 205 -4662 126 -8005 12812 1152 -5747 11192 2168 -5438 77 5560 -11171
1133 -11171 4446 6387 -10167 3908 6134 -4462 -8979 8408 -1504 -5428 3888 -1108 7727
1146 7727 -4925 -4467 6737 3383 -8603 1510 15139 -11467 -4173 4769 -7600 -6782 3126 3491
1160 3491 -2585 11200 -1127 -1478 5363 -3905 3500 -673 -309 1104 -147 -9660 -4612 9026 -10822
1175 -10822 -2884 14527 621 -6918 6060 3158 -8882 470 1308 1813 2322 51 2102 1920 -1965
1190 -1965 -3672 6534 -2824 -3080 7103 -6813 -7270 2522 -2355 -9636 6601 9713 -4016 4656
1204 4656 6777 -827 -3898 -614 1510 1198 -2811 -4274 5782 -5497 -9091 6462 1651 -3750
1218c750R521J056j1844N675L149j1026O102O594o905J48M288m222o21k800K580
1233b055P651q037l14R093j854j2074P766J0320j5917M603Q481q912k014J159
1247b104m17k768L245J221J331K907k976L124j996m038O216K23q805N704N867
1262F734j4375J328J1329o172m440Q765L193p854N25J975q92j308l559O287J784
1277C320p614L871N185o929M76P317n202l127P007l435p162P199J225p005L597
1292a277L827j051k774N15M413k049n954L268O077p835k693J0204k601p259O928
1307A739L072p470K328L183l840j47J381K87k026M47J733j14j777R92N002n447
1323f57l434P477k540p684O341N553p894O27O731k556m574K940K752l670q18R87
$$ plain form
1218 -3750 5771 6827 -5017 658 3807 -7219 -1117 5477 -1428 -1280 3008 -1214 -1835 -4635 -2055
1233 -2055 5596 -2441 -2755 6338 4484 -7590 176 10496 -5421 -818 7663 -1249 -3263 -2104
1247 -2104 -2521 -5289 -2044 -823 508 3415 439 3563 1567 -2471 3745 3968 -4837 867 6734
1262 6734 -7641 -6313 5016 -1156 -5596 3169 6362 -1492 -967 1008 116 -1192 -4751 1536 3320
1277 3320 -4294 -423 4762 -2167 -1691 5626 424 -2703 4304 869 -6293 906 2131 -4874 -1277
1292 -1277 2550 1499 -1275 -760 3653 1604 -4350 -1082 4995 -2840 -5533 4671 2070 -5189 1739
1307 1739 4811 -2659 -331 2852 -988 -1135 246 533 -1493 -1046 687 573 -1204 -212 4790 -657
1323 -657 -4091 3386 846 -6838 -497 5056 -2838 -2211 4520 1964 -2610 330 3082 -588 -1406 -419
1339d19K178l481k103O410k768k332M864J730n212K71N262p428j771N900j493
1354c92l248L210M197l618j201K990J945l773j278N476k628n688J657L522n958
1369d787k09Q084k175k553L806J545n378N37L924k431j544J738K367m513q45L296
1385H62n44k984J420O259n863j489M278k098l716J603O983m886L75L762k374l273
1401a685j300N282m401j75L544q7k893j654O346m371m1M780J151l616k360N200
1417C720o928j224L978J643j968j044O041n216j380K464J829k481j293N792m227
1432b94j381M60K988l016j132P431l205j288n34K810n847k415P344m225M16R49
1448i39L952l696j617O364l325K41p61M212l786l900M132k732j648l76P280l333
$$ plain form
1339 -419 1759 -1722 -3825 2585 -183 -2515 2349 4079 -1133 -862 4400 -3028 -4799 1101 -392
1354 -392 -3640 -430 3767 149 -1052 1938 3883 110 -1168 4308 1680 -4008 -2351 1171 -4787
1369 -4787 -4996 3088 913 -1640 2166 3711 -1667 -1130 2794 363 -1181 557 2924 -1589 -2434 862
1385 862 318 -2666 -1246 5013 -850 -2339 1939 -159 -3875 -2272 4711 -175 200 3962 1588 -1685
1401 -1685 -2985 2297 -2104 -2279 1265 1178 -1715 -3369 2977 -1394 -1435 3345 4496 880 -1480 3720
1417 3720 -3208 -4432 -454 1189 -779 -1823 4218 -998 -2378 86 1915 -566 -1859 3933 -294
1432 -294 -1675 -1215 1773 -1243 -2375 5056 1851 563 29 2839 -3008 -5423 1921 -2304 -1888 -939
1448 -939 3013 -683 -2300 4064 739 980 219 4431 645 -3255 877 -1855 -3503 -3879 3401 68
1464F8j413M969k658k297r00O276n101P6L398k443o14k976O424l947n40L115N11
1481A948j170m921P817n124k196M664J411j818k463P359o762k74K210p64j79l146
1497c408N595l932N65j71K740j89m571Q841l847k107N98K141m213l463R029n146
1513a538M72J044J839j431k808N974k969O39l231K964p33n277O144q54j108r83
1529a856N636l329k700O936m061j471K70K751m727j84L556j933J781k997N686
1544C358j893l893K760J575j091n420Q829m256m225N598j155l7j337M852l977
1559c12J6J748k641J782l417L446r20j281J477K918k041m583Q005l653l490L406
1575D60K635m193k858O901m547N78Q46J196J597l990K657q02j14l680L464J267
$$ plain form
1464 68 -1345 3624 966 -1331 -2231 4045 -1056 -980 2418 -25 -639 -3615 2809 -1138 -1678 1437 1948
1481 1948 778 -4143 3674 -1450 -3646 1018 2429 611 -1852 5507 -1255 -1529 681 -83 -262 -3408
1497 -3408 2187 -1745 -1180 -1351 1389 1200 -3371 5470 1623 -484 114 2255 -1958 -5421 3608 -1538
1513 -1538 -1066 -22 1817 386 -2422 3552 583 1222 -2009 955 222 -5055 1089 235 -873 -1856
1529 -1856 3780 451 -2249 4687 626 -845 -575 2176 -2551 -2735 821 -1112 669 -2328 3358
1544 3358 1465 -2428 332 1907 816 -4604 4225 -31 -4256 1342 187 150 -1187 3665 -312
1559 -312 -296 1452 -1189 593 -2824 622 -298 -1579 -102 2816 775 -3808 4197 544 -2946 460
1575 460 3095 -1098 -3956 2945 -1602 -1024 -178 1018 2615 -1375 1282 480 366 -3314 150 1417
1591A417n203O307j003k837R54L589m302j553P086n451q89J165Q39j283j837L640
1607F39Q19O89l580M884Q16p746K943K377l484k007N793k449k723L970j988K90
1623g57J441J590j493O23k67j606M70l328L901P84l582K218L916m310m195P770
1639C175k682l893M282J493k690j638L058k083J453n92M52L337m729Q66R16k246
1655a521j418L429J59m099O662j283m722L991J270l612n8L800k222j242k63M12
1671g17J080k637Q21M063q48m387N004l9o152M009J071k844P27L350k752j150
1687a401L918l274K88J147m69P88j909l05J494p09l464M489K766n494K723L840
1703D428m686k045M381k039k350L122j043n05M40o59O29O58p51J619J349l731
$$ plain form
1591 1417 -3786 2521 1518 -1319 -365 3224 -1078 -2631 4455 -996 -1885 -720 119 -1164 -3001 639
1607 639 1458 2147 -1433 3451 4267 -3479 -536 1841 -1643 -3650 2143 -306 -3029 941 -1047 -757
1623 -757 684 2274 781 1404 1137 -469 1 -3327 574 1358 -2224 -6 3910 -400 -4595 3175
1639 3175 493 -3400 882 2375 -315 -1953 1105 -978 475 -117 335 3672 -1057 -191 725 -1521
1655 -1521 -2939 490 649 -3450 3212 1929 -2793 1198 2468 -1144 -1202 2598 376 -866 -1129 -717
1671 -717 363 -2274 -1453 2610 1762 -2625 2379 2340 -3812 197 1268 -1576 -849 2501 -251 -1401
1687 -1401 2517 -757 -469 678 209 997 -912 -1217 277 -432 -3896 593 3359 -2135 588 4428
1703 4428 -258 -2303 2078 39 -2311 811 -232 -737 -297 -956 -327 331 -420 1199 2548 -1183
1719a183J344J848m901N04N327l365k490N744j703l412K598J033j305n31P88m63
1735a67Q33k150K86L660l898M75L638k555j596L316j260l942M587r9l909L072
1751B91J401k530M0K133p46n1j268K10K557l685o50M379j399l715M038J840n076
1768b231K545J851l396J045J240j968r5J204j416Q72R91m83J545j301j735K728
1784A396m14l936L855J940n973J683L686l196j031L693n24j763J312q76M64l65
1800d9j863K062P11k257J728J776l481J105K588l589K91L526l005k029L853j176
1816A91k332K155N06l53p0P7J102K61l317Q54L102l937J99M088k307k546L296
1833I69l72k887L394j0k024J583r2j083R0M70m60J330j123m6K773l620j172L585
$$ plain form
1719 -1183 161 2009 -2892 -2388 2939 -426 -2916 2828 1125 -2287 311 1344 39 -492 296 -167
1735 -167 666 -1484 -1198 2462 -1436 -961 2677 122 -1474 1842 582 -3360 1227 1128 -2781 291
1751 291 1692 -838 -798 1335 589 538 -730 -520 2037 -1648 -2298 2081 682 -3033 1005 2845 -2231
1768 -2231 314 2165 -1231 -186 1054 -914 -1009 195 -1221 -349 642 159 1704 403 -1332 1396
1784 1396 982 -2954 901 2841 -3132 -1449 2237 -959 -1990 1703 1179 -584 728 -148 316 -49
1800 -49 -1912 150 861 -1396 332 2108 -1373 -268 2320 -1269 -978 2548 -457 -2486 1367 191
1816 191 -2141 14 520 167 97 174 1276 1537 -1780 -926 2176 -1761 -1562 2526 219 -2327 969
1833 969 597 -2290 1104 1094 -930 653 561 -522 -432 38 -422 908 -215 -261 2512 -1108 -2280 1305
1851A305j478k695L961J285m345K000J543k228N01J136l77j21l43r35J216j415
1867i90j161K903o92j505L074K92l857K352J378l721J601K455k304j054J946j165
1883d48m54P86k47J628r95j099J841k01l001J778K353l836J755K563l043m18K170
1900A132r71j670K720p95r51P10q83R57n02o57J277R60k515J088K753l985K01
1917a131K614j906j452L063O3k647K129o52q48N52j8P01j23n60k73J827k534R1
1935a104L360k613m34K488p01l164K277P74k988K225N82p51j46K59J92q4j7m34
1953b79J993k009j006K587j550j719K349Q66l146K316J376k631O58R96p83p60
1969g42J169n32L14m66q75K234j465n71J953J59k641J436K001l853J708J545j887
$$ plain form
1851 1305 -173 -2868 1093 2378 -1967 33 1576 -652 -151 985 608 487 144 -791 425 -990
1867 -990 -2151 752 60 -1445 1629 1921 -1936 416 1794 -1927 -326 2129 -175 -1229 717 -448
1883 -448 -902 -116 -363 1265 270 -829 1012 811 -2190 -412 1941 -1895 -140 2423 -620 -1038 1132
1900 1132 161 -1509 1211 416 -535 175 -708 249 -253 -910 367 1327 -1188 -100 2653 -1332 -1131
1917 -1131 1483 -423 -1875 1188 1251 -1396 733 81 -767 -215 -233 468 345 -215 -488 1339 -1195 -1104
1935 -1104 2256 -357 -791 1697 996 -2168 109 883 -2105 120 702 -49 -195 64 256 172 155 -279
1953 -279 1714 -295 -1301 1286 -264 -1983 366 1232 -1914 402 1778 -853 -195 801 18 -742
1969 -742 427 -105 209 -257 -1132 1102 -363 -934 1019 1178 -1463 -27 1974 -1879 -171 1374 -513
1986e13l15J364N6j745J811o76J75rj103J833j086p18J193J138k389N25K526l266
2004a199K82J966r41j349J625K77j870J376l33N24j09m30J092m22j081%J834k559
2022a317J99K724k144m66J863K2k349J937P06j864J110k74J49p38l01O76L43o19
2040c43j99K312k051p60K171j030j546J598R27k332J300P94j313R0O48K14o99
2057b19O74k60M25j096p32K099j581m17J949K55k133R66J671k725P21J301p38
2074A60n35O89Q7r27L61n67J180m10n19J618r52j098O01J120k060R80K262k469
2092d79J50J088n15j303R06Q79j114K80j48O78p89p55J594J84r71M87J533j989
2110b84n72J669j203n47J225K11j298P96M17p64K01K56M60n84j78N80L09j583
$$ plain form
1986 -513 -828 536 592 -1153 658 -18 157 148 -955 878 -208 -926 267 1405 -984 -459 2067 -1199
2004 -1199 -917 1049 108 -1241 384 661 -1209 167 -166 358 249 -181 911 489 -592 -592 1242 -1317
2022 -1317 -1118 1606 -538 -1004 859 881 -1468 469 1175 -689 421 147 296 -442 -743 -67 276 -343
2040 -343 -542 1770 -281 -1041 1130 100 -1446 152 1079 -1253 47 841 -472 -382 266 480 -219
2057 -219 455 195 620 -476 -1208 891 -690 -1107 842 1097 -1036 -70 1601 -1124 -403 898 160
2074 160 -375 314 401 -526 -165 -732 448 38 -481 1137 185 -913 -312 808 -1252 -272 1990 -479
2092 -479 -329 759 244 -1059 -153 726 -388 -108 -256 422 -367 -1122 472 656 -315 172 1705 -284
2110 -284 -856 813 -390 -937 288 499 -799 -3 414 -350 -149 107 567 -17 -195 385 694 -889
2128h89%K042j841j74J950k77j615N86J134j782N20P89m56l0l03N50k18k89K78
2147b5O66p01k80J416j110q54J152J22j604J004J373j565Q1P91j8q91R3R55n33
2166G2k95o1J019q24r52J490k73p43O61R73j512j42J221j266J31R66J44q43R0
2185a44O45p43L4R1P67n38j027J291Mj223M90J278r98n60J450l62r89N32M69q69
2205d02J25M46j96k62n7Q11l72m60Q06J16j013k8J360r95p90J284o3j062M39J030
2225G17p19k88N41J64m36k24O38l71m95J93O82m92m21J234p52o92R55L47q87J6
2245b90J176r55o19P84K90o42k14R31r8p33M9P77n53p32J155Q9o31J50O04p08
2265a70l94J064m59k93M71J24o40j91Q07k50n08L40P78n10p47R62J38j101K4J227
$$ plain form
2128 -889 -889 1153 -688 -862 1088 811 -804 -218 916 -866 -346 443 -13 -43 -346 204 -14 -303 -25
2147 -25 641 -60 -340 1076 -34 -888 264 386 -1218 -214 1159 -406 -325 466 448 -443 -350 605 72
2166 72 -223 -284 735 -89 -1041 449 176 -567 94 1067 -445 -587 634 -632 -501 465 609 -234 -144
2185 -144 501 -242 -208 -117 650 112 -915 376 380 -843 -353 925 -73 -633 817 455 -534 -2 467 -402
2205 -402 -277 169 -27 -289 -346 465 93 -367 439 555 -458 -486 874 -121 -911 373 310 -752 -313 717
2225 717 -2 -290 251 415 -21 -245 393 22 -473 -280 402 -90 -511 723 -29 -721 234 581 -306 -290
2245 -290 886 -69 -688 96 386 -256 -470 461 363 -370 -321 456 -97 -829 326 415 -216 -66 538 -170
2265 -170 -564 500 41 -252 219 343 -297 -488 319 69 -439 -99 679 169 -578 384 522 -579 -555 672
2285F72m74q38R99N5p77n0O90j49l82N35m4l10j70K68j70l66O95K84n74O2O65
2306F21o53p55R11M68r53P9R10o26p84N10O80m39k76Q89j00o84n6N66l02n11Q47
2327C42n2n62J99K97n87j88R92l59l05N25K53p74k82Q55k34m88K48P03m68q40
2347g25Q21J72o98j1R69k13p65P54K2o76J51N12k53k77N07j29m35RM93k83l25
2368c80N77K21n83j57Q80m87p04P75L81p43j40Q64m14n87M37K54k64k06O04r6
2388B32m88Q6L65k41l94Q18p6o27L18M45p11k04R20k82n33M57L67o29k01N88j22
2409H8k81l2O67l23n70N93J11m81r0Q87n11n27P91k22m65J41N25l90k57O09j35
2430A28j95k03N64j14n87N09K43n14l02R03k80p13Q30R3o17jO80l52l46M61k2
$$ plain form
2285 672 198 -640 359 414 -363 -413 277 128 -254 281 237 -73 -243 25 -145 -511 184 468 -106 -44 621
2306 621 -32 -787 124 592 -361 -282 628 2 -782 -272 408 -31 -307 582 482 -202 -258 308 6 -505 342
2327 342 290 -272 -73 224 -363 -551 441 82 -223 302 555 -219 -501 354 120 -368 -120 583 115 -725
2347 -725 96 268 -430 -441 528 315 -450 304 326 -350 -199 313 60 -217 290 161 -274 -265 228 -55 -380
2368 -380 197 418 -165 -322 558 71 -633 142 523 -220 -360 504 90 -497 -60 194 -70 -276 328 232
2388 232 -256 -170 195 -46 -440 378 302 -325 -7 438 -273 -477 443 161 -372 85 452 -177 -378 210 88
2409 88 -193 -225 442 119 -451 142 253 -228 -318 569 58 -469 322 100 -365 -224 301 -89 -346 263 128
2430 128 -67 -270 294 180 -407 102 345 -169 -471 432 152 -561 269 362 -255 -256 424 72 -274 187 165
2451A65l26j54M92ql91J66M78m28m79Q18j27o67M41M98o54k16P60m17l11L41L17
2472B98k68k43M12j06k83j42O54j55o35P80M4o60P0P28n99l75R29l45l16J44L39
2493B71l48k72M85Q4j32k67N24j54p10M65L35n17j71R64n10n29O79n2m30P2O55
2514D42l64k24K59o3j15l94O34J38n74K69M25m89n48R63j80o33O11K55n34q2N11
2535C07l22k31K55K15j9m06L16L0n06j01P93k11n31Q81q9p80K13N43n41j55P35
2556C96k92k74M0J97j81k22M42K38k03m26O23k41p05P33K34n28l6P61o37l61P07
2577B65k01k01NL98j84l16K01J61j08n10P32J85p88M55L60o31l77Q88k70n26O43
2598A81M0l35j17L88j47j25R1K50Mn99M62J39o06J51O54l74m66Q21j80o55M09
$$ plain form
2451 165 -161 -315 177 169 -222 -56 422 -6 -485 333 206 -461 -20 478 -176 -392 368 -49 -360 -19 298
2472 298 30 -213 199 93 -190 -332 322 167 -468 312 356 -304 -234 494 -105 -480 449 104 -212 -68 271
2493 271 -77 -349 136 220 88 -179 345 191 -519 -54 281 -236 -407 557 47 -482 197 145 -285 -213 442
2514 442 78 -146 113 50 -65 -459 175 313 -261 8 433 -56 -604 359 179 -454 157 412 -122 -204 307
2535 307 -15 -246 9 224 205 -201 115 145 -361 -462 331 120 -411 470 381 -399 -186 357 -184 -339 396
2556 396 104 -170 -130 67 -114 -336 106 344 141 -285 338 97 -608 125 359 -169 -205 556 -81 -442 265
2577 265 64 -137 -132 266 82 -234 -33 128 20 -490 242 427 -361 94 454 -177 -554 334 64 -462 181
2598 181 221 -114 -231 157 10 -115 -24 226 230 -369 93 232 -374 -223 431 57 -409 412 232 -423 -14
2619a4L04l70k06M99j22k12j1K97J5n13L23L98m42k97O68k25p06P36J52n97K51
2640g2M84m34k35M65j50j30k4K48J5m37J72L90l18m05P87rp92N29L51n98j55O31
2662C13k82l72M59l4o4j50K41J02l49M1K56p2n69O36J90q14M11M07m23l58P99
2683C68j73n57M67M5j72k34K52K13l00o1L39R9o36L25M36p22O8O38l38m76O69
2704B50m7n58L51K88k20k18K98M6k82j94L38J63n88K57N39n01l25O76j44n98O45
2725A76J53m85N5K99k39k68L13J25q6j34K09K09o17N4N38l28l91O90J61q01L14
2746e3L94m59j55N00m6l41J96qo4k50J59L61l16L8L56j13o22M77K59p25L22N04
2768D14m21l40M84M5m58K03K77J0l59J20K78l41k31L77L04o27K58M80o29o3M13
$$ plain form
2619 -14 290 -80 -286 213 91 -121 -132 165 180 -333 -10 388 -54 -351 317 92 -614 122 274 -323 -72
2640 -72 412 -22 -257 208 58 -72 -96 152 167 -270 -98 292 -26 -431 356 347 -445 84 435 -163 -318 313
2662 313 31 -341 118 84 20 -130 111 213 -136 -95 161 89 -480 156 346 -468 -57 350 -73 -431 368
2683 368 195 -362 105 150 -22 -256 -4 209 -91 -152 187 286 -350 -25 411 -311 -243 395 57 -419 250
2704 250 203 -355 -4 284 64 -154 144 190 -92 -286 52 215 -373 -116 423 -78 -403 273 129 -469 176
2725 176 329 -156 -101 198 -41 -309 4 129 43 -91 118 327 -290 -236 302 -26 -417 273 434 -367 -53
2746 -53 341 -118 -273 227 181 -160 36 28 -36 -286 -127 234 -82 -44 312 199 -423 54 313 -412 -90 414
2768 414 -7 -347 137 182 -276 -73 204 214 -145 -25 253 -88 -319 58 362 -265 -7 473 -156 -219 194
2789A94j77l27M50J50n02J93J50j64j84J58L42j81l17L99R6o83J08O24l53l57
2809c81O27N5o16K30K94k62m2K14J9j79l1J01mk40K44K69m38Q9L99k69n11N67
2831A35J73p06L37M25l48k82L77P3l70N6K45J49m26oM22l44k27M11J47n01L10
2852E0K48n12P5L45j76l01M12O7l74P8J73J00l92J28L75k72l40M39J97o36J86
2873a30N10m12k36M59K5m03J76J36k11n1J47J23k44j0K41m0l55K97K60n13O2M89
2895C20k96l90M95J28n19J79K97j60k24K44J14k37j04K21J43m67J54L70l23j61
2915b16L83k2m46L76K07m35P3K67j00l64K70J61k01o2K09J56m64M1L94l12j50
2936b35L43K30n61J56L60m22o5L33K7k95J54J17k03j22K04J63k72KL57j02l64
$$ plain form
2789 194 17 -310 140 290 -212 -19 131 -33 -217 -59 283 102 -215 184 280 -403 -295 329 -24 -381
2809 -381 246 301 -315 -85 209 -53 -95 119 138 -41 -72 29 25 -215 29 298 -140 -51 348 79 -432 135
2831 135 308 -398 -61 364 16 -266 111 184 -186 -130 115 264 -162 -168 254 -90 -317 94 241 -260 50
2852 50 298 -214 -139 206 30 -271 141 208 -166 -88 85 185 -207 -79 296 24 -316 123 320 -316 -130
2873 -130 380 -32 -268 191 216 -187 -11 125 -86 -137 10 133 -111 -121 120 80 -275 22 282 -231 -169 320
2895 320 24 -366 129 257 -262 -83 214 54 -170 74 188 -49 -153 68 211 -256 -102 268 -55 -216
2915 -216 167 145 -301 75 282 -153 -80 187 87 -277 -7 154 -47 -109 100 256 -208 -167 227 -85 -235
2936 -235 108 338 -223 -67 293 -129 -194 139 166 -129 25 142 -61 -183 21 184 -88 -86 271 169 -195
2957a95K32K50n21M8M30j82k80L20Q3m00R1K20k2j72J20K18l24j34K31R2l58K34
2979a9L42l88j20L68p4m30L69K30l40l7K38q1l01K06K01j38j33K11J65m22O7K85
3001A99k54j60L27J12m60K17K07k87j23L02J15l20J15K11k03k07J84K20l18K3
3021a00L45j47l40K01K42m48J57L30j37k45K29Q9l39O1K40n5j59O0K34l27j06
3042b15L04M5l24J67L48l73j25L42j10l01K30J95k42m7J87K1k89J11K42j46j21
3063a01K03J44m97J43K93k41r1K82P7l85J46K35k62q6J72J44k95N5K22j12j73
3084a27R2K85l19n1L46j81k41J91J85l55P6L24j93j60J94J04l04M4J72m3j90R1
3106f0K76k88j16K87N0l33J42L36m01n2K97q4j84Q0K31k33n4K15Rj70k6K54j92
$$ plain form
2957 -195 37 287 -234 -186 244 62 -218 102 185 -215 -124 96 74 -98 22 240 -84 -218 13 105 -253 -19
2979 -19 323 -65 -185 183 109 -321 48 278 -62 -99 139 58 -243 -37 164 26 -107 104 269 -153 -86 199
3001 199 -55 -215 112 224 -236 -19 188 -99 -222 80 195 -125 -10 201 -2 -209 -25 195 -123 -100
3021 -100 245 98 -242 -41 201 -247 -90 240 103 -142 87 176 -163 -102 138 83 -76 -16 218 -109 -215
3042 -215 89 134 -190 -23 325 -48 -173 169 59 -242 -12 183 -59 -106 81 102 -187 -76 166 20 -101
3063 -101 102 246 -251 -108 185 -56 -147 135 212 -173 -27 208 -54 -140 32 176 -119 -64 158 46 -127
3084 -127 -35 250 -69 -120 226 45 -196 -5 180 -175 -99 225 32 -128 66 170 -134 -90 82 39 -151 -60
3106 -60 216 -72 -188 99 149 -184 -42 294 -107 -159 138 54 -130 -50 181 -52 -106 109 118 -52 -78 176 -16
3129a6j40K35Q7l09K1L41k80j33L51l8k85J29K12k07j47K04O1k23K5K25m3j93
3151a23J09K60l30n3L19j07k35J64K13l73R6K42j90o9Q8J52j67j01K14r2j96Q0
3173i9K94j93j35L42r4l12J23K37k21p2K68r4j98O7J94j63p2K41L3j37j04K27
3195A32j43k07K81Q0k86Q2K86k25j75K99M2k50P3J74j56j60J64L1j30m8L09o1
3217A12k40J78J06k81n5L32j12j88J90Q6k94L0K36o8r9R8J48k28j47K21M2k08
3239a41R3K47j90j72L04l7k61J56J63k29l4K07o7j60N3J93j25q2J48Q3k20k8K74
3262A75k07j83K32J23k39JK84k37j30K55Lj23L6J18o4j75Q8J25j01r8K81n6k79
3285a71K61M3k20m3L08q5k28K20L0j94j3K02pj98P6J30j31j53J84R0k54N9K13
$$ plain form
3129 -16 -156 79 166 -143 -122 219 -61 -194 157 119 -166 -37 175 -32 -179 25 86 -137 -112 113 70 -123
3151 -123 -14 246 -84 -137 182 75 -160 4 217 -156 -60 182 -8 -77 11 163 -4 -105 109 17 -179 -99
3173 -99 195 2 -133 209 115 -197 -74 163 -58 -130 138 44 -154 -87 107 -56 -128 113 146 9 -95 132
3195 132 -11 -218 63 143 -143 -61 225 0 -175 124 166 -84 -11 163 7 -153 11 42 -88 -136 173 112
3217 112 -128 50 156 -125 -180 152 40 -148 42 128 -166 -136 100 32 -67 31 179 -49 -196 25 67 -141
3239 -141 -48 199 9 -163 141 104 -157 -1 162 -67 -101 106 39 -121 -68 125 0 -82 66 149 -71 -99 175
3262 175 -32 -215 17 140 -99 -98 186 -51 -181 74 77 -46 -10 108 44 -131 -43 82 -19 -117 164 108 -171
3285 -171 90 133 -87 -130 178 93 -135 85 115 -79 -92 110 103 -95 -19 111 -20 -173 11 101 -153 -94 119
3308A19j30j09K37n6k04J00J24j37l8J72l0j35K8J95r4j50J66J24k96OL00j65
3330B7k07K43L9j88L6K07j53o6J00L3p6p2J28qj39Q3J09j32r0K75j27j86J92J38
3354A66k81k5K72j39j19J26J34j18j27J84K1j85L2J79o0j97K21rj67R0J00j29
3376c1p0K02l7j43J04M3j14p4J72L7j66J2J78p2k11J65J16k40K2K76j63j73J81
$$ plain form
3308 119 -11 -120 117 61 -143 -43 81 -56 -94 78 48 -87 -59 136 42 -108 58 182 -114 -108 192 27
3330 27 -180 63 102 -86 -50 157 4 -62 38 71 -5 -77 51 43 -96 -13 96 -36 -126 149 22 -164 28 166
3354 166 -115 -140 132 -7 -126 0 134 16 -111 73 94 -91 -59 120 60 -137 84 75 -92 -2 98 -31
3376 -31 -101 101 64 -79 25 68 -46 -120 52 89 -77 -65 113 41 -170 -5 111 -129 -107 169 6 -167 14
$$ [...]
8191g
##END NTUPLES=NMR FID
##END=
