##TITLE=31P_DE-80H_X3
 64 sc D2O
 26.2.2025
##JCAMPDX= 6.0         $$ Bruker NMR JCAMP-DX V2.0
##DATA TYPE= NMR SPECTRUM
##DATA CLASS= NTUPLES
##ORIGIN= UXNMR, Bruker Analytische Messtechnik GmbH
##OWNER= root
$$ XWIN-NMR		Version 3.5
$$ Fri Aug  1 11:08:11 2025 Russian Standard Time (UT+4h)  Yarkov@DPX200
##.OBSERVE FREQUENCY= 81.013821
##.OBSERVE NUCLEUS= ^31P
##.ACQUISITION MODE= SIMULTANEOUS
##.ACQUISITION SCHEME= undefined
##.AVERAGES= 64
##.DIGITISER RES= 17
##SPECTROMETER/DATA SYSTEM= spect
##.PULSE SEQUENCE= zgpg30
##.SOLVENT NAME= D2O
##.SHIFT REFERENCE= (INTERNAL, D2O, 0, 198.062)
##AUDIT TRAIL= $$ (NUMBER, WHEN, WHO, WHERE, WHAT)
$$ ##TITLE= Audit trail, XWIN-NMR		Version 3.5
$$ ##JCAMPDX= 5.01
$$ ##ORIGIN= Bruker BioSpin GmbH
$$ ##OWNER= Yarkov
$$ C:/Bruker/XWIN-NMR/data/yarkov2/nmr/P31/2/pdata/1/auditp.txt
$$ ##AUDIT TRAIL=  $$ (NUMBER, WHEN, WHO, WHERE, WHAT)
(   1,<2025-08-01 11:07:23.15 +0400>,<Yarkov>,<DPX200>,
      <created by zg, POWCHK disabled, PULCHK disabled
       configuration hash MD5:
       00 E9 B6 7A A2 85 ED C7 34 08 36 98 17 FE 4E 26
       data hash MD5: 32K
       5A 45 0C BD 6A 86 0F 1D 54 CD 96 DD F6 8D 53 14>)
(   2,<2025-08-01 11:07:49.25 +0400>,<Yarkov>,<DPX200>,
      <Start of raw data processing
       efp BC_mod = 2 LB = 1.5 FT_mod = 6 PKNL = 1 PHC0 = 1678.243 PHC1 = 49.15953 SI = 64K 
       data hash MD5: 64K
       67 7D AF 40 EE 91 3F 18 14 5A 4A 3F 52 B1 DA 1C>)
$$ ##END=
$$ 
$$ hash MD5
$$ 8A 84 7B B3 E6 9E E5 64 DF 90 13 A9 70 EC CA 2C
##$RELAX= 
##$RELAX= 
##$RELAX= 
##$RELAX= 
##$RELAX= 
##$RELAX= 
##$RELAX= 
##$RELAX= 
$$ Bruker specific parameters
$$ --------------------------
##$DU= <C:/Bruker/XWIN-NMR>
##$EXPNO= 2
##$NAME= <P31>
##$PROCNO= 1
##$TYPE= <nmr>
##$USER= <yarkov2>
##$AMP= (0..31)
100 100 100 100 100 100 100 100 100 100 100 100 100 100 100 100 100 100 
100 100 100 100 100 100 100 100 100 100 100 100 100 100 
##$AQSEQ= 0
##$AQ_mod= 1
##$AUNM= <au_zg>
##$AUTOPOS= <>
##$BF1= 81.014009
##$BF2= 200.13
##$BF3= 200.13
##$BF4= 200.13
##$BF5= 200.13
##$BF6= 200.13
##$BF7= 200.13
##$BF8= 200.13
##$BYTORDA= 1
##$CFDGTYP= 0
##$CFRGTYP= 5
##$CHEMSTR= <none>
##$CNST= (0..31)
1 1 145 1 1 1 1 1 1 1 1 1 1 1 1 1 1 1 1 1 1 1 1 1 1 1 1 1 1 1 1 1 
##$CPDPRG= <waltz16>
##$CPDPRG1= <>
##$CPDPRG2= <waltz16>
##$CPDPRG3= <>
##$CPDPRG4= <mlev>
##$CPDPRG5= <mlev>
##$CPDPRG6= <mlev>
##$CPDPRG7= <mlev>
##$CPDPRG8= <mlev>
##$CPDPRGB= <>
##$CPDPRGT= <>
##$D= (0..31)
0 1 0 0 0 0 0 0 0 0.06 0 0.03 2e-05 3e-06 0 0 0.0002 0 0 0 0 0 0 0 0 0 
0 0 0 0 0 0 
##$DATE= 1754032042
##$DBL= (0..7)
120 120 120 11 120 120 24 19 
##$DBP= (0..7)
150 150 150 150 150 150 150 150 
##$DBP07= 0
##$DBPNAM0= <>
##$DBPNAM1= <>
##$DBPNAM2= <>
##$DBPNAM3= <>
##$DBPNAM4= <>
##$DBPNAM5= <>
##$DBPNAM6= <>
##$DBPNAM7= <>
##$DBPOAL= (0..7)
0.5 0.5 0.5 0.5 0.5 0.5 0.5 0.5 
##$DBPOFFS= (0..7)
0 0 0 0 0 0 0 0 
##$DE= 6
##$DECBNUC= <off>
##$DECIM= 4
##$DECNUC= <off>
##$DECSTAT= 4
##$DIGMOD= 1
##$DIGTYP= 9
##$DL= (0..7)
0 0 52 120 120 21 21 25 
$$ [...]
##$SUBNAM2= <"">
##$SUBNAM3= <"">
##$SUBNAM4= <"">
##$SUBNAM5= <"">
##$SUBNAM6= <"">
##$SUBNAM7= <"">
##$SUBNAM8= <"">
##$SUBNAM9= <"">
##$SW= 400.765351723535
##$SWIBOX= (0..15)
0 1 3 0 0 0 0 0 0 0 0 0 0 0 0 0 
##$SW_h= 32467.5324675325
##$TD= 32768
##$TD0= 1
##$TE= 0
##$TE2= 300
##$TE3= 300
##$TEG= 300
##$TL= (0..7)
0 120 53 12 22 120 120 120 
##$TP= (0..7)
150 150 150 150 150 150 150 150 
##$TP07= 0
##$TPNAME0= <>
##$TPNAME1= <>
##$TPNAME2= <>
##$TPNAME3= <>
##$TPNAME4= <>
##$TPNAME5= <>
##$TPNAME6= <>
##$TPNAME7= <>
##$TPOAL= (0..7)
0.5 0.5 0.5 0.5 0.5 0.5 0.5 0.5 
##$TPOFFS= (0..7)
0 0 0 0 0 0 0 0 
##$TUNHIN= 0
##$TUNHOUT= 0
##$TUNXOUT= 0
##$USERA1= <user>
##$USERA2= <user>
##$USERA3= <user>
##$USERA4= <user>
##$USERA5= <user>
##$V9= 5
##$VALIST= <valist>
##$VCLIST= <CCCCCCCCCCCCCCC>
##$VD= 0
##$VDLIST= <DDDDDDDDDDDDDDD>
##$VPLIST= <PPPPPPPPPPPPPPP>
##$VTLIST= <TTTTTTTTTTTTTTT>
##$WBST= 1024
##$WBSW= 4
##$XGAIN= (0..3)
0 0 0 0 
##$XL= 0
##$YL= 0
##$YMAX_a= 1877
##$YMIN_a= -408
##$ZGOPTNS= <>
##$ZL1= 120
##$ZL2= 120
##$ZL3= 120
##$ZL4= 120
##$ABSF1= 0
##$ABSF2= 0
##$ABSG= 0
##$ABSL= 0
##$ALPHA= 0
##$AQORDER= 0
##$ASSFAC= 0
##$ASSFACI= 0
##$ASSFACX= 0
##$ASSWID= 0
##$AUNMP= <proc_1d>
##$AZFE= 0.1
##$AZFW= 0.5
##$BCFW= 0
##$BC_mod= 2
##$BYTORDP= 0
##$COROFFS= 0
##$CY= -3
##$DATMOD= 1
##$DC= 0
##$DFILT= <>
##$DTYPP= 0
##$F1P= 0
##$F2P= 0
##$FCOR= 1
##$FTSIZE= 65536
##$FT_mod= 6
##$GAMMA= 0
##$GB= 0
##$INTBC= 1
##$INTSCL= 9.790993e-09
##$ISEN= 30
##$LB= 1.5
##$LEV0= 0
##$LPBIN= 0
##$MAXI= 10000
##$MC2= 0
##$MEAN= 0
##$ME_mod= 0
##$MI= 50
##$NCOEF= 0
##$NC_proc= -11
##$NLEV= 6
##$NOISF1= 182.463
##$NOISF2= 159.3651
##$NSP= 0
##$NTH_PI= 0
##$NZP= 0
##$OFFSET= 198.0616
##$PC= 4
##$PHC0= 1678.243
##$PHC1= 49.15953
##$PH_mod= 1
##$PKNL= yes
##$PPARMOD= 0
##$PSCAL= 0
##$PSIGN= 0
##$REVERSE= no
##$SF= 81.0140089999434
##$SI= 65536
##$SIGF1= 159.3651
##$SIGF2= -187.1042
##$SINO= 113.3802
##$SIOLD= 16384
##$SREGLST= <1H.CDCl3>
##$SSB= 0
##$STSI= 65536
##$STSR= 0
##$SW_p= 32467.5324675325
##$SYMM= 0
##$S_DEV= 0
##$TDeff= 32768
##$TDoff= 0
##$TI= <>
##$TILT= no
##$TM1= 0
##$TM2= 0
##$TOPLEV= 0
##$USERP1= <user>
##$USERP2= <user>
##$USERP3= <user>
##$USERP4= <user>
##$USERP5= <user>
##$WDW= 1
##$XDIM= 65536
##$YMAX_p= 299632118
##$YMIN_p= -50728388
$$ End of Bruker specific parameters
$$ ---------------------------------
##NTUPLES= NMR SPECTRUM
##VAR_NAME=  FREQUENCY,     SPECTRUM/REAL,   SPECTRUM/IMAG
##SYMBOL=    X,             R,               I
##VAR_TYPE=  INDEPENDENT,   DEPENDENT,       DEPENDENT
##VAR_FORM=  AFFN,          ASDF,            ASDF
##VAR_DIM=   65536,         65536,           65536
##UNITS=     HZ,            ARBITRARY UNITS, ARBITRARY UNITS
##FACTOR=    0.49542278885378, 1,            1
##FIRST=     16045.7642231865, 0,            0
##LAST=      -16421.768244346, 0,            0
##MIN=       -16421.768244346, -50728388,    0
##MAX=       16045.7642231865, 299632118,    0
$$ Real data points
##PAGE= N=1
##DATA TABLE= (X++(R..R)), XYDATA
$$ [...]
38641B234914L84220q2566m65845o56528m32394K74937R77215J082163O68740
$$ 2234914 2619134 2536568 2070723 1414195 981801 1256738 2233953 3316116 3984856
38632C984856K84578R2415j86992n72741p41013o54149n97012n36385j66922L01556
$$ 3984856 4269434 4361849 4174857 3602116 2861103 2206954 1609942 1073557 906635 1208191
38622A208191K24240l58585n40985P5249O67535M73564J968J22632N76009M29642
$$ 1208191 1432431 1073846 532861 608110 1275645 1749209 1751177 1873809 2449818 2879460
38612B879460l25725p35675l81776R8002J31660o3697j68559l28087n70089l65824
$$ 2879460 2553735 1818060 1436284 1534286 1665946 1602249 1433690 1105603 535514 169690
38602A69690N83489J570770J575444N41249o07470j130553j116142r59829p56997
$$ 169690 753179 2323949 3899393 4440642 3833172 2702619 1586477 626648 -130349
38593a30349m35878q1712K14074N78305J056833J259853P90063K1359j29203N29594
$$ -130349 -566227 -647939 -433865 144440 1201273 2461126 3251189 3272548 3143345 3672939
38583C672939R79684L25521q11299j038726j84543M33321o5619r14148r96009
$$ 3672939 4652623 4978144 4166845 3128119 2943576 3376897 3311278 2397130 1401121
38574A401121m98108l32498m65394p160J108996J695259R32673m15847r83024
$$ 1401121 903013 570515 105121 97961 1206957 2902216 3834889 3419042 2436018
38565B436018m76491J87638J61384m32206q16497m44715M65329J130507R51056
$$ 2436018 1959527 2147165 2308549 1876343 1059846 615131 1080460 2210967 3162023
38556C162023J20906n76447n93643j15177K75855K41946o5593k65113j59680O6344
$$ 3162023 3282929 2706482 2112839 1997662 2273517 2515463 2449870 2184757 2025077 2091421
38546B091421Q6600j16807k22610j04049j02408m63080p73169m46021L71213R09746
$$ 2091421 2178021 2061214 1838604 1734555 1632147 1169067 395898 -50123 321090 1230836
38536A230836P68480K69087j67276m16620l79769K6655M34357K50732l91720n78549
$$ 1230836 1999316 2268403 2101127 1684507 1304738 1331393 1765750 2016482 1624762 1046213
38526A046213R4648Q15140O62814j44298p28816p72270n45042j46899M44285Q15370
$$ 1046213 1140861 1956001 2618815 2474517 1745701 973431 428389 281490 725775 1541145
38516A541145M87396k11554m45288p7565J79209p1293l60530k20320Q8408Q5523
$$ 1541145 2028541 1816987 1371699 1294134 1473343 1402050 1041520 821200 909608 995131
38506I95131k11820m60810m78214k28387L05469R20341J188311R57165N84353
$$ 995131 783311 322501 -155713 -384100 -78631 841710 2030021 2987186 3571539
38497C571539M28692M00681K37735j08667n93534j199414j646436j406071m17744
$$ 3571539 4000231 4400912 4638647 4529980 3936446 2737032 1090596 -315475 -733219
38488g33219N70049Q41620N83124M10582L60631J8707n39670p17997l61439k3223
$$ -733219 -163170 678450 1261574 1672156 2032787 2051494 1511824 793827 432388 409165
38478D09165m6952l0425M11192Q59088N98228l35865j108232j038570k67709N29082
$$ 409165 362213 331788 742980 1602068 2200296 1864431 756199 -282371 -550080 -20998
38468b0998Q37368O71158M28310M64053P51040R25803O63071j9359p84871j214088
$$ -20998 816370 1487528 1915838 2379891 3130931 4056734 4719805 4700446 3915575 2701487
38458B701487j060024m38312J97614M13499J92169j09787k00592j16151n0290
$$ 2701487 1641463 1203151 1400765 1814264 2006433 1896646 1696054 1579903 1529613
38449A529613j02590k39135l44783k69156L1253L68654M92111L75898J63133j22937
$$ 1529613 1427023 1187888 843105 573949 605202 973856 1465967 1841865 2004998 1882061
38439A882061n24474q17932o11534J12733Q76570J241797J153735O87878q2406
$$ 1882061 1357587 539655 -71879 40854 917424 2159221 3312956 4000834 3918428
38430C918428p89853q77550l41083J11557L9153j00326J90921N02876J85020m41096
$$ 3918428 3128575 2251025 1909942 2021499 2060652 1960326 2151247 2654123 2839143 2398047
38420B398047m62734J91247O39325L94518p4834k79479l45664m59450m69881l70719
$$ 2398047 1935313 2126560 2765885 3160403 3085569 2806090 2460426 2000976 1531095 1160376
38410A160376m42308n84660k77778M10220O19156L8843m02609O9422P92048P21012
$$ 1160376 718068 133408 -144370 265850 885006 923849 521240 590662 1382710 2103722
38400B103722J21846O6833O37254Q54538L14641k75913l47921k30590l55161n35947
$$ 2103722 2225568 2292401 2929655 3784193 4098834 3822921 3475000 3244410 2889249 2353302
38390B353302m33106j09696J90226L16690R6660n06838j002093p77758n0634L04451
$$ 2353302 1920196 1810500 2000726 2317416 2414076 1907238 905145 127387 76753 381204
38380C81204N5626q4195K22424K61418m51912j067590n21364P71745J382528Q19760
$$ 381204 436830 352635 575059 836477 384565 -683025 -1204389 -432644 949884 1769644
38370A769644L4106q0740J93339J08179l53328n06051K5508P40910Q12573O9856
$$ 1769644 1803750 1723010 1916349 2024528 1671200 1165149 1190657 1931567 2744140 2813996
38360B813996p47403q20358j77760M56583N89114L08627j75108p10391q70921
$$ 2813996 2066593 1246235 1068475 1525058 2114172 2422799 2247691 1537300 666379
38351F66379k25961P77537J026438L07913k00995K86694Q04497J28042j112979
$$ 666379 440418 1217955 2244393 2552306 2351311 2638005 3442502 3570544 2457565
38342B457565j261982k07795M80987M6729m58668j25068L90957K34899j40969
$$ 2457565 1195583 987788 1468775 1515504 1056836 931768 1322725 1557624 1416655
38333A416655K8677L10448j13719p50198l55825J004517J830775J274328J76014
$$ 1416655 1445332 1755780 1642061 891863 536038 1540555 3371330 4645658 4821672
38324D821672l63964m44971p65890j296152j351179o93834J29226N19382M20650
$$ 4821672 4457708 4012737 3246847 1950695 599516 -94318 34908 554290 974940
38315I74940J53473K6332K05179O71005J127040J130399N42094k13710n61418
$$ 974940 1128413 1154745 1359924 2030929 3157969 4288368 4830462 4616752 4055334
38306D055334m59738m20035p13589q65459l05085O50263J002914L60447n01909
$$ 4055334 3595596 3175561 2461972 1596513 1291428 1941691 2944605 3305052 2803143
38297B803143o53274j58028K03799N5322k69043m12089m52649n93340p79088p77874
$$ 2803143 2149869 1991841 2195640 2250962 1981919 1569830 1117181 523841 -255247 -1033121
38287a033121m32726K13861Q71876J129784Q60824M35202K61637K25412n6614
$$ -1033121 -1465847 -1251986 -380110 749674 1610498 2045700 2307337 2532749 2476135
38278B476135n14083o41525k75264J51495K76594K52587L03475L05407J26479
$$ 2476135 1962052 1320527 1045263 1196758 1473352 1725939 2029414 2334821 2461300
38269B461300k0543N8755J57186L2571j47530j41292j12995k89069l94878k5793
$$ 2461300 2440757 2499512 2656698 2689269 2541739 2400447 2287452 1998383 1603505 1577712
38259A577712N63700O77375J72863l70448n35479m85905l48013J34973R47779
$$ 1577712 2141412 2818787 2991650 2621202 2085723 1599818 1251805 1386778 2334557
38250B334557J392550R16256q50l95639r7183J51141j48718n52743l90025K31118
$$ 2334557 3727107 4643363 4642513 4246874 4149691 4300832 4152114 3599371 3209346 3440464
38240C440464N50518J79082m06852n39583k51076j43691m32806n79723j17887
$$ 3440464 3990982 4170064 3763212 3223629 2972553 2828862 2396056 1816333 1698446
38231A698446N47318O35486P9277m41438m92341l06901j46476J10755M84149N80843
$$ 1698446 2245764 2881250 2960527 2519089 2026748 1719847 1573371 1684126 2168275 2749118
38221B749118J60863m28007p29872o78899l38822K97072Q72967P12774j31961
$$ 2749118 2909981 2481974 1752102 1073203 734381 1031453 1904420 2617194 2485233
38212B485233n69377K3935O71685K17607p24214o17650M97194R61052R3829p86147
$$ 2485233 1915856 1939791 2611476 2829083 2104869 1487219 1984413 2945465 3039294 2253147
38202B253147n16354K04538J91275l46663m58353j20816Q06o9625K86720J041520
$$ 2253147 1736793 1941331 2132606 1785943 1327590 1206774 1207580 1137955 1424675 2466195
38192B466195J440070J109083L99258k95164p92596q31269l26821J51907l3644
$$ 2466195 3906265 5015348 5414606 5119442 4326846 3495577 3168756 3320663 3287019
38183C287019n64296n32770J39138N21475R0907n04904m47580J51162N62498L79242
$$ 3287019 2722723 2189953 2329091 2850566 2941473 2436569 1988989 2140151 2702649 3081891
38173C081891k14322p42542p34645n8442Q00577J072916M97376m40712j095198
$$ 3081891 2867569 2125027 1390382 1331940 2132517 3205433 3702809 3262097 2166899
38164B166899j177964p23616J4998N62188N45036J49936r3669j9621P4112J2101
$$ 2166899 988935 265319 280317 842505 1387541 1537477 1443808 1424187 1498299 1510400
38154A510400n7917o9824j17203q1831K54030O59337O25187J80003j13704r2453
$$ 1510400 1452483 1382659 1265456 1183625 1437655 2096992 2722179 2902182 2788478 2696025
38144B696025j88601n05814n18070l6789L33013J75889n5928R9093L03544J17276
$$ 2696025 2507424 2001610 1483540 1446751 1779764 1955653 1899725 1998818 2302362 2419638
38134B419638j69244j20564K1888j37772l67862l56068m71080j033307j327811
$$ 2419638 2250394 2129830 2151718 2013946 1646084 1290016 818936 -214371 -1542182
38125a542182m74343R98471J624104R82828J02443j82222j56087k73598l46098
$$ -1542182 -2016525 -1018054 606050 1588878 1691321 1509099 1353012 1079414 733316
38116G33316j41201N8878L0609P0752L60862M36619j38951r60896j171112m53501
$$ 733316 592115 650993 681602 752354 1113216 1549835 1410884 449988 -721124 -1174625
38106a174625P18090J630737J860303J450853Q12629L22605n3802n52977j053813
$$ -1174625 -456535 1174202 3034505 4485358 5297987 5620592 5566790 5013813 3960000
38097C960000j100731n63924J05963M24690L48371R2216j75440l27015k84037
$$ 3960000 2859269 2295345 2401308 2825998 3174369 3266585 3091145 2764130 2480093
38088B480093j52833r0544l2045J29892J87722q1076l48304j06187M00060L76183
$$ 2480093 2327260 2236716 2204671 2334563 2522285 2441209 2092905 1986718 2386778 2762961
38078B762961k43600n66868j19474L97931K54962j86375j93389J29472J61252
$$ 2762961 2519361 1952493 1833019 2230950 2485912 2299537 2106148 2235620 2396872
38069B396872j57164l71981l29380j85717J25622O82759J050332P41204O3268
$$ 2396872 2239708 1867727 1538347 1352630 1478252 2161011 3211343 3952547 4015815
38060D015815k50391j46960k04229n33779n86081j45344K96301L67291K85478
$$ 4015815 3765424 3618464 3414235 2880456 2294375 2149031 2445332 2812623 3098101
38051C098101K54076J03077j53437j01706L07066M12615k01253r29290r25519
$$ 3098101 3352177 3455254 3301817 3200111 3507177 3919792 3718539 2789249 1863730
38042A863730k86906J67870O8381j76204j39305P4656J18024j26917m57859n56497
$$ 1863730 1576824 1744694 1813075 1636871 1497566 1572222 1690246 1563329 1105470 548973
38032E48973l02879R063n2342m08905m01059L19051J120297J103367L05340l66626
$$ 548973 246094 255157 202815 -206090 -607149 -288098 832199 1935566 2240906 1874280
38022A874280l66138p3169j0638r1402K0928K46094K36597k8163k05375o1724
$$ 1874280 1508142 1434973 1424335 1332933 1353861 1599955 1836552 1808389 1603014 1541290
38012A541290L18391P20676R23128P06841N6076o43678q83874n80485j52218j3962
$$ 1541290 1859681 2580357 3503485 4210326 4266402 3622724 2738850 2158365 2006147 1992185
38002A992185j80158l99248m63933l17459n4465R9924Q503j08514J20897O15465
$$ 1992185 1812027 1412779 948846 631387 576922 676846 685349 576835 697732 1313197
37992A313197P58157K04344m88929m67761K85860Q84350O56761o7948m76115k48827
$$ 1313197 2071354 2275698 1786769 1319008 1604868 2489218 3145979 3078031 2601916 2353089
37982B353089K25356M24504K24562q1564j36525R3548K57696M9259l24712l42174
$$ 2353089 2578445 3002949 3227511 3145947 3009422 3102970 3360666 3409925 3085213 2743039
37972B743039J02576M69188K74563k32274m00135l4511L86828L15812k93430r92679
$$ 2743039 2845615 3314803 3589366 3357092 2956957 2922446 3309274 3625086 3331656 2338977
37962B338977j224945p44863J48172Q19566Q91473N63156K26287m1231l38881
$$ 2338977 1114032 369169 517341 1336907 2228380 2791536 3017823 2976592 2637711
37953B637711n02507k38072L17278N98096L12198j66099k60233J57362O79420
$$ 2637711 2135204 1897132 2214410 2812506 3124704 2958605 2698372 2855734 3535154
37944C535154P59494J69838p30489j201548q57701j64197J21033o8576j55543
$$ 3535154 4294648 4464486 3733997 2532449 1674748 1510551 1631584 1563008 1407465
37935A407465N7191O1853m19848q35149n98592L0065M28388N43710O87604P22749
$$ 1407465 1464656 1526509 1106661 271512 -327080 -297015 131373 675083 1362687 2085436
37925B085436K29465o12126j034594o52836J34515P49123R24323O22958N9508
$$ 2085436 2314901 1702775 668181 15345 149860 898983 1823306 2446264 2505772
37916B505772j91588K36169P74392M87120n13032j049025n65708O2215o5986n14947
$$ 2505772 2314184 2550353 3324745 3811865 3298833 2249808 1684100 1746315 1680329 1165382
37906A165382l39930L81558P87647O03742L21544K03742L1365j79713o0396L82767
$$ 1165382 825452 1207010 1994657 2598399 2919943 3123685 3155050 2975337 2914941 3297708
37896C297708O17007L44481j27158m00552l95264j79307J18283J87193j77837
$$ 3297708 3914715 4259196 4132038 3731486 3336222 3156915 3275198 3462391 3284554
37887C284554o40135o56197k38092J20456J99372J38933j12348o81313j136807
$$ 3284554 2644419 1988222 1750130 1870586 2069958 2208891 2096543 1415230 278423
37878B78423q30946M1690O00050O04270O51910Q68998N64919l69000r03846m20921
$$ 278423 -552523 -510833 89217 693487 1345397 2214395 2779314 2410314 1506468 1085547
37868A085547K49602J74318k77913l16591r1455j01255p7379L55617O38779J66572
$$ 1085547 1335149 1509467 1231554 914963 823508 722253 644874 1000491 1639270 1805842
37858A805842m38724k81467K04205Q8660k10774L29661J165022P52592p49775
$$ 1805842 1367118 1085651 1289856 1378516 1167742 1497403 2662425 3415017 2665242
37849B665242j446792o72660Q5556j59995m08668J67131N60358j21319p27196
$$ 2665242 1218450 545790 631346 471351 62683 229814 790172 668853 -58343
37840e8343J12572J457260J326239j97093j064403k53038J025320J220029K22079
$$ -58343 54229 1511489 2837728 2640635 1576232 1323194 2348514 3568543 3790622
37831C790622r73809j392413o90094N82290J267017P81697r8701k58109K52751
$$ 3790622 2816813 1424400 734306 1316596 2583613 3365310 3266609 3008500 3261251
37822C261251M96619J38704k72757l59078l05979k38547o2515O3592j19693l76824
$$ 3261251 3757870 3896574 3623817 3264739 2958760 2720213 2657698 2721290 2601597 2224773
37812B224773k90850p2904k20558m77928j21374O91912R17584K09206m60741j69813
$$ 2224773 1933923 1861019 1640461 1162533 1041159 1733071 2650655 2859861 2399120 2229307
37802B229307P47604J295127J003967J64877o10216p78921k83518K50517J73936
$$ 2229307 2976911 4272038 5276005 5440882 4830666 4051745 3768227 4018744 4192680
37793D192680l13482n01339k90655k09007l39638j98651J70136K9542p38539j157926
$$ 4192680 3879198 3377859 3087204 2878197 2538559 2339908 2510044 2539586 1801047 643121
37783F43121n66101L72330P14514N36504M58328N28286L79116L3675j85650k23155
$$ 643121 77020 449350 1163864 1700368 2158696 2686982 3066098 3099773 2914123 2690968
37773B690968j79296J506K07531k2846p66828j256057q20803J05021O22608O28634
$$ 2690968 2511672 2513178 2720709 2697863 1931035 674978 -145825 -40804 581804 1210438
37763A210438O53584P63395N37939L4610j38123J85202M39529K51622o952J02410
$$ 1210438 1864022 2627417 3165356 3199966 3061843 3247045 3686574 3938196 3931244 4033654
37753D033654L58688K08093m58939j156375j308885p63366J03438P04392P32022
$$ 4033654 4392342 4600435 4141496 2985121 1676236 912870 1016308 1720700 2452722
37744B452722L60365k6746j94431j33003K234o2066m76266r42076r19269l38361
$$ 2452722 2813087 2786341 2591910 2458907 2461141 2399075 1922809 980733 61464 -276897
37734b76897K17019K81496J10904J78716M08987L74847M5132j74381q5804N6710
$$ -276897 -59878 221618 332522 511238 920225 1295072 1340204 1165823 1080019 1136729
37724A136729k778j49974q8212K51804N65422M63326j7840l12060n80N27744N54898
$$ 1136729 1133951 983977 895765 1147569 1712991 2176317 2158477 1846417 1845837 2373581 2928479
37713B928479J16169n2864K47417L06278k75109q11065o04267q5685q5914n05329
$$ 2928479 3044648 2991784 3239201 3545479 3270370 2459305 1855038 1769353 1683439 1178110
37703A178110n93678j93274J78561K51622J76695k2237l43219l39597L52744J134222
$$ 1178110 584432 391158 569719 821341 998036 975799 632580 292983 645727 1779949
37693A779949J035571J98718k15226K41202O32006P6759r59969j347432p14105
$$ 1779949 2815520 3014238 2799012 3040214 3672220 3748979 2789010 1441578 727473
37684G27473K88498Q15568N89922M9706j28438J61354K50422l41166j024355q90612
$$ 727473 1015971 1831539 2421461 2471167 2342729 2504083 2754505 2413339 1388984 498372
37674D98372j28432K11226j54916l75607N4239N03278L69596P0365J83773M00842
$$ 498372 369940 581166 426250 50643 104882 608160 977756 1048121 1231894 1632736
37664A632736J47554l41008m27015j51866p6140k74062k72937Q5788M04656L74637
$$ 1632736 1780290 1439282 1012267 860401 784261 510199 237262 323050 727706 1102343
37654A102343J31823p4629j59433j23027k4221j2075j18531j20304J07994K63153
$$ 1102343 1234166 1159537 1000104 877077 852856 840781 722250 601946 709940 973093
37644I73093J3374l86600l32171K61039P52513N94421K6308k91713j51340J0187
$$ 973093 986467 599867 267696 528735 1281248 1875669 1901977 1610264 1458924 1469111
37634A469111j88689m65282k38582M84346R85792P65494K17734L3446K35482L09554
$$ 1469111 1280422 815140 576558 1060904 2046696 2812190 3029924 3063370 3298852 3608406
37624C608406R0514j00032j42508k84889n40390n70183l47958l08047n56142n35694
$$ 3608406 3698920 3598888 3456380 3171491 2631101 2060918 1712960 1404913 848771 313077
37614C13077J33392R73019J206481O31750l47923j142861j177182k16755J117195
$$ 313077 446469 1419488 2625969 3257719 2909796 1766935 589753 372998 1490193
37605A490193J664249R97211m6390m85776l48252k57891m21531o11256p13385
$$ 1490193 3154442 4151653 4105263 3619487 3271235 3013344 2591813 1980557 1267172
37596A267172o89372l63051J94471M70177K56127J14163M59975P27669K55773
$$ 1267172 577800 214749 409220 879397 1135524 1249687 1709662 2437331 2693104
37587B693104n08211o72475l55206l34895n14381m6219R85292J361112N71008
$$ 2693104 2184893 1512418 1157212 822317 307936 261717 1247009 2608121 3179129
37578C179129l37408l31939J88785K71877j07249k80348q3011J9732k06896m25813
$$ 3179129 2841721 2509782 2698567 2970444 2863195 2582847 2499836 2519568 2312672 1886859
37568A886859k20929M10655J006857R87316K88141l54914k04840L91748L80753
$$ 1886859 1665930 2076585 3083442 4070758 4358899 4003985 3799145 4190893 4571646
37559D571646m18510r63920n89447k1095j22079m96814l18970J38310J2283n18097
$$ 4571646 4153136 3189216 2599769 2578674 2456595 1959781 1640811 1779121 1791404 1273307
37549A273307m57604K31178M50635k03314p52988m96781j32474m13505p39940
$$ 1273307 815703 1046881 1497516 1294202 541214 44433 -88041 -501546 -1241486
37540a241486k00537P32138Q49741J77256l5168P42075J621889J748162J281513
$$ -1241486 -1442023 -709885 139856 317112 281944 1024019 2645908 4394070 5675583
37531E675583N75683m64840j556725j651175l67736R72500Q97333j46360n05616
$$ 5675583 6251266 5786426 4229701 2578526 2210790 3183290 4080623 3934263 3428647
37522C428647J87671O20709j2200q01952o54958N7406K04450m14074r14674n76755
$$ 3428647 3616318 4237027 4224827 3422875 2767917 2825323 3029773 2615699 1701025 1124270
37512A124270L66672J075484R34329J89218j97158L08809R01273M03374q37663
$$ 1124270 1490942 2566426 3500755 3689973 3492815 3801624 4702897 5106271 4268608
37503D268608j128965P3617J084872L34554j271289j658943n36581N12466N65917
$$ 4268608 3139643 3213260 4298132 4632686 3361397 1702454 1165873 1678339 2244256
37494B244256L60881O20422Q79994N12900k03069o57876p22638m98316n449M37572
$$ 2244256 2605137 3225559 4105553 4618453 4415384 3757508 3034870 2536554 2531105 2968677
37484B968677K89035k99471m11408K59189P44955J96684p78345j007162m26125
$$ 2968677 3257712 2958241 2546833 2806022 3550977 3747661 2969316 1962154 1536029
37475A536029O5461N5998o2125p0753k20769m45557j89654O22535J145396O48853
$$ 1536029 1601490 1657488 1595363 1524610 1303841 858284 668630 1291165 2436561 3085414
37465C085414m22070r35634m25789M77502R01384O29236Q7878k53187k86915k33643
$$ 3085414 2663344 1727710 1301921 1779423 2680807 3310043 3397921 3144734 2857819 2624176
37455B624176l83273p96279j132664r01337o7738P32401Q78163N25996K65858
$$ 2624176 2240903 1444624 311960 -589377 -657115 75286 953449 1479445 1745303
37446A745303J40521l12348r52517q54758K59859J203455P73541m98894j019886
$$ 1745303 1885824 1573476 620959 -233799 26060 1229515 2003056 1504162 484276
37437D84276k62572P64641J070218P12720K27682n3857N2529N07841P52768K60488
$$ 484276 221704 986345 2056563 2769283 2996965 2943108 2995637 3503478 4256246 4516734
37427D516734n12310n77697Q1327M50763J23821j26116J84303L67999j91746r81611
$$ 4516734 4004424 3426727 3508054 3958817 4082638 3956522 4140825 4508824 4317078 3335467
37417C335467j323004j405268j456477q67703O85722K028416J753080K85141o09628
$$ 3335467 2012463 607195 -849282 -1716985 -1031263 997153 2750233 3035374 2425746
37408B425746j65162P27073J077926Q34461L01881l57470q04854o16726L28K91435
$$ 2425746 2260584 2987657 4065583 4900044 5201925 4844455 4039601 3422875 3423203 3714638
37398C714638j8261l97936l83921j68896j20629k40283l04917j67246J68886M61490
$$ 3714638 3696377 3298441 2914520 2745624 2624995 2384712 2079795 1912549 2081435 2542925
37388B542925L33301j52830k86106L53652J034473P11159m58695j298399j230241
$$ 2542925 2876226 2723396 2437290 2790942 3825415 4536574 4077879 2779480 1549239
37379A549239p79142m35648l9866M55809N85338J71988k47036k37960l4535R0449
$$ 1549239 770097 334449 294583 750392 1335730 1507718 1260682 1022722 988187 1078636
37369A078636K93609N66361M23478k31047n96677m8847P77313P32482l12889j365394
$$ 1078636 1372245 1938606 2362084 2131037 1534360 1485513 2262826 2995308 2682419 1317025
37359A317025j569610r79798j73957L68798N04110M36852N37224R03214J158898
$$ 1317025 -252585 -1232383 -1406340 -1037542 -533432 -96580 440644 1343858 2502756
37350B502756Q96518K23694l44864m70656k89005j71128l11824n47043n75107
$$ 2502756 3399274 3622968 3278104 2807448 2518443 2347315 2035491 1488448 913341
37341I13341l69723k19184k47129j79302J44048L90335L39830M68925J188327
$$ 913341 543618 324434 77305 -101997 42051 432386 772216 1241141 2429468
37332B429468J800546J214901l42123j408733j250418o52306m29452l02708J62382
$$ 2429468 4230014 5444915 5102792 3694059 2443641 1791335 1361883 1059175 1221557
37323A221557O01202O36826O53085Q67314N42095p70374j975151j731250m78400
$$ 1221557 1822759 2459585 3112670 3979984 4522079 3751705 1776554 45304 -433096
37314d33096K04624m3203r8033N90026J131059P36140j03607n35765n01655l65748
$$ -433096 -228472 -271675 -369708 220318 1351377 2087517 1983910 1448145 946490 580742
37304E80742j27974L33385P11859N85576P4944k23136J08320Q64788J352183J021200
$$ 580742 452768 786153 1498012 2083588 2158532 1935396 2043716 2908504 4260687 5281887
37294E281887J45091l55826p6368K52809j46646q18418p61083j15311J2844n51877
$$ 5281887 5426978 5071152 4994784 5247593 5100947 4282529 3521446 3406135 3418979 2867102
37284B867102o45970L09555J219841R42422r245m01887j72024k06897o53365o79895
$$ 2867102 2221132 2530687 3750528 4692950 4683705 4281818 4109794 3902897 3249532 2569637
37274B569637N7557P44808N21664l86228r85495o31216L51147R81066N90917l64376
$$ 2569637 2627194 3372002 3893666 3507438 2521943 1890727 2241874 3222940 3813857 3449481
37264C449481p07285k6043O24648N8691j328694j970090j169381J18518P27286
$$ 3449481 2742196 2716153 3340801 3399492 2070798 100708 -1068673 -950155 -222869
37255b22869O72958O59540Q45752P78400K55341l78257p55512q50223p65971n06412
$$ -222869 450089 1109629 1955381 2733781 2989122 2610865 1855353 1005130 239159 -267253
37245b67253q0484L58163O09000O12913M90197L78168K26596j56795p32223j014021
$$ -267253 -347737 10426 619426 1232339 1722536 2100704 2327300 2170505 1438282 424261
37235D24261n49285L57998Q03706L92881j78325m7321N94135P76299J58222n13120
$$ 424261 -125024 232974 1036680 1429561 1251236 1203915 1798050 2574349 2732571 2219451
37225B219451n32404j90520j58458m03121l71826k8857M3698l44425n75894j46265
$$ 2219451 1687047 1496527 1338069 934948 563122 534265 577963 233538 -342356 -488621
37215d88621N34298P29813M04719J19591J23577J63393J50292L64436Q05571R09527
$$ -488621 45677 775490 1180209 1299800 1423377 1586770 1737062 2101498 2907069 3816596
37205C816596K97439n66700q97597n43108j1610K85639L72389L57076K15528l127
$$ 3816596 4114035 3547335 2649738 2106630 2095020 2380659 2753048 3110124 3325652 3322525
37195C322525j48565k63505n38220q26098o20766J84332Q67907O58945k34315
$$ 3322525 3173960 2910455 2372235 1546137 925371 1109703 1977610 2636555 2402240
37186B402240q34653n89301Q6079N01521M88895L12756J43059o7145l38928n72896
$$ 2402240 1567587 978286 1064365 1565886 2054781 2367537 2510596 2443451 2104523 1531627
37176A531627o56280n18394j41572L68409P81506Q93943O42143R9447m90592p30507
$$ 1531627 875347 356953 215381 583790 1365296 2259239 2901382 3000829 2510237 1779730
37166A779730m05509J61908M20680L22285L32005N78587N42840o0442o48267n77162
$$ 1779730 1374221 1536129 1956809 2279094 2611099 3189686 3732526 3672084 3023817 2446655
37156B446655j23587L6787n3862J11676L96130J72519m50367o31413k02387J5669
$$ 2446655 2323068 2359855 2305993 2417669 2813799 2986318 2535951 1904538 1702151 1717820
37146A717820l30921m59247J47879P25332M98468O7241L88369J041093Q26435
$$ 1717820 1386899 927652 1075531 1800863 2299331 2366572 2754941 3796034 4622469
37137D622469k31008q44421m45591O6818j37159o29544n92269m1391M25288N36798
$$ 4622469 4391461 3547040 3101449 3168267 3031108 2401564 1809295 1767904 2193192 2729990
37127B729990M32333K14728p1472k24653l3718M30801Q35265Q09747J98220o88843
$$ 2729990 3162323 3377051 3305579 3080926 3047208 3478009 4313274 5123021 5321241 4632398
37117D632398j181989r66600n45881n15571n70296M1982J137319J591413R38101
$$ 4632398 3450409 2483809 1937928 1422357 852061 894043 2031362 3622775 4560876
37108D560876M9249k24552k16356n85578j059665r19796k61012J61669J06297
$$ 4560876 4610125 4385573 4169217 3583639 2523974 1604178 1343166 1504835 1611132
37099A611132k029Q212j76775n73653o33476m5025P05276R12109N02708L8911
$$ 1611132 1609103 1617315 1440540 866887 233411 188386 893662 1805771 2308479 2347390
37089B347390J0760L24210M81720J92245k94622n59549n91410o95366q81197q11516
$$ 2347390 2358150 2682360 3164080 3356325 3061703 2502154 1910744 1215378 334181 -477335
37079d77335m51417k18974k47456r0591M43261P76229M62803N1582K84703Q55424
$$ -477335 -928752 -1147726 -1395182 -1485773 -1042512 -266283 196520 248102 532805 1388229
37069A388229Q45659J63238l71972k94334M4734K88997M58114M07732j72605r46793
$$ 1388229 2233888 2397126 2025154 1730820 1775554 2064551 2522665 2930397 2757792 1810999
37059A810999r75114N204J047184J184051N34614j92352o39317p28214k91066
$$ 1810999 835885 841089 1888273 3072324 3606938 3414586 2775269 2047055 1755989
37050A755989N28669R64899M71564l86893n80643J2307N33023L68155j78876m89525
$$ 1755989 2284658 3249557 3721121 3334228 2753585 2765892 3298915 3667070 3488194 2998669
37040B998669l60676r92K84069K48646j46919o19253q11068p00966n35741l61581
$$ 2998669 2637993 2637001 2921070 3169716 3022797 2403544 1592476 891510 355769 -5812
37030e812M5105O69616J006205N94740l13418r05038o70625O3252N97722P13415
$$ -5812 39293 708909 1715114 2309854 1996436 1091398 420773 484025 1081747 1795162
37020A795162P62863R01767O86519j85944j078176j010961k8381P31904N30440
$$ 1795162 2558025 3459792 4146311 3960367 2882191 1871230 1842849 2574753 3105193
37011C105193p5347k01777J06924J80815j64536n08257n72181m27919r8037M09710
$$ 3105193 3029846 2828069 2934993 3115808 2951272 2443015 1870834 1442915 1344878 1754588
37001A754588P47546N46198O6518j07336j2601j95244n62961k64571Q62920J585506
$$ 1754588 2502134 3048332 3114850 3007514 2994913 2799669 2236708 1972137 2835057 4420563
36991D420563P84290q73775j678697j047336n6885J74528k49881o19272o92657
$$ 4420563 5204853 4331078 2652381 1605045 1548160 1722688 1472807 853535 160878
36982A60878o16446l10280L53372R71129Q99247J66189m57634m52315j41659q0291
$$ 160878 -455568 -765848 -412476 558653 1457900 1624089 1166455 714140 572481 492190
36972D92190k97453m86202n51121n04604j20893P16457J472354J427080P10340
$$ 492190 194737 -291465 -842586 -1347190 -1468083 -751626 720728 2147808 2858148
36963B858148K03247K51482J79538n52244j381399j441408q34685l64674k78194
$$ 2858148 3061395 3312877 3492415 2940171 1558772 117364 -717321 -1081995 -1360189
36954a360189q8432L94642O67691L88197k1541k340L35383M41649J35789j76422
$$ -1360189 -1448621 -1053979 -386288 1909 -19632 -21972 313411 755060 890849 714427
36944G14427l8754N21898J007069R19894K46478n33078r29671q38386m03698K49214
$$ 714427 675673 1197571 2204640 3124534 3371012 2837934 1908263 1069877 666179 915393
36934I15393R16003J198722Q82041K95534q7752k90536o28896r92706q92929k41752
$$ 915393 1831396 3030118 3912159 4207693 4119941 3829405 3200509 2207803 1314874 1073122
36924A073122M63966Q08966P87976M43177j81403o20183k81567N51112P80854
$$ 1073122 1537088 2346054 3134030 3577207 3395804 2775621 2494054 3045166 3826020
36915C826020P000p62492n16684L15343O14085K25626p5392K8445N9500k27389
$$ 3826020 3833020 3070528 2553844 2869187 3483272 3708898 3633506 3661951 3721451 3494062
36905C494062m01443j47347K13516K73374Q3389j06086k32829l18944k99936j49501
$$ 3494062 3092619 2945272 3158788 3432162 3515551 3409465 3176636 2857692 2557756 2408255
36895B408255L8335J73667K08404J05689k6353N2581K77492J35062n75794j136625
$$ 2408255 2446590 2620257 2828661 2934350 2907997 2960578 3238070 3373132 2797338 1660713
36885A660713p42053K32812O08792M7494n40470m02727J04288L25731K75582K85815
$$ 1660713 918660 1151472 1760264 1807758 1267288 864561 968849 1294580 1570162 1855977
36875A855977L30882K52439J47021L7553l19667p95860o51230L90541J352473
$$ 1855977 2186859 2439298 2586319 2623872 2304205 1508345 857115 1247656 2600129
36866B600129J117877j6670p78884o90214m39867n08462m34205K08542R12998
$$ 2600129 3718006 3701336 2922452 2232238 1792371 1283909 849704 1058246 1971244
36857A971244Q99982K22966l36833k90071O9588J60381j74916n18651l75325K11580
$$ 1971244 2871226 3094192 2757359 2467288 2536876 2697257 2522341 2003690 1628365 1839945
36847A839945O30553L93878k58148o54084n04035j22242J50383L84108P47192
$$ 1839945 2470498 2864376 2606228 1952144 1448109 1325867 1476250 1860358 2607550
36838B607550J024313P82770K5698n92239m42836K33618M98962p7357p27135m71222
$$ 2607550 3631863 4414633 4440331 3848092 3405256 3638874 4137836 4060479 3333344 2862122
36828B862122M28122P45348O8843n94326m00055L5775k75771r94846r44474j695
$$ 2862122 3290244 4035592 4104435 3510109 3110054 3145829 2870058 1875212 930738 929043
36818I29043O85375M33142j20273k21477j05059l19034o61232n08812J53321O77127
$$ 929043 1614418 2047560 1927287 1705810 1600751 1281717 620485 111673 264994 942121
36808I42121O20167K21139j0188P1750J05737k73612q03307p35947J27239R05460
$$ 942121 1562288 1783427 1773239 1844989 1950726 1677114 873807 137860 265099 1170559
36798A170559P07278m0725j54075N04351P97603J16769o67454o32935k24060l63174
$$ 1170559 1877837 1837112 1683037 2187388 2984991 3101760 2434306 1801371 1577311 1214137
36788A214137q52986p36930R1643O95281M78827r5983k99241M0149O44986J168658
$$ 1214137 361151 -375779 -284136 411145 889972 793989 494748 534897 1179883 2348541
36778B348541J280171Q01181m4353p61710j023041p99478k07275M51229O56272
$$ 2348541 3628712 4429893 4385540 3623830 2600789 1801311 1594036 2045265 2701537
36769B701537J44086o10005p96254j90759O48483J071326Q88971L05282l12002
$$ 2701537 2845623 2235618 1439364 1248605 1897088 2968414 3857385 4162667 3850665
36760C850665n94109m61450k63891l44165n37281m41619p9789J34035L1913j46345
$$ 3850665 3256556 2795106 2531215 2187050 1649769 1208150 1128361 1262396 1294309 1147964
36750A147964k21595k65387k94122k00956n6027q5270k79987l71949k35974L530
$$ 1147964 926369 660982 366860 165904 109877 24607 -255380 -627329 -863303 -859773
36740h59773K47721M65187N31777M15681M06192O93407Q63656M02017m06917p79948
$$ -859773 -612052 -146865 384912 800593 1206785 1900192 2763848 3165865 2758948 1979000
36730A979000o13730n72938r06797j034882n79418K3530L39189N75309R22981
$$ 1979000 1365270 792332 -114465 -1149347 -1728765 -1705235 -1366046 -790737 132244
36721A32244J015635O61069M31375P87852J172549P87411j13095n42417j83127
$$ 132244 1147879 1808948 2240323 3028175 4200724 4988135 4875040 4332623 4149496
36712D149496K89152K00894m13703j046955j178744o16296K27910O04649L27294
$$ 4149496 4438648 4639542 4225839 3178884 2000140 1383844 1611754 2216403 2543697
36703B543697L2212J30199P4100o39200j325668r78022J05589P05329N19621L83925
$$ 2543697 2575909 2706108 2780208 2141008 815340 -162682 -57093 648236 1167857 1551782
36693A551782O20495N15269j89533n72287r295O75482M29659m37089q27291m62460
$$ 1551782 2172277 2687546 2498013 1925726 1916431 2591913 3021572 2584483 1757192 1294732
36683A294732L5843K92104M46531M60773P4545n08785o65661k36033K38181L23334
$$ 1294732 1330575 1622679 2069210 2529983 2604528 2095743 1430082 1194049 1432230 1755564
36673A755564K21574K82595M28993L45399l3557m57378o25442l96191J09590N20752
$$ 1755564 1977138 2259733 2688726 3034125 3000568 2543190 1917748 1521557 1631147 2151899
36663B151899M86040L7160m11541m82779j83187J78911L31293K68434J92713K38717
$$ 2151899 2637939 2675099 2263558 1780779 1597592 1776503 2107796 2376230 2568943 2807660
36653B807660K93141J87775K3431N7917K20261O8040n47869j069435q42307K0033
$$ 2807660 3100801 3288576 3312007 3369924 3590185 3658225 3110356 2040921 1198614 1218647
36643A218647P57105Q69144N33446J33050k27449n96681q58459p80949l43552
$$ 1218647 1975752 2844896 3378342 3511392 3283943 2687262 1828803 1047854 704302
36634G04302R2219M1140n16580q36583q4985J479991K438159J782754K16566p54270
$$ 704302 796521 837661 321081 -515502 -600487 879504 3317663 5100417 5316983 4562713
36624D562713p37661n95158p52435n18158M87939J297935Q78697k38167o65362
$$ 4562713 3825052 3229894 2477459 1959301 2447240 3745175 4623872 4385705 3720343
36615C720343j44304K83526J9057l15728j21195J84591K1980k60348M8777P99367
$$ 3720343 3576039 3859565 3878622 3562894 3441699 3626290 3648270 3387922 3436699 4236066
36605D236066J138410P22239L0300n04673r46463j275314j059366j39143Q19270
$$ 4236066 5374476 6096715 6127015 5622342 4675879 3400565 2341199 2202056 3021326
36596C021326R78865L21428m66393r29850j162527j238415r25483j96721M36585
$$ 3021326 4000191 4321619 3855226 2925376 1762849 524434 -401049 -597770 -161185
36587a61185M99555K06809J37468M02733N63805L44272j7903k20395k79275k62194
$$ -161185 338370 545179 682647 1085380 1649185 1993457 1975554 1755159 1475884 1213690
36577A213690l5940L69812M52018k09925j175865j435480n97404O05927J193108
$$ 1213690 1177750 1547562 1999580 1789655 613790 -821690 -1419094 -813167 379941
36568C79941R87718N46647L19221K54045J28947j07516l62434m91815l21431J66829
$$ 379941 1367659 1914306 2233527 2487572 2616519 2509003 2146569 1654754 1333323 1500152
36558A500152O10250N32213q145l42135n8211L20996q990r06429j296844n97544
$$ 1500152 2110402 2642615 2634470 2292335 2234124 2555120 2546130 1639701 342857 -254687
36548b54687M13865N93649p5451n83832l37927J78321L07759J48094J92660M83637
$$ -254687 159178 752827 677376 93544 -244383 -66062 241697 389791 582451 1066088
36538A066088O23141M19789O7878k33407m52204n48556m64967k94016j84487j08678
$$ 1066088 1689229 2109018 2176896 1943489 1491285 942729 477762 183746 -741 -109419
36528a09419K9630J47897J43370J70472L68188M30379k6545o78153o85986J42791
$$ -109419 -79789 68108 211478 381950 750138 1180517 1153972 475819 -210167 -67376
36518f7376R36827P92469j93093j164833j377746o34339O18247J363956Q06625
$$ -67376 869451 1661920 1468827 303994 -1073752 -1708091 -1089844 274112 1080737
36509A080737n05876r83802K5661J224241J085988l7959n76796n6167N17944M73732
$$ 1080737 574861 -408941 -383280 840961 1926949 1888990 1312194 1256027 1773971 2247703
36499B247703L03174M08780L02737l37692q54978o25186r9450k3465k43431j40356
$$ 2247703 2550877 2959657 3262394 2924702 2069724 1444538 1345088 1321623 1078192 937836
36489I37836K21349K70793l1614j85357m4189M7297l6325m7015P1794R1565Q634
$$ 937836 1159185 1429978 1398364 1213007 1168818 1216115 1179790 1132775 1204569 1296134 1304768
36478A304768P1576K54414K71531J79066L53673P26312O66834o5459q04749q39079
$$ 1304768 1376344 1630758 1902289 2081355 2435028 3161340 3828174 3762715 2957966 2118887
36468B118887l81287j84122m35735n82177k18606L30718M99826K34553j6863O2203
$$ 2118887 1737600 1553478 1117743 535566 316960 647678 1147504 1382057 1365194 1427397
36458A427397L27318N00025N29129M48342J38056m22250q23617o29328j02948
$$ 1427397 1754715 2254740 2783869 3232211 3370267 2948017 2124400 1495072 1392124
36449A392124M415m60534p48327k91067M57014P20032M67469K22641K01090K75117
$$ 1392124 1396539 936005 187678 -103389 353625 1073657 1541126 1763767 1964857 2239974
36439B239974M76072Q27548R14580L71452l56262n13374j86135j14724m19090
$$ 2239974 2716046 3543594 4458174 4829626 4473364 3959990 3773855 3659131 3240041
36430C240041m67922r6300Q2810j49004j82429K22469L34294k89307q82349o62281
$$ 3240041 2772119 2675819 2758629 2609625 2427196 2649665 2983959 2694652 1812303 1150022
36420A150022j18089q4765k12050M01439J437849J591228N77666l55459k50509
$$ 1150022 1031933 947168 735118 1136557 2574406 4165634 4743300 4387841 4137332
36411D137332L04718K72502l32759p19412n31386q0624L18695N86919N56213K352
$$ 4137332 4442050 4714552 4381793 3662381 3130995 3050371 3369066 3955985 4512198 4514550
36401D514550q76105j398934j068301j69254M60568K64381m98569j054620q67452
$$ 4514550 3638445 2239511 1171210 1001956 1462524 1726905 1228336 173716 -693736
36392f93736l6247R17825J446291J225469L75515m53050n54217L5547M91130K09583
$$ -693736 -729983 187842 1634133 2859602 3235117 2782067 2227850 2263397 2754527 2964110
36382B964110m22621o04850j81690L05565M13315J54892k90980p08202p46781
$$ 2964110 2541489 1936639 1754949 2060514 2473829 2628721 2337741 1629539 882758
36373H82758k30808M30424O34883L88816J87574J19346k23629q07592r10131k14076
$$ 882758 651950 1082374 1717257 2106073 2293647 2412993 2189364 1381772 471641 257565
36363B57565N16872M33479k15013n31808k57557Q8739J50039P5300o0002m40962
$$ 257565 774437 1207916 992903 461095 203538 292277 442316 517616 457614 16652
36353A6652r01031p44264L75438J735997K182055J405013K50545k76603n7133
$$ 16652 -884379 -1628643 -1253205 482792 2664847 4069860 4320405 4043802 3986669
36344C986669K10956l9119n95234q30865n46104j91403k01879l64699j20890N76970
$$ 3986669 4197625 4158506 3563272 2732407 2186303 1994900 1793021 1428322 1307432 1884402
36334A884402J052825P26678o6456l95307J14019P52886N92404l06946r29725
$$ 1884402 2937227 3663905 3597449 3202142 3316161 4069047 4661451 4354505 3424780
36325C424780n89069K34174N97710L01118q1041j88217k77895n48978o74651l62744
$$ 3424780 2835711 3069885 3667595 3968713 3887672 3699455 3421560 2872582 2197931 1835187
36315A835187Q8156K75970L75732P05431Q43588L5762j381069j853964n23767
$$ 1835187 1923343 2199313 2575045 3280476 4124064 4159826 2778757 924793 401026
36306D01026J339939J685711K48510j161742j054947N685N65019L29325J21725
$$ 401026 1740965 3426676 3675186 2513444 1458497 1464182 2029201 2358526 2480251
36297B480251K46947R3185n49443q89157l67152L48370L29622k19814l61605J19980
$$ 2480251 2727198 2820383 2270940 1381783 1014631 1363001 1692623 1472809 1111204 1231184
36287A231184N01318K57423l47715q25470r28987n05186M08181J186948J037877
$$ 1231184 1732502 1989925 1642210 816740 -112247 -617433 -209252 977696 2015573
36278B015573R9836n23262k05328L34234R8751p63676j216323o97842L44880J105516
$$ 2015573 2115409 1592147 1386819 1721053 1819804 1056128 -160195 -858037 -513157 592359
36268E92359J123253M96958j79292k39288L28552P61679M68976j97655n50455
$$ 592359 1715612 2212570 2033278 1793990 2122542 2884221 3353197 3155542 2605087
36259B605087n86415p64883j024831q18756r5682N23226O64393N85711M70782
$$ 2605087 2018672 1253789 228958 -589798 -685480 -162254 502139 1087850 1558632
36250A558632Q0576n61259q28327l47419L11275L50361j91331n97985m42327P4921
$$ 1558632 1639208 1077949 249622 -97797 213478 563839 372508 -225477 -667804 -592883
36240e92883N54896P50550O38007M65299N27598O29575J56798r03870j502661
$$ -592883 -37987 712563 1350570 1815869 2343467 2973042 3129840 2225970 723309
36231G23309q01159M42393P08351j47137o56013R6068J109181R32320k88246j114039
$$ 723309 -77850 364543 1072894 925757 269744 365812 1474993 2407313 2119067 1005028
36221A005028p62957J45767O81525O22400K76649m2201r3996K60323P95314R69356
$$ 1005028 242071 387838 1069363 1691763 1968412 1926211 1832215 2092538 2887852 3857208
36211C857208M92733l20858r12107j007204p00529k41070J11769K01372R7071
$$ 3857208 4349941 4029083 3116976 2109772 1409243 1168173 1279942 1481314 1578385
36202A578385m245m8548j24409j75348L350L68914N27964K30103k68267n37406
$$ 1578385 1574140 1525592 1401183 1225835 1229185 1598099 2126063 2356166 2087899 1550493
36192A550493m57341j77636J46350L31062J61502k43892l14043K84415J000144
$$ 1550493 1093152 915516 1061866 1392928 1554430 1310538 996495 1280910 2281054
36183B281054R60774J61059m42851j65066N29237O26087k33855j384689j806510
$$ 2281054 3241828 3402887 2960036 2794970 3324207 3950294 3716439 2331750 525240
36174E25240j042446L80203J350077J174555K65715l42102j71602K64929K65803
$$ 525240 -517206 -137003 1213074 2387629 2653344 2311242 2139640 2404569 2670372
36165B670372j72006m83416l17556Q6617K38318o9496n67318q09660o67080m14941
$$ 2670372 2498366 2014950 1697394 1784011 2022329 1952833 1385515 575855 -91225 -506166
36155e06166k52524K0127N59333R73407P79248K36795Q2842M04070M93515K0268
$$ -506166 -758690 -738563 -179230 794177 1573425 1810220 1893062 2297132 2790647 2810915
36145B810915m21201l17680o0121j83048m13191k06134K39952L08065l683j50314
$$ 2810915 2389714 2072034 2011913 1828865 1415674 1209540 1449492 1757557 1753874 1603560
36135A603560O1532L71354O62803R14760P63173k4879p67688n28818M20631Q16287
$$ 1603560 1665092 2036446 2699249 3614009 4377182 4352303 3584615 3055797 3476428 4292715
36125D292715K39608l24311j26656K29783m6414n95821n90400q2568K32106J46180
$$ 4292715 4532323 4208012 4081356 4311139 4264725 3668904 3078504 2995936 3228042 3374222
36115C374222k3578j89883m44486n02660m0144N55709N92448J67679L2872L34210
$$ 3374222 3350644 3160761 2716275 2213615 2173471 2729180 3321628 3489307 3522179 3856389
36105C856389L53041k81354r28742q95575m15379j68985k86664l63330j81666
$$ 3856389 4209430 3928076 2999334 2103759 1688380 1519395 1232731 869401 687735
36096F87735Q5061K52473K94663K11701O5983Q2540L83434O58252M49915j80896
$$ 687735 772796 1025269 1319932 1531633 1597616 1680156 2063590 2721842 3171757 2990861
36086B990861o14178m38928L6857K85321K98824M22678N84778K76107n30960j019690
$$ 2990861 2376683 1937755 1974612 2259933 2558757 2981435 3566213 3842320 3311360 2291670
36076B291670n53559L36432O18345J76380j89981j06243o2537l24021l60318J16388
$$ 2291670 1738111 2074543 2692888 2869268 2679287 2573044 2510507 2186486 1826168 1942556
36066A942556L97502j53255r25680q82656j09697M33628M11311L21529L70960
$$ 1942556 2340058 2186803 1261123 378467 268770 702398 1113709 1435238 1806198
36057A806198K47116L7667K51542P24165O07942k01140p19474m41686j50448m77173
$$ 1806198 2053314 2090981 2342523 3066688 3674630 3473490 2754016 2312330 2161882 1684709
36047A684709p23031p1423R12600J134702O73592M27613N29791L92453N7776J52540
$$ 1684709 961678 890255 1802855 2937557 3611149 4038762 4568553 4961006 5018782 5171322
36037E171322N10209J84036q95991j507130q73723K01946N70025K56898N2323
$$ 5171322 5681531 5865567 4969576 3462446 2588723 2790669 3360694 3617592 3669915
36028C669915K06143K89935M685m80078p87309n64838K44445J067716J051107
$$ 3669915 3876058 4165993 4170678 3690600 2903291 2338453 2582898 3650614 4701721
36019D701721J09603p83591p49603l1078N37801O10995L57245j22589p04550q68279
$$ 4701721 4811324 4027733 3278130 3247052 3784853 4395848 4753093 4630504 3925954 3057675
36009C057675j76260R43966J521325J141071K44576n67771j005150r47734m30141
$$ 3057675 2881415 3825381 5346706 6487777 6732353 6164582 5159432 4211698 3781557
36000C781557J89860N04164M94682L19628j42219r45874j463876r41567K71160
$$ 3781557 3971417 4475581 4970263 5289891 5147672 4201798 2737922 1796355 2067515
35991B067515Q87348L38768n11956o74845k83598k2063k617O8259J26807l2986
$$ 2067515 2954863 3293631 2781675 2106830 1823232 1801169 1798552 1866811 1993618 1960632
35981A960632j11685K87989P77752N74579k21158o06271j31637M52297M09325
$$ 1960632 1848947 2136936 2914688 3489267 3268109 2661838 2530201 2982498 3391823
35972C391823J15128K86564O93176N33436j39578l45350L22023R88672P45936
$$ 3391823 3506951 3793515 4486691 5020127 4880549 4535199 4857222 5845894 6591830
35963F591830p0336m84101l02392j57140l42690m63818l04552k39782m91490o58013
$$ 6591830 6521494 6037393 5735001 5577861 5235171 4771353 4466801 4227019 3735529 3077516
35953C077516l99654k5224Q0752J06048L31928M61245Q3303n31693p97336o99797
$$ 3077516 2677862 2652638 2733390 2839438 3171366 3632611 3715914 3184221 2386885 1687088
35943A687088n98311l96392K22998Q68769P28138j26047o54847l10811L13393
$$ 1687088 1088777 692385 915383 1784152 2512290 2386243 1731396 1420585 1733978
35934A733978O00448P55809J061485J148195O83826J13449N684J99145K75680
$$ 1733978 2334426 3090235 4151720 5299915 5983741 6097190 6102874 6302019 6577699
35925F577699L71388P80830J182831J040065M74394L0446j65735l34547m27057
$$ 6577699 6949087 7729917 8912748 9952813 10427207 10457653 10291918 9957371 9530314
35916I530314l09070k83115o36496q93802l73318O45517J183684R27383M41864
$$ 9530314 9221244 8938129 8301633 7407831 7034513 7680030 8863714 9791097 10232961
35907A0232961M6882n16959j137486j080617j28916Q58146J043215O30785L10872
$$ 10232961 10279843 9762884 8625398 7544781 7415865 8274011 9317226 9948011 10258883
35898A0258883K68729K62089K03566J52514Q5998R4208M51487J124071J581332
$$ 10258883 10527612 10789701 10993267 11145781 11231779 11325987 11777474 12901545 14482877
35889A4482877J461948J044283P01971L46177j50002m44460k29811J21782O6416
$$ 14482877 15944825 16989108 17691079 18037256 17887254 17442794 17212983 17334765 17401181
35880A7401181k17067j20276L73888O99601P15171R29274J525328J878881J497398
$$ 17401181 17184114 17063838 17437726 18137327 18852498 19781772 21307100 23185981 24683379
35871B4683379R36985J192195K402311L753961M643502N344644O315262P404332
$$ 24683379 25620364 26812559 29214870 32968831 37612333 42956977 49272239 56676571
35863E6676571Q283599R343706J1406622J4500165J7633049K0003685K1613632
$$ 56676571 64960170 74303876 85710498 100210663 117843712 137847397 159461029
35856A59461029K2141680K0101532J4331160O069534j661933o918135j0106943
$$ 159461029 181602709 201704241 216035401 222104935 220443002 213524867 203417924
35849B03417924j2283156j3412802j3020056j1560602j0057363q762424p113993
$$ 203417924 191134768 177721966 164701910 153141308 143083945 134321521 127207528
35842A27207528m921151k868104j777212j797203k311465k390310j511393r8598
$$ 127207528 122286377 119418273 117641061 115843858 113532393 111142083 109630690 109532092
35834A09532092R18367J347693K120775M004892O393832Q069557Q902520J0020511
$$ 109532092 110450459 111798152 113918927 117923819 124317651 132387208 141289728 151310239
35826A51310239J2323240J5535096J8805032K1515210K3122309K2681844J9129042
$$ 151310239 163633479 179168575 197973607 219488817 242611126 265292970 284422012
35819B84422012J2194643L015463o210204j3411645j7813085k0033207k1064577
$$ 284422012 296616655 299632118 293421914 280010269 262197184 242163977 221099400
35812B21099400k1329979k0752470j9344836j7397278j5277274j3309125j1692307
$$ 221099400 199769421 179016951 159672115 142274837 126997563 113688438 101996131
35805A01996131j0364908r163638q204504p710162p348171o368913m750686l523731
$$ 101996131 91631223 82467585 74263081 66552919 59204748 52835835 48085149 44561418
35797D4561418l366061l514602k876990j707798j180159j577905j994009j813263
$$ 44561418 41195357 37680755 34803765 33095967 31915808 30337903 28343894 26530631
35789B6530631j479868j577331j970705k170818j950518j364151o42169k02272
$$ 26530631 25050763 23473432 21502727 19331909 17381391 16017240 15375071 15172799
35781A5172799l19453p26566r29499q08753m81818J02218P62078O84818n74954
$$ 15172799 14853346 14126780 13197281 12388528 11906710 12008928 12771006 13455824 12880870
35772A2880870j950564j922624o78839R6997k76537o60533k04992K73165j15303
$$ 12880870 10930306 9007682 8328843 8425840 8149303 7488770 7283778 7556943 7441640
35763G441640p29078n67960K1328J31071l1783L13787Q49474N33321n38489j076026
$$ 7441640 6712562 6144602 6165930 6297001 6265218 6579005 7428479 7961800 7423311 6347285
35753F347285n23840J92835J66559k88674m10836j75759j27104m72726q52469
$$ 6347285 5823445 6016280 6182839 5894165 5483329 5307570 5180466 4707740 3855271
35744C855271q33832l58476K42725N99712O84880P17884O55088J50403p34478
$$ 3855271 3021439 2662963 2905688 3505400 4190280 4908164 5563252 5713655 4979177
35735D979177j245650q39701N722M49865M20242M25120N33918L59993o5989k61472
$$ 4979177 3733527 2893826 2899548 3349413 3769655 4194775 4728693 5088686 5022697 4761225
35725D761225j76655l09279p83293j063293q25469m25653k03229L8493M82284
$$ 4761225 4584570 4275291 3491998 2428705 1603236 1177583 974354 1012847 1495131
35716A495131P96674O41493K50977P3188J47389K22567K05064J18730j15193m67845
$$ 1495131 2291805 2933298 3184275 3257463 3404852 3627419 3832483 3951213 3836020 3368175
35706C368175n77075j41295N49925Q31034M05864l62598r01733r61504o61165
$$ 3368175 2791100 2649805 3199730 4030764 4436628 4074030 3172297 2210793 1549628
35697A549628j72641M74335J198323J587470J143391R068q45979o20147K54919
$$ 1549628 1376987 1851322 3049645 4637115 5780506 5789574 4943595 4323448 4578367
35688D578367N72968q7568q44806p82493j82519l0652o40664j309315j240968
$$ 4578367 5151335 5063767 4218961 3436468 3253949 3223297 2582633 1273318 32350
35679C2350l89038O18979J083774P72512J29960o6173M60785J016321O54438n45059
$$ 32350 -356688 262291 1346065 2118577 2248537 2182364 2643149 3659470 4313908 3768849
35669C768849j326381p00186P48359J482828Q83426q0020k45686K46580M03409
$$ 3768849 2442468 1742282 2490641 3973469 4856895 4776875 4531189 4777769 5181178
35660E181178o7071m62838l21090p1615j50055k54943o8471n4440p02835j396684
$$ 5181178 5114107 4651269 4330179 4258564 4108509 3853566 3785095 3730655 3027820 1631136
35650A631136j036550K72795J138243P09418k28225l99526L62049J175236J323263
$$ 1631136 594586 867381 2005624 2715042 2486817 2087291 2449340 3624576 4947839
35641D947839Q50354J83123l31932n48344n28273m89332o02050q42350j060461
$$ 4947839 5798193 5981316 5649384 5101040 4572767 4083435 3481385 2639035 1578574
35632A578574j076641p24772l2042O19900Q02275N87578M80228O77957P51987
$$ 1578574 501933 -222839 -254881 365019 1167294 1754872 2235100 2913057 3665044
35623C665044K92810m27244p53133m45199R3246L00637j5674n58438q25789o01157
$$ 3665044 3957854 3530610 2777477 2332278 2425524 2726161 2710487 2152049 1326260 725103
35613G25103j93898m2569j12749R906M12132O65667N04532K38276J93686J68451
$$ 725103 531205 488636 375887 385793 797925 1463592 1968124 2206400 2400086 2568537
35603B568537j27954m27853k45517L11172O25814M37352J07083l4502j20473l44919
$$ 2568537 2440583 2012730 1767213 2078385 2704199 3141551 3248634 3214132 3093659 2748740
35593B748740n26874l68758P1135M37810N16677M12056L29097L21983K65923K0826
$$ 2748740 2221866 1853108 1924243 2362053 2878730 3290786 3619883 3941866 4207789 4228615
35583D228615l64493o09621m49603L5425M34593M21549O2717l69202p33654r65843
$$ 4228615 3864122 3254501 2804898 2840323 3274916 3696465 3759182 3389980 2656326 1690483
35573A690483q25567j24099P20406Q54702Q3822o24594l23851N07972N72540k87757
$$ 1690483 864916 740817 1461223 2315925 2399747 1775153 1451302 1959274 2531814 2244057
35563B244057p54043m355R96318R29971K4717n09881l82580l35824o07343n78875
$$ 2244057 1490014 1485659 2481977 3411948 3436665 2926784 2544204 2208380 1601037 1022162
35553A022162q0012J62415k35728o35140m31524N3087K80085L53615N83249Q10689
$$ 1022162 942150 1104565 868837 233697 -197827 -144740 135345 488960 1072209 1882898
35543A882898P58535N38410L13599j9468l62888k52353L15136N54005K2803n86961
$$ 1882898 2641433 3179843 3493442 3473974 3111086 2858733 3173869 3727874 3750677 3163716
35533C163716n42548k69857n15880r02788m91487N34829R95517M89478j16070
$$ 3163716 2621168 2351311 1835431 932643 441156 975985 1971502 2460980 2344910
35524B344910j40545L1523j24190l80536k94878K8585K24652K61533L09297L27674
$$ 2344910 2204365 2235888 2111698 1731162 1436284 1464869 1689521 1951054 2260351 2588025
35514B588025J50343j88380m28767l08953J83116O45834N16467k44194r39161
$$ 2588025 2738368 2549988 2121221 1812268 1995384 2641218 3157685 2913491 1974330
35505A974330r72894o28922n25064o08749l81728R7700K60820J5355j44099l5149
$$ 1974330 1001436 372514 -152550 -761299 -1143027 -1045327 -784507 -769152 -913251 -948400
35495i48400M6376J31836O33997J392673J592147R62835J88586k50457o98418
$$ -948400 -902024 -770188 -136191 1256482 2848629 3811464 4000050 3749593 3051175
35486C051175j289040j302987l55833O26271O08955J632o5404M16702M00278m20245
$$ 3051175 1762135 459148 103315 729586 1338541 1340173 1274769 1691471 2091749 1671504
35476A671504j023299n27463O23606J336285J138278L96719l03174n97569m05526
$$ 1671504 648205 120742 744348 2080633 3218911 3615630 3312456 2714887 2309361
35467B309361O7601M06527K99393j20259l15895J05799Q18489R58489J50540q29969
$$ 2309361 2376962 2783489 3082882 2962623 2646728 2752527 3571016 4529505 4680045 3850076
35457C850076q77908K0895P74933O79634K45434K32971N31680N32360J18450l16494
$$ 3850076 2972168 2993063 3767996 4447630 4693064 4926035 5457715 5990075 6108525 5792031
35447E792031n04014m12855l8476L93207L39598l59097r88243p86646k990N29342
$$ 5792031 5288017 4875162 4836686 5229893 5569491 5210394 4222151 3435505 3432515 3961857
35437C961857O01687O28540O23729J31035p28511j061845m28962M27263N33782
$$ 3961857 4563544 5192084 5815813 5946848 5218337 4156492 3727530 4154793 4688575
35428D688575j10446p32701q54542p10520p15429q45460o38694K04101J258927
$$ 4688575 4578129 3845428 2990886 2280366 1564937 719477 80783 284884 1543811
35419A543811J660210J128812M14326L34711O78626O30924N0334m45464o06532
$$ 1543811 3204021 4332833 4747159 5081870 5760496 6391420 6441754 5996290 5389758
35410E389758q54673j242628j023035J80773J448570J543943M78875n69642p49879
$$ 5389758 4535085 3292457 2269422 2450195 3898765 5442708 5921583 5351941 4602062
35401D602062l55869j72501m96502r64205j081123p36609k28393J42721L68772
$$ 4602062 4246193 4073692 3577190 2612985 1531862 795253 566860 709581 1078353
35392A078353N13581L98271j23658o66480o15896l2896L04256P120l48939j71027
$$ 1078353 1591934 1990205 1866547 1200067 584171 551275 855531 862651 513712 342685
35382C42685J89031O2671l41897j91793O37886J303213J199607P10856M49039
$$ 342685 531716 594387 252490 60697 698583 2001796 3201403 3912259 4361298
35373D361298L67170J02000k52352l09043j07217p4699l10183m46360l19134k64220
$$ 4361298 4728468 4830468 4578116 4269073 4161856 4087157 3776974 3330614 3011480 2747260
35363B747260n20947p80709o66003l08132m6175J47598M47247O25770L57936m3432
$$ 2747260 2226313 1445604 779601 471469 425294 572892 1020139 1645909 2003845 1960413
35353A960413Q3149O73001R15606N05916R9542J37956P4928n73429j179110r18774
$$ 1960413 2043562 2716563 3632169 4138085 4237627 4375583 4450511 3877082 2697972 1779198
35343A779198j93848p9511o36871q40414j35304Q98134J480405J364134N97725
$$ 1779198 1585350 1505839 868968 28554 -106750 791384 2271789 3635923 4233648
35334D233648n46981j330004j134437m23949j98274m29765j69346N94983N69458
$$ 4233648 3686667 2356663 1222226 798277 600003 170238 892 595875 1165333
35325A165333p29077j808519j181609M91678J413049J069100M24993J92491J63559
$$ 1165333 436256 -1372263 -2553872 -2062194 -649145 419955 844948 1037439 1200998
35316A200998Q3184O0561P8829l6234j25271J16287M89654M81269L5560m45775
$$ 1200998 1284182 1344743 1423572 1387338 1262067 1378354 1868008 2349277 2384837 1939062
35306A939062p31047p98199m79840K48865Q42069P79636M09912M30845P08509
$$ 1939062 1208015 409816 -70024 178841 1020910 1800546 2210458 2641303 3349812
35297C349812M79395l38777r41493q33166m25720k76702l89374m18831o6085P19199
$$ 3349812 3829207 3490430 2548937 1715771 1290051 1013349 623975 205144 139059 858258
35287H58258J453467J282374Q0479r47664o32703M98621R55601M03595j76692
$$ 858258 2311725 3594099 3674578 2726914 2094211 2592832 3548433 3952028 3775336
35278C775336k78686l66717n18684j50034N50656M93603m00935p14880J98957
$$ 3775336 3496650 3129933 2611249 2461215 3011871 3505474 3104539 2389659 2588616
35269B588616R52802K58822r80155j068107K1795J001967J283560J184857P36059
$$ 2588616 3541418 3800240 2820085 1751978 1773773 2775740 4059300 5244157 5980216
35260E980216k36847j166441j236601o49104k55168j62141J49925N69013M39312
$$ 5980216 5743369 4576928 3340327 2691223 2436055 2273914 2423839 2992852 3432164
35251C432164j88146n67901n14812n52414p94560p46584k92001J14374K95668
$$ 3432164 3244018 2676117 2161305 1608891 814331 67747 -224254 -109880 185788
35242A85788M53453M42927l7813n60389l72279K86277M50126Q4724J53596P99002
$$ 185788 639241 1082168 1044355 483966 111687 397964 848090 932814 1086410 1885412
35232A885412Q96706l0443q29220m67934L84911M94991j43974o38051n86005j87746
$$ 1885412 2782118 2751675 1922455 1454521 1839432 2334423 2190449 1552398 966393 778647
35222G78647M38171J115405J277292O56491r4258k68217j64074m52905r21319
$$ 778647 1216818 2332223 3609515 4266006 4171748 3903531 3739457 3286552 2365233
35213B365233q20414k06789Q4327k35856n50694m13717j30740o155K47622Q86270
$$ 2365233 1544819 1338030 1422357 1186501 635807 222090 91350 85195 332817 1219087
35203A219087J418167J106757P7454n83177p7026R87102J167063j0259j321476
$$ 1219087 2637254 3744011 3821465 3238288 3161262 4148364 5315427 5305168 3983692
35194C983692j379737m45430J10988j05239j26171N26080Q99170J98256p98150
$$ 3983692 2603955 2158525 2269513 2164274 2038103 2564183 3463353 3661609 2863459
35185B863459r23141m02510k74485n81179m33116L38892Q64813O61294K81498
$$ 2863459 1940318 1537808 1263323 682144 249028 587920 1452733 2114027 2395525
35176B395525K64449L41497Q7431l19270m19911j32752K25100L00912k8736m98570
$$ 2395525 2659974 3001471 3088902 2769632 2349721 2216969 2442069 2742981 2714245 2215675
35166B215675n96225j79879K00101L7233k91669o3739N48293N80604k73962j108087
$$ 2215675 1619450 1439571 1639672 1676905 1385236 1321497 1869790 2450394 2176432 1068345
35156A068345r92246j03474O80585Q14734L84577j95247m56291j95483K24658
$$ 1068345 76099 -27375 653210 1467944 1852521 1657274 1200983 1005500 1230158
35147A230158K19828j98454l67860L5614M29511J33362o21332r63209m85184L41813
$$ 1230158 1449986 1251532 883672 919286 1348797 1482159 860827 -102382 -587566 -245753
35137b45753Q04032O65933K35908m9308o311K36444M46060M75133K80391o7906
$$ -245753 558279 1224212 1460120 1410812 1404501 1640945 2087005 2562138 2842529 2774623
35127B774623l23587k31616R0141J83666j14219l57772j36691K61358K76697p4972
$$ 2774623 2451036 2219420 2309561 2493227 2379008 2021236 1884545 2145903 2422600 2347628
35117B347628l03489k20153m5773J44316M70165P57851N99258k3389o59980r58060
$$ 2347628 2044139 1823986 1778213 1922529 2392694 3150545 3749803 3726414 3066434 2108374
35107B108374q58054l41890M26583Q33044M11374l28518m63373n1819m9955p01453
$$ 2108374 1250320 908430 1335013 2168057 2579431 2250913 1787540 1735721 1685766 984313
35097I84313j053308m79425K98384L41515j55906l73807j06304K40316M37815
$$ 984313 -68995 -548420 -250036 91479 -64427 -438234 -544538 -304222 133593
35088A33593N49738N86865N88131P14654Q43025N18100k55745p49529n83789m28879
$$ 133593 683331 1270196 1858327 2572981 3416006 3934106 3678361 2928832 2345043 1916164
35078A916164q87684j285956n83566Q62665J557277Q59432k72203o81189k97568
$$ 1916164 1028480 -257476 -841042 21623 1578900 2438332 2166129 1484940 1187372
35069A187372K52868N54772M73764r4183r49569j346391o29292Q28907J763263
$$ 1187372 1440240 1995012 2468776 2374593 1425024 78633 -550659 278248 2041511
35060B041511J362195K49313k76610Q1853L01711l44329j065254p02613M04650
$$ 2041511 3403706 3653019 3376409 3458262 3759973 3415644 2350390 1647777 2052427
35051B052427Q31187K09750l03935N6583N80183M80963J95239L92488O60857K41333
$$ 2052427 2883614 3093364 2789429 2846012 3426195 3907158 4102397 4494885 5155742 5397075
35041E397075o11756j045560q65788m34833J52315P94321Q09266k21434j383297
$$ 5397075 4785319 3739759 2873971 2439138 2591453 3385774 4195040 3973606 2590309
35032B590309j367363k93530N00539L73759j101P3197M37633O06967L55980k93334
$$ 2590309 1222946 929416 1429955 1803714 1802613 1875810 2313443 2920410 3276390 2983056
35022B983056r98177j121749n05911P2161k2311k20338K32110P53724K99182o56833
$$ 2983056 1984879 863130 357219 429380 407069 186731 418841 1172565 1471747 814914
35012H14914o74290K23497M91730l46881r16328l52016L46408K05422j21970K09860
$$ 814914 140624 364121 855851 508970 -407358 -759374 -412966 -207544 -329514 -119654
35002a19654O23207K75637l08101k04872J81215j45843r15570r61262j45212M73588
$$ -119654 503553 779190 471089 266217 447432 301589 -613981 -1575243 -1720455 -1246867
34992a246867L42817O7871K16268M81560L57994l8557j71997K14522P63001P83508
$$ -1246867 -904050 -836179 -619911 -138351 219643 181086 9089 223611 986612 1770120
34982A770120K1800q08108o88582L36741J054782O60438k41378o99135p32786
$$ 1770120 1791920 983812 295230 631971 1686753 2347191 2105813 1406678 673892
34973F73892q39162q28273j53958R12373J414438R77122J97378k26769j67355
$$ 673892 -165270 -993543 -1147501 -235128 1179310 2156432 2353810 2127041 1959686
34964A959686J10039K98162K40655J05403K37053O14336P76683N24530J99269
$$ 1959686 2069725 2367887 2608542 2713945 2950998 3565334 4342017 4866547 5065816
34955E065816k8537m66967j036598r29843Q9603Q37382K19361j005438j200035
$$ 5065816 5037279 4570312 3533714 2603871 2693474 3530856 3750217 2744779 1544744
34946A544744k16165N38405K92329j73298j7077M40830M58972k6171n34854o97676
$$ 1544744 1328579 1866984 2159313 1986015 1968938 2409768 2868740 2842569 2307715 1610039
34936A610039m24045J22193M98662L52281p7360k15800R3099N17175P97954Q45276
$$ 1610039 1185994 1308187 1806849 2159130 2081770 1865970 1959069 2476244 3274198 4119474
34926D119474M32107n11884j364921j319559m94152J33558m353m72893n69416
$$ 4119474 4551581 4039697 2674776 1355217 861065 994623 990270 517377 -52039
34917e2039o2130Q18970J522893J349309J68754j042846j121901j84862N67731
$$ -52039 -114169 704801 2227694 3577003 3745757 2702911 1581010 1396148 1963879
34908A963879M96760J05812p2995j77270l34407k34598J86548M31166K43920L4278
$$ 1963879 2460639 2566451 2493456 2316186 1981779 1747181 1933729 2364895 2608815 2643093
34898B643093R7618J20739j05319j80257J77374M95919K00850n37126j060583
$$ 2643093 2740711 2861450 2756131 2575874 2753248 3249167 3450017 2912891 1852308
34889A852308r80659l81824L31313O06555K44564j65894Q5905O92544O80841O637
$$ 1852308 871649 489825 821138 1427693 1672257 1506363 1592268 2284812 2965653 2972290
34879B972290k69966K63017O33001J33178m64868k73062J84537l3357o00560n59265
$$ 2972290 2702324 2965341 3598342 3731520 3266652 2993590 3178127 3144770 2544210 1984945
34869A984945n7947n1788n75990o99404j32342M03120M89939N03293N87012L01507
$$ 1984945 1926998 1875210 1299220 599816 467474 870594 1360533 1863826 2450838 2752345
34859B752345l43150n59994p921N52364M11386n5776j67061o0891k47302n27977
$$ 2752345 2409195 1849201 1841280 2393644 2805030 2749254 2582193 2521302 2274000 1746023
34849A746023k79658L87592O44454J73752l75380l86780p1828J01351J97035M62620
$$ 1746023 1466365 1853957 2498411 2672163 2296783 1910003 1838175 1939526 2136561 2599181
34839B599181N95201J07981o96253r23163l92989M1670j61919l61924J59662Q87230
$$ 2599181 3194382 3302363 2606110 1682947 1289958 1331628 1169709 807785 967447 1854677
34829A854677Q00326R332m09031r7350J65334j14437l69415l8973M83579N50857
$$ 1854677 2655003 2664335 2255304 2157954 2323288 2208851 1839436 1800463 2284042 2834899
34819B834899K38860L0774K4695K127r3319j91035k81980k73581n4291Q5289l41813
$$ 2834899 3073759 3104533 3129228 3131355 3038036 2847001 2565021 2291440 2237149 2322438 1980625
34808A980625j119100j304493n15426M44314P43142O14520O71198Q00804N37328
$$ 1980625 861525 -442968 -958394 -514080 229062 843582 1514780 2315584 2852912
34799B852912K5834k19715j91590k75693n23550o74908o40036m15616J21214Q08245
$$ 2852912 2878746 2659031 2467441 2191748 1668198 993290 353254 -62362 58852 867097
34789H67097J059597P11610M37293O34089N75427m10314j552762j586550o41921
$$ 867097 1926694 2638304 3075597 3709686 4285113 3874799 2322037 735487 93566
34780I3566N3007P5127R9463L99275M29039P4317M4583O30092J114278Q67365
$$ 93566 146573 221700 321163 720438 1149477 1223794 1268377 1898469 3012747 3880112
34770C880112J75031m04389p42097q61109o77426l44610k19635k45337l466M49869
$$ 3880112 4055143 3650754 2908657 2047548 1370122 1025512 805877 560540 557074 1006943
34760A006943N17658L8544l86551k83098J55110O08695J011157J182823Q21243
$$ 1006943 1524601 1563145 1176594 893496 1048606 1657301 2668458 3851281 4672524
34751D672524J05466l75309m87361o26116p98029n14200J57358L92805j16137
$$ 4672524 4777990 4402681 3915320 3289204 2491175 1976975 2134333 2527138 2411001
34742B411001n88627l67766J11531J48553j50529k41398j290L25300N46910M93300
$$ 2411001 1822374 1454608 1566139 1714692 1564163 1322765 1321475 1646775 2193685 2686985
34732B686985R3303k41646K3941N80235N15398j83134m21342K25819O95550J47610
$$ 2686985 2780288 2538642 2562583 3142818 3658216 3475082 3053740 3279559 3975109 4122719
34722D122719o52804o75957l08778m41980p32173k46795O82699P81060j65063
$$ 4122719 3469915 2793958 2485180 2043200 1311027 1064232 1746931 2527991 2362928
34713B362928r97751r15995l12398K26693O41703Q87283O79610R9574l02221k89773
$$ 2362928 1365177 449182 136784 363477 1005180 1892463 2572073 2671647 2369426 2079653
34703B079653k05653k63240k12079P4513K77866J78548M1538J73907M50205N29072
$$ 2079653 1874000 1610760 1398681 1473194 1751060 1929608 1971146 2145053 2595258 3124330
34693C124330L24855Q8431R2697K60843J49838m67262j045195q05644O2481M78769
$$ 3124330 3449185 3537616 3630313 3891156 4040994 3573732 2528537 1722893 1785374 2264143
34683B264143R1892p4310P03870J440532Q35087n79671j081243k70527N01922
$$ 2264143 2356035 2281725 2985595 4426127 5261214 4681543 3600300 3329773 3831695
34674C831695K69425l74846n64441l92668l12412k78692j04304N4356R3444K30399
$$ 3831695 4101120 3726274 3161833 2769165 2456753 2178061 2073757 2128113 2221557 2451956
34664B451956M54565L37267j77218m12486R7235Q10542Q46781R9947p25577r06891
$$ 2451956 2906521 3243788 3066570 2654084 2751319 3561861 4408642 4508589 3783012 2876121
34654B876121k62522P41330J231860O62478m99266j207602j077262o89494n63923
$$ 2876121 2613599 3354929 4586789 5249267 4750001 3542399 2465137 1775643 1211720
34645A211720m99811k12145O8121P2532J0435J46143L46088M63658O59879Q94713
$$ 1211720 711909 499764 567885 640417 650852 796995 1143083 1606741 2266620 3161333
34635C161333O63201j83128q59818n88050K63579P01547N01923L04626M28056
$$ 3161333 3824534 3641406 2781588 2193538 2457117 3158664 3660587 3965213 4393269
34626D393269M04427j38711p82570q59091l46285J17139K0753m24740n58786j07082
$$ 4393269 4797696 4658985 3876415 3017324 2671039 2788178 2808931 2384191 1825405 1718323
34616A718323M19981L72689j25683l38249j2987K36987p6644m87198k43262N46233
$$ 1718323 2138304 2510993 2385310 2047061 2034074 2271061 2194417 1707219 1463957 2010190
34606B010190J037912P78843J55123k49361k40919Q0594N23885P37963L43580
$$ 2010190 3048102 3826945 3982068 3732707 3491788 3572382 4096267 4834230 5177810
34597E177810n49978j167869p73165M23545J322556J077775M6213o51490m73331
$$ 5177810 4627832 3459963 2686798 3110343 4432899 5510674 5556887 4905397 4432066
34588D432066m49k0366m90476p81641o25939l00744n1056J01277M9940l07705
$$ 4432066 4431617 4411251 3920775 3139134 2513195 2212451 2161395 2262672 2312612 2004907
34578B004907o84164o91114n14390o38259q60840l94879Q21323J744660J579661
$$ 2004907 1320743 629629 115239 -523020 -1383860 -1778739 -957416 787244 2366905
34569B366905P70395J43656k08890n48376o62571k67523K08672J27106l13000
$$ 2366905 3137300 3280956 3072066 2523690 1861119 1593596 1802268 1929374 1616374
34560A616374l50527J26285M33286J86830j56585l7688M43360P25855M42782k69460
$$ 1616374 1265847 1392132 1825418 2012248 1855663 1817975 2261335 2987190 3429972 3160512
34550C160512r34657j154733r40214n61868j14203M56638Q78790O68407m0539
$$ 3160512 2225855 1071122 130908 -430960 -545163 -88525 790265 1458672 1418133
34541A418133l90347M7626O11062O05650M15404P50153J263428R42950k73591
$$ 1418133 1027786 1075412 1686474 2292124 2707528 3457681 4721109 5664059 5390468
34532E390468j260865j193613m83839l5352j67761m86972m14148K43704R65308
$$ 5390468 4129603 2935990 2452151 2416799 2249038 1762066 1347918 1591622 2556930
34523B556930R12477J9502o49689k07710P52797R41940J77093n39099o07486m42319
$$ 2556930 3469407 3488909 2839220 2631510 3384307 4326247 4503340 3964241 3356755 2914436
34513B914436m24451l18449j9556Q8702p6711j6202L96138M81433j82130r62307
$$ 2914436 2489985 2171536 2151980 2240682 2163971 2147769 2543907 3025340 2843210 1880903
34503A880903j016074l73067L40108P37905P53323M00966k7248j4427M29507N53983
$$ 1880903 864829 491762 831870 1569775 2323098 2724064 2696816 2682389 3111896 3665879
34493C665879o2230p24892n50349K27717N98023J80378m07960n18618j91625J51626
$$ 3665879 3603649 2878757 2328408 2556125 3154148 3334526 2926566 2407948 2216323 2367949
34483B367949K80959K79507L07845L34587J24400l64005o66654l14580L47309
$$ 2367949 2648908 2928415 3236260 3570847 3695247 3331242 2664588 2350008 2697317
34474B697317M29370k28696p13588l51322K87220K86328k34539l93804P0661M36454
$$ 2697317 3126687 2897991 2184403 1833081 2120301 2406629 2172090 1778286 1848947 2285401
34464B285401K0610r17957j372568n35913J257931K474130J770641k95763j594941
$$ 2285401 2306011 1388054 15486 -520427 737504 3211634 4982275 4686512 3091571
34455C091571r12315N61631Q90892j23534j048100r16564j21670N93546R37567
$$ 3091571 2179256 2740887 3631779 3508245 2460145 1543581 1421911 2015457 2953024
34446B953024Q16872K45807l19293l49011p5144k05844p32140q72039l82413j7390
$$ 2953024 3769896 4015703 3696410 3347399 3272255 3066411 2334271 1462232 1079819 1062429
34436A062429l05333o99271m83955J28942M24460K51689Q8143L03901Q02866J209984
$$ 1062429 757096 57825 -426130 -297188 127272 378961 467104 771005 1573871 2783855
34426B783855J137918N03081k28823m28796j14978J8708l97105q40153o68738
$$ 2783855 3921773 4424854 4196031 3767235 3652257 3670965 3273860 2433707 1764969
34417A764969m5861L28620J09275m61595r58386j051458o22539M7006M13057L00392
$$ 1764969 1719108 2047728 2157003 1695408 737022 -314436 -936975 -889969 -476912 -176520
34407a76520J52082L39766N43922K63009l15268m97985n6464N00016O54876M58629
$$ -176520 -24438 315328 859250 1122259 806991 309006 252542 752558 1407434 1866063
34397A866063K68460K54692L17806K74256k781m81032r16270r99345o20805L4479
$$ 1866063 2134523 2389215 2707021 2981277 2978496 2497464 1581194 581849 -38956 -4477
34387d477O22639Q37221N86247R7206k25836j70659J06436L44264M93303O26451
$$ -4477 618162 1455383 2041630 2138836 1913000 1742341 1848777 2193041 2686344 3312795
34377C312795O53539L69560j87097o25818n93730k09683M9140m8964j51881J96478
$$ 3312795 3966334 4335894 4148797 3522979 2929249 2719566 2768706 2719742 2567861 2764339
34367B764339Q06761R52078L71310k48430j72295L21768L34433l59337j025564
$$ 2764339 3571100 4523178 4894488 4646058 4473763 4795531 5129964 4770627 3745063
34358C745063r93062l73307L21372O92773M63234l88665j238863j184035j71234
$$ 3745063 2752001 2378694 2700066 3392839 3856073 3467408 2228545 1044510 873276
34349H73276P65303P69714J40516l47720m99449n40608m72082k50093j65281l52418
$$ 873276 1638579 2408293 2548809 2201089 1701640 1161032 688950 438857 273576 -78842
34339g8842l33302K19702O91322L79802j97435R4845J230999J935911J454195
$$ -78842 -412144 -192442 498880 878682 681247 776092 2007091 3943002 5397197
34330E397197L78376m76853r96326j222561r00210j11402M51879M26539K81467
$$ 5397197 5775573 5298720 4302394 3079833 2179623 2068221 2520100 2946639 3228106
34321C228106L60295K13576m46263r16597n19334J94124K59782j66025k02028
$$ 3228106 3588401 3801977 3355714 2439117 1919783 2113907 2373689 2207664 2005636
34312B005636J63251J21584l76687l96832L66658R59062O78668J78837L20404
$$ 2005636 2168887 2290471 1913784 1516952 1883610 2842672 3521340 3700177 4020581
34303D020581P61216N91813j89525p74807p75035m51844M0831O80769R13704L8272
$$ 4020581 4781797 5373610 5184085 4409278 3634243 3182399 3223230 3903999 4817703 4855975
34293D855975j473019k024543q59725P71272J161676L38172k16877K13062P00560
$$ 4855975 3382956 1358413 498688 1269960 2431636 2769808 2552931 2765993 3466553
34284C466553K53549o49119p72678J05007R20846P61268r5369p82839r94698j089615
$$ 3466553 3720102 3070983 2298305 2403312 3324158 4085426 3990057 3207218 2212520 1122905
34274A122905j262537j138945l61379P39808J382099J169123M35549k43081n97830
$$ 1122905 -139632 -1278577 -1639956 -900148 481951 1651074 2086623 1843542 1245712
34265A245712o16908k73882L49070Q09316O21811o4572m73652j33046M66198M99998
$$ 1245712 628804 354922 703992 1513308 2135119 2070547 1596895 1463849 1930047 2430045
34255B430045m2601l30528R1459N71074K77898m56738m55635N64955J358025P89440
$$ 2430045 2387444 2056916 2148375 2719449 2997347 2540609 2084974 2649929 4007954 4797394
34245D797394m85515q96878k37134R9978o51313j398105r17927K24018O38695
$$ 4797394 4311879 3415001 3177867 3277845 2626532 1228427 310500 534518 1173213
34236A173213K93924L09495Q74490R49403K15753k33734K42350O60958M4515q94670
$$ 1173213 1467137 1776632 2651122 3600525 3816278 3582544 3824894 4485852 4530367 3635697
34226C635697q72407k5309M91308L60163K25008K37638j47291q71989j020111
$$ 3635697 2763290 2737981 3229289 3589452 3814460 4052098 3904807 3032818 2012707
34217B012707j96000P94631J004347L41833p21273j668878j924697j144377R4773
$$ 2012707 1816707 2611338 3615685 3957518 3236245 1567367 -357330 -1501707 -1406934
34208a406934O23289J14052m67684k42365M47251P63025N65585K70078N5598j20275
$$ -1406934 -783645 -669593 -1137277 -1379642 -932391 -169366 396219 666297 721895 601620
34198F01620j29064P3641J31835j86613m54187j43543N52171J000373R43513N10642
$$ 601620 472556 546197 678032 491419 37232 -106311 445860 1446233 2389746 2900388
34188B900388j99038q86122q06816L51291J561456J416759Q951j132842j132773
$$ 2900388 2701350 1815228 1008412 1359703 2921159 4337918 4346869 3214027 2081254
34179B081254p37958p79949p62880J13884J289852J408983L27984o03886m57827
$$ 2081254 1343296 563347 -199533 -85649 1204203 2613186 2941170 2337284 1879457
34170A879457Q6842l4123o54202p65782q5496O44506Q10275N51366J40046m33592
$$ 1879457 1966299 1932176 1277974 512192 426696 1071202 1881477 2432843 2572889 2139297
34160B139297r24744o75004L92850J222956Q47029k36687p32947l17306J97173
$$ 2139297 1214553 539549 932399 2155355 3002384 2765697 2032750 1715444 1912617
34151A912617L21029M40999P69903Q19552L55157l7715Q1778K29496j79828q52125
$$ 1912617 2233646 2674645 3444548 4264100 4619257 4581542 4663320 4892816 4712988 3860863
34141C860863j122528r29432o32132l22206K4195J27390j84880m96219l63913
$$ 3860863 2738335 1808903 1176771 854565 878760 1006150 821270 325051 -38862
34132c8862j7463J00862P8456J65900J36351k21864m29711k5368M49871J71432
$$ -38862 -56325 44537 122993 288893 425244 203380 -226331 -251699 198172 369604
34122C69604n67526p50298k27889K16463K83380M35591P42836O91689L03692K00175
$$ 369604 -197922 -948220 -1176109 -959646 -676266 -240675 502161 1193850 1497542 1697717
34112A697717L23078p5211p94894n26020R56298J883499Q96564q38809j292910
$$ 1697717 2020795 1945584 1150690 624670 1580968 3464467 4361031 3522222 2229312
34103B229312m55992P947n08394q52896j90301P08070P60178J22233k32272R2171
$$ 2229312 1773320 1781267 1272873 419977 229676 937746 1697924 1820157 1587885 1680056
34093A680056N44835M37478k73748r93868j127792o81250j76816l326q4032k38607
$$ 1680056 2224891 2662369 2388621 1394753 266961 -414289 -591105 -594431 -678463 -917070
34083i17070m86948p58523o82646n6938P18494J043909P94781L28074K2931M6150
$$ -917070 -1404018 -2162541 -2845187 -2902125 -2183631 -1139722 -344941 -16867 6064 52214
34073E2214L17602N03007L59473K35180P10032J497773J420636K0054j485847
$$ 52214 369816 872823 1232296 1467476 2177508 3675281 5095917 5115971 3630124
34064C630124j640790o33722J51359Q4325k27904k18048l7189J24069M11908P37376
$$ 3630124 1989334 1355612 1506971 1591296 1363392 1145344 1108155 1232224 1644132 2381508
34054B381508O24243m3359p37121j001995q93460n26321J55298Q89501J042524
$$ 2381508 3005751 2962392 2225271 1223276 329816 -196505 -41207 848294 1890818
34045A890818M63465j23773k2982N42923Q53494O53255K67487J6960n8695k1868
$$ 1890818 2354283 2230510 2207528 2750451 3603945 4257200 4524687 4541647 4482952 4461084
34035D461084P5744J50906J20532l7605k80748m56326l33780P9776L36152K4217
$$ 4461084 4536828 4687734 4808266 4770661 4489913 4033587 3699807 3779583 4115735 4139952
34025D139952n67183p11389k46663J61885m3383n59465o93238k40670M12768Q10564
$$ 4139952 3572769 2861380 2614717 2776602 2733219 2173754 1480516 1239846 1652614 2463178
34015B463178P50791K88115l14768p28488q03620o09727k48551J58960L50466
$$ 2463178 3213969 3502084 3187316 2458828 1655208 1045481 796930 955890 1306356
34006A306356J49831j47131j8622N53383J012442J001250P34786M33443n6984
$$ 1306356 1456187 1309056 1290434 1843817 2856259 3857509 4592295 5025738 4968754
33997D968754p46457j140136r00638m76208n06670q71595r07809m10390J75223
$$ 4968754 4222297 3082161 2181523 1705315 1198645 327050 -580759 -991149 -815926
33988h15926N14655P48716R85005R49758M38266k14524m65943k54185m4626j45413
$$ -815926 -301271 447445 1432450 2382208 2820474 2605950 2140007 1885822 1841196 1695783
33978A695783k43365J33585Q03044R81320L20290m90147n58793L3737M51927L52288
$$ 1695783 1452418 1586003 2389047 3370367 3690657 3200510 2641717 2675454 3127381 3479669
33968C479669K06668L04683K10617m08276j048820j017203l99389J38881K28763
$$ 3479669 3686337 3991020 4201637 3793361 2744541 1727338 1327949 1466830 1695593
33959A695593N975k89623m55957k95314J27305M12447L99982M95037R44867J172991
$$ 1695593 1701568 1411945 955988 660674 787979 1200426 1600408 2095445 3040312 4213303
33949D213303N27507n52307r27195k81343N14510O36345J52093n28479j256281
$$ 4213303 4740810 4188503 3261308 2979965 3494475 4130820 4282913 3754434 2498153
33940B498153j806426j610050m08564J170996K156612K127041J308671J64341
$$ 2498153 691727 -918323 -1326887 -155891 2000721 4127762 5436433 5600774
33932E600774p51867r37556m64000r7758l85253q35459n87471K79971Q10725N50839
$$ 5600774 4848907 3911351 3447351 3349593 2964340 2128881 1541410 1821381 2632106 3182945
33922C182945J09347J02881K59513N2119l52651m39336k72392l32825n80880m62095
$$ 3182945 3292292 3395173 3654686 3706805 3354154 2914818 2642426 2309601 1728721 1266626
33912A266626R1405M15271J17194l29781l63755j25260j2846L5420K49736M45227
$$ 1266626 1358031 1773302 1890496 1560715 1196960 1071700 1058854 1094274 1344010 1789237
33902A789237L78765L50277P26228J117932Q55255J56511p5446L15129M31355
$$ 1789237 2168002 2518279 3244507 4362439 5217694 5374205 5298759 5613888 6045243
33893F045243k80840j178265j393900r51508l95916Q3818N66959Q77964P48873
$$ 6045243 5764403 4586138 3192238 2240730 1844814 1928632 2495591 3373555 4122428
33884D122428K63175k73529o54862o96064k41433M32699O91498L94077J67435
$$ 4122428 4385603 4112074 3457212 2761148 2519715 2952414 3643912 4037989 4205424
33875D205424M04578N73342J02241o09698p95348m74348k22441j70478p7666j03247
$$ 4205424 4610002 5183344 5285585 4675887 3880539 3406191 3183750 3013272 2935606 2832359
33865B832359n92713j243400j353984q42843k31341K82275Q98801J453794J474570
$$ 2832359 2239646 996246 -357738 -1200581 -1431922 -1149647 -250846 1202948 2677518
33856B677518J011631N60281J74983m16578q61342m71810L97545N01733l82517
$$ 2677518 3689149 4249430 4424413 4007835 3146493 2674683 3072228 3573961 3191444
33847C191444r22005k17615Q33002J002545N24608L57005M87854K27579l14149
$$ 3191444 2269439 2051824 2884826 3887371 4411979 4768984 5256838 5484417 5170268
33838E170268l42191J81138L63333k51948j072915j387260j146766o48017j03792
$$ 5170268 4828077 5009215 5372548 5120600 4047685 2660425 1513659 865642 761850
33829G61850K45333J73590j13979p3288M24249Q22922O06281n1596n98892p70040
$$ 761850 1007183 1180773 1066794 993506 1417755 2240677 2846958 2795362 2196470 1426430
33819A426430o62712l86985K1714M09189N27051L37894J18087J09832J59950q2851
$$ 1426430 763718 376733 398447 807636 1334687 1672581 1790668 1900500 2060450 1977599
33809A977599n91277q49959n01435J45271N49350O57780P61204Q02358M18953
$$ 1977599 1386322 536363 34928 180199 729549 1387329 2148533 2950891 3369844
33800C369844l26452q88852j039671j101527j197373r51325k68116K77831L04948
$$ 3369844 3043392 2154540 1114869 13342 -1184031 -2135356 -2403472 -2125641 -1820693
33791a820693K43034N33578Q24184O31644K44169J76424K19838o7232l37906M0118
$$ -1820693 -1577659 -1044081 -219897 411747 655916 832340 1052178 984946 647040 687158
33781F87158P25124P78712K30055Q0900O07835Q47410J66365p39731j000543p88335
$$ 687158 1412282 2190994 2421049 2501949 3109784 3957194 4123559 3383828 2383285 1594950
33771A594950o66744n07671R3370Q69348J207908J081041Q79066N96962k8742
$$ 1594950 928206 420535 513905 1383253 2591161 3672202 4551268 5148230 5119488
33762E119488p35805q85955m17437L3749N7898q5319q8777q8471k68339m35909
$$ 5119488 4383683 3497728 3080291 3114040 3171938 3086619 2997842 2909371 2641032 2205123
33752B205123l45552j56015k10062m86109n66924j70180M49776P10821L28860
$$ 2205123 1859571 1703556 1493494 1007385 440461 270281 720057 1430878 1759738
33743A759738l00159m90140j04366K32417j0134m70052m12539J10096K90323j41005
$$ 1759738 1459579 969439 865073 1097490 1087356 617304 204765 314861 605184 464179
33733D64179m17510L0811N58481L00118l12757j18908Q01727R77582k30695j414804
$$ 464179 46669 77480 635961 936079 623322 504414 1306141 2283723 2053028 638224
33723F38224j006652M53160J100280L55702n42043n58147j07591N8954M2530K08382
$$ 638224 -368428 84732 1185012 1540714 998671 440524 332933 391887 434417 642799
33713F42799L22649Q9148j15415J14261L49024j5303o36450o99129k39061p338
$$ 642799 965448 1054596 939181 1053442 1402466 1387163 750713 51584 -187477 -194815
33703a94815j41340j1762N39071Q38174N24321J09103J2268q1512l81268l28395
$$ -194815 -336155 -347917 191154 1029328 1553649 1662752 1675020 1593508 1212240 883845
33693H83845M88439J359144J233122J66452p64761q62173m69217k49259l27924
$$ 883845 1372284 2731428 3964550 4131002 3366241 2504068 2034851 1785592 1457668
33684A457668k81864K68640J100605J399575N88761p65798j338434o11325M39227
$$ 1457668 1175804 1444444 2545049 3944624 4533385 3767587 2429153 1817828 2257055
33675B257055O52382J57827r3832J60472L01962l0833m59501n71864m00103q9001
$$ 2257055 2909437 3067264 2973432 3133904 3435866 3405033 2945532 2373668 1973565 1884564
33665A884564K90922M95435K68422j36601j78100J33553K39350j9310j69467k3998
$$ 1884564 2175486 2670921 2939343 2802742 2624642 2758195 2997545 2978235 2808768 2784770
33655B784770m0306l93875m88094L7588N07065J60861o00643p52244j21215M71729
$$ 2784770 2744464 2350589 1862495 1900083 2407148 2568009 1967366 1215122 1093907 1565636
33645A565636M09512j08321o08822q54006p71275m14762n1830J13309K40631M92775
$$ 1565636 1975148 1866827 1258005 403999 -367276 -782038 -833868 -720559 -479928 12847
33635A2847N84578K33558j63492j1097M55094M32989j45952m56481p4956M56311
$$ 12847 597425 830983 667491 656394 1111488 1544477 1398525 942044 867088 1323399
33625A323399O54249P76920J005642Q26216o0778r12267q69147k44100m8354n32563
$$ 1323399 1977648 2754568 3760210 4586426 4525648 3613381 2744234 2500134 2451780 1919217
33615A919217r86565q19456j44802N89146R58367P12534J25964l1363N30048R80800
$$ 1919217 932652 113196 -31606 557540 1515907 2228441 2354405 2323042 2853090 3833890
33605C833890M44302o06994r53032m19146K8088l2383P4940O81624J005336M71314
$$ 3833890 4278192 3671198 2718166 2299020 2327108 2294725 2369665 3051289 4056625 4527939
33595D527939k14314j77391K01026m6366q60630j202950n31266N92769J319978
$$ 4527939 4313625 4136234 4337260 4290894 3430264 2227314 1696048 2288817 3608795
33586C608795J276401N60048m03353r75072q00630k54924P157r2548q9959J69241
$$ 3608795 4885196 5445244 5041891 4066819 3266189 3011265 3018422 2925874 2835915 3005156
33576C005156K45107k01202q68395j184200r19078k59969M65001R30725Q85243
$$ 3005156 3250263 3049061 2180666 996466 77388 -182581 282420 1213145 2098388
33567B098388L48851k76871m99510k32694Q6887J7661k98611l24599K6689J33811
$$ 2098388 2447239 2170368 1670858 1438164 1525051 1542712 1244101 919502 946191 1080002
33557A080002l98706r28415n37126N72215J221869Q42559R3951k83611l51326
$$ 1080002 681296 -247119 -784245 -212030 1009839 1852398 1946349 1662738 1311412
33548A311412l21703M3652P11966Q65914J6635r43989p83074L39878J128570R07810
$$ 1311412 989709 1033361 1745327 2611241 2627876 1683887 900813 1240691 2369261 3277071
33538C277071K08134k70968l90236k89917j68769l28803p50082p55383J37113
$$ 3277071 3485205 3214237 2824001 2534084 2365315 2036512 1286430 531047 668160
33529F68160J217713J354896O15120O4515K0948k48935r16667j044335k11865
$$ 668160 1885873 3240769 3855889 3920404 3941352 3692417 2775750 1731415 1519550
33520A519550N35365K21829n24371m55834M47633J126106J021438N57565K26637
$$ 1519550 2054915 2276744 1752373 1296539 1744172 2870278 3891716 4449281 4675918
33511D675918L7292j10353j40204k6782N8539p3802m36843p88492p34085j65021
$$ 4675918 4713210 4602857 4462653 4435871 4494410 4420608 3983765 3195273 2461188 2296167
33501B296167L88533K49291m84337r95312q52383m72481k61099L8940P19739J401429
$$ 2296167 2684700 2933991 2449654 1454342 601959 129478 -131621 -92681 627058 2028487
33491B028487J471050Q46247q2954q78734j132250o42645J28710L35950j51715
$$ 2028487 3499537 4345784 4262830 3384096 2251846 1609201 1737911 2073861 1922146
33482A922146n24831k57987J94566L84021O31356J082244R35989l17575j612144
$$ 1922146 1397315 1139328 1333894 1717915 2349271 3431515 4367504 4049929 2437785
33473B437785j497217j86607P89208O85116J08108l03265n11999m23049J87527
$$ 2437785 940568 753961 1543169 2228285 2336393 2033128 1521129 1098080 1285607
33464A285607R27354J027794M87753Q064k68353q29980j478234j228984K5074
$$ 1285607 2212961 3240755 3728508 3736572 3468219 2638239 1160005 -68979 -43905
33455d3905R75364P07658O157K1661N26170M99031j50130n21425j64018L42735
$$ -43905 931459 1639117 1645274 1666935 2193105 2692136 2542006 2020581 1856563 2199298
33445B199298L04112k17969o11647m81555q0441j048l91055o51540k56027L44193
$$ 2199298 2503410 2285441 1673794 1192239 1111798 1110750 719695 68155 -187872 156321
33435A56321K85864l09375l90352L78448R96130O30200j72997m91062m24839n72030
$$ 156321 442185 132810 -257542 120906 1117036 1747236 1574239 1083177 658338 86308
33425H6308p43640l30100L84360M52697j80633m20679L98676J505974J697116
$$ 86308 -657332 -987432 -603072 -150375 -331008 -751687 -353011 1152963 2850079
33416B850079Q10245k28208n31865j10847K69036n6299q75522j279214p69514
$$ 2850079 3660324 3432116 2900251 2789404 3058440 3002141 2126619 847405 77891
33407G7891M2759K05562l35228p86651o70384k89901r85K88010O35335P07564
$$ 77891 120650 326212 -9016 -795667 -1466051 -1755952 -1756937 -1468927 -833592 -126028
33397a26028L19558j29390k15003j17250k09214l43825j40449K27022K21894r0187
$$ -126028 193530 64140 -150863 -268113 -477327 -821152 -961601 -734579 -512685 -602872
33387f02872Q74O99270J183095P03394k87250p09548k69932L60985O53879P78646
$$ -602872 -601998 97272 1280367 1983761 1696511 986963 717031 1078016 1731895 2510541
33377B510541R49425Q99492L60594m04833r23785j030954p79280k14281M27302
$$ 2510541 3459966 4359458 4720052 4315219 3391434 2360480 1581200 1366919 1794221
33368A794221O87016M55010J94291J72151o5115q50563j500736j122041m7710
$$ 1794221 2481237 2936247 3130538 3302689 3237574 2387011 886275 -235766 -283476
33359b83476N03533J55663k36337o1872J95829l4751m55326m99478k01826J02753
$$ -283476 220057 375720 139383 77511 273340 238589 -216737 -716215 -918041 -815288
33349h15288L90832P25972R09705Q44989P81396P71645M37698k52579o23655l25517
$$ -815288 -424456 301516 1211221 2056210 2837606 3609251 4046949 3794370 3170715 2845198
33339B845198p5002n72077j249555j049874l2889P94763R63530Q17131N13153
$$ 2845198 2770196 2198119 948564 -101310 -134199 660564 1624094 2441225 2954378
33330B954378j20200p57246p54311l03044l02989q39951r23826j57304M76239
$$ 2954378 2834178 2076932 1322621 1019577 716588 -123363 -1047189 -1204493 -728254
33321g28254J60839m28014k20905O15669J112323R72087O17021J88231m55807
$$ -728254 -567415 -995429 -1216334 -600665 511658 1483745 2100766 2288997 1833190
33312A833190r61562p31546M4127N02500L51930K00843M81157P91539N95112k6811
$$ 1833190 871628 140082 184209 686709 1038639 1239482 1720639 2512178 3107290 3080479
33302C080479o13943q59648o97429k88730n7784k75861n50244l11880J44322p8692
$$ 3080479 2466536 1606888 909459 620729 562945 287084 -263160 -575040 -430718 -509410
33292e09410r51832j228297k40998R46468J048244M12494K40731N53043L46389
$$ -509410 -1461242 -2689539 -2930537 -1984069 -935825 -523331 -282600 270443 616832
33283F16832m19411n21802N43568J609413J461347L91039n17044p64959m23935
$$ 616832 197421 -324381 219187 1828600 3289947 3680986 3163942 2398983 1975048
33274A975048M25228J406097J677189R27448J0769k36965k27411p04343j200065
$$ 1975048 2400276 3806373 5483562 6411010 6421779 6184814 5957403 5253060 4052995
33265D052995o99295M56827P79951j47212j020515p71855K8765L15908K6520k98266
$$ 4052995 3353700 3810527 4590478 4443266 3422751 2650896 2679661 2995569 3022089 2723823
33255B723823n47935p89997o13976K97558J282422J310322L94099l80002k75090
$$ 2723823 2175888 1385891 771915 1069473 2351895 3662217 4056316 3676314 3401224
33246C401224K78224M24733n2689o39689p61348l35624K16657L89660M4424n21717
$$ 3401224 3679448 4104181 4051492 3411803 2650455 2314831 2531488 2921148 2965572 2443855
33236B443855r01228q83987n17905p6181O5335k06150m81062k42872M10029Q00785
$$ 2443855 1542627 658640 140735 64554 129889 -76261 -557323 -800195 -390166 410619
33226D10619N24461q4401m50374l80235p2137J45297j7243n15579p74211k57575
$$ 410619 935080 850679 400305 20070 -52067 93230 75987 -439592 -1213803 -1471378
33216a471378O63081R91584M36448j94787k22963N190p1171k26172L0861M58900
$$ -1471378 -808297 183287 619735 424948 201985 207175 136004 -90168 -59307 399593
33206C99593M23731o0289l76513k33571R2115L09014L33902R4115l56955o46622
$$ 399593 823324 763035 386522 152951 245066 554080 887982 982097 625142 -21480
33196b1480m82620r0670J75480L88148P02926P99786L41558k50845k31782L64118
$$ -21480 -504100 -594770 -419290 -31142 671784 1471570 1813128 1562283 1330501 1694619
33186A694619P59837N36447L4617l12280m04160k58997M389J5986l84351o43369
$$ 1694619 2454456 2990903 3025520 2713240 2309080 2050083 2054472 2070458 1686107 1042738
33176A042738j74606N80200O49717N6477j94312K02390L37102k84177p29889r3485
$$ 1042738 868132 1448332 2098049 2154526 1960214 2162604 2499706 2215529 1485640 1392155
33166A392155R34379J021122J83260l53337j17904k9185p69823j505983r58109
$$ 1392155 2326534 3347656 3530916 3177579 3059675 3030490 2260667 754684 -203425
33157b03425P11106J886140J407176j15818j169958j078545m08262R4202L11629
$$ -203425 507681 2393821 3800997 3685179 2515221 1436676 1028414 1122616 1434245
33148A434245M52187N70761O63315P42305N55633k12792j128927j092015J56104
$$ 1434245 1886432 2457193 3120508 3862813 4418446 4205654 3076727 1984712 2140816
33139B140816J243262P52076q34569j724170j105349J16314P57891N64873m1467
$$ 2140816 3384078 4136154 3301585 1577415 472066 588380 1346271 1911144 1869677
33130A869677n04068l12960N22794J107450N88886n13313q46295j61367L70685
$$ 1869677 1365609 1052649 1575443 2682893 3271779 2758466 1912171 1750804 2121489
33121B121489K6976m40014j53990N51357Q46866O19100K43044j67411n76628o72540
$$ 2121489 2148465 1708451 1554461 2105818 2952684 3571784 3814828 3647417 3070789 2398249
33111B398249l49511n2822r9848j84577l8169N3787o6583P0037P22361J278959
$$ 2398249 2048738 1995916 1896068 1711491 1673322 1727109 1660526 1730563 2452924 3731883
33101C731883J166970P58790N69311K41476o65136j467554j154531p8573L78759
$$ 3731883 4898853 5657643 6226954 6468430 5803294 4335740 3181209 3102636 3481395
33092C481395k14357q29499n80889J64878N70734M29338J47993J80964O76203
$$ 3481395 3267038 2437539 1856650 2021528 2592262 3021600 3169593 3350557 4026760
33083D026760J256255J166054J63066q67069q86711j68979J42035q6510K18779
$$ 4026760 5283015 6449069 6612135 5745066 4858355 4689376 4831411 4744901 4963680
33074D963680J220285J211605j059145l957614m419786j780734J257839J944313
$$ 4963680 6183965 7395570 6336425 2378811 -2040975 -3821709 -2563870 -619557
33066f19557O18112l26480K01723R69268O23002m09389p91632j59776P09984J131661
$$ -619557 -1445 -327925 -126202 843066 1466068 1056679 265047 105271 815255 1946916
33056A946916J028873M42013n86453j575857j831066j306528o41744j91704L13849
$$ 1946916 2975789 3417802 2831349 1255492 -575574 -1882102 -2523846 -2715550 -2401701
33047b401701R42490J160361P09722K22742L39630O89748M51443l41200p72297
$$ -2401701 -1459211 -298850 410872 633614 973244 1662992 2114435 1773235 1000938
33038A000938l20476M24045N20912j62541q05219n97090L04666R36355O61061
$$ 1000938 680462 1104507 1625419 1462878 657659 60569 365235 1301590 1962651
33029A962651j11599n37212l88202j24041j43480m45652q68787j145953q80604
$$ 1962651 1851052 1313840 925638 801597 658117 212465 -656322 -1802275 -2682879
33020b682879m0863O86510O76795L10832L89823Q20650Q20239L04275j9694J9835
$$ -2682879 -2723742 -2037232 -1360437 -1049605 -659782 160868 981107 1285382 1265688 1285523
33010A285523k01531q27685j117935o48467R8934O19316Q41252N63751l48053
$$ 1285523 1083992 256307 -861628 -1510095 -1411161 -791845 49407 613158 265105
$$ [...]
##END NTUPLES=NMR SPECTRUM
##END=
