##TITLE=31P_DE-80H_X3
 64 sc D2O
 26.2.2025
##JCAMPDX= 6.0         $$ Bruker NMR JCAMP-DX V2.0
##DATA TYPE= NMR SPECTRUM
##DATA CLASS= NTUPLES
##ORIGIN= UXNMR, Bruker Analytische Messtechnik GmbH
##OWNER= root
$$ XWIN-NMR		Version 3.5
$$ Thu Jul 31 11:02:47 2025 Russian Standard Time (UT+4h)  Yarkov@DPX200
##.OBSERVE FREQUENCY= 81.013821
##.OBSERVE NUCLEUS= ^31P
##.ACQUISITION MODE= SIMULTANEOUS
##.ACQUISITION SCHEME= undefined
##.AVERAGES= 64
##.DIGITISER RES= 17
##SPECTROMETER/DATA SYSTEM= spect
##.PULSE SEQUENCE= zgpg30
##.SOLVENT NAME= D2O
##.SHIFT REFERENCE= (INTERNAL, D2O, 0, 198.062)
##AUDIT TRAIL= $$ (NUMBER, WHEN, WHO, WHERE, WHAT)
$$ ##TITLE= Audit trail, XWIN-NMR		Version 3.5
$$ ##JCAMPDX= 5.01
$$ ##ORIGIN= Bruker BioSpin GmbH
$$ ##OWNER= Yarkov
$$ C:/Bruker/XWIN-NMR/data/yarkov2/nmr/P31/2/pdata/1/auditp.txt
$$ ##AUDIT TRAIL=  $$ (NUMBER, WHEN, WHO, WHERE, WHAT)
(   1,<2025-07-31 11:02:05.70 +0400>,<Yarkov>,<DPX200>,
      <created by zg, POWCHK disabled, PULCHK disabled
       configuration hash MD5:
       00 E9 B6 7A A2 85 ED C7 34 08 36 98 17 FE 4E 26
       data hash MD5: 32K
       EE CB 25 39 87 10 5C 62 7C F5 D5 AB 2A EE B9 26>)
(   2,<2025-07-31 11:02:09.57 +0400>,<Yarkov>,<DPX200>,
      <Start of raw data processing
       efp BC_mod = 2 LB = 1.5 FT_mod = 6 PKNL = 1 PHC0 = 1670.043 PHC1 = 49.15953 SI = 64K 
       data hash MD5: 64K
       71 36 BD F5 7F D0 5A 3C 0A AA FA 1A 60 D7 1F 63>)
(   3,<2025-07-31 11:02:26.31 +0400>,<Yarkov>,<DPX200>,
      <pk PHC0 = 8.200001 PHC1 = 0 
       data hash MD5: 64K
       24 63 60 4E 29 DE 7B 68 FC AE 4B 33 14 21 57 03>)
$$ ##END=
$$ 
$$ hash MD5
$$ A8 CB E3 1D C2 42 6E B8 B9 97 F8 6D 04 40 5B F5
##$RELAX= 
##$RELAX= 
##$RELAX= 
##$RELAX= 
##$RELAX= 
##$RELAX= 
##$RELAX= 
##$RELAX= 
$$ Bruker specific parameters
$$ --------------------------
##$DU= <C:/Bruker/XWIN-NMR>
##$EXPNO= 2
##$NAME= <P31>
##$PROCNO= 1
##$TYPE= <nmr>
##$USER= <yarkov2>
##$AMP= (0..31)
100 100 100 100 100 100 100 100 100 100 100 100 100 100 100 100 100 100 
100 100 100 100 100 100 100 100 100 100 100 100 100 100 
##$AQSEQ= 0
##$AQ_mod= 1
##$AUNM= <au_zg>
##$AUTOPOS= <>
##$BF1= 81.014009
##$BF2= 200.13
##$BF3= 200.13
##$BF4= 200.13
##$BF5= 200.13
##$BF6= 200.13
##$BF7= 200.13
##$BF8= 200.13
##$BYTORDA= 1
##$CFDGTYP= 0
##$CFRGTYP= 5
##$CHEMSTR= <none>
##$CNST= (0..31)
1 1 145 1 1 1 1 1 1 1 1 1 1 1 1 1 1 1 1 1 1 1 1 1 1 1 1 1 1 1 1 1 
##$CPDPRG= <waltz16>
##$CPDPRG1= <>
##$CPDPRG2= <waltz16>
##$CPDPRG3= <>
##$CPDPRG4= <mlev>
##$CPDPRG5= <mlev>
##$CPDPRG6= <mlev>
##$CPDPRG7= <mlev>
##$CPDPRG8= <mlev>
##$CPDPRGB= <>
##$CPDPRGT= <>
##$D= (0..31)
0 1 0 0 0 0 0 0 0 0.06 0 0.03 2e-05 3e-06 0 0 0.0002 0 0 0 0 0 0 0 0 0 
0 0 0 0 0 0 
##$DATE= 1753945325
##$DBL= (0..7)
120 120 120 11 120 120 24 19 
##$DBP= (0..7)
150 150 150 150 150 150 150 150 
##$DBP07= 0
##$DBPNAM0= <>
##$DBPNAM1= <>
##$DBPNAM2= <>
##$DBPNAM3= <>
##$DBPNAM4= <>
##$DBPNAM5= <>
##$DBPNAM6= <>
##$DBPNAM7= <>
##$DBPOAL= (0..7)
0.5 0.5 0.5 0.5 0.5 0.5 0.5 0.5 
$$ [...]
##$SUBNAM2= <"">
##$SUBNAM3= <"">
##$SUBNAM4= <"">
##$SUBNAM5= <"">
##$SUBNAM6= <"">
##$SUBNAM7= <"">
##$SUBNAM8= <"">
##$SUBNAM9= <"">
##$SW= 400.765351723535
##$SWIBOX= (0..15)
0 1 3 0 0 0 0 0 0 0 0 0 0 0 0 0 
##$SW_h= 32467.5324675325
##$TD= 32768
##$TD0= 1
##$TE= 0
##$TE2= 300
##$TE3= 300
##$TEG= 300
##$TL= (0..7)
0 120 53 12 22 120 120 120 
##$TP= (0..7)
150 150 150 150 150 150 150 150 
##$TP07= 0
##$TPNAME0= <>
##$TPNAME1= <>
##$TPNAME2= <>
##$TPNAME3= <>
##$TPNAME4= <>
##$TPNAME5= <>
##$TPNAME6= <>
##$TPNAME7= <>
##$TPOAL= (0..7)
0.5 0.5 0.5 0.5 0.5 0.5 0.5 0.5 
##$TPOFFS= (0..7)
0 0 0 0 0 0 0 0 
##$TUNHIN= 0
##$TUNHOUT= 0
##$TUNXOUT= 0
##$USERA1= <user>
##$USERA2= <user>
##$USERA3= <user>
##$USERA4= <user>
##$USERA5= <user>
##$V9= 5
##$VALIST= <valist>
##$VCLIST= <CCCCCCCCCCCCCCC>
##$VD= 0
##$VDLIST= <DDDDDDDDDDDDDDD>
##$VPLIST= <PPPPPPPPPPPPPPP>
##$VTLIST= <TTTTTTTTTTTTTTT>
##$WBST= 1024
##$WBSW= 4
##$XGAIN= (0..3)
0 0 0 0 
##$XL= 0
##$YL= 0
##$YMAX_a= 1648
##$YMIN_a= -236
##$ZGOPTNS= <>
##$ZL1= 120
##$ZL2= 120
##$ZL3= 120
##$ZL4= 120
##$ABSF1= 0
##$ABSF2= 0
##$ABSG= 0
##$ABSL= 0
##$ALPHA= 0
##$AQORDER= 0
##$ASSFAC= 0
##$ASSFACI= 0
##$ASSFACX= 0
##$ASSWID= 0
##$AUNMP= <proc_1d>
##$AZFE= 0.1
##$AZFW= 0.5
##$BCFW= 0
##$BC_mod= 2
##$BYTORDP= 0
##$COROFFS= 0
##$CY= -3
##$DATMOD= 1
##$DC= 0
##$DFILT= <>
##$DTYPP= 0
##$F1P= 0
##$F2P= 0
##$FCOR= 1
##$FTSIZE= 65536
##$FT_mod= 6
##$GAMMA= 0
##$GB= 0
##$INTBC= 1
##$INTSCL= 9.790993e-09
##$ISEN= 30
##$LB= 1.5
##$LEV0= 0
##$LPBIN= 0
##$MAXI= 10000
##$MC2= 0
##$MEAN= 0
##$ME_mod= 0
##$MI= 50
##$NCOEF= 0
##$NC_proc= -11
##$NLEV= 6
##$NOISF1= 182.463
##$NOISF2= 159.3651
##$NSP= 0
##$NTH_PI= 0
##$NZP= 0
##$OFFSET= 198.0616
##$PC= 4
##$PHC0= 1678.243
##$PHC1= 49.15953
##$PH_mod= 1
##$PKNL= yes
##$PPARMOD= 0
##$PSCAL= 0
##$PSIGN= 0
##$REVERSE= no
##$SF= 81.0140089999434
##$SI= 65536
##$SIGF1= 159.3651
##$SIGF2= -187.1042
##$SINO= 113.3802
##$SIOLD= 16384
##$SREGLST= <1H.CDCl3>
##$SSB= 0
##$STSI= 65536
##$STSR= 0
##$SW_p= 32467.5324675325
##$SYMM= 0
##$S_DEV= 0
##$TDeff= 32768
##$TDoff= 0
##$TI= <>
##$TILT= no
##$TM1= 0
##$TM2= 0
##$TOPLEV= 0
##$USERP1= <user>
##$USERP2= <user>
##$USERP3= <user>
##$USERP4= <user>
##$USERP5= <user>
##$WDW= 1
##$XDIM= 65536
##$YMAX_p= 375008211
##$YMIN_p= -50649942
$$ End of Bruker specific parameters
$$ ---------------------------------
##NTUPLES= NMR SPECTRUM
##VAR_NAME=  FREQUENCY,     SPECTRUM/REAL,   SPECTRUM/IMAG
##SYMBOL=    X,             R,               I
##VAR_TYPE=  INDEPENDENT,   DEPENDENT,       DEPENDENT
##VAR_FORM=  AFFN,          ASDF,            ASDF
##VAR_DIM=   65536,         65536,           65536
##UNITS=     HZ,            ARBITRARY UNITS, ARBITRARY UNITS
##FACTOR=    0.49542278885378, 1,            1
##FIRST=     16045.7642231865, 0,            0
##LAST=      -16421.768244346, 0,            0
##MIN=       -16421.768244346, -50649942,    0
##MAX=       16045.7642231865, 375008211,    0
$$ Real data points
##PAGE= N=1
##DATA TABLE= (X++(R..R)), XYDATA
$$ [...]
42634 2205514 3014781 3262038 2875028 2578784 2868827 3405056 3523284 2951369 1962872
42625 1962872 1146556 1015660 1520454 1978451 1800642 1200930 830909 846277 822248 550093
42615 550093 373715 634685 1240559 1906390 2419094 2567220 2248391 1801294 1824652 2474276
42605 2474276 3263949 3684472 3668797 3358493 2855848 2389930 2303461 2620787 2942336 2941901
42595 2941901 2664231 2271084 1935938 2052782 2934490 4086576 4448089 3741217 2953465
42586 2953465 2979244 3376408 3110315 2046793 983069 542267 756350 1469774 2409218
42577 2409218 3026063 2991233 2741344 2879425 3192595 2990573 2269086 1685204 1413942 972502
42567 972502 330048 232861 1043465 2078087 2589802 2712078 2872219 2884878 2306995 1294253
42557 1294253 467819 182593 431730 1169902 2155902 2721366 2363537 1528950 1228511
42548 1228511 1793536 2470109 2379072 1539636 799689 971140 2117392 3526717 4345386
42539 4345386 4352871 4081834 4077633 4202764 3914955 3105106 2309522 2074079 2418981 3023414
42529 3023414 3656946 4221367 4514718 4216060 3200372 1816745 754312 523484 1023080
42520 1023080 1672438 2013238 2135915 2480276 3262052 4126293 4362839 3536969 1985316
42511 1985316 576493 -170625 -580686 -1182749 -1779460 -1660322 -722340 249406 640447
42502 640447 745877 1060693 1393260 1277448 856294 659411 761056 892463 1204864 2047199
42492 2047199 2967197 2894903 1668339 556922 725353 1819498 2703335 3041381 3339344
42483 3339344 3757131 3815586 3267728 2424327 1459138 171656 -1240489 -1914350 -1389583
42474 -1389583 -399168 83272 186645 708754 1546938 1596853 476369 -577736 -190015
42465 -190015 1356979 2573580 2697985 2355321 2320062 2436467 2084507 1185213 332558
42456 332558 165976 866167 2078575 3149323 3601007 3495648 3194815 2820985 2295549
42447 2295549 1867212 2030027 2705863 3079741 2669623 2106807 2318318 3247872 3971317
42438 3971317 3908162 3347936 2833055 2543104 2336162 2003705 1447217 888649 816044 1387627
42428 1387627 2036075 2073069 1530702 934449 452064 -70404 -349802 188072 1322541
42419 1322541 1920471 1324675 229894 -290269 -91528 211502 238955 61668 -231561
42410 -231561 -530983 -443296 356724 1534722 2336335 2429685 2140433 1896687 1830479 1904883
42400 1904883 2033113 2027733 1784366 1583300 1890863 2757838 3659206 4017298 3697762 2976866
42390 2976866 2261138 1885273 1940303 2192343 2322688 2292568 2321833 2521031 2763160 2933256
42380 2933256 3051538 3089675 2930727 2616504 2351679 2083974 1380330 59305 -1239273
42371 -1239273 -1573045 -826284 85329 318329 52286 13859 344283 489071 186610 -47061
42361 -47061 301643 969010 1385791 1598172 2131222 3061181 3846716 4153150 4270599 4492451
42351 4492451 4551741 3996606 2821968 1463823 401864 -74082 -22653 39741 -446877
42342 -446877 -1327412 -1764951 -1298454 -439567 131282 476911 985084 1469217 1405027 854446
42332 854446 423201 340272 253343 -10485 -125152 128548 489921 691704 889605 1391077
42322 1391077 2267408 3386895 4527284 5314349 5327907 4432524 2891820 1222720 111669
42313 111669 186916 1377412 2657308 3023294 2660820 2515696 2805136 2805500 2211739 1722878
42303 1722878 1870224 2163092 2008570 1712706 1831274 2166451 2241463 2256608 2652582 3092978
42293 3092978 2874308 2170472 1881932 2265151 2673147 2781800 3124106 4064167 5035772
42284 5035772 5268719 4700856 3769024 2818361 2115437 1936352 2174789 2276732 2002579
42275 2002579 1827836 2105736 2309762 1798307 984549 886469 1602970 2131711 1880961 1533195
42265 1533195 1973069 3006254 3726901 3711978 3206593 2414410 1331427 232349 -355240
42256 -355240 -290024 95985 650856 1566473 2698903 3359214 3180006 2667656 2429438 2347938
42246 2347938 2083964 1896547 2187301 2586080 2399376 1790226 1538981 1663464 1331808
42237 1331808 305304 -621485 -954947 -1146657 -1362646 -812970 750227 1914323 1304109
42228 1304109 -235786 -561517 946021 2828286 3759961 3951717 4080733 4049397 3419298
42219 3419298 2293828 1203003 577666 619301 1198627 1716346 1603724 1054688 672067
42210 672067 433255 -147101 -811592 -642816 331906 812993 156480 -458887 298151 1956272
42200 1956272 3010705 2993014 2671332 2633659 2753443 2793318 2580753 1857247 891509 887243
42190 887243 2631029 4933294 5693115 4573579 3369877 3488251 4312324 4534139 3910279
42181 3910279 2954802 1880722 804357 351448 1078328 2586191 3948603 4765818 5176519
42172 5176519 5147724 4503058 3527452 2846576 2661554 2608674 2396966 2133880 1983666 1908365
42162 1908365 1827379 1728686 1570570 1328706 1165480 1314291 1753480 2171774 2296962 2176676
42152 2176676 2157746 2584382 3352022 3772565 3219945 2008841 1203430 1325337 1729517
42143 1729517 1619246 1133222 826530 562982 -204389 -1277184 -1785172 -1443370 -855859
42134 -855859 -436412 57416 618444 580677 -279317 -1016715 -689667 283627 779467 600205
42124 600205 537094 973334 1371076 1253485 872802 636328 558010 638997 1196950 2326411
42114 2326411 3444151 3894584 3763368 3613940 3602258 3380400 2837417 2396465 2401191 2594574
42104 2594574 2472037 1923920 1268844 791226 511341 357474 301887 286790 230765 191926
42094 191926 338339 644484 811901 679824 544978 803041 1387178 1901621 2251104 2682295
42084 2682295 3112296 2951406 1957111 871258 684754 1411057 2037132 1643170 236668
42075 236668 -1388571 -2218599 -1604803 162727 1883291 2575941 2577808 2944370 3804222
42066 3804222 4139748 3391945 2337800 1855382 1700230 1304635 1044280 1629355 2674695
42057 2674695 3061251 2595035 2164000 2177833 2002430 1278088 747619 1179143 2235533
42048 2235533 3027203 3194902 2893122 2265478 1536913 1157049 1265758 1423078 1386829 1658057
42038 1658057 2624346 3660265 3862598 3302913 2721521 2304681 1715018 1131751 1181041
42029 1181041 1782741 2114852 1966819 2149217 3151203 4263291 4568361 4065442 3221963
42020 3221963 2104648 723112 -257316 -34500 1225385 2470392 2919406 2651046 2144098
42011 2144098 1761814 1694122 1927709 2135232 1880300 1039897 -98604 -1102060 -1616679
42002 -1616679 -1480957 -835424 -32258 693435 1298423 1621219 1391093 784638 523904
41993 523904 990849 1628200 1742325 1530456 1631645 1948818 1784512 1088812 655141 887538
41983 887538 1213685 1066425 684573 465698 231446 -195533 -230847 809434 2510159
41974 2510159 3623588 3557652 2949461 2644300 2707463 2735033 2670926 2839021 3309639 3642164
41964 3642164 3351447 2438388 1346448 486434 -64895 -421401 -631946 -694100 -698620 -741828
41954 -741828 -704958 -337840 363800 1021366 1210956 867602 332241 61336 227952 496383
41944 496383 323203 -314358 -684165 -168880 795344 1223865 1007306 1102885 2071294 3186405
41934 3186405 3531155 3337471 3475156 4017739 4184398 3564162 2563834 1583062 492504
41925 492504 -837934 -2044512 -2560630 -2068907 -627016 1228080 2526212 2612805 1971750
41916 1971750 1729423 2209578 2630535 2436790 2146353 2415967 2987364 3236128 3206828 3301751
41906 3301751 3323500 2729483 1718486 1202055 1584597 2267081 2548213 2428646 2273743
41897 2273743 2175092 1979483 1650405 1331043 1211535 1433272 1925306 2323892 2337879 2185949
41887 2185949 2292837 2526380 2230969 1207446 185827 -5709 616164 1431969 2095474
41878 2095474 2737456 3472623 4134821 4471625 4302665 3555230 2457077 1640864 1679726
41869 1679726 2412242 2991089 2750056 1871025 1079085 810535 842264 705716 298428 -22283
41859 -22283 105100 655982 1326837 1853763 2086017 1938879 1558576 1412220 1832571 2489875
41849 2489875 2730454 2482362 2330814 2542056 2599818 2099124 1559569 1718596 2346296 2500883
41839 2500883 1882410 1230690 1274640 1895996 2554195 3011726 3283360 3227933 2627767 1600566
41829 1600566 671552 389909 880047 1701579 2219482 2265037 2309301 2735672 3130890 2773734
41819 2773734 1775166 1133516 1491495 2403968 3137286 3644889 4258119 4826840 4821473 4158049
41809 4158049 3340916 2747234 2231208 1572911 986352 972236 1768029 3013848 3939030
41800 3939030 3984487 3357996 2849795 2960944 3392120 3582977 3497127 3499704 3635710 3546527
41790 3546527 3129213 2767670 2694303 2533800 1839336 844782 263885 367804 639228 500536
41780 500536 114499 136569 741352 1311289 1303495 1071786 1359711 2132431 2534581 2127267
41770 2127267 1531987 1463413 1652594 1323180 422810 -270588 -150868 688583 1841497
41761 1841497 2875562 3231192 2539881 1283284 563069 878949 1556169 1680201 1168578
41752 1168578 545107 57340 -440562 -902287 -919373 -215610 970824 2059271 2536593
41743 2536593 2244127 1448372 651890 223842 162960 188418 15040 -381381 -648088 -332201
41733 -332201 503116 1110639 894444 279023 186124 666650 779610 46265 -758312 -761538
41723 -761538 -256328 -96541 -337362 -330554 105698 502869 659137 896371 1311799 1547595
41713 1547595 1523170 1708154 2332802 2874822 2712901 1903241 992345 391072 196006 297577
41703 297577 400183 240464 22531 309537 1230967 2146384 2410514 2161549 2017512 2290976
41693 2290976 2872390 3585029 4185296 4246896 3611629 2877739 2875525 3595080 4146277 3935552
41683 3935552 3386142 3182422 3216866 2801556 1772450 820617 580037 829097 942635
41674 942635 839763 948354 1281336 1201176 407218 -398872 -410461 71998 53104 -673953
41664 -673953 -1282863 -1247024 -1035415 -1081634 -861720 297331 2000390 3144353 3234219 2663663
41654 2663663 1889973 1047036 318826 13379 174313 617174 1337148 2346572 3166309
41645 3166309 3163483 2489456 2006277 2102856 2267275 2092845 1961980 2249186 2496656 2058886
41635 2058886 1160460 640354 881538 1577927 2348121 2969758 3142831 2661518 1845358
41626 1845358 1294787 1212236 1418567 1942383 2953930 4067209 4428813 3808926 3038414
41617 3038414 2981887 3549260 4142800 4607007 5115283 5409003 4909380 3633546 2372880
41608 2372880 1732218 1450757 973088 337430 97197 536462 1372793 2223898 2993066
41599 2993066 3650708 3915618 3437494 2248424 842823 -205784 -600711 -344160 384600
41590 384600 1278349 1968082 2200648 1962770 1414560 785581 375320 496280 1231361 2283471
41580 2283471 3216577 3842346 4263733 4597918 4837695 4968672 5003368 4850455 4371564 3670898
41570 3670898 3103526 2813632 2462964 1698100 781274 413060 885013 1715128 2265710
41561 2265710 2464174 2677851 3060579 3359143 3349609 3144918 2951688 2769959 2537527 2404357
41551 2404357 2573857 2873565 2740306 1778805 252894 -1072066 -1550250 -1102141 -126678
41542 -126678 935808 1921903 2844815 3575432 3823346 3536490 3119185 2983565 2975446 2586929
41532 2586929 1754146 1060947 1013085 1483417 2101557 2796451 3563777 4032519 3834839 3285115
41522 3285115 3115181 3507841 3918924 3936884 3755787 3596561 3244805 2567891 2022735 2101873
41512 2101873 2541439 2623307 2117256 1398931 727972 8966 -663606 -835844 -360923 229539
41502 229539 412985 401190 712102 1229235 1272529 652901 87977 237848 711424 551653
41492 551653 -381865 -1048758 -433475 1259440 2903842 3664078 3518713 2766183 1582655
41483 1582655 212687 -856352 -1251905 -1063297 -603115 -107 732462 1386641 1631422
41474 1631422 1380246 876509 414509 112116 -91387 -344969 -710486 -944272 -607079
41465 -607079 376751 1403568 1758204 1455939 1157046 1182382 1009484 20358 -1484355
41456 -1484355 -2397711 -1969462 -606248 635999 1208552 1462202 1884565 2317688 2265474
41447 2265474 1760090 1387432 1414211 1455988 1241157 1125766 1398022 1578902 1080601 242951
41437 242951 -35042 465033 1197492 1939594 3024322 4271778 4628720 3458870 1578687
41428 1578687 405775 507884 1519511 3007404 4670153 5924893 6108331 5218927 3978849
41419 3978849 3065671 2618843 2479661 2497913 2510299 2342319 1964624 1481594 967606 496888
41409 496888 264716 424683 837684 1218172 1477601 1671408 1684831 1315195 687631 259355
41399 259355 303702 636682 963918 1273671 1711969 2184126 2277332 1674073 646822 8036
41389 8036 333261 1226477 1685133 1343699 975732 1429153 2410986 2874016 2465749 1984037
41379 1984037 2291606 3263588 4033255 3970270 3214465 2447294 2279067 2707887 3096059 2798905
41369 2798905 1824579 749043 66573 -154765 -63315 212351 567275 927317 1261977
41360 1261977 1428989 1153711 455142 -69213 187915 1040322 1698290 1752336 1553185 1624279
41350 1624279 2143201 3001646 3872178 4169341 3497676 2275689 1406666 1212209 1245313
41341 1245313 1260755 1626195 2431812 2919465 2376659 1106622 -36044 -650642 -805773
41332 -805773 -503854 201808 849230 999783 877293 1003027 1342371 1389968 995144 516034
41322 516034 183374 -130064 -465087 -609815 -491783 -340701 -346017 -446776 -514755 -482008
41312 -482008 -263915 212500 896165 1663336 2358348 2667425 2272100 1414589 953632 1414320
41302 1414320 2272687 2669807 2526786 2351244 2229199 1784109 1021221 418341 167853
41293 167853 77196 227131 874242 1582546 1410446 330242 -419923 53945 1079978
41284 1079978 1433565 927933 271100 -128554 -355821 -299819 333671 1343259 2081698
41275 2081698 2262841 2168726 2020562 1716188 1305363 1155863 1383813 1582712 1481480 1523779
41265 1523779 2311690 3611421 4437448 4252319 3639985 3434125 3482817 2883893 1468717
41256 1468717 355478 577803 1650685 2183711 1708626 1131816 1309915 1910759 2021130
41247 2021130 1377061 590961 425117 1086781 2014794 2260125 1401638 153707 -352644
41238 -352644 50334 456858 263510 -69505 57156 472959 790408 1145474 1666985 1841514
41228 1841514 1308343 814114 1342391 2549008 3132994 2697577 2170845 2268107 2606019
41219 2606019 2673388 2692706 2962893 3127425 2756005 2109071 1703199 1540725 1371911 1389300
41209 1389300 2042206 3320716 4712773 5746001 6188958 5926251 5097769 4222242 3722535
41200 3722535 3416265 2903538 2327353 2186046 2392710 2179973 1229366 376104 690336
41191 690336 2084727 3328333 3435997 2645353 1903332 1720809 1805962 1660017 1191402
41182 1191402 690613 448001 545296 887918 1291932 1613855 1912356 2395591 3074954 3569730
41172 3569730 3456151 2780742 2030722 1584010 1372357 1127681 778677 500583 482372 747963
41162 747963 1165559 1570513 1871785 2023951 1912763 1399009 573191 -147720 -338718 63076
41152 63076 809508 1642033 2371446 2798248 2845500 2757854 2910841 3381054 3892591 4189994
41142 4189994 4263217 4203416 4047457 3787308 3365113 2694437 1878303 1315248 1303993 1602296
41132 1602296 1712679 1579541 1619473 2030484 2488975 2652019 2581484 2516854 2564457 2742010
41122 2742010 2976428 2942429 2331712 1454833 1099202 1528081 2108434 2272483 2322553 2773713
41112 2773713 3364700 3408868 2865301 2354801 2215261 2207948 2149726 2172230 2227088 1933582
41102 1933582 1174451 400303 84309 228135 648571 1411350 2627229 3964876 4685586
41093 4685586 4253911 2902385 1586155 1226677 1820735 2420980 2223653 1499651 1101834
41084 1101834 1250812 1386240 1203007 1138141 1551972 2014170 1875485 1185136 561304 366000
41074 366000 440980 527513 549135 531859 566572 817511 1304794 1725408 1737211 1385842 1043157
41063 1043157 982649 1214240 1651088 2205163 2756356 3197617 3437285 3259242 2440638 1254592
41053 1254592 538112 811175 1553214 1905205 1916266 2354325 3261705 3598333 2736174 1546705
41043 1546705 1292193 1892739 2093220 1192598 -125241 -727359 -200842 1046861 2361984
41034 2361984 3287148 3730118 3876727 3822554 3383850 2531780 1799380 1727832 1998147 1784401
41024 1784401 1037882 648713 1054812 1507900 1265246 753772 738158 927093 468968 -457030
41014 -457030 -728714 -39559 550359 217385 -413343 -271865 643461 1476377 1767601 1744245
41004 1744245 1592098 1170323 483444 -91959 -209934 62161 308986 93558 -670370
40995 -670370 -1531788 -1864917 -1551163 -1023969 -485236 452737 1949332 3228825 3357032
40986 3357032 2496196 1698648 1547629 1702804 1792364 1982731 2440798 2904380 3133058 3246245
40976 3246245 3259367 2809998 1810609 943370 943657 1636496 2195840 2187440 1857710 1509853
40966 1509853 1140402 740177 489365 490407 608883 710737 827498 1000924 1188312 1403957
40956 1403957 1732998 2106048 2272606 2134687 1947435 2060681 2580937 3359501 4134432
40947 4134432 4582267 4464004 3935796 3525406 3516091 3502251 2933797 2035112 1687155 2258414
40937 2258414 3051393 3255230 3021149 3040685 3318352 3095213 2053507 914759 533078
40928 533078 895583 1390154 1653985 1728142 1692265 1622183 1706656 1976549 2104091 1886557
40918 1886557 1706756 2025204 2627411 2948438 2957920 3026729 3023856 2402384 1301348 684876
40908 684876 1036384 1683436 1876066 1822116 2065125 2460506 2489920 2134742 1701347 1149492
40898 1149492 374669 -130052 236007 1136395 1590303 1338111 1108080 1391346 1750582
40889 1750582 1648393 1268223 1079082 1101810 1065853 931631 830846 728022 490787 133636
40879 133636 -248437 -629622 -983305 -1257629 -1514024 -1839570 -2079350 -2007856 -1794237 -1789465
40869 -1789465 -1741830 -895972 784621 2179882 2376914 1896811 1828506 2211110 2205574 1634786
40859 1634786 1313851 1752027 2441385 2724401 2635496 2565162 2744014 3378349 4609318 5908151
40849 5908151 6205289 5238227 4191197 4248793 4972668 4998836 4055487 3243276 3276181 3487686
40839 3487686 2979948 1925543 1117854 798433 626960 491511 625716 976239 1088932
40830 1088932 804253 651641 1278218 2636057 3910728 4242544 3516100 2490780 2097617
40821 2097617 2507122 2940763 2503884 1140548 -346654 -1147871 -1185795 -1064668 -1393731
40812 -1393731 -2114194 -2475681 -1862236 -698917 -208319 -1025981 -2384870 -3051255 -2754370
40803 -2754370 -2142461 -1583047 -808483 218415 941880 1051297 974071 1076829 1020944 527680
40793 527680 221056 864119 2049756 2567136 2070684 1551919 1950945 3009113 3845307
40784 3845307 4101497 4051156 3937341 3713288 3346524 3038332 3110542 3758658 4807531 5668542
40774 5668542 5759321 5080175 4181260 3489570 2942744 2391113 1982449 1859323 1764774 1323828
40764 1323828 562036 -201472 -866126 -1589219 -2332067 -2706096 -2362899 -1337494 41162
40755 41162 1405277 2473338 3076549 3147994 2691380 1859371 1110460 1045668 1814602 2800194
40745 2800194 3201267 2889028 2397461 2129690 1991100 1882130 2081808 2820839 3766213
40736 3766213 4319103 4309191 4058210 3820294 3527170 3137993 2865422 2818766 2674830 2065009
40726 2065009 1245838 1018480 1813266 3085675 3868729 3805529 3361302 3084564 3046287 3116765
40716 3116765 3375282 3867989 4187109 3780821 2713642 1728064 1422215 1681716 2085595
40707 2085595 2527729 3089821 3506957 3250238 2256943 1247312 1048846 1701644 2437858
40698 2437858 2521167 1908415 1050953 312461 -162866 -171334 494297 1559055 2253720 2187879
40688 2187879 1996771 2604432 3912037 4814990 4663428 4085435 3971930 4203882 4062438
40679 4062438 3569714 3524865 4133418 4478277 3830271 2859848 2835972 3901491 4883747 4810101
40669 4810101 3913077 2916396 1983991 909875 -61195 -334978 128010 639293 706402
40660 706402 617935 797306 1038247 890102 501246 434759 715701 737354 274211 -32209
40650 -32209 441913 1404908 2091549 2273113 2339009 2591158 2958299 3288520 3436204 3122348
40640 3122348 2212162 1165355 754659 1234420 2115972 2747265 2729461 1878985 415690
40631 415690 -737358 -547435 928191 2490259 3226523 3395788 3559416 3573363 3075171
40622 3075171 2371106 2038862 2036182 1988852 2027529 2474084 2952825 2804391 2316092 2509556
40612 2509556 3566768 4454010 4401237 3825047 3368423 2929772 2259362 1747962 1839580 2180798
40602 2180798 2138094 1831762 1940336 2696960 3733015 4766150 5805045 6691888 6995180
40593 6995180 6491590 5478475 4578136 4346690 4885248 5649988 5869756 5315740 4383582
40584 4383582 3365814 2198016 1103569 719270 1116277 1479559 1419287 1764590 3085658
40575 3085658 4191749 3442379 1151232 -730357 -1174595 -889498 -565534 112398 1302135
40566 1302135 2309729 2745882 3189933 3976491 4410096 3989949 3405951 3414717 3621847 3326777
40556 3326777 2729888 2268743 1574229 302338 -675294 -295355 917025 1523483 1406027
40547 1406027 1842212 3297726 4618183 4817445 4385412 4169028 3969975 3078195 1572273
40538 1572273 313245 -71153 324300 1017120 1612580 2062097 2594955 3284645 3792238
40529 3792238 3835969 3695168 3718784 3542122 2568817 1201589 684623 1483581 2650806
40520 2650806 3151325 3027596 2788635 2434474 1786815 1215315 1237143 1670143 1851993 1565032
40510 1565032 1227593 1265036 1693956 2245055 2605493 2640112 2534681 2526211 2443344 1930055
40500 1930055 1233260 1161743 1938533 2700007 2611144 1932693 1430185 1258041 1114371 1051795
40490 1051795 1323489 1677956 1578229 989008 297059 -358296 -994206 -1236206 -650023 458464
40480 458464 1307723 1623768 1627107 1195935 -5720 -1523553 -2232891 -1728931 -751956 21151
40470 21151 706116 1394645 1606928 1189301 917396 1407163 2046205 1843522 890627 140650
40460 140650 42282 214365 308159 411673 618471 846947 1118217 1491915 1752493 1664638
40450 1664638 1485951 1685969 2178960 2394267 2137527 1829420 1822532 2035597 2362278 2837556
40440 2837556 3190264 2837611 1690665 481546 -113371 -248313 -351572 -207111 744507
40431 744507 2325846 3502240 3492990 2602337 1798491 1754585 2416843 3255214 3790206 4031196
40421 4031196 4447359 5311806 6091024 5861331 4487266 2985987 2378981 2507587 2477370
40412 2477370 2044813 1869270 2349718 2957080 3060894 2774488 2441413 1843157 715010
40403 715010 -282920 -100442 1152474 2112615 1905651 1178320 989182 1446448 2035498
40394 2035498 2583914 3072615 3011648 2013912 775833 484980 1228664 1904769 1857207 1699869
40384 1699869 2189110 3094682 3697931 3787239 3606137 3281429 2843257 2471369 2266460 2089800
40374 2089800 1984122 2306881 3004059 3280498 2635586 1765025 1627934 1960922 1679231
40365 1679231 617133 -176303 3617 674174 1204112 1724416 2422782 2747255 2128210
40356 2128210 1004120 331570 364123 640930 955775 1542804 2338804 2824746 2759033 2466468
40346 2466468 2218843 1895902 1511774 1517024 2146122 2861742 2961496 2539052 2356924 2830997
40336 2830997 3593039 4109398 4308470 4379030 4247633 3618873 2511047 1473474 1109930
40327 1109930 1447239 1899991 1889595 1421387 985518 959047 1264245 1645048 2079679 2711722
40317 2711722 3436738 3817028 3515880 2670920 1725897 1018823 660253 652857 879214 1048960
40307 1048960 966674 870655 1182116 1834390 2223950 2027159 1667127 1616192 1626952 1231076
40297 1231076 741622 981545 1992682 2821241 2863413 2663816 2866883 3041390 2332381
40288 2332381 910403 -95178 -44918 581509 1073685 1315767 1517419 1722115 1920765
40279 1920765 2232432 2647335 2915156 2970552 3151553 3671204 4129178 3905170 2895663
40270 2895663 1578017 483711 -108810 -81665 567206 1605483 2584682 3080406 2949073
40261 2949073 2429415 1970193 1803131 1710705 1433275 1225688 1589882 2416499 2953526 2885944
40251 2885944 2873143 3547250 4491842 4882885 4772295 4912491 5466617 5786724 5542781 5183895
40241 5183895 4986571 4471758 3286835 2004474 1372121 1212505 795359 54207 -301434
40232 -301434 145346 964924 1481701 1435805 953062 313665 -105991 -63496 209115 245489
40222 245489 65690 248668 1055911 1898634 2045826 1538999 963726 562554 118303 -383003
40212 -383003 -578796 -337287 -15230 147429 465480 1270205 2221157 2606200 2244767 1699663
40202 1699663 1553147 1791205 2026310 2084441 2143582 2353545 2530952 2358480 1833853 1325796
40192 1325796 1056578 707572 -137363 -1188597 -1529568 -708198 606979 1386106 1385636 1161409
40182 1161409 1160473 1286062 1309553 1264251 1359127 1772323 2482181 3059301 2867385 1916064
40172 1916064 1238239 1718084 2689253 2595637 1125917 -318776 -637014 -455923 -845646
40163 -845646 -1524822 -1389116 -263581 999707 1908678 2711152 3412409 3457993 2642579
40154 2642579 1544938 777874 410651 310397 420188 478526 79065 -701029 -1244819
40145 -1244819 -1208721 -894850 -621920 -315176 3787 -49502 -573708 -1011286 -921413 -661864
40135 -661864 -759568 -992283 -713898 140640 964851 1277633 1102164 630935 14530 -482955
40125 -482955 -526379 -37307 706153 1304688 1465486 1141906 624314 325020 291815 159560
40115 159560 -213008 -392843 -18695 511137 504536 -37817 -429224 -228631 340151 893314
40105 893314 1296295 1495175 1444554 1373109 1668369 2264155 2551486 2198213 1686795 1629583
40095 1629583 1828765 1557616 712647 110786 422460 1234246 1559118 1054411 288526
40086 288526 -131360 -184373 -54749 356001 1134763 1912189 2224694 2174838 2240494 2495759
40076 2495759 2522802 2094264 1432562 755585 126450 -136770 462325 1814901 3033222
40067 3033222 3420037 3181791 2867594 2577666 2115167 1482499 810155 190602 -45233
40058 -45233 625140 2116782 3447525 3768678 3262365 2550295 1802215 1056887 742751
40049 742751 957120 799478 -432654 -1751987 -1469145 427457 2155240 2484169 1931317
40040 1931317 1370862 784259 -12041 -523591 -273718 431977 1129333 1891260 2755029
40031 2755029 3169327 2790689 2270084 2444769 3160221 3642367 3675231 3629414 3568463 3121404
40021 3121404 2210693 1291079 830722 965727 1596528 2438685 3057602 3178980 2878455
40012 2878455 2290072 1435561 600663 424072 1112124 1914325 1973771 1479392 1371707 2036284
40002 2036284 2914343 3426063 3704224 4206269 4942720 5333368 4788886 3415971 2087810
39993 2087810 1599151 1771467 1769907 1321285 1026262 1275707 1597482 1548621 1529649 1978890
39983 1978890 2346825 1806203 646807 2496 313131 937355 1268972 1409793 1672914
39974 1672914 2174751 3026284 4236931 5306960 5561849 5018693 4328449 3806825 3205247
39965 3205247 2531686 2294277 2611083 2772909 2154273 1092066 439409 559713 1067660
39956 1067660 1319982 973717 286781 -58768 333134 1107752 1717751 2213447 2916305
39947 2916305 3531949 3417048 2707192 2256268 2286437 2056705 1235122 651254 1080839 2063573
39937 2063573 2654426 2763212 2989683 3524863 3936504 3849140 3319565 2717967 2571037 3202663
39927 3202663 4212116 4717118 4439404 4051949 4104443 4260241 4120594 4089143 4640119 5320375
39917 5320375 5403822 5100640 5109930 5267659 4748218 3560821 2766795 3028789 3875200 4681373
39907 4681373 5519058 6592981 7548390 7956725 8112361 8771508 10172662 11706698 12740779
39898 12740779 13756976 16437230 22086438 29684729 35964744 37983798 35473795 30419414
39890 30419414 24962595 20401381 17495426 16328666 15864982 14883276 13616851 13439440
39882 13439440 14753828 16426175 17694426 19198530 21215135 22167512 20334709 16359697
39874 16359697 12638837 10548998 9592313 9087612 9229784 10167796 11245600 11743782 11601668
39865 11601668 10986678 9899750 8644453 7921344 7861711 7612180 6554388 5376264 5123140
39856 5123140 5600436 5671005 4980328 4392173 4580655 5109727 5291097 5188006 5194521 5178759
39846 5178759 4734636 3974027 3389989 3070764 2691621 2267506 2270459 2844700 3463676 3651422
39836 3651422 3615384 3823229 4276321 4582937 4538767 4249380 3796175 3168130 2520272 2159028
39826 2159028 2179048 2362611 2552074 2900779 3566825 4328366 4824775 5194702 6101953 7855175
39816 7855175 9774016 10902926 11262204 11815538 13155848 14954637 16975230 19793864
39808 19793864 24075498 30295183 40126956 56454342 79242645 101459126 112212152
39801 112212152 105985080 87688526 67453167 51768677 40919265 32986566 27153086
39794 27153086 23149015 20260884 18103507 16988910 16705168 16009879 14046608 11401489
39786 11401489 9165658 7703048 6837647 6508866 6668410 7046020 7420667 7716487 7729276
39777 7729276 7348078 7040094 7309955 7673557 7172946 6006292 5471203 6026164 6679324
39768 6679324 6722591 6692402 6956869 6790149 5825725 5114470 5552827 6399757 6612319 6566373
39758 6566373 7064975 7695342 7787229 8127066 10023042 13474675 18033378 24408232 32658507
39749 32658507 39356269 39733972 33347431 25032074 19271938 15969380 12945491 10057143
39741 10057143 8644105 8605375 8529586 7982833 7557937 7090892 5804104 4118412 3512862
39732 3512862 4337865 5234200 5077022 4268065 3698474 3517797 3449362 3463250 3587090 3676095
39722 3676095 3805670 4318750 5061731 5113243 3806473 1719132 206503 101739 1131520
39713 1131520 2407057 3218962 3479811 3622281 4062138 4730539 5211445 5267772 5024696
39704 5024696 4686966 4348667 4065009 3811820 3379634 2659391 2059046 2202930 3065446
39695 3065446 3834880 3915743 3688652 3877703 4436507 4568751 3786897 2476672 1339528
39686 1339528 696661 531624 842563 1574509 2358716 2709441 2525785 2159034 1961627
39677 1961627 2015142 2325932 2938272 3656975 3958993 3519815 2695910 2185418 2298412 2829018
39667 2829018 3500459 4131903 4414217 4021839 3136040 2497712 2664105 3380142 3879347
39658 3879347 3713010 3169243 2913630 3203902 3431838 2672343 910192 -589278 -610918
39649 -610918 532108 1483463 1649019 1656769 1969233 2111352 1755950 1581366 2204697 2976013
39639 2976013 2844681 2006416 1642931 2178782 2790352 2714686 2181123 1820409 1831058 2009855
39629 2009855 2109820 1931232 1429582 880858 642134 730968 950339 1318298 1949975 2656081
39619 2656081 3188845 3746546 4583932 5216392 4810777 3453179 2227885 1826247 1842679
39610 1842679 1720735 1590041 1729639 1941392 2030724 2330575 3164150 4241916 5090157
39601 5090157 5608589 5739036 5165128 3962087 2997195 2925091 3201593 2882353 2046814
39592 2046814 1577053 1790258 2215961 2592935 3108541 3606695 3523400 2846137 2293754 2213176
39582 2213176 2046833 1312007 473150 358757 1176764 2516674 3891230 4872536 5111734
39573 5111734 4687973 4144774 3806887 3377370 2576816 1811752 1728367 2373456 3269760 4074888
39563 4074888 4666807 4824560 4450260 4003981 4061938 4391920 4090769 2829113 1413325
39554 1413325 808838 1031403 1361262 1324738 1038005 756775 533180 355389 318945 519030
39544 519030 888721 1239683 1452697 1604478 1865417 2225775 2398457 2141052 1632412 1311472
39534 1311472 1324856 1391261 1286873 1158338 1174307 1174739 970100 747324 788959 942608 825430
39523 825430 523272 604320 1317987 2191839 2622321 2527980 2194155 1796276 1396705 1181503
39513 1181503 1319290 1650891 1811564 1654425 1361575 1174801 1174748 1260579 1211184 878605
39503 878605 462188 410374 834935 1223626 1053290 544844 433959 1050437 1980307 2590487
39493 2590487 2512192 1674615 374847 -605679 -496369 578938 1596124 1757774 1266811
39484 1266811 742843 340885 -86318 -307262 149750 1199313 2077354 2190153 1787859
39475 1787859 1641859 2209018 3174810 3697004 3104391 1519168 -163106 -996350 -719569
39466 -719569 189748 1031015 1368774 1210113 918570 905596 1295103 1938490 2711732 3523014
39456 3523014 4012616 3721516 2811407 2135137 2152737 2217107 1544294 525651 273868 1052707
39446 1052707 2069115 2814533 3573807 4328763 4258226 3048014 1862403 2043044 3302939
39437 3302939 4175225 4013514 3578200 3658178 4048742 4121396 3627380 2602504 1159426
39428 1159426 -159180 -382683 893120 2754272 3749741 3359617 2342706 1761759 2041684
39419 2041684 2881439 3631017 3676305 2831375 1574842 748241 868789 1751009 2755632
39410 2755632 3288682 3121870 2436440 1600563 810382 9023 -732417 -966701 -356376
39401 -356376 678577 1251749 1029931 544463 359699 418977 494651 776359 1478118 2173030
39391 2173030 2148247 1356953 502788 188659 430776 973243 1562792 1882618 1771394 1630933
39381 1630933 2059650 2889112 3171000 2435468 1390479 933484 1016072 1094847 1245102 1996010
39371 1996010 3226871 4075401 4064300 3632855 3320975 3021152 2402978 1632451 1199129
39362 1199129 1221297 1306275 1043258 374582 -477291 -1202735 -1479925 -1055110 60610 1433247
39352 1433247 2352310 2310999 1418779 269066 -609672 -1036062 -947388 -255086 834478
39343 834478 1642690 1565425 742915 -81527 -287793 251284 1305401 2403241 2963599
39334 2963599 2792327 2434170 2584906 3141370 3304026 2688515 1837624 1463763 1648232
39325 1648232 2036667 2422990 2827949 3278773 3770472 4222949 4333880 3814905 2970376
39316 2970376 2633497 3186724 3976917 4100459 3510601 2923021 2837506 3146783 3602831 4104040
39306 4104040 4419092 4145068 3286609 2597057 2899920 4050371 4921848 4633780 3567129
39297 3567129 2827752 2827340 2903713 2431903 1682608 1178456 787259 156135 -351272 -33999
39287 -33999 973731 1789877 2021942 2022956 1896259 1301318 467277 264038 802854 1075597
39277 1075597 622776 431751 1279027 2241548 2050036 1094603 742864 1267423 1858527
39268 1858527 2239096 2727203 2939328 2116834 862890 907334 2660429 4404759 4546055
39259 4546055 3448618 2355153 1659322 1150180 1013370 1526781 2307003 2712458 2601686
39250 2601686 2113633 1268032 407094 373453 1434599 2545770 2528776 1589652 860611
39241 860611 819374 1039056 1213429 1482977 1835251 2037796 2178503 2538443 2918363 2788258
39231 2788258 2141545 1553119 1362628 1436612 1741782 2428012 3226648 3489314 3069158 2546592
39221 2546592 2326132 2109451 1577666 1016113 827568 873250 766468 513680 438462 687707
39211 687707 1161224 1716420 2123130 2062561 1560367 1227703 1625339 2462897 2854722 2379752
39201 2379752 1498360 868704 675569 817133 1319904 2124766 2676205 2313734 1226340
39192 1226340 568150 1243403 2766630 3715716 3278286 2006424 1019012 828908 1121172
39183 1121172 1386345 1482456 1653976 2170569 2952557 3581323 3785021 3782340 3864670 3795493
39173 3795493 3149937 2224277 1875550 2203096 2175253 1130833 -40200 -35610 1029962
39164 1029962 1896865 1968095 1767073 1655572 1283824 623883 457402 1196311 2015565 1898712
39154 1898712 1003320 283308 192801 503141 1074032 1969790 2894865 3292799 3124263 2932683
39144 2932683 2980561 2892569 2410415 1971557 2101063 2567220 2657774 2176416 1661993 1545268
39134 1545268 1537123 1122238 354222 -227229 -323642 -71548 481154 1540883 2944300 3854819
39124 3854819 3610578 2647566 2027197 2125744 2351212 2186662 1898693 1962169 2296934 2483676
39114 2483676 2422217 2358905 2427759 2532550 2608673 2682186 2659499 2309400 1560332 729685
39104 729685 365965 788783 1745299 2620214 3079350 3346791 3682055 3860521 3565229 3058921
39094 3058921 2869073 2899976 2588453 2006022 1943052 2565837 2869648 2104617 1015742 817283
39084 817283 1446601 1794067 1382643 826281 677878 775008 875122 1092723 1391985 1305649
39074 1305649 544322 -529368 -1281228 -1318782 -549295 797607 2067092 2587763 2408152
39065 2408152 2274523 2761148 3755379 4752441 5171650 4500799 2858491 1393851 1226794
39056 1226794 1870507 1759291 636029 141120 1322262 2839034 2820471 1493475 511327
39047 511327 409579 412768 352597 878612 1683758 1412120 -101174 -1156343 -602692 506821
39037 506821 723903 394976 705587 1504320 1652159 1046909 744329 1146344 1439230 1014311
39027 1014311 308964 -80266 -204757 -338120 -483396 -614076 -774403 -707292 -24092 1024260
39017 1024260 1610749 1449922 1200852 1431216 1848589 1984775 1984679 2131422 2119819 1497319
39007 1497319 519276 -81786 -36527 247829 285847 -76757 -681450 -1098617 -847667 22611
38997 22611 774345 826002 548145 715466 1321628 1536514 882380 -71755 -382068 221754
38987 221754 1131788 1542629 1256705 872873 1120480 1993535 2780423 3011298 2954806 2948374
38977 2948374 2778269 2246382 1901551 2445930 3587441 4231264 3823265 2866372 2065108
38968 2065108 1593022 1347615 1361536 1712614 2372317 3244151 4054970 4291163 3680865 2649610
38958 2649610 1799123 1072280 57384 -1032025 -1508057 -1331088 -1164953 -1171349 -731186
38949 -731186 310418 1120916 1141985 982825 1387527 2085233 2392438 2249543 1872507 1074124
38939 1074124 -105961 -670314 297107 2134815 3236493 3098931 2742267 3066279 3767026
38930 3767026 4107638 3927594 3524146 3136907 2903901 2903573 2959300 2700213 1982011 1015712
38920 1015712 58874 -738629 -1203624 -1159868 -569803 525990 1988385 3237948 3361296
38911 3361296 2136181 645396 179228 730175 1303366 1498395 1827084 2462929 2739993
38902 2739993 2255743 1613590 1564100 2022269 2392046 2350063 1886226 1032535 -5068 -772339
38892 -772339 -959772 -609171 206031 1471421 2839174 3673802 3758891 3483273 3107724
38883 3107724 2433562 1504761 977400 1278572 1919097 2185439 2079057 2037262 2146073 2219921
38873 2219921 2305075 2480800 2433008 1846644 1030955 576316 548438 577157 592443 879484
38863 879484 1464592 2001689 2273480 2333163 2164705 1675311 1041535 612475 421889 214015
38853 214015 15664 259429 1177578 2384924 3247174 3492317 3360674 3283760 3471231 3733303
38843 3733303 3706536 3275458 2682872 2232281 2069998 2223893 2506036 2366405 1377603 48861
38833 48861 -454605 228240 1090898 1156427 759583 678116 646269 -106436 -1145679 -1026927
38823 -1026927 574420 2090007 1964382 519594 -671510 -666452 204266 1158840 1791812
38814 1791812 2178861 2553353 2932825 3048796 2779876 2502851 2616523 2854508 2698032
38805 2698032 2458324 3118071 4806358 6238725 6220791 5071169 3919336 3165453 2459776
38796 2459776 1829798 1827549 2514451 3129228 3052283 2544553 2207779 2104816 1781035 962748
38786 962748 -97434 -954599 -1433009 -1666356 -1770578 -1637743 -1136471 -397505 286639
38777 286639 799938 1228242 1580599 1757892 1798837 1825981 1705665 1168016 393663 19977
38767 19977 301887 713714 758307 747803 1259969 2132248 2625034 2466619 2145164 2167322
38757 2167322 2555357 3118096 3694990 4005114 3745932 3072953 2603392 2699720 3045632 3143122
38747 3143122 2926240 2618744 2252360 1680007 946603 318075 -60049 -295536 -490778
38738 -490778 -519935 -184045 432468 856936 624732 -125472 -569841 61309 1639371 3201709
38728 3201709 3864297 3482184 2458044 1299224 538041 661097 1624779 2567510 2509397
38719 2509397 1460511 489869 529476 1395636 2209828 2514424 2596698 2816927 3070966 3074154
38709 3074154 2852003 2658045 2552766 2364237 2039898 1761776 1656135 1632419 1621245 1729226
38699 1729226 1942492 1872457 1150102 65767 -531955 -145813 772432 1330545 1157963
38690 1157963 635566 265608 125906 22528 -75777 34821 511841 1255578 1953255 2281319
38680 2281319 2156967 1854399 1731529 1736523 1386913 465681 -450872 -538490 247502 1093215
38670 1093215 1325010 1060581 716182 344497 -166048 -576905 -478215 130887 828655 1269344
38660 1269344 1381706 1201595 901640 894486 1422912 2003930 1763733 527207 -781167
38651 -781167 -1069218 -194708 1013307 1631846 1364789 582227 -112603 -367657 -245359
38642 -245359 26522 329944 593102 665944 525176 443053 618893 799032 684083 546854
38632 546854 854338 1354222 1298767 697780 491193 1083180 1549427 1009421 132706 339264
38622 339264 1820532 3317306 3826201 3634231 3466968 3395743 3053099 2466198 2149239
38613 2149239 2471530 3249906 3983348 4339465 4337616 4067893 3385361 2155588 804838
38604 804838 177230 538465 1072417 822814 -80196 -631712 -267996 570999 1213821 1579126
38594 1579126 2056898 2921319 4036628 4943691 5185279 4737430 4085713 3656573 3292588
38585 3292588 2609598 1738088 1265676 1484820 2154621 2992776 3875695 4475773 4284819
38576 4284819 3277915 2133398 1501835 1362843 1315290 1159476 932075 663468 386861
38567 386861 184826 22843 -245136 -530928 -428897 295377 1321352 2067010 2228747
38558 2228747 1955727 1695430 1889104 2507677 2858823 2287014 1182193 770032 1607886
38549 1607886 2766351 2912833 1820325 349700 -709199 -1198684 -1196627 -707221 133282
38540 133282 915505 1181459 724218 -210356 -912966 -702676 273354 989012 656199 -323339
38530 -323339 -926192 -808953 -524298 -553292 -718941 -643425 -265583 288593 915537 1342166
38520 1342166 1078341 -22653 -1249200 -1462232 -234006 1551926 2458986 1953251 956151
38511 956151 768543 1602758 2515307 2670363 2119862 1277787 331817 -450183 -492946 359482
38501 359482 1333992 1644817 1582956 1940002 2636432 2840172 2349901 1855594 1677226 1240706
38491 1240706 221550 -642657 -484821 554499 1724358 2701755 3575151 4144209 3972245
38482 3972245 3092467 2124887 1625831 1636094 1870223 2097236 2316404 2668028 3113265 3241119
38472 3241119 2710032 1939742 1878223 2782521 3666947 3411634 2118015 901676 582881
38463 582881 1063002 1788067 2277629 2281117 1936666 1780856 2176477 2777694 3007400 2973821
38453 2973821 3320312 4118512 4565919 4063528 3073504 2512907 2643796 2968642 3013223 2826845
38443 2826845 2771870 3089388 3666092 4088654 3974187 3339846 2591447 2134086 2111213 2464558
38433 2464558 2952894 3069515 2335260 921471 -294733 -578968 -42857 743495 1557326
38424 1557326 2514658 3414664 3648580 2919237 1703551 798285 605293 988897 1597596
38415 1597596 2096851 2225896 1912902 1388909 1042186 1084919 1411496 1791387 2103795 2323401
38405 2323401 2386132 2246910 2061051 2078316 2241374 2131913 1579422 1113547 1358522 2042743
38395 2042743 2221390 1684613 1488488 2532975 4087478 4534165 3426131 1968884 1364940
38386 1364940 1526395 1783773 2066402 2676540 3407861 3750749 3806092 4178913 4895054 5157781
38376 5157781 4454928 3325577 2627805 2462698 2294471 1884411 1582680 1700130 1994289
38367 1994289 1927012 1256928 301488 -278224 55629 1309364 2916506 4141968 4596597
38358 4596597 4425656 4083694 3932896 3946390 3752943 3086773 2248331 1948329 2535998 3492959
38348 3492959 3888249 3317530 2268313 1588505 1692813 2236146 2472039 2000098 1226369
38339 1226369 953905 1454821 2203097 2689652 3131186 3959223 4920522 5343783 5218641
38330 5218641 5257124 5709092 5850896 5060317 3782966 2871987 2460520 2162855 2018156
38321 2018156 2405517 3143806 3498477 3176433 2623006 2216874 1887475 1726811 2170946
38312 2170946 3118293 3585189 2899496 1703403 1022610 765037 68097 -1047796 -1428331
38303 -1428331 -424397 1081559 1768296 1406143 774128 490743 548458 805835 1295653
38294 1295653 1927524 2309010 2118410 1518845 1034872 1026317 1358722 1639541 1741531 1930040
38284 1930040 2378338 2789383 2812096 2682816 2976107 3710456 4265443 4367854 4527046 5047373
38274 5047373 5199258 4148006 2419059 1526101 2041440 2835907 2596040 1482647 742593
38265 742593 1036530 1785507 2145703 2086517 2227289 2845127 3402147 3152706 2032013 730762
38255 730762 -52060 -162715 206130 855958 1479438 1608483 1155685 835402 1522109 3180120
38245 3180120 4830694 5562111 5186256 4006456 2517938 1385712 1099281 1422114 1650895
38236 1650895 1561772 1565706 1809364 1860789 1622019 1766308 2666205 3556424 3540574 2930187
38226 2930187 2713604 3036242 3140908 2649003 1956886 1371625 784032 334025 489831
38217 489831 1152518 1495335 1149905 883184 1543320 2818833 3622483 3432916 2790707
38208 2790707 2624775 3378596 4604574 5233807 4551498 3089337 2153149 2248669 2500332
38199 2500332 1994161 1087693 733007 968649 960827 378340 -160016 -99578 369661 883926
38189 883926 1465237 2128120 2496727 2333765 2091100 2402838 3225833 3955939 4249281 4220833
38179 4220833 3900235 3103436 2010046 1293914 1278713 1381664 946629 373371 702192
38170 702192 2041591 3162920 3027000 2100812 1565905 1669928 1679281 1298900 1181321 1764668
38160 1764668 2418735 2309860 1589827 1075645 1054754 1096917 950169 923912 1232568 1532122
38150 1532122 1428764 1069740 871928 911547 961344 984755 1162360 1418201 1349176 817584
38140 817584 285091 261771 653899 1019452 1295602 1780874 2425154 2721175 2486505 2195676
38130 2195676 2198789 2148885 1712258 1353501 1691163 2399292 2602449 2223094 2004798 2150645
38120 2150645 1957810 1146838 595032 1114739 2209313 2749009 2365329 1497645 539312
38111 539312 -277393 -496330 185010 1235457 1713707 1368245 738584 271438 13359
38102 13359 123212 879198 1970021 2470953 1893116 797111 49371 -146165 -171176 -288661
38092 -288661 -385136 -261832 101870 554706 932943 1226992 1551055 1883833 2009121 1897284
38082 1897284 1901229 2228338 2466874 2169221 1751635 2109423 3252792 4038648 3585078 2395809
38072 2395809 1656772 1818054 2322143 2476857 2159743 1747113 1640621 1847709 1951515
38063 1951515 1634836 1213298 1306418 1922797 2341541 2115616 1700507 1718679 2058024 2234044
38053 2234044 2307539 2758261 3531346 3884346 3365098 2469281 2055154 2385264 2999510 3361235
38043 3361235 3360406 3200685 3016877 2767953 2476887 2370394 2600671 2928773 2967821 2773357
38033 2773357 2885140 3623117 4601632 5176299 5168156 4854172 4388665 3624915 2560016 1629392
38023 1629392 1341826 1731621 2338680 2698382 2707540 2499570 2168918 1814637 1725435 2164513
38013 2164513 2905107 3348217 3294582 3218144 3459230 3578931 3074500 2402210 2499038 3360514
38003 3360514 3935127 3594104 2915777 2698191 2954603 3385573 4175506 5608089 7276084
37994 7276084 8364090 8558604 8186895 7651267 7190710 6988519 7004863 6831101 6165784
37985 6165784 5320227 4834823 4736356 4621451 4351087 4173666 4197173 4202179 4038750 3874925
37975 3874925 3994758 4538958 5366402 6012606 6013129 5493704 5108793 5074400 4714338 3531997
37965 3531997 2329001 2440022 3990787 5744615 6719681 7140809 7564288 7839722 7456910
37956 7456910 6480786 5607994 5386437 5646675 5702646 5085533 4124296 3659813 4051021 4728764
37946 4728764 4969221 4711198 4201733 3361609 2248009 1696185 2423008 3633868 3699597
37937 3699597 2351951 1029720 723692 732197 215221 -211520 479116 1890776 2651730
37928 2651730 2349299 1918000 2188872 2967079 3598263 3718687 3345882 2783268 2477581
37919 2477581 2503634 2263999 1246832 20053 -186760 987252 2514043 3229157 3110279
37910 3110279 2948580 3094923 3031470 2192945 847786 -104273 -152211 305348 627256 831951
37900 831951 1407647 2364169 3081951 3201923 3043102 2892618 2536105 1921390 1661884 2246461
37890 2246461 3202030 3708982 3689723 3616030 3589917 3387339 3145765 3176117 3272419 3073054
37880 3073054 2958352 3582306 4506429 4426578 3061549 1761046 1699112 2359971 2498300
37871 2498300 1864295 1165316 827792 655899 482541 424945 565855 901996 1488721 2182619
37861 2182619 2437447 1890117 1025225 712512 1121073 1585883 1528740 1004419 309475 -386508
37851 -386508 -816433 -501868 761737 2509882 3973914 4745892 4934637 4818501 4569232
37842 4569232 4271547 3990968 3717085 3334805 2810020 2433691 2696277 3719767 4924286
37833 4924286 5576487 5670516 5870010 6449830 6771739 6168335 4939578 3932166 3395381
37824 3395381 2900428 2271448 1850247 1757299 1662812 1572139 2059553 3179532 3832576 3047402
37814 3047402 1491856 758825 1276650 1921540 1845483 1665560 2303418 3457047 4053386
37805 4053386 3799501 3447069 3636012 4183771 4546063 4400148 3711237 2764635 2252783
37796 2252783 2819869 4304026 5803938 6644452 6908101 6925964 6746466 6342181 5882921
37787 5882921 5492997 5094280 4720686 4565435 4492046 4054662 3339205 3110548 3566118 3659255
37777 3659255 2552411 1187133 1234045 2702697 3863879 3650054 2860695 2559694 2489821
37768 2489821 1898816 1028642 728240 1066058 1333519 1234034 1182379 1437899 1717706 1809917
37758 1809917 1931299 2217272 2330690 1929943 1301758 1223387 2189922 3869476 5343333
37749 5343333 5900010 5579206 4905026 4260918 3815936 3909575 4879723 6292805 6941287
37740 6941287 6083217 4305369 2729003 1796155 1380695 1583217 2503172 3415311 3178277
37731 3178277 1663541 41238 -577484 -162015 713874 1635828 2340644 2632219 2707238
37722 2707238 2984657 3258971 2708381 1233673 47440 178764 993648 1122530 434100
37713 434100 53232 645658 1795307 3074350 4575509 6123662 7054159 7267336 7555695
37704 7555695 8289151 8682840 8131584 7392678 7389372 7532502 6574828 4815858 3984394 4783371
37694 4783371 5897962 5896424 4937383 3933295 3098573 2286187 1941389 2522217 3381767
37685 3381767 3420269 2764630 2704540 3804342 5050930 5235859 4388821 3361075 2627419
37676 2627419 2108822 1773523 1756202 1990080 2211917 2342374 2530857 2803070 2922810 2664543
37666 2664543 2067916 1375807 812503 453314 258892 192135 272588 521481 919345 1425682
37656 1425682 1926513 2169031 2002683 1780291 2160948 3226734 4124969 4012401 3101671
37647 3101671 2302668 2104959 2425813 3282811 4712930 6024969 6128235 4963200 3821247
37638 3821247 3803224 4608467 5270691 5423509 5298060 5052335 4734374 4523655 4510920 4610608
37628 4610608 5042000 6320037 8298910 9868130 10224431 9874957 9755304 10001356 10330336
37619 10330336 10933148 12051385 13298401 14449157 16323744 19728529 24064145 28251232
37611 28251232 32463653 37457845 42794173 47669169 53201325 61727895 74158699 91176530
37603 91176530 117698613 161899012 225662199 296611542 352552763 375008211 359124997
37596 359124997 313604053 254494988 198028331 154456616 125144776 105368535 90414489
37589 90414489 78732763 70109612 63310167 56770134 50237331 44327878 39113825 34244712
37581 34244712 29974258 26962625 25166658 23727175 21944148 19788032 17521383 15402402
37573 15402402 13805262 13104340 13206865 13461863 13218454 12374228 11308985 10397591 9706900
37564 9706900 9153203 8809783 8873881 9309076 9738623 9840896 9667413 9387889 8956163 8342179
37554 8342179 7882142 7918647 8130841 7734728 6516408 5281278 5010599 5761087 6601394
37545 6601394 6550532 5477212 4144820 3442181 3582870 4099528 4539934 4880763 5192853
37536 5192853 5320204 5195092 5121546 5338807 5579221 5485206 5177473 4919965 4537322 3798126
37526 3798126 3120097 3133436 3663357 3937092 3769466 3718037 4007953 4172926 3945085 3647111
37516 3647111 3428796 2958036 2233672 1875067 2132432 2391406 2223958 2204077 3001772 4253335
37506 4253335 5035247 5026774 4602704 4195417 4099611 4431413 4747180 4254870 3001289 2243549
37496 2243549 2936345 4468629 5704967 6593558 7677037 8603891 8490963 7534853 6898874
37487 6898874 6959575 6918493 6315536 5709952 5544653 5478299 5287830 5375362 5816139 5852864
37477 5852864 5006864 3913386 3391027 3380305 3475817 3833644 4749366 5827599 6369296
37468 6369296 6273954 5907982 5406454 4738963 4139126 3797959 3395918 2595938 1758998 1495209
37458 1495209 1712161 1814504 1682011 1680922 1775906 1461382 691831 116666 143494 425652
37448 425652 592443 899177 1733904 2909826 3871503 4307573 4209715 3611483 2653611 1709917
37438 1709917 1082474 688476 330350 111625 246682 584410 729875 645794 745214 1259553
37428 1259553 1833723 1980307 1742218 1627638 1929312 2344148 2339226 1759712 974861 476548
37418 476548 415463 521666 420474 2544 -508265 -842075 -994570 -1173018 -1424263 -1453528
37408 -1453528 -951448 -43653 768849 1160597 1322420 1655732 2242406 2770003 2937837
37399 2937837 2753631 2370289 1802886 1013405 244761 8071 561481 1534079 2283369
37390 2283369 2557969 2569148 2479561 2205463 1804331 1618676 1754262 1782013 1372755 967801
37380 967801 1296779 2299521 3011147 2586641 1125383 -485790 -1219404 -539173 1088333
37371 1088333 2321621 2142378 1021840 375232 796957 1496405 1653297 1520974 1702845
37362 1702845 2056406 2060299 1820424 1922484 2498407 3131682 3568298 3895797 4089202 3966537
37352 3966537 3580816 3156721 2690318 2094342 1627204 1612842 1823736 1775897 1598942 1905021
37342 1905021 2732466 3381397 3506085 3610754 4084422 4424403 3951392 2806141 1692533
37333 1692533 981329 572910 385005 505337 1006315 1903332 3063122 3929245 3764885
37324 3764885 2570387 1359699 1028114 1298843 1337163 1021847 870448 975456 931885
37315 931885 825044 1363638 2737563 4087879 4520392 4073186 3282657 2360564 1351163
37306 1351163 668005 776159 1447770 1878258 1583922 859344 370418 564147 1411395
37297 1411395 2463163 3220077 3655594 4226100 5120840 5751466 5412656 4290965 3308405
37288 3308405 3016951 3183286 3472321 3892788 4347674 4352774 3621230 2527366 1617324 1029595
37278 1029595 752206 980968 1673025 2144341 1832922 1247407 1374694 2198009 2637751
37269 2637751 2120899 1389192 1353381 1833355 2016748 1706551 1470612 1768453 2477897 3190532
37259 3190532 3533238 3273326 2529633 1875810 1867576 2408668 2844459 2719811 2235097 1930765
37249 1930765 2088920 2464952 2527571 2029530 1384630 1271862 1739767 1999400 1396827 341011
37239 341011 -145345 333843 1204924 1806642 2149056 2601809 3136497 3206104 2403938 1093595
37229 1093595 191900 202429 624072 620337 157016 -35865 352231 777567 878495 1181060
37219 1181060 2171309 3312454 3783396 3698353 3687376 3668976 3104844 2242601 1921513 2140398
37209 2140398 2016926 1367039 1129155 1808217 2618478 2759841 2547627 2571570 2615989 2225063
37199 2225063 1624739 1264409 1039124 741627 706361 1199221 1713069 1705516 1506384 1600197
37189 1600197 1560168 783462 -124644 55270 1300064 2255183 2056771 1186711 410702
37180 410702 -74797 -208423 197193 895297 1252648 1252037 1621924 2530610 3002459 2278448
37170 2278448 1077742 748329 1591147 2725663 3320736 3286073 2901599 2410555 2051614
37161 2051614 2058196 2462580 3057727 3586507 3913190 4084250 4238295 4315054 3918156 2792310
37151 2792310 1447433 854566 1323689 2086627 2272744 1926501 1678324 1710401 1570820
37142 1570820 958602 229982 -34153 281116 758196 1000427 1085833 1381423 1987904 2578362
37132 2578362 2846444 2869136 2848685 2741566 2422822 2006664 1673435 1383759 1140652 1288549
37122 1288549 2041772 2919132 3267052 3220093 3449465 4017522 4275661 3965558 3571522 3371258
37112 3371258 3003318 2326981 1859205 1867095 1826789 1388376 1136934 1679850 2634426 3308410
37102 3308410 3767874 4304675 4384114 3280618 1541013 646713 1126586 1999882 2313736
37093 2313736 2329139 2778344 3665720 4355414 4449499 4099335 3611973 3076499 2387940 1566479
37083 1566479 1010144 1198364 1972615 2448236 2056743 1403793 1517621 2389776 2927253
37074 2927253 2394721 1280326 566393 679809 1390649 2282942 3014116 3396614 3485279
37065 3485279 3466549 3419074 3338202 3277753 3179021 2756076 2015179 1689735 2466539 3807135
37055 3807135 4347968 3675090 2895354 3032263 3601258 3430606 2366562 1378853 1187014
37046 1187014 1481846 1522334 1012160 310823 64537 610241 1537072 1976619 1571446 951566
37036 951566 924019 1414461 1680572 1450231 1269549 1620884 2216791 2464189 2294961 2181186
37026 2181186 2464900 2964261 3209786 2866357 1946022 804008 -49117 -317330 -191089
37017 -191089 -111518 -164092 122842 1160636 2588231 3490500 3375721 2661867 2094847 1970880
37007 1970880 2099472 2221105 2151451 1736249 1047485 531196 610294 1165749 1682624 1838147
36997 1838147 1667694 1291693 897217 932777 1811909 3274496 4417486 4546229 3759073
36988 3759073 2630925 1637911 991176 694642 575570 478991 529403 951872 1587234 1939058
36978 1939058 1839578 1718174 1998135 2528477 2864476 2877956 2828208 2969483 3288486 3537327
36968 3537327 3422054 2882284 2246494 1967768 2181237 2663665 3143898 3394134 3129134
36959 3129134 2230605 1082444 300364 123984 436137 1235742 2500357 3671102 4064541
36950 4064541 3883760 3961202 4309091 3963113 2727154 1938896 2616693 3813475 4013111
36941 4013111 3447461 3546402 4401060 4424511 2816935 923079 408119 1113492 1643796
36932 1643796 1453076 1347409 2073217 3246042 3905302 3671323 3031610 2626666 2549973
36923 2549973 2472449 2275324 2224123 2447726 2593476 2265677 1587244 1045380 943215 1250632
36913 1250632 1805400 2392484 2808946 3086309 3405834 3593433 3130210 2023599 1153188
36904 1153188 1173518 1547658 1415707 997363 1163839 1859183 2070885 1416629 666517 450502
36894 450502 504862 618430 1293315 2755817 4092853 4229235 3351619 2655964 2936867
36885 2936867 3962609 4992622 5416866 5069569 4323937 3767292 3584067 3499135 3409662
36876 3409662 3561536 3871831 3709558 2816525 1900322 1727913 2058380 2096139 1665670 1298872
36866 1298872 1393956 1875732 2483839 2849041 2518215 1500375 593626 555288 1099134 1325131
36856 1325131 982479 615308 542160 460287 167045 -12595 252493 854498 1500404 1993219
36846 1993219 2182753 2088731 2116381 2631420 3260266 3213411 2456631 1915429 2216480 2834643
36836 2834643 2934786 2564546 2455214 2937816 3599956 3893293 3657552 3114021 2670137
36827 2670137 2650853 2927734 2904881 2186745 1207795 862593 1452985 2269865 2348513 1479006
36817 1479006 334993 -298757 -241944 163623 644185 1224580 1845066 2078757 1530558
36808 1530558 399168 -643059 -1085951 -874536 -204665 604094 1091740 981312 626539
36799 626539 726346 1428979 2104139 2203602 1938253 1799791 1804404 1661445 1434149 1513952
36789 1513952 2017649 2671337 3298600 3999275 4761235 5282168 5348845 5098515 4731412 4268510
36779 4268510 3856855 4010936 5054141 6366321 6732105 5689204 4138112 3240987 3040084
36770 3040084 2729537 2108465 1948165 2704742 3655826 3879168 3507044 3265900 3166715 2556630
36760 2556630 1341758 218613 -428051 -972333 -1598352 -1728625 -897117 438633 1487859
36751 1487859 2012378 2123393 1756078 1018316 625045 1182815 2225965 2691297 2298878
36742 2298878 1830615 2034570 2822777 3609846 3939344 3673947 2987452 2300838 1954081
36733 1954081 1908791 1965817 2112540 2347706 2391593 2017251 1492503 1210415 1062394 724751
36723 724751 375467 454686 830565 956752 833457 1002375 1521581 1822419 1786338 2050276
36713 2050276 2862830 3513501 3446738 3173629 3412663 3954677 4098649 3729316 3266436 2940307
36703 2940307 2766061 2861283 3150676 3127951 2569484 2112124 2408440 3052976 3127051 2523184
36693 2523184 1897229 1532215 1159364 813075 938752 1585459 2303485 2922369 3655711
36684 3655711 4361607 4509421 4025368 3404363 2860301 2186678 1600211 1769973 2685371
36675 2685371 3429057 3524195 3601063 4160427 4581192 4136533 3231243 2695775 2406439 1614987
36665 1614987 337678 -566739 -630356 -256433 86178 477708 1212516 2288743 3329998
36656 3329998 3798768 3427227 2661602 2378239 2855630 3423244 3490371 3357647 3422950 3214604
36646 3214604 2141406 765222 215347 525023 705170 449522 513297 1158047 1507989
36637 1507989 1043736 599494 1009892 1667685 1496783 756431 674942 1508163 2149507 1846190
36627 1846190 1295809 1539395 2461790 3078108 2986926 2812543 3138863 3602089 3428094 2552094
36617 2552094 1680078 1287347 1113079 829398 664895 942240 1422410 1674283 1797692
36608 1797692 2126783 2425492 2163594 1552407 1439678 1990200 2312967 1780635 967679
36599 967679 751724 1115064 1458618 1588381 1685398 1670172 1355093 1038529 1231672 1856714
36589 1856714 2361262 2621620 3069150 3762288 3927792 2807508 697136 -1154672 -1627894
36580 -1627894 -656451 795634 1641444 1651500 1517539 1902452 2628039 3016085 2833524
36571 2833524 2518540 2493441 2615333 2430849 1770938 988592 696123 1247637 2350711
36562 2350711 3231003 3339090 2872509 2472192 2476075 2649703 2597082 2215292 1707535 1305903
36552 1305903 1059768 853510 603773 405042 419667 690310 1209540 2067562 3210262
36543 3210262 4084705 4006375 3062108 2197575 2110240 2476076 2647407 2648378 2865804 3080400
36533 3080400 2625159 1535363 803353 1189859 2259840 2940346 2742369 2099908 1640143
36524 1640143 1432461 1055530 316748 -273959 29469 1234920 2387210 2539370 1767430
36515 1767430 981320 877764 1322959 1646781 1337385 583299 266306 1129464 2748917
36506 2748917 3753607 3442586 2714921 2806013 3552405 3790464 3240283 2889372 3327528
36497 3327528 3763714 3274614 2256552 1862286 2409609 3112985 3258734 2970481 2717714
36488 2717714 2598854 2406509 2123766 1988617 2080371 2158906 2095214 2220445 2881324 3750280
36478 3750280 4078696 3713532 3292840 3189231 2907493 2027918 1131184 1017490 1430192
36469 1430192 1455189 961353 687091 940043 1187604 1099385 1093295 1528179 2112527 2488714
36459 2488714 2777174 3171191 3507736 3553506 3293093 2783087 2209410 2113581 2862811 3805444
36449 3805444 3793759 2769669 1928093 1970783 2202301 1921375 1697832 2393143 3679280
36440 3679280 4509500 4548964 4232026 3824360 3332187 3016272 3093382 3125562 2543258 1656110
36430 1656110 1372680 1964049 2773061 3113792 2887536 2394805 2082518 2356475 3102776
36421 3102776 3528695 3006408 1922264 1187559 1134699 1445637 1878444 2372327 2655103
36412 2655103 2514328 2356715 2760575 3523819 3873318 3597311 3249891 3197640 3160108 2790862
36402 2790862 2101303 1244258 467099 297488 1122561 2490611 3428530 3542737 3264164
36393 3264164 3019693 2823861 2723244 2897951 3135756 2869053 1970862 966428 302988
36384 302988 -17318 38398 696421 1795646 2614843 2583079 1775707 622664 -371131 -597768
36374 -597768 263894 1638537 2464512 2432081 2251586 2559716 3197442 3693556 3740456 3058223
36364 3058223 1644498 397764 530926 1935270 3069796 3027218 2735357 3341962 4349555
36355 4349555 4449418 3577581 2911186 3042331 3257152 2708715 1499847 444487 275373
36346 275373 1129475 2416247 3265017 3440312 3593381 4224249 4757417 4256606 2806868
36337 2806868 1473274 941696 859737 600282 110496 -193082 -7136 558084 1083033
36328 1083033 1209916 1015470 907871 1076463 1326949 1611581 2277625 3421360 4412492
36319 4412492 4594325 4184751 3936868 4094463 4215124 3896689 3184300 2364869 1793978
36310 1793978 1757021 2036060 1837511 738745 -452348 -461063 840953 2238520 2678982
36301 2678982 2352591 2058974 2055757 1939998 1405919 749847 587300 1138157 1855432 1948851
36291 1948851 1335047 751997 745144 960389 830668 555260 806601 1708609 2728084 3441829
36281 3441829 3807226 3784358 3354408 2916357 3023228 3615183 4042045 3924942 3490000 3001185
36271 3001185 2430112 1824915 1468669 1436827 1385618 975430 240137 -507507 -866118 -535761
36261 -535761 305136 949704 943955 729395 934489 1269268 949439 124216 -117038 654313
36251 654313 1559638 1734141 1417098 1229695 1163467 921914 632961 536874 432633 75145
36241 75145 -244928 -92958 460917 1084609 1713699 2319723 2528400 2083038 1430782 1263543
36231 1263543 1648913 2087226 2188728 1826752 958296 -94765 -483729 289153 1443916
36222 1443916 1626459 572051 -610393 -891071 -354845 423143 1327253 2524763 3753497
36213 3753497 4366567 4064582 3275171 2756523 2919298 3495893 3801518 3355112 2294318
36204 2294318 1217800 714207 1050187 2077002 3232959 3816779 3582916 3044852 2937989
36195 2937989 3391616 3850197 3764600 3080077 2057784 988095 241357 281918 1271646
36186 1271646 2692810 3640622 3627367 3012790 2540553 2515764 2604356 2443203 2175960 2159653
36176 2159653 2317148 2141391 1352271 233568 -754125 -1400564 -1672565 -1498958 -820205
36167 -820205 306596 1735351 3167885 4063116 3984238 3188009 2508160 2425279 2571176
36158 2571176 2391605 1942698 1688281 1799106 2038616 2135694 1919466 1292156 437925 -123954
36148 -123954 -67222 324459 625852 942301 1657008 2653728 3309521 3256219 2716001 2079197
36138 2079197 1570437 1357746 1557157 2005705 2349697 2439052 2345125 1970962 1036874 -388367
36128 -388367 -1651560 -2053396 -1526651 -683902 -263463 -526772 -1105245 -1451390 -1445578 -1381909
36118 -1381909 -1334089 -941004 -83854 654230 693698 314610 235012 573899 896145 1111673
36108 1111673 1515736 1928067 1682649 746801 66708 374393 1287626 2047798 2541167
36099 2541167 3006263 3240432 2835315 1958975 1235370 934545 833753 813362 1019803 1370723
36089 1370723 1416231 933126 355024 349028 1038053 1761426 1630937 400327 -1161739 -1899282
36079 -1899282 -1394917 -336266 372792 645815 1073136 1911012 2655288 2722631 2215885
36070 2215885 1760169 1718965 1825730 1618502 1065429 622687 717867 1332152 2131511 2822914
36060 2822914 3216584 3098245 2358266 1277284 432438 226172 645541 1457760 2386466
36051 2386466 3076840 3225469 2914830 2578539 2470531 2390715 2105934 1804251 1880089 2407758
36041 2407758 3050077 3401073 3254513 2634317 1737542 828533 130193 -145242 231441
36032 231441 1229074 2267548 2588316 2053366 1263406 774466 583434 517062 591867 674983
36022 674983 364736 -255382 -249382 1039305 2804277 3581139 3140546 2692348 3087807 3714352
36012 3714352 3588976 2816609 2315917 2507423 2941689 3109528 3071729 3197611 3610273 4045668
36002 4045668 4168672 3973558 3838780 4080041 4465847 4388446 3595025 2548154 1932872
35993 1932872 1953199 2209429 2117831 1392896 324621 -348690 -112638 648674 958414 438325
35983 438325 -144170 122362 1030317 1518137 1107425 491535 531692 1159061 1632442 1585894
35973 1585894 1353799 1294452 1225369 759435 -3710 -436586 -86163 792358 1574602 2029188
35963 2029188 2468877 3091088 3497379 3209592 2538167 2448625 3350690 4395150 4424412 3475149
35953 3475149 2769012 3084353 3727605 3580067 2724961 2279338 2707977 3161800 2786087
35944 2786087 1949763 1605350 1948819 2422079 2724275 3027871 3296766 3187562 2712665
35935 2712665 2276677 1889998 1077260 -147434 -952802 -808509 -298159 -234352 -503269
35926 -503269 -485138 -200996 -224404 -655529 -977102 -886384 -559323 -75985 724541 1721486
35916 1721486 2480331 2874769 3157295 3311466 2992561 2287251 1830509 1881617 1985134 1913543
35906 1913543 2165596 2932229 3311673 2456775 1041238 565459 1358909 2263446 2390096
35897 2390096 2257060 2807068 3993321 4872696 4734604 3702918 2436918 1586984 1432382
35888 1432382 1784862 2233529 2528925 2654881 2604672 2358965 2099968 2118380 2377789 2454269
35878 2454269 2088446 1565673 1337592 1437177 1502514 1315739 1133500 1443765 2416388 3583263
35868 3583263 4134967 3651672 2495406 1378572 679002 361413 359007 637373 962429
35859 962429 1062425 1073266 1410373 2116969 2756972 3065201 3257225 3528386 3725450 3786905
35849 3786905 4049032 4713702 5334264 5243209 4313552 3019266 1950455 1488679 1675309
35840 1675309 2132475 2362506 2315730 2339569 2452082 2232840 1706818 1615615 2244624 2661414
35830 2661414 1941052 635181 65482 504923 1105351 1427637 1874962 2551314 2865277
35821 2865277 2604909 2388375 2576080 2617031 2034601 1308045 1150305 1503552 1844551 1980260
35811 1980260 1999259 1932678 1994575 2628626 3724292 4331653 3869139 3123043 3201724 3868578
35801 3868578 3873742 2767076 1388585 521918 22771 -458296 -725712 -452928 241633
35792 241633 1053021 1863613 2479758 2441725 1583982 514423 70644 422585 1061348 1535605
35782 1535605 1807225 1925604 1772816 1306345 832118 817882 1437471 2359149 2982738 2904673
35772 2904673 2235487 1526735 1359775 1914537 2866177 3693942 4110942 4189502 4090626 3791454
35762 3791454 3181824 2335593 1499844 826831 295004 -100586 -280238 -229513 -4865 433430
35752 433430 1113883 1711856 1684255 972001 247290 141464 477760 635287 451574 291490
35742 291490 326518 287964 25613 -165673 -3849 344585 556627 627072 754648 932471
35732 932471 998212 1033470 1336684 1879482 2105368 1563904 606288 93920 374406 877572
35722 877572 886601 394713 -93671 -335707 -470082 -505749 -250460 183943 345368 142314
35712 142314 128084 747793 1635525 2038796 1731017 1160728 847668 945375 1304152 1695056
35702 1695056 2000316 2305610 2691499 2897342 2503368 1613133 998027 1252543 2071928
35693 2071928 2679694 2712714 2338752 1753983 1009974 244877 -268588 -293707 282422 1327492
35683 1327492 2309116 2641076 2421977 2376586 2724853 2659608 1505913 -96566 -900235
35674 -900235 -599047 83598 575804 890823 1052337 984733 988328 1506273 2326398 2733172
35664 2733172 2519951 2148620 1869386 1440229 797667 237846 -160572 -507801 -448974 517743
35654 517743 1899563 2421600 1748402 1002725 1098775 1557389 1601149 1445839 1647868 1950248
35644 1950248 1729077 1059028 507695 352310 728958 1945161 3756911 4926954 4585577
35635 4585577 3623829 3585880 4437507 4676475 3631563 2379976 2093971 2597704 3072202
35626 3072202 3271893 3364115 3211768 2586443 1809740 1540986 1950783 2487921 2499073 1888086
35616 1888086 1154259 864472 1083123 1336964 1179985 689394 287098 196188 250612 152201
35606 152201 -225162 -654123 -562079 517142 2259465 3568029 3598627 2612349 1560760
35597 1560760 1058454 1056034 1241104 1348475 1254399 1120559 1259721 1596720 1634833 1320534
35587 1320534 1419042 2413825 3538321 3764130 3366936 3417342 3863382 3402334 1555253
35578 1555253 -293599 -565768 630074 1953428 2500737 2285656 1575883 634461 -27596
35569 -27596 110772 972226 1932407 2538346 2857659 3079122 3076626 2546101 1492188 445373
35559 445373 64646 428568 836877 557144 -252041 -648416 -15969 1185009 1933512
35550 1933512 1764880 1219912 1205164 1973361 2830217 2996229 2669724 2813946 3753845 4535936
35540 4535936 4126581 2770575 1517793 779210 181225 -356748 -385137 144174 616955
35531 616955 699785 770756 1084265 1226424 819806 172880 -186922 -112028 374114 1303552
35521 1303552 2361271 2813423 2356056 1630459 1455041 1923015 2611037 3194004 3429764
35512 3429764 3054276 2238384 1724463 1953347 2422273 2441605 2143377 2138626 2496508 2704407
35502 2704407 2443914 1856390 1227596 893302 1208938 2100400 2892619 3088089 3017774 3166902
35492 3166902 3217021 2499413 1182133 204228 53518 293779 314930 -65342 -746886 -1475137
35482 -1475137 -1775214 -1318303 -422973 268584 584721 824364 1084268 1165798 1053975 849569
35472 849569 309206 -812090 -1967227 -2165684 -1238971 -4509 961516 1873558 2816416
35463 2816416 3200610 2670129 1826394 1435423 1480682 1602205 1934527 2760086 3656532 3764701
35453 3764701 2872636 1690885 1038388 1140296 1711818 2393445 3042364 3742158 4509673
35444 4509673 5015968 4866453 4213673 3692804 3554867 3287628 2415751 1299831 740532
35435 740532 1069529 2000990 3086387 3898492 4050587 3546341 2958952 2810012 2905163 2710939
35425 2710939 2213957 1893352 1951325 2131528 2282834 2519248 2716047 2420170 1543197 729429
35415 729429 691784 1417572 2324529 3049812 3783692 4796257 5810239 6032294 4975143
35406 4975143 3237900 2144043 2335843 2972205 2734825 1493673 458274 652263 1769157
35397 1769157 2725188 2877478 2388857 1736026 1221781 804484 176577 -813427 -1690354
35388 -1690354 -1650281 -590449 526206 731906 164662 -355371 -537322 -713298 -869056
35379 -869056 -452438 626862 1566405 1702322 1421592 1508983 1997919 2275452 2061509 1646343
35369 1646343 1278324 943006 750140 950426 1460816 1863815 1972712 1925443 1684647 1075670
35359 1075670 480476 752302 2022634 3250273 3522241 3217575 3176618 3265912 2751064
35350 2751064 1797099 1433070 1920632 2257005 1715113 938047 857748 1267023 1307222 925564
35340 925564 919019 1628874 2421230 2621229 2320307 1973121 1692129 1363352 1180774 1562995
35330 1562995 2496068 3308686 3322114 2597204 1815298 1443815 1282575 946505 517082 404584
35320 404584 710836 1129628 1492047 2012670 2845610 3707644 4133644 3879834 2938968 1443955
35310 1443955 -215639 -1409673 -1678907 -1070359 5516 1056116 1624508 1537111 1253685
35301 1253685 1565764 2593971 3436386 3257924 2440798 2119213 2746500 3686419 4154347
35292 4154347 3998705 3518960 3043366 2809146 2811178 2637291 1862659 734283 57146 256884
35282 256884 953447 1598554 2068189 2398570 2438719 2181058 2085102 2592506 3476710 4056090
35272 4056090 3966605 3446945 2968496 2832119 3022975 3251487 3246066 3130694 3286306 3705539
35262 3705539 3871922 3578857 3431466 4000195 4789688 4736979 3639064 2402231 1820803
35253 1820803 1756646 1688943 1444595 1078817 582301 137607 264603 1224440 2492683 3236949
35243 3236949 3202319 2823409 2598052 2646014 2785482 2782966 2580569 2416097 2569253 2882260
35233 2882260 2836810 2347457 2138662 2911514 4329062 5265051 4987215 3769828 2469009
35224 2469009 1829253 2022739 2453247 2181964 1010173 -47726 68014 1011333 1495651
35215 1495651 1147538 954420 1602236 2300041 1880863 427925 -901600 -1264503 -688194
35206 -688194 429496 1659021 2499648 2643017 2330255 2036479 1825548 1385129 640607
35197 640607 -42346 -258503 95383 784190 1309536 1234177 732390 554170 1064258 1618471
35187 1618471 1393188 563058 61344 382932 1267932 2357354 3366236 3721999 2985649
35178 2985649 1758801 1230568 1534640 1494667 470144 -482456 -55891 1424462 2500803
35169 2500803 2518579 2067819 1681343 1130944 229291 -477601 -294400 728029 1847240
35160 1847240 2398400 2290659 1892855 1653089 1808721 2309142 2908400 3317165 3367849 3158799
35150 3158799 2991491 3030721 3105758 3026871 2935054 2993903 2900815 2275226 1519401 1559835 2476588
35139 2476588 3124686 2625156 1609384 1297996 1811258 2204423 1914493 1309042 840652
35130 840652 480193 156186 70025 274465 427644 276218 61312 207159 830228 1681441
35120 1681441 2354504 2504341 2130163 1692488 1683730 2062142 2386996 2468981 2491622 2477710
35110 2477710 2126352 1369121 685383 589955 1051822 1620495 1924031 1909680 1810208 1970611
35100 1970611 2472385 2878202 2661982 1956921 1487532 1637295 2032725 2255021 2439395
35091 2439395 2784849 2979422 2724773 2494184 3012254 4050584 4485227 3720483 2446234
35082 2446234 1709489 1756693 2158403 2618234 3141896 3681486 4148213 4629938 5089345 4995985
35072 4995985 3910717 2432926 1793795 2250309 2649003 2080806 1235324 1307033 2112891
35063 2112891 2381052 1694359 949925 738617 455861 -435772 -1236266 -912351 424757
35054 424757 1707770 2175394 1795453 832784 -280055 -903819 -725440 -216390 -42716
35045 -42716 -212125 -277166 -67536 346318 1065834 2047787 2670820 2380625 1553855 972852
35035 972852 700937 339954 137062 728575 1806318 2208246 1598319 1029047 1446609
35026 1446609 2516396 3343163 3561891 3287489 2706452 2166326 2081093 2415401 2789669
35017 2789669 3167610 3667341 3694258 2425217 438040 -446511 443534 1645693 1749401
35008 1749401 1292749 1416619 1848019 1649344 1052672 949267 1159058 844179 288339
34999 288339 605834 1759363 2449638 2114533 1582035 1476445 1367612 920541 599021
34990 599021 658461 572778 108137 -37765 616255 1412172 1541438 1241439 1218618 1448949
34980 1448949 1370281 917662 646453 1006836 2001548 3338923 4476967 4765393 4037971
34971 4037971 2968939 2500533 2972725 3951058 4696191 4680586 3951247 3154134 2911826
34962 2911826 3069151 2908092 2175390 1412452 1140110 1283564 1614126 2114030 2533073
34953 2533073 2221402 975653 -373605 -765394 -21914 1204680 2202160 2533983 2102686
34944 2102686 1408984 1313713 1955706 2307018 1465495 43198 -498380 288648 1393497
34935 1393497 1704654 1121362 293611 -102554 277155 1268275 2219680 2575957 2508903 2646573
34925 2646573 3225596 3906425 4362771 4589490 4621404 4387832 3899994 3249628 2466749 1710369
34915 1710369 1427590 1840437 2410631 2373366 1725695 1118016 873874 797956 879637 1341045
34905 1341045 1881868 1775946 1042793 711923 1471120 2727291 3446817 3269143 2364546
34896 2364546 978054 -258273 -345230 860611 2008934 1793606 710821 298300 976672
34887 976672 1791789 2140459 2454133 2961515 3015945 2232667 1349307 1243135 1754460 2160601
34877 2160601 2274535 2367080 2403240 2087153 1453944 796895 172468 -442034 -648012 66652
34867 66652 1480870 2630119 2753888 1890636 551353 -720015 -1388700 -1066787 58285
34858 58285 1178684 1506497 875080 -321333 -1521387 -2203521 -1988636 -876697 583237
34849 583237 1521507 1332325 213775 -845825 -863078 174748 1345604 1993988 2543169
34840 2543169 3648604 4862014 4935856 3503714 1658674 548341 102473 -345420 -795759
34831 -795759 -697597 -434 720171 1178145 1738947 2706299 3779951 4494790 4826826 5026954
34821 5026954 5047657 4504318 3281825 1980206 1522898 2225246 3377682 3952011 3669752
34812 3669752 3126105 2918382 3076903 3448514 4098870 4949700 5430773 5038005 4050317
34803 4050317 3202241 2767439 2447969 2091263 1977117 2295650 2755678 2884627 2508957
34794 2508957 1896398 1571252 1871919 2483518 2633455 2067695 1537128 1826650 2587459
34785 2587459 2818822 2347729 1999254 2252608 2600558 2503919 2157126 1862459 1368812 439470
34775 439470 -455868 -673770 -287138 135524 376869 652324 1057532 1481140 1959219 2628038
34765 2628038 3355056 3796413 3787640 3391564 2686143 1837994 1254431 1257112 1614266 1726180
34755 1726180 1317008 733346 560098 1077464 2014696 2718177 2711389 2219047 1944443 2214821
34745 2214821 2643487 2798241 2786537 2846703 2773748 2259355 1522738 1040142 799192 378176
34735 378176 -283677 -713037 -543229 72265 721520 1091773 1092179 910751 866427 947216
34725 947216 729048 124885 -129736 616889 1753375 1955818 969615 27261 216546
34716 216546 1151146 1707250 1509132 1096464 949465 986762 1027387 1269780 2039098 3156011
34706 3156011 3833880 3484799 2591984 2312904 2978278 3550392 3131484 2432142 2742706
34697 2742706 3764605 3810735 2346234 933511 965225 1670921 1456324 340625 -273968
34688 -273968 182086 829432 912367 781135 1046336 1700631 2437655 3116688 3588708 3691624
34678 3691624 3684723 4042944 4553993 4352890 3247649 2238740 2125347 2317362 1844041
34669 1844041 949730 657843 1101624 1452822 1440603 1703749 2361636 2442684 1390182 166630
34659 166630 -24847 568488 799640 393073 148486 623525 1608610 2816818 4111261
34650 4111261 5009220 4932936 4125432 3415693 2904917 1896963 425665 -309244 344221
34641 344221 1403488 1726983 1640266 2046769 2706548 2663638 1889884 1202190 834122 415368
34631 415368 253984 1219780 3118037 4444832 4219694 3062130 2026397 1352808 917252
34622 917252 995927 1802156 2810856 3199249 2645160 1367364 -139837 -1119241 -915932
34613 -915932 234866 1281998 1571714 1472453 1525960 1665885 1675842 1701940 1784529 1541460
34603 1541460 876013 357237 323294 297611 -47920 -89389 760278 1930390 2520049 2680071
34593 2680071 3107615 3606798 3323389 2194159 1042860 331509 -116274 -192313 578843
34584 578843 2035569 3247365 3603773 3260867 2460582 1325081 439212 605477 1659264
34575 1659264 2396945 2086536 1301136 897931 943163 1077221 1214177 1365066 1361578 1228117
34565 1228117 1301271 1587632 1574523 1084663 720508 995672 1599456 2019647 2328708 2793776
34555 2793776 3228722 3343015 3289039 3262825 2989343 2240388 1473403 1269910 1442170 1370117
34545 1370117 963595 619546 473934 423308 696823 1595671 2685411 3025279 2346183
34536 2346183 1390259 941366 1058397 1390724 1707724 1912707 1975833 2061261 2394852 2905167
34526 2905167 3315978 3585896 3832855 3865111 3381249 2704918 2608132 3121641 3227930 2232895
34516 2232895 832886 151452 193092 88198 -405272 -636136 -339157 -165268 -501557
34507 -501557 -602343 358235 1881716 2663542 2334458 1844012 2047545 2694016 3088800
34498 3088800 3073007 2878358 2520183 1905405 1258342 936951 1014075 1413791 2145689 2931980
34488 2931980 2992414 1934081 657908 556084 1784318 3083802 3407942 2971191 2530536
34479 2530536 2439203 2728063 3344183 3840138 3497796 2305691 1266715 1203242 1750592
34470 1750592 2040293 1851103 1506000 1148997 810906 790393 1295145 2038959 2774403 3755113
34460 3755113 4973324 5484312 4466651 2629364 1537266 1684551 2207090 2383412 2366285
34451 2366285 2396304 2348236 2269438 2462426 2820574 2903005 2783279 2916387 3066949 2452621
34441 2452621 1201755 503077 859127 1341872 1170607 850154 943187 883208 122170 -510041
34431 -510041 65184 1326821 1809817 1239984 689057 778212 1016635 955239 805740 715676
34421 715676 460993 126416 192994 674066 988604 962561 1122773 1641603 1805626 1054224
34411 1054224 -99990 -758563 -761870 -555934 -274418 444896 1772320 3204070 3901725
34402 3901725 3513593 2666053 2420967 3029238 3544171 3095797 2144999 1736097 1843998
34393 1843998 1540675 736013 467566 1149293 1843518 1936132 2284743 3662057 5083762
34384 5083762 5030802 3702694 2648243 2488367 2427458 1963694 1649129 1853045 2030946
34375 2030946 1779838 1629207 2121911 2858245 3131033 2954284 2819319 2859629 2870911 2831015
34365 2831015 2805183 2559716 1843165 966504 633379 1177610 2237815 3107931 3208233
34356 3208233 2433334 1351659 862174 1281731 1918314 1919344 1376074 1109113 1446582 1807330
34346 1807330 1623427 1102361 714509 355501 -419717 -1460744 -1906234 -1197548 183050
34337 183050 1308285 1896142 2381978 3002919 3383390 3250519 3040692 3289046 3731163
34328 3731163 3669146 3142421 2989824 3549836 3997939 3451343 2238556 1454442 1498359 1679691
34318 1679691 1257508 346466 -350161 -360737 174476 754151 1004453 942014 750528 372962
34308 372962 -394453 -1324948 -1704872 -1199472 -428773 -200803 -439796 -474797 -223349 -343694
34298 -343694 -1128757 -1944028 -2030222 -1341324 -350295 462695 684479 117242 -753578 -958106
34288 -958106 -181052 750852 1021451 971645 1402676 2140001 2218610 1412363 647979 706845
34278 706845 1326366 1948937 2637656 3647585 4551483 4527017 3472348 2320922 2091468
34269 2091468 2823028 3533965 3205320 1856369 612351 515819 1319802 1837436 1539263
34260 1539263 1229162 1777741 2751350 3014391 2415669 2012206 2533098 3406437 3661939
34251 3661939 3206202 2726316 2723890 3138354 3669321 3988058 3783519 3057216 2305031 2020289
34241 2020289 2091051 2061312 1864541 1824577 2014501 2206888 2500162 3312735 4495714 5091445
34231 5091445 4429800 2988775 1695504 840501 271597 206554 987549 2179425 2801158
34222 2801158 2567974 2141948 1965288 1637894 844839 175253 377810 1250914 1927237
34213 1927237 2001658 1785055 1633137 1642610 1944351 2684633 3614725 4169797 4079988 3541328
34203 3541328 2753464 1759014 862776 680496 1422152 2472826 3058180 3092400 3014250 3010953
34193 3010953 2885665 2634974 2624575 2983664 3205271 2707286 1633980 739889 477049
34184 477049 525433 349629 -78857 -381615 -387263 -254129 -24657 498636 1278241 1818166
34174 1818166 1698384 1090981 476524 79565 -114715 -44685 295597 594111 605291 702328
34164 702328 1456396 2638812 3294758 3013162 2483387 2425376 2572523 2280445 1674545 1470888
34154 1470888 1896126 2516695 3064688 3704284 4390267 4652584 4278955 3666131 3204823
34145 3204823 2809080 2376823 2201234 2445373 2633478 2281742 1771022 1890609 2577278
34136 2577278 2840014 2129112 1149656 925414 1506715 2117166 2343890 2613873 3441498
34127 3441498 4641360 5517588 5619399 5070266 4231455 3311445 2437597 1936501 2199783
34118 2199783 3127695 3963389 4018326 3488411 3178983 3403704 3621242 3365457 3031900 3249818
34108 3249818 3807349 3885728 3316817 2900820 3236820 3821733 3735720 2823222 1697284 836577
34098 836577 265302 65958 585137 1885388 3387354 4372333 4645958 4480164 4118115
34089 4118115 3661793 3325972 3388190 3797368 4165555 4332654 4632277 5251097 5534473 4494972
34079 4494972 2156104 -93316 -872387 -264402 525988 767439 858914 1366954 2084535
34070 2084535 2452996 2468671 2581328 2835442 2688370 1813402 701453 228594 765292
34061 765292 1828936 2526479 2315144 1454916 736909 660772 923908 889692 474495 245707
34051 245707 596284 1198005 1484904 1359691 1093793 775064 316974 -68586 51654 620834
34041 620834 918900 460282 -214428 -88036 1065725 2367565 2833422 2341624 1483039
34032 1483039 784526 344883 45189 -184991 -287498 -87201 576697 1604338 2602304
34023 2602304 3234071 3506353 3577193 3461456 3177041 3021912 3322427 3912745 4229709 4017626
34013 4017626 3635933 3535135 3678697 3643053 3114452 2167747 1210769 738899 970069 1608297
34003 1608297 2072904 2010299 1512894 932361 650542 874214 1359035 1514269 1195653 1174325
33993 1174325 2161711 3477433 3581953 2121927 503403 -30456 20647 -511941 -1598902
33984 -1598902 -2221542 -1961007 -1301215 -548445 508430 1811005 2785221 3061947 2801698
33975 2801698 2225546 1438569 752804 543524 714825 880959 1045779 1457122 1890239
33966 1890239 1915544 1860920 2493786 3543925 3621960 2106197 173046 -703947 -503318
33957 -503318 -199435 -260603 -446979 -600870 -734445 -576252 178444 1262568 2100249 2573154
33947 2573154 2982753 3369861 3431713 3096992 2717520 2648477 2936172 3378986 3673667 3631822
33937 3631822 3427185 3370977 3255163 2348710 429947 -1578528 -2516063 -2240096 -1486717
33928 -1486717 -779132 -75475 682176 1312224 1704864 1931254 2031564 2011404 1936493 1727990
33918 1727990 1100684 105739 -537388 -190214 780037 1355415 1062662 353509 -101128
33909 -101128 -45147 320424 503898 88585 -653104 -769357 222382 1461030 1652819 667163
33899 667163 -435553 -790976 -416457 340661 1176104 1601101 1171691 176392 -510398
33890 -510398 -406169 265291 1184375 2158077 2744371 2502214 1806361 1652132 2410317 3445569
33880 3445569 4108984 4324216 4024830 2975949 1590307 1032218 1862067 3190704 3734327
33871 3734327 3175315 2042747 901499 227940 480446 1584385 2693770 2995935 2457944
33862 2457944 1485846 404617 -329755 -92979 1086169 2177066 2244176 1471498 604225
33853 604225 -47193 -448729 -336780 338388 975259 1125299 1254340 1887881 2531483 2429850
33843 2429850 1958547 2129463 2960013 3483426 3294645 2975716 2958148 3018183 2995179 2993170
33833 2993170 2736347 1751739 409420 -218047 196887 906197 1468915 2353299 3675008
33824 3675008 4449206 3896525 2661235 1893441 1755873 1635544 1287274 957529 793559
33815 793559 872264 1430275 2348385 2796863 2168449 1048672 480203 555607 580025 376784
33805 376784 446140 883066 1152250 1096863 1220746 1653307 1725046 1076039 433082 620173
33795 620173 1330622 1606357 1219875 866695 1095579 1662895 1976534 1717735 990720 254079
33785 254079 128437 873574 1977330 2606827 2535260 2270506 2200188 2054721 1445659 553292
33775 553292 -63400 -110161 288638 877856 1407504 1640486 1528888 1286270 1082598 861234
33765 861234 660462 762081 1138734 1148034 391342 -416722 -227404 818833 1539774 1421624
33755 1421624 1186332 1382791 1473811 929143 281027 220998 370944 -26306 -681255 -612144
33745 -612144 314968 1239610 1616164 1688978 1651531 1314720 784162 581332 839200 1156733
33735 1156733 1458588 2130348 2960065 2850400 1204474 -1038574 -2371059 -2272297 -1328206
33726 -1328206 -307356 340416 505184 511716 873814 1501059 1551397 561740 -735704 -1340867
33716 -1340867 -1300801 -1349757 -1566989 -1299715 -360228 581196 980242 1085153 1322102 1547180
33706 1547180 1282708 422158 -562702 -1001805 -571651 372989 1053999 1047088 678332 433924
33696 433924 278204 -4526 -110639 427102 1299083 1643024 1298950 1029423 1250692 1387587
33686 1387587 953286 489543 733221 1421356 1723815 1491405 1258798 1233579 1117453 868161
33676 868161 832705 1046008 1132580 1060585 1300206 2007132 2711737 3105181 3462006 3886993
33666 3886993 3824885 2926074 1874209 1641489 2250828 2947319 3312287 3479516 3447818 2988046
33656 2988046 2215932 1519768 888499 42069 -728267 -703340 55677 499183 6999 -747168
33646 -747168 -870232 -482417 -214668 -75539 363679 1009837 1272521 903173 203246 -437502
33636 -437502 -691700 -267826 655614 1241064 905560 175407 -71990 77458 -119623 -691573
33626 -691573 -953598 -849623 -1134396 -1984291 -2536888 -2238464 -1612855 -1122304 -276032 1312551
33616 1312551 2829632 3246031 2850146 2736963 3068395 2920790 1873844 791903 716663
33607 716663 1609689 2539428 2740142 2202057 1443573 960122 871223 999382 1201907 1510461
33597 1510461 1969793 2524494 3066441 3387119 3157083 2318167 1471121 1401018 2158577 3105244
33587 3105244 3878587 4612011 5081973 4579419 3111222 1858195 1723088 2149017 2182237
33578 2182237 1993603 2308936 2895940 2895707 2445238 2668413 3897726 4997196 4801760 3433380
33568 3433380 1896576 1030717 1066554 1577225 1685841 918414 -51432 -140993 649187 1281935
33558 1281935 1285098 1319185 1855015 2333962 2251206 2169586 2811065 3757642 3958692 3199941
33548 3199941 2263043 1775403 1576086 1203245 525164 -126629 -198085 556599 1581324
33539 1581324 1895042 1275706 665468 952504 1751210 1990569 1404313 709010 426440
33530 426440 296737 -35861 -439463 -683090 -893581 -1236783 -1453173 -1115963 -248981 636225
33520 636225 1152201 1456740 1921074 2492589 2650021 2102858 1295671 916317 1034257 1139022
33510 1139022 1002344 961975 1191684 1284663 977650 800548 1406238 2542933 3336387 3454113
33500 3454113 3329061 3241182 2880241 2025547 1052673 410409 49987 -234132 -299395 -12487
33490 -12487 150128 -493414 -1798539 -2734337 -2566339 -1653408 -766621 -36659 896215 1921709
33480 1921709 2366974 2010565 1565083 1718319 2083600 1661184 231244 -1214408 -1521592
33471 -1521592 -552716 769270 1415174 1220931 998614 1583709 2729210 3293294 2742426
33462 2742426 1946480 1919447 2269839 1870225 869001 796446 2321364 4003302 4008259 2311623
33452 2311623 400526 -643353 -894769 -814410 -680209 -705687 -927135 -913423 -203692 924174
33442 924174 1668542 1703607 1432363 1252806 1178608 1252008 1662269 2219431 2327753 1859136
33432 1859136 1548020 2042055 2924693 3221189 2680912 2009692 1859231 2111545 2317292
33423 2317292 2390748 2508847 2564907 2192282 1366703 588346 256672 155413 -134278 -522695
33413 -522695 -535053 -71079 428570 647361 771941 1028883 1270368 1312920 1346461 1656855
33403 1656855 2170643 2581117 2726861 2590859 2181177 1706791 1586816 1911374 2142609
33394 2142609 1767287 1033932 605041 684079 981031 1351240 1853408 2233282 2016895 1262365
33384 1262365 676467 775718 1363824 2015849 2609383 3074325 3009471 2006362 270203
33375 270203 -1377836 -2154545 -1897632 -1063668 -233888 365372 825349 1104134 904410
33366 904410 181797 -529765 -683882 -428203 -301433 -345632 -60421 726367 1480743 1634189
33356 1634189 1201506 518163 -244809 -1008753 -1509477 -1429730 -744069 224318 1033960 1394359
33346 1394359 1365888 1322768 1552683 1888205 1916163 1529475 1060599 897111 1176755 1787758
33336 1787758 2417099 2698756 2603491 2534352 2685229 2546162 1619121 468962 295407 1370392
33326 1370392 2658506 3230435 3299069 3439907 3509920 3021060 2119486 1426463 1075531 575894
33316 575894 -347539 -1306739 -1796950 -1855918 -1960612 -2370556 -2751240 -2567139 -1814824 -1084786
33306 -1084786 -703350 -169281 1069820 2540347 3156794 2673423 1957948 1723010 1801147
33297 1801147 1885974 2068150 2211929 1755886 820174 635754 1930586 3546488 3725282
33288 3725282 2347992 836837 134053 -102598 -421852 -850465 -1350091 -1971377 -2330247
33279 -2330247 -1860186 -855728 -337994 -468168 29692 2227720 5380979 7595845 7748478
33270 7748478 6273260 4424352 3247282 2995211 3074680 2674357 1696454 855529 693586
33261 693586 894321 868236 593821 439199 486938 550845 643380 899330 1148853 1073169
33251 1073169 764758 678332 989658 1418515 1772892 2267889 3104758 4016183 4471361 4196842
33241 4196842 3332323 2204553 1144744 460794 331958 587889 692748 160104 -922468
33232 -922468 -1892383 -2164073 -1809449 -1333913 -963265 -441098 417410 1287240 1676559 1540000
33222 1540000 1311046 1385436 1747894 2060230 1967512 1383357 662029 463352 1219336 2626033
33212 2626033 3784176 3990311 3405271 2871360 3023140 3623759 3886481 3454578 2861131
33203 2861131 2851612 3431526 3917673 3882342 3624860 3580260 3675501 3568932 3217441 2838156
33193 2838156 2538689 2398075 2723734 3704232 4852627 5334087 4918455 4100449 3198218
33184 3198218 1998300 599576 -116595 445015 1497297 1681077 818437 21407 10133
33175 10133 195165 -225134 -998331 -1235075 -640632 264683 906876 1134916 1121295 1243377
33165 1243377 1894374 2951853 3588727 3119107 1937005 1084209 929015 858045 350388
33156 350388 -242632 -235053 530435 1625735 2506996 2837604 2675210 2527084 2888697 3556838
33146 3556838 3775100 3256292 2626279 2550077 2827614 2755023 2055256 1021066 6219
33137 6219 -758313 -1037174 -765280 -258647 165564 680973 1614700 2671168 3024504 2361119
33127 2361119 1450008 1389362 2424702 3707823 4189621 3632631 2702850 2122136 1906602
33118 1906602 1594080 1058312 722891 933138 1493034 1965829 2101059 1824622 1195409
33109 1195409 583385 482511 862813 1116943 990023 1109667 2082795 3411603 3917457
33100 3917457 3104559 1605893 380708 -99549 16692 222410 114742 -117216 139356
33091 139356 993933 1648849 1342436 340017 -512431 -850378 -821335 -456989 212661 684085
33081 684085 464544 -61927 -8922 849154 1978264 2946061 3542454 3249930 1691262
33072 1691262 -314363 -1212392 -523719 674897 1303520 1404091 1453718 1527411 1578122 1700156
33062 1700156 1669891 1013348 -72794 -705935 -626275 -586264 -932482 -837865 296331 1625233
33052 1625233 2001021 1592907 1396763 1734198 2201814 2573109 2756070 2314678 1060291
33043 1060291 -230274 -670948 -503229 -475901 -361790 686595 2437910 3511239 3175106
33034 3175106 2155834 1434652 1213618 1315937 1621824 1724987 1075447 -28545 -389589
33025 -389589 560106 1840433 2154892 1477856 743806 442567 347108 386228 879791 1769339
33015 1769339 2323242 1985148 1137667 669044 984652 1736577 2361995 2543508 2225886
33006 2225886 1612633 1227596 1537211 2278469 2580111 2094837 1564615 1733800 2148258
32997 2148258 1839318 899128 325436 345708 123009 -557745 -590158 713125 2241867
32988 2241867 2484713 1561699 773465 695774 934183 1423527 2602217 4189038 4992801
32979 4992801 4395822 3213578 2609808 2749932 2986981 2913744 2671661 2412608 2020064
32970 2020064 1531115 1476551 2368354 3866086 4939268 5076191 4793505 4545798 3872918
32961 3872918 2489513 1486964 2062179 3476740 3950556 3399659 3338522 4015064 3972404
32952 3972404 2957484 2733231 4075076 5620947 6884104 9285593 12503727 13694509
32944 13694509 13349206 17533446 28872184 38485125 34278259 16833902 -89325 -6049191
32936 -6049191 -4141117 -2541430 -2990754 -2513962 -1105886 -1223116 -2300779 -1639633 441115
32927 441115 1226945 596595 904389 2309134 2518712 1223712 729907 1725103 2183516
32918 2183516 1259957 761362 1644263 2272589 1546408 866495 1382556 1872720 1176866
32909 1176866 518540 1429007 3142743 4022864 4125779 4411894 4587838 3709154 2160702
32900 2160702 1240460 1257134 1572757 2097647 3234161 4555438 4944742 4109063 2882645
32891 2882645 1962230 1249486 534791 10465 -140532 -118539 -222609 -463197 -568896 -275549
32881 -275549 326594 688777 264083 -840383 -1910738 -2380124 -2263462 -1842269 -1266882
32872 -1266882 -489871 708719 2497146 4399161 5225568 4293485 2537624 1602411 1906483
32863 1906483 2441527 2395887 1987624 1683776 1684587 2306884 3732063 5137713 5256924 4116222
32853 4116222 3001711 2365091 1204367 -877896 -2561814 -2773409 -2387679 -2700901 -3341317
32844 -3341317 -3127178 -2103894 -1189207 -411423 939936 2736103 4038951 4603944 5074221
32835 5074221 5654354 5704321 4787052 3275493 1857712 1069304 1126746 1548714 1265008
32826 1265008 -121224 -1538947 -1736117 -900688 -29618 778692 2106885 3636970 4283140
32817 4283140 3926324 3618447 3872678 4081800 3942337 4130525 5013331 5804736 5638215
32808 5638215 4610688 3281653 2029510 1357871 1837612 3100925 3784702 3180959 2152707
32799 2152707 1722358 1597116 957196 -58895 -707027 -942549 -1291007 -1733776 -1752338
32790 -1752338 -1295562 -718956 107862 1564120 3091283 3367272 2078799 618767 444651
32781 444651 1436817 2523065 3301733 4118197 4799947 4390974 2488511 172170 -932092
32772 -932092 -272395 1267651 2380536 2356458 1323167 -21338 -875282 -909323 -484146
32763 -484146 -79054 406131 1362440 2518839 2914967 2132629 1029701 729963 1166899
32754 1166899 1166573 -95374 -2120096 -3554748 -3386515 -1769560 89973 982623 843054
32745 843054 713621 1426337 2636497 3423890 3460216 3142937 2920630 3063370 3852414 5293484
32735 5293484 6667805 7020201 6235662 5161478 4558242 4367432 4133646 3719971 3365888
32726 3365888 3267750 3290822 3075689 2505025 2098786 2613548 3989628 5071698 4833360
32717 4833360 3595870 2515815 2112592 1888526 1225297 61140 -1160201 -1629264 -517999
32708 -517999 2044399 4505122 5258540 4460990 3655501 3648368 3755596 3256073 2480966 2062256
32698 2062256 2069909 2406491 3194113 4188233 4594745 4131669 3597618 3711585 4032329 3791006
32688 3791006 3212051 3089526 3434858 3535350 3233741 3189519 3713960 4167593 3939485 3485263
32678 3485263 3787478 4906010 5643135 4958038 3399625 2568392 3146070 4151888 4482958
32669 4482958 4406325 4750684 5290746 5145114 4484107 4434055 5148303 5341293 4194368 2512013
32659 2512013 1384408 830763 502975 648348 1420694 2134199 2248643 2360154 3115102
32650 3115102 3766729 3062839 1255520 40667 531771 2205363 3809205 4493412 4081580
32641 4081580 3044072 2351065 2777453 4194457 5806022 6939459 7335077 7017589 6349848
32632 6349848 5939101 6043364 6291039 6269707 6016686 5681565 5252850 4921967 5053667 5437376
32622 5437376 5341797 4725032 4485311 5019481 5593591 5756982 6132077 6962100 7267078 6591292
32612 6591292 6167873 6914038 7692594 7295098 6760529 7676485 9465184 10629646 11379663
32603 11379663 12424904 12678728 11542316 11951212 16343853 20015389 14412849 -1073513
32595 -1073513 -15867356 -20033970 -15233192 -10117374 -8603078 -7870239 -5713336 -3851845
32587 -3851845 -3732085 -3924852 -3107352 -2220945 -2213127 -2264051 -1640758 -1161493 -1460633 -1574769
32577 -1574769 -614284 542832 508324 -671333 -1876833 -2418840 -2337225 -1900659 -1512112
32568 -1512112 -1545971 -1807077 -1711781 -1227613 -869502 -607306 183706 1318727 1474995 -52676
32558 -52676 -2172822 -3328829 -3286987 -2863430 -2532373 -2158483 -1688506 -1271411 -830930 -124514
32548 -124514 810158 1622778 1977927 1743053 1088620 554547 691249 1440107 2178722 2527871
$$ [...]
##END NTUPLES=NMR SPECTRUM
##END=
