##TITLE=31P_DE-80H_X3
 64 sc D2O
 26.2.2025
##JCAMPDX= 6.0         $$ Bruker NMR JCAMP-DX V2.0
##DATA TYPE= NMR SPECTRUM
##DATA CLASS= NTUPLES
##ORIGIN= UXNMR, Bruker Analytische Messtechnik GmbH
##OWNER= root
$$ XWIN-NMR		Version 3.5
$$ Wed Jul 30 11:00:16 2025 Russian Standard Time (UT+4h)  Yarkov@DPX200
##.OBSERVE FREQUENCY= 81.013821
##.OBSERVE NUCLEUS= ^31P
##.ACQUISITION MODE= SIMULTANEOUS
##.ACQUISITION SCHEME= undefined
##.AVERAGES= 64
##.DIGITISER RES= 17
##SPECTROMETER/DATA SYSTEM= spect
##.PULSE SEQUENCE= zgpg30
##.SOLVENT NAME= D2O
##.SHIFT REFERENCE= (INTERNAL, D2O, 0, 198.062)
##AUDIT TRAIL= $$ (NUMBER, WHEN, WHO, WHERE, WHAT)
$$ ##TITLE= Audit trail, XWIN-NMR		Version 3.5
$$ ##JCAMPDX= 5.01
$$ ##ORIGIN= Bruker BioSpin GmbH
$$ ##OWNER= Yarkov
$$ C:/Bruker/XWIN-NMR/data/yarkov2/nmr/P31/2/pdata/1/auditp.txt
$$ ##AUDIT TRAIL=  $$ (NUMBER, WHEN, WHO, WHERE, WHAT)
(   1,<2025-07-30 10:50:03.31 +0400>,<Yarkov>,<DPX200>,
      <created by zg, POWCHK disabled, PULCHK disabled
       configuration hash MD5:
       00 E9 B6 7A A2 85 ED C7 34 08 36 98 17 FE 4E 26
       data hash MD5: 32K
       8D 22 EE 9C 62 82 CE 8A 05 54 83 A1 CE 2E 39 1B>)
(   2,<2025-07-30 10:59:21.56 +0400>,<Yarkov>,<DPX200>,
      <Start of raw data processing
       efp BC_mod = 2 LB = 1.5 FT_mod = 6 PKNL = 1 PHC0 = 1662.243 PHC1 = 49.15953 SI = 64K 
       data hash MD5: 64K
       F1 57 9E 26 E5 37 95 D6 94 BC 76 7C 66 B8 32 12>)
(   3,<2025-07-30 10:59:49.71 +0400>,<Yarkov>,<DPX200>,
      <pk PHC0 = 7.799997 PHC1 = 0 
       data hash MD5: 64K
       5C DA E0 92 8C 09 17 2A 5B DA AB EB F5 EA 1E F4>)
$$ ##END=
$$ 
$$ hash MD5
$$ 5A 54 4F 1B B0 FA 24 05 E8 F1 96 B9 9C B8 4F FD
##$RELAX= 
##$RELAX= 
##$RELAX= 
##$RELAX= 
##$RELAX= 
##$RELAX= 
##$RELAX= 
##$RELAX= 
$$ Bruker specific parameters
$$ --------------------------
##$DU= <C:/Bruker/XWIN-NMR>
##$EXPNO= 2
##$NAME= <P31>
##$PROCNO= 1
##$TYPE= <nmr>
##$USER= <yarkov2>
##$AMP= (0..31)
100 100 100 100 100 100 100 100 100 100 100 100 100 100 100 100 100 100 
100 100 100 100 100 100 100 100 100 100 100 100 100 100 
##$AQSEQ= 0
##$AQ_mod= 1
##$AUNM= <au_zg>
##$AUTOPOS= <>
##$BF1= 81.014009
##$BF2= 200.13
##$BF3= 200.13
##$BF4= 200.13
##$BF5= 200.13
##$BF6= 200.13
##$BF7= 200.13
##$BF8= 200.13
##$BYTORDA= 1
##$CFDGTYP= 0
##$CFRGTYP= 5
##$CHEMSTR= <none>
##$CNST= (0..31)
1 1 145 1 1 1 1 1 1 1 1 1 1 1 1 1 1 1 1 1 1 1 1 1 1 1 1 1 1 1 1 1 
##$CPDPRG= <waltz16>
##$CPDPRG1= <>
##$CPDPRG2= <waltz16>
##$CPDPRG3= <>
##$CPDPRG4= <mlev>
##$CPDPRG5= <mlev>
##$CPDPRG6= <mlev>
##$CPDPRG7= <mlev>
##$CPDPRG8= <mlev>
##$CPDPRGB= <>
##$CPDPRGT= <>
##$D= (0..31)
0 1 0 0 0 0 0 0 0 0.06 0 0.03 2e-05 3e-06 0 0 0.0002 0 0 0 0 0 0 0 0 0 
0 0 0 0 0 0 
##$DATE= 1753858202
##$DBL= (0..7)
120 120 120 11 120 120 24 19 
##$DBP= (0..7)
150 150 150 150 150 150 150 150 
##$DBP07= 0
##$DBPNAM0= <>
##$DBPNAM1= <>
##$DBPNAM2= <>
##$DBPNAM3= <>
##$DBPNAM4= <>
##$DBPNAM5= <>
##$DBPNAM6= <>
##$DBPNAM7= <>
##$DBPOAL= (0..7)
0.5 0.5 0.5 0.5 0.5 0.5 0.5 0.5 
$$ [...]
##$SUBNAM2= <"">
##$SUBNAM3= <"">
##$SUBNAM4= <"">
##$SUBNAM5= <"">
##$SUBNAM6= <"">
##$SUBNAM7= <"">
##$SUBNAM8= <"">
##$SUBNAM9= <"">
##$SW= 400.765351723535
##$SWIBOX= (0..15)
0 1 3 0 0 0 0 0 0 0 0 0 0 0 0 0 
##$SW_h= 32467.5324675325
##$TD= 32768
##$TD0= 1
##$TE= 0
##$TE2= 300
##$TE3= 300
##$TEG= 300
##$TL= (0..7)
0 120 53 12 22 120 120 120 
##$TP= (0..7)
150 150 150 150 150 150 150 150 
##$TP07= 0
##$TPNAME0= <>
##$TPNAME1= <>
##$TPNAME2= <>
##$TPNAME3= <>
##$TPNAME4= <>
##$TPNAME5= <>
##$TPNAME6= <>
##$TPNAME7= <>
##$TPOAL= (0..7)
0.5 0.5 0.5 0.5 0.5 0.5 0.5 0.5 
##$TPOFFS= (0..7)
0 0 0 0 0 0 0 0 
##$TUNHIN= 0
##$TUNHOUT= 0
##$TUNXOUT= 0
##$USERA1= <user>
##$USERA2= <user>
##$USERA3= <user>
##$USERA4= <user>
##$USERA5= <user>
##$V9= 5
##$VALIST= <valist>
##$VCLIST= <CCCCCCCCCCCCCCC>
##$VD= 0
##$VDLIST= <DDDDDDDDDDDDDDD>
##$VPLIST= <PPPPPPPPPPPPPPP>
##$VTLIST= <TTTTTTTTTTTTTTT>
##$WBST= 1024
##$WBSW= 4
##$XGAIN= (0..3)
0 0 0 0 
##$XL= 0
##$YL= 0
##$YMAX_a= 596
##$YMIN_a= -789
##$ZGOPTNS= <>
##$ZL1= 120
##$ZL2= 120
##$ZL3= 120
##$ZL4= 120
##$ABSF1= 0
##$ABSF2= 0
##$ABSG= 0
##$ABSL= 0
##$ALPHA= 0
##$AQORDER= 0
##$ASSFAC= 0
##$ASSFACI= 0
##$ASSFACX= 0
##$ASSWID= 0
##$AUNMP= <proc_1d>
##$AZFE= 0.1
##$AZFW= 0.5
##$BCFW= 0
##$BC_mod= 2
##$BYTORDP= 0
##$COROFFS= 0
##$CY= -3
##$DATMOD= 1
##$DC= 0
##$DFILT= <>
##$DTYPP= 0
##$F1P= 0
##$F2P= 0
##$FCOR= 1
##$FTSIZE= 65536
##$FT_mod= 6
##$GAMMA= 0
##$GB= 0
##$INTBC= 1
##$INTSCL= 9.790993e-09
##$ISEN= 30
##$LB= 1.5
##$LEV0= 0
##$LPBIN= 0
##$MAXI= 10000
##$MC2= 0
##$MEAN= 0
##$ME_mod= 0
##$MI= 50
##$NCOEF= 0
##$NC_proc= -10
##$NLEV= 6
##$NOISF1= 182.463
##$NOISF2= 159.3651
##$NSP= 0
##$NTH_PI= 0
##$NZP= 0
##$OFFSET= 198.0616
##$PC= 4
##$PHC0= 1670.043
##$PHC1= 49.15953
##$PH_mod= 1
##$PKNL= yes
##$PPARMOD= 0
##$PSCAL= 0
##$PSIGN= 0
##$REVERSE= no
##$SF= 81.0140089999434
##$SI= 65536
##$SIGF1= 159.3651
##$SIGF2= -187.1042
##$SINO= 113.3802
##$SIOLD= 16384
##$SREGLST= <1H.CDCl3>
##$SSB= 0
##$STSI= 65536
##$STSR= 0
##$SW_p= 32467.5324675325
##$SYMM= 0
##$S_DEV= 0
##$TDeff= 32768
##$TDoff= 0
##$TI= <>
##$TILT= no
##$TM1= 0
##$TM2= 0
##$TOPLEV= 0
##$USERP1= <user>
##$USERP2= <user>
##$USERP3= <user>
##$USERP4= <user>
##$USERP5= <user>
##$WDW= 1
##$XDIM= 65536
##$YMAX_p= 305715608
##$YMIN_p= -9152377
$$ End of Bruker specific parameters
$$ ---------------------------------
##NTUPLES= NMR SPECTRUM
##VAR_NAME=  FREQUENCY,     SPECTRUM/REAL,   SPECTRUM/IMAG
##SYMBOL=    X,             R,               I
##VAR_TYPE=  INDEPENDENT,   DEPENDENT,       DEPENDENT
##VAR_FORM=  AFFN,          ASDF,            ASDF
##VAR_DIM=   65536,         65536,           65536
##UNITS=     HZ,            ARBITRARY UNITS, ARBITRARY UNITS
##FACTOR=    0.49542278885378, 1,            1
##FIRST=     16045.7642231865, 0,            0
##LAST=      -16421.768244346, 0,            0
##MIN=       -16421.768244346, -9152377,     0
##MAX=       16045.7642231865, 305715608,    0
$$ Real data points
##PAGE= N=1
##DATA TABLE= (X++(R..R)), XYDATA
$$ [...]
42720c22873j36668j36870k29325k17501J04623M96862M13514k40739q11684o28099
42710a708760J67832Q14643Q26378L88072p5447l72635m98657m13011j10329J89989
42700g91925J80913j34660l51506j31958L05875M00599j0878m27654l42138P2498
42690a230834K49541N7812p8274J05352L18987K10742j08515k76260j48473J79790
42680g20132N76442Q30211O45042J2712n69407o02700k16417L2990r0655l09573
42670d11487l45971k42522j13845O5140K89529M22600M09098L69218L58936K56317
42660A057013J7983j68328j52693o0199q0550j77632k04605j85065k59732m08614
42650f22422m30399k13829J02789K69387J57619j26473l08261j64297K52399O28345
$$ y = [-322873, -459541, -596411, -825736, -1043237, -938614, -441752, -28238, -268977, -1080661, -1708760, -1540928, -726285, 100093, 488165, 412718, 40083, -458574, -871585, -981914, -791925, -611012, -745672, -1097178, -1229136, -923261, -522662, -533540, -961194, -1303332, -1230834, -981293, -923481, -1001755, -896403, -577416, -366674, -475189, -751449, -899922, -720132, -143690, 686521, 1331563, 1344275, 774868, 172168, -44249, -11259, -101914, -411487, -757458, -999980, -1113825, -1048685, -759156, -336556, 72542, 441760, 800696, 1057013, 1074996, 906668, 753975, 693776, 613226, 435594, 230989, 45924, -213808, -622422, -1052821, -1266650, -1163861, -894474, -736855, -863328, -1171589, -1335886, -1083487, -455142]
42640d55142O79553M06584M8402j61333j73188j26136j95659l76400m31547j65841
42630i50707K69882N08452M13057K01415Q0404j0695j82435l56787m21368m18598
42620h67380l82566j91455J66781L74441J57206k47334l55748j15083O6002l2518
42610a427654j58836n5913J56991K46574K08421J46962O8084j547P2231K69727
42600d74960L01836L0276k09182m7552L05974L05572j17116m16051k13326J68991
42590c65538J96078j31144l26105r8999L16997N46102N33520M91860N11065M23100
42580B096936R8825k72544l74584k12270j59496m45778p67199o30826k1510N23399
42570a65047N39301J18849l07339m68761l87738j79119O3235K29374K39051J55757
$$ y = [-455142, 224411, 630995, 679397, 518064, 344876, 218740, 23081, -353319, -784866, -950707, -680825, -172373, 240684, 442099, 522503, 511808, 329373, -27414, -448782, -867380, -1249946, -1441401, -1274620, -900179, -742973, -990307, -1346055, -1461138, -1395136, -1427654, -1586490, -1642403, -1485412, -1238838, -1030417, -883455, -815371, -816918, -744687, -474960, -173124, -142848, -352030, -399582, -93608, 211964, 94848, -321203, -534529, -365538, -169460, -300604, -626709, -725708, -408711, 137391, 670911, 1162771, 1673836, 2096936, 2195761, 1923217, 1548633, 1336363, 1176867, 731089, -36110, -666936, -688446, -165047, 374254, 493103, 185764, -282997, -670735, -849854, -786619, -557245, -318194, -162437]
42560a62437J32590K10547K61348J68041n563p2944P0335L13316L91426J18226
42550A424885l81909o93008m64115K00101P71517Q02721L80384l97r624J78372
42540B208927J81340o4309k41390j05103K02867L97895M50423N60831Q26066J135822
42530E553369J360103J413675J135529L87826o03920j258767j215937p74477n42654
42521E454747p22638r53030q32816l93981q424L8110j80049l24431j60664J42959
42511B059783J69081k23321o58487o87712l58983j14743j83084l42951l11578
42502f51995r5749J27037K48092K38799J18105J8148R5922K71559K59908k395
42492F27431j88417l8585K25376K17478l4270j52587N356J60763M8872k40439
$$ y = [-162437, -29847, 180700, 442048, 610089, 604526, 531582, 601917, 915233, 1306659, 1424885, 1042976, 349968, -114147, 85954, 857471, 1660192, 2040576, 2040179, 2030555, 2208927, 2390267, 2325958, 2084568, 1979465, 2182332, 2580227, 3030650, 3591481, 4417547, 5553369, 6913472, 8327147, 9462676, 9850502, 9246582, 7987815, 6771878, 5997401, 5454747, 4732109, 3779079, 2946263, 2552282, 2543858, 2581968, 2401919, 2077488, 1916824, 2059783, 2228864, 2005543, 1347056, 659344, 300361, 185618, 2534, -340417, -651995, -747744, -620707, -372615, -133816, -15711, 2437, 98359, 369918, 629826, 627431, 439014, 400429, 625805, 843283, 809013, 656426, 661782, 822545, 871417, 630978]
42482F30978m52427m74711l38753r5528J67298L01367K31071O3527j6926P2254
42472H8150K69782M34529M16126J56097k10973m25506l48234j00197R1607J37360
42462E08741J08200O0642n6927k82318m89697m70708k10457J0703o8370l01827
42452a192018k68332J43193N15195M58839J80277J73183M57858N32716J32145
42443A133056l66352m82417k57953o5276k3180N4383K34334L35955K47580R9721
42433I09851M3227N5581O3488R4654J75046J80666l8211l85045n20117k48311
42423C30829J54762J78873k92405p59542o90476j94904J63058J61807J42724L52791
42413d52483N08245L03036n363N1924M28447O55948N64909M28851L94833K72744
$$ y = [630978, 178551, -296160, -634913, -730441, -563143, -261776, -30705, 32822, 15896, 88150, 357932, 792461, 1208587, 1364684, 1153711, 728205, 379971, 279774, 371381, 508741, 616941, 677583, 620656, 338338, -151359, -622067, -832524, -821821, -890191, -1192018, -1460350, -1317157, -801962, -343123, -162846, 10337, 468195, 1000911, 1133056, 766704, 284287, 26334, -38942, -62122, -7739, 226595, 562550, 810130, 909851, 953078, 1008659, 1072147, 1166801, 1341847, 1522513, 1484302, 1099257, 579140, 330829, 485591, 664464, 372059, -387483, -1077959, -1272863, -1109805, -947998, -805274, -452483, 55762, 358798, 353435, 405359, 833806, 1489754, 2054663, 2483514, 2878347, 3151091]
42403C151091J6946m6541K79490O84129P43168M42596P3465j63065k23841j40221
42393D817217j09517m17871r79556j198911o65738J88254N41144J89704l12155
42384B052571m74263l73795k84846k52457k17331k22645k76038k41361n0541J67639
42374a73067K97401L60473L21965M7778l70570n37130k59598J01419J03876j39094
42364b46547j54737J65374M34993L74540J65186Q2306Q0572m9701k96312m21914
42354A33760k95631o1481M9944j0959r8165j11918j59750l60651n34444l17799
42344a767094L05888Q18480P35867K15159j81156k26294j95151l01179l53025
42335i48505j22289K47845M33387L49282J60773o244j54889k72061k81734j63215
$$ y = [3151091, 3168037, 3121496, 3400986, 4085115, 4828283, 5270879, 5344344, 5181279, 4957438, 4817217, 4707700, 4289829, 3310273, 2111362, 1445624, 1633878, 2175022, 2364726, 2052571, 1578308, 1204513, 919667, 667210, 449879, 227234, -48804, -290165, -340706, -173067, 124334, 484807, 806772, 854550, 483980, -53150, -312748, -211329, -107453, -246547, -401284, -235910, 199083, 573623, 738809, 821115, 901687, 851986, 555674, 133760, -161871, -223352, -173408, -184367, -282532, -394450, -554200, -914851, -1449295, -1767094, -1461206, -642726, 93141, 308300, 127144, -99150, -294301, -595480, -948505, -1070794, -822949, -389562, -40280, 120493, 114249, -40640, -312701, -594435, -757650]
42325g57650j4634K6328r7610k96906l87945k74456o8429N7318J06589K04012
42315a503383L22006K77029M5164j46469j49660j02307j61966k34485j54206L5979
42305a772298J91546L07028M23222M16443J43420k54671m35736k50575J16513
42296a115108L84507M08495K18697k4833j53327j72625k36766l46511k68303O4275
42286a241499L07504J73257p2706P761K91142K53560j59951l97780j64868J29550
42276h74030O4143j38229m8450K31356K39579j26025m96410n56191l23826L6360
42266a991723L56284M46713K41733k7971n6732J39104K75244K28380J46900J24285
42256a17783N1140j21991k27699j26836P0765J69562J38730P5937L0578j7637
$$ y = [-757650, -772284, -745956, -843566, -1140472, -1528417, -1802873, -1871302, -1813984, -1707395, -1503383, -1181377, -904348, -859184, -1005653, -1155313, -1257620, -1419586, -1654071, -1808277, -1772298, -1580752, -1273724, -850502, -434059, -290639, -545310, -981046, -1231621, -1115108, -730601, -322106, -103409, -128242, -281569, -454194, -690960, -1037471, -1305774, -1241499, -933995, -760738, -833444, -825683, -534541, -280981, -440932, -838712, -1003580, -874030, -809887, -948116, -996566, -765210, -525631, -651656, -1148066, -1704257, -2028083, -1991723, -1635439, -1188726, -946993, -974964, -1031696, -892592, -617348, -388968, -242068, -117783, -66643, -188634, -416333, -543169, -472404, -302842, -164112, -88175, -57597, -75234]
42246g5234q3187j75393l00427l78433k50693J10977M68039N32818L09327Q6126
42236B43920P3423J75339J77129L7387j14295j85764j83429j09949K2219P5529
42226B11509r8318l58816l34086N6499L78418K60157p412J37115O19821P31739
42216A596626J50486n36851o34382k68255q8996k89040m23999j76032J72527J78975
42206c18941j49846l96620k50430J72631M89913M50226J58737q4891j28405n9118
42196a16744K4731J54636L29866M00957K63963L3097j29550k22050k87770k48312
42186B02824m6436J80943K78631K86677K64860P5588l64118p49295o63712j54609
42176f88647K89241L30577P6793j91487k88570j41747J47142K62370Q833l22122
$$ y = [-75234, -158421, -333814, -634241, -1012674, -1263367, -1152390, -684351, -151533, 157794, 243920, 317343, 492682, 669811, 707198, 592903, 407139, 223710, 113761, 135980, 211509, 113191, -245625, -579711, -523212, -144794, 115363, 107951, 245066, 864887, 1596626, 1747112, 1210261, 575879, 307624, 218628, -70412, -494411, -670443, -497916, -318941, -468787, -865407, -1115837, -943206, -453293, -3067, 155670, 70779, -57626, -116744, -92013, 62623, 392489, 793446, 1057409, 1090506, 960956, 738906, 451136, 202824, 156388, 337331, 615962, 902639, 1167499, 1243087, 878969, 129674, -534038, -688647, -399406, -68829, 7964, -183523, -472093, -613840, -466698, -204328, -195495, -517617]
42166e17617k59732J70160M48089K74330j13929m01105n39052n13348k16408K29893
42156a438719M30773K59007Q3613J95503L59815K44218m2574j87206j52446o2316
42146c10332J14548L72036M11635K8415m33911m73151j42141Q4036M6037Q020
42136b94808O8177l368k48827l35474q0946K18790K18618j1892j87282k38583
42126h95595k99088l98172l97155j91396J57531M74205N98816N02799K99076J06558
42116d2421n5950j80364j71857J3951K14087K28235J03960N4525J21983J42455
42106D28604M5093m9778p3242j26384k74112l98420l50198j28912J35346K73041
42096e18962J58307j51619l76257k85336P60J70717J48636J18261J36126K7921
$$ y = [-517617, -777349, -607189, -159100, 115230, 1301, -399804, -938856, -1452204, -1668612, -1438719, -1007946, -748939, -665326, -469823, -110008, 134210, 91636, -95570, -248016, -310332, -195784, 176252, 587887, 616302, 182391, -290760, -432901, -348865, -302828, -294808, -226631, -229999, -478826, -814300, -895246, -676456, -457838, -469730, -657012, -895595, -1194683, -1592855, -1990010, -2181406, -2023875, -1549670, -950854, -448055, -148979, -42421, -98371, -278735, -450592, -436641, -222554, 5681, 109641, 164166, 286149, 428604, 473697, 423919, 350677, 224293, -49819, -448239, -798437, -927349, -792003, -518962, -360655, -512274, -888531, -1173867, -1173107, -1002390, -853754, -735493, -599367, -571446]
42086e71446k56997m83096m53757k53285l0554K18111M93368O48826N90004M33123
42076C34297K98082J31776r3692k19301j52070q6623k23928m31181m51877l13118
42066a207635k19629j50776Q1645L99187M49859J20595k50872l14717j11923J18625
42056a085641L03105M69553M83177J54522l88036p01862n24020r4217J63585J62543
42046a057291J56082K77080L42955J98292p092p9533j19849l20022n54149n22987
42036a686514k65630j33899k01678j24794K36790M89235L21748Q2728K72369O96413
42026c13232O81865P9241n04677n69887l12507j39239m8647J49229L28114K16769
42016d32971o6841j00779K03329M26605K30609j77325l67660k76801k09879l26716
$$ y = [-571446, -828443, -1311539, -1765296, -2018581, -2049135, -1831024, -1337656, -688830, -98826, 334297, 632379, 764155, 670463, 451162, 299092, 212469, -11459, -442640, -894517, -1207635, -1427264, -1578040, -1496395, -1097208, -647349, -526754, -777626, -1092343, -1204266, -1085641, -782536, -312983, 170194, 324716, -63320, -765182, -1289202, -1383419, -1219834, -1057291, -901209, -624129, -281174, -82882, -89974, -169507, -289356, -609378, -1163527, -1686514, -1952144, -2086043, -2287721, -2412515, -2175725, -1686490, -1364742, -1282014, -1009645, -313232, 368633, 447874, -56803, -626690, -939197, -1078436, -1127083, -977854, -649740, -432971, -499812, -600591, -397262, 29343, 259952, 82627, -285033, -561834, -771713, -1098429]
42006a098429l98424j63869K52969M59529K86901K09m3179J60957K77957P2587
41996a92792k84100m05444j35254K67676M00138J37917k32661l11855j0627L48171
41986d18831L79546O0844k62814l04197j61337j32486k80531l46934j25863K29496
41976a363107L75809J61048k61766o04942o03798j27183O32065J120640Q79484
41967B08250J19702m25615l69985j23776k42731n90333n49302L5971N85056N46150
41957h06613O9130k83530k38852J3247J86240J81621N5906r2528j74264j51735
41947a241378n6298O9766K15182L48504L83848K62476M1771j41864j89694j18625
41937d26312m9760r6569k21080k52368j19469J9041Q404l5375R5466L13122L09880
$$ y = [-1098429, -1496853, -1660722, -1407753, -948224, -661323, -661114, -704293, -543336, -265379, -192792, -476892, -882336, -1017590, -749914, -349776, -211859, -444520, -756375, -767002, -418831, -39285, 21559, -241255, -545452, -706789, -839275, -1119806, -1466740, -1592603, -1363107, -987298, -826250, -1088016, -1692958, -2296756, -2423939, -1791874, -671234, 208250, 327952, -97663, -467648, -591424, -834155, -1424488, -1973790, -1937819, -1352763, -806613, -737483, -1021013, -1259865, -1246618, -1060378, -878757, -822851, -915379, -1089643, -1241378, -1297676, -1227910, -1012728, -664224, -280376, -17900, 23871, -117993, -307687, -426312, -476072, -572641, -793721, -1046089, -1165558, -1146517, -1138113, -1173488, -1078022, -764900, -455020]
41926d55020M7072j35064q131K23351K59668J14588k7356j44308k99836l78860
41916h03896j91744J99676M82432M13322J1866m94254p86391o33886j34977L07868
41906a629984M14969L26748L13957L51876K31101l4033k11531k13196j60010j12486
41896g22589k6962K4647r7152k90818k67146n299J46297k2566k44256j52921J96368
41885a462397M30080L63258J72029R4098J43064J46690k9499l13306m44983k11640
41875a112606K80574O27234N10436M6787l23096k91549L1184K93952K88364R1240
41865D42520j26419k95657l99176l60040j42483R7154J54108O0105K0010N9180
41855d90698o464j87592k11868M8279L24252L38619J77716L8017j13710l19956
$$ y = [-455020, -407948, -543012, -551143, -327792, -68124, 46464, 19108, -125200, -425036, -803896, -995640, -795964, -313532, 99790, 111656, -382598, -1168989, -1802875, -1937852, -1629984, -1215015, -888267, -574310, -222434, 8667, -25366, -236897, -450093, -610103, -722589, -749551, -724904, -822056, -1112874, -1380020, -1385319, -1239022, -1261588, -1505844, -1658765, -1462397, -1032317, -669059, -497030, -402932, -259868, -113178, -142677, -455983, -900966, -1112606, -832032, -204798, 305638, 352425, 29329, -262220, -231036, 62916, 351280, 442520, 316101, 20444, -378732, -738772, -881255, -784101, -629993, -569888, -549878, -490698, -497162, -684754, -896622, -848343, -524091, -185472, -7756, 30261, -83449, -403405]
41845d03405l66300j41630q732l18010p37616o41200p3245K91159J64865j3319
41835b247433J14481L17844L29577L20237M66567N37424L16281M0015J1116J12699
41825C18808R9569L9151N0676o4168m52978p54753n39279j2124K47836J15571
41815i51691m9746r4912k01862l26931j21845M26337P95019O13696J57145j02658
41805A42552j13680j43297l07213m73825m93259l09046M8013M08986N07507K28599
41795e04663k23939m93111l69743O6405N00082N86298K59314j47963k53503r6109
41785f76932m6732k28586l07764k712M47542N67707K69045n9867o1813J84786
41775H4674L16657J27277k16753l84504k60684o2685n9165k48827l96345l17429
$$ y = [-403405, -769705, -911335, -920067, -1238077, -1975693, -2616893, -2690138, -2398979, -2234114, -2247433, -2132952, -1815108, -1485531, -1165294, -698727, -161303, 154978, 194993, 206109, 318808, 418377, 457528, 508204, 444036, -8942, -763695, -1302974, -1315098, -1067262, -951691, -1001437, -1096349, -1298211, -1625142, -1746987, -1320650, -525631, 88065, 245210, 142552, 28872, -114425, -421638, -895463, -1388722, -1697768, -1649755, -1240769, -733262, -504663, -728602, -1221713, -1591456, -1525051, -1024969, -438671, -179357, -327320, -580823, -676932, -723664, -952250, -1260014, -1262726, -815184, -247477, 21568, -38299, -100112, 84674, 401331, 528608, 311855, -72649, -333333, -396018, -455183, -704010, -1100355, -1417784]
41765a417784k0675L59748O29402O09108L35146J19288J80061K80604M5922l85648
41755G35172m50001p342L55728J60373k40565k18900J46551K21472j59684m50971
41745I1833k87805l9209j56812m26049l21860J50461M68416L66833J35932R3095
41735G4835J62434J32309J744j37231k95179m22284k85981J79348N65899L95497
41725C71391k30742p21451p10799l50303R3375N07355P14462M59792j21421m10471
41715c98812m0037N50116O60066K10320l06993n50599n51965l63171j4158J98239
41705f06994p6900o25734p48408j59070N96231Q45894N51717J15052k13738m03210
41695g25160m11481k69739k03814l13758k89275J80692Q29765J056280P15087
$$ y = [-1417784, -1438459, -1078711, -449309, 159799, 494945, 614233, 794294, 1074898, 1120820, 735172, 285171, 277829, 633557, 793930, 553365, 334465, 481016, 702488, 542804, 91833, -195972, -235181, -391993, -818042, -1139902, -989441, -521025, -154192, -18260, 74835, 237269, 369578, 371322, 234091, -61088, -483372, -769353, -590005, -24106, 371391, 140649, -580802, -1291601, -1641904, -1548529, -1041174, -326712, 133080, 11659, -398812, -438849, 111267, 771333, 981653, 674660, 124061, -427904, -791075, -805233, -606994, -683894, -1309628, -2058036, -2217106, -1620875, -774981, -223264, -108212, -321950, -725160, -1136641, -1406380, -1610194, -1923952, -2213227, -2032535, -1202770, -146490, 568597]
41686E68597K61401O2217j6326j76505k47779j5156K61864J07103m09998o01799
41676b06381p0006O17389N54398k76412q75445n05860L18275N44002J4879m08708
41666b93869j57800K78844J96685k57649l87069j4101L34029K46547p9173k50405
41656c83961j84534n1385J2307j6030p0215k5895J38396K16701L2167k04498j02538
41645f39485L04711N23480K96264l7045r7946k2068j05940k13842k5450K88470
41635B71149K03960l05430n96740k54107K86697L54325l8152l23868k57847j66044
41625h26057k99283m09972j90298K01147L62302K16713M2796J4817L2721K3905
41615h31209J06217L23444M53956K78035r3794l41186l07784j00245J15780K41118
$$ y = [568597, 829998, 892215, 875889, 699384, 451605, 436449, 698313, 805416, 395418, -206381, -276387, 341002, 895400, 618988, -256457, -762317, -444042, 99960, 114839, -293869, -451669, -172825, 23860, -233789, -620858, -634959, -300930, -54383, -133556, -383961, -568495, -619880, -607573, -623603, -693818, -719713, -581317, -364616, -332449, -536947, -639485, -334774, 188706, 484970, 447925, 349979, 327911, 221971, 8129, -17321, 271149, 475109, 169679, -427061, -681168, -394471, -40146, -78298, -402166, -660013, -826057, -1125340, -1535312, -1725610, -1524463, -1162161, -945448, -902652, -887835, -855114, -831209, -724992, -401548, 52408, 330443, 236649, -104537, -412321, -512566, -396786, -155668]
41605a55668J97400m8319l72853n60495n36913m22728l05862j04658K34463N27827
41595a547806N25839K62539M7697O1468J22246k1278k94787l93874k32550n4025
41585a524531k7646J6740K61792N09981M26215R2278m4053J69955L38577J07340
41575C26648k98433m12231j94450j3810n6512j17934r123J53402J87250J38372
41565b96821J70111K88550L24278J43756j89319m38761l94551j14018Q2669k7466
41555d51572k74837l25770j41957K1875M7711P9423J73122J59039j558m1158K01783
41544e53899M64814M34650K13808J00320R5312j298j45890j26096j9820j21373
41534C40528l72878l44828N6053L10148J3624m67070m62339Q1036N57069N13931
$$ y = [-155668, 41732, -6587, -379440, -939935, -1476848, -1899576, -2205438, -2310096, -2075633, -1547806, -1021967, -759428, -711731, -650263, -528017, -549295, -844082, -1237956, -1470506, -1524531, -1552177, -1535437, -1273645, -763664, -337449, -245171, -289224, -119269, 219308, 326648, 28215, -384016, -578466, -592276, -648788, -766722, -775845, -622443, -435193, -296821, -126710, 161840, 486118, 629874, 440555, 1794, -392757, -506775, -424106, -451572, -726409, -1052179, -1194136, -1172261, -1124550, -1045127, -872005, -712966, -714524, -755682, -553899, -89085, 345565, 559373, 659693, 755005, 753707, 607817, 481721, 461901, 340528, -32350, -377178, -321125, -10977, 2647, -464423, -926762, -845726, -288657, 225274]
41524B25274J39694j09317o4021R8161J48670O625k61265m99736n36403k92633
41514a144951J20991M43970M77632K96772J72456K09484J80349j05036l88064
41505B63603k49729J96998L23607j36608o37975n70168j10919J11401l8079j31345
41495i79214N2191K58447L05281L48784M40787L18595r7240m07852k67683R7899
41485F9995K33899O1720j80609l75118n36156n50558k96080M2762J24678p9508
41475a484975k44460j28238J81686M70124O24793O30786N04891K85462J0786k68476
41465E82379m15689k84237K8288J76535j2910k84846l10748j17869O5439J87724
41455c85934K97156K75149J7333k49187k20207N395R7251N4813J42866L18082
$$ y = [225274, 364968, 255651, 191630, 289791, 438461, 445086, 183821, -315915, -852318, -1144951, -1023960, -579990, -102358, 194414, 366870, 576354, 756703, 651667, 263603, 13874, 210872, 534479, 397871, -240104, -810272, -921191, -809790, -847869, -979214, -927023, -668576, -363295, -14511, 426276, 744871, 647631, 239779, -27904, 69995, 303894, 365614, 185005, -190113, -726269, -1276827, -1572907, -1530145, -1405467, -1484975, -1729435, -1857673, -1675987, -1205863, -581070, 49716, 554607, 840069, 850855, 582379, 166690, -117547, -89259, 87276, 74366, -210480, -521228, -639097, -573658, -385934, -88778, 186371, 203704, -45483, -265690, -260295, -163044, -108231, 34635, 352717]
41445C52717K43172p7959k14970j2371J24985j20880m86171n53035l06826N922
41435a045416K46577L42728J92513j04829k07058K536J80194M0947j69276n6464
41425e77548L00702M74061K77056q4971l41240l75204k31333r8402j38828k03062
41415i98769K7283M60797N41614M8545m62596m22383p1389J571j73753q6386L20112
41404h15354N28765K73998j12933k78345k59888k02686r9498M3832J35062J87343
41394e99704K79551L04463R7577j91236k46516j04596q6646k00476j04200K54717
41384e97066M84791L85331K19392J46967q2493n62545q49211n63584K728L15897
41374a099793L30560L52228M18149L01957J3479j63063j17227k9420j3956L9604
$$ y = [352717, 595889, 517930, 302960, 290589, 415574, 294694, -191477, -744512, -1051338, -1045416, -798839, -456111, -263598, -368427, -575485, -572949, -392755, -351808, -521084, -577548, -276846, 197215, 474271, 389300, 48060, -327144, -558477, -656879, -795707, -998769, -971486, -510689, 30925, 79470, -383126, -805509, -876898, -875327, -1049080, -1135466, -815354, -286589, -12591, -125524, -403869, -663757, -866443, -965941, -922109, -787047, -599704, -320153, -15690, 81887, -109349, -355865, -460461, -547107, -747583, -851783, -597066, -112275, 273056, 492448, 639415, 556922, -5623, -854834, -1418418, -1415690, -1099793, -769233, -417005, 1144, 303101, 316580, 153517, 36290, 6870, -7086, 32518]
41364C2518J91061K62125O3461l01452m82734k58245J65499L13806j7079m80805
41354e11845n99497l56467j23953q9525j05229q6474j35895j87333K6637M66857
41344a702724O68276L81735m6411k19243k33046l30927l80740j45042K00188K98593
41334a509341J91892J99944L36105L05111N2278j11059K0972K76673L58839J36778
41324B58192l03067o86179o89294k79016J55786K23955j4902k23758k45729j22210
41314a926222J41690M64809N13854Q1396m52600n01309q4220K12641J11915k2764
41304a460810J42522L90681L56591Q6592j05160j07168o1794p4661q8793m360
41294i26360J84221L48997L34537J67727P1977J36961J21125j70882m57645k92403
$$ y = [32518, 223579, 485704, 549165, 247713, -235021, -493266, -327767, -13961, -31040, -511845, -1111342, -1467809, -1591762, -1681287, -1786516, -1872990, -2008885, -2196218, -2169581, -1702724, -1034448, -652713, -699124, -918367, -1151413, -1482340, -1863080, -2008122, -1807934, -1509341, -1317449, -1117505, -781400, -476289, -424011, -535070, -514098, -237425, 121414, 258192, -44875, -731054, -1420348, -1699364, -1543578, -1319623, -1334525, -1558283, -1804012, -1926222, -1784532, -1319723, -805869, -724473, -1177073, -1678382, -1762602, -1549961, -1438046, -1460810, -1318288, -927607, -571016, -484424, -589584, -696752, -758546, -833207, -922000, -926360, -742139, -393142, -58605, 109122, 181099, 318060, 439185, 268303, -189342, -481745]
41284d81745K45395N69924L46777j31323m03014l33907o7441J85681K04034p9656
41274E4725l64059k43168K18605N08821L67526J00063N0486J41116J29221k5970
41264I37366k53907m99295n78397k74515K27754M05900J25787j36003p0507k8158
41254a43975l26328n76763k82799K80369M37771J14478j86584k26421j87992j05384
41244a203628J77668M88019M23673M1332j67676p0148l9405j94352j54508K16349
41234d82676M66333K89982L0163N1121J33775m6296k99336k97029j89798k96686
41224f40447m67932l25390N5397K50204J48155Q994l1783k7567J01647M37551
41214d91171O80122M41824q6487l09973r5784R8328K5149l5830P4711O2779k12853
$$ y = [-481745, -236350, 333574, 680351, 549028, 146014, -187893, -255334, -69653, 134381, 54725, -309334, -552502, -333897, 174924, 542450, 642513, 692999, 834115, 963336, 937366, 683459, 184164, -394233, -668748, -440994, -35094, 90693, -45310, -115817, -143975, -470303, -1047066, -1329865, -1049496, -611725, -497247, -683831, -910252, -1098244, -1203628, -1025960, -537941, -114268, -72936, -240612, -310760, -350165, -544517, -699025, -482676, -16343, 273639, 303802, 354923, 488698, 442402, 143066, -153963, -343761, -640447, -1108379, -1433769, -1378372, -1128168, -980013, -971019, -1002802, -1030369, -928722, -491171, 188951, 630775, 544288, 234315, 138531, 236859, 262008, 226178, 300889, 363668, 150815]
41203A50815l75837j55267J24209R6991n1910j6003L7180j57293l53981j83798
41193h84894J21208N2087k97009l58295l2971J85958P1398k9736J14562K51330
41183h06362J84712J29409K47840L20371J67766k8604j05452j92320l27033k43191
41173f52864J21664L44949J46332j11073N53K68745K32169l9857j33108j6733
41163A60777K0308M139K12406N29207M95898O6968k61749k11335q5208j91009
41153G40402l63905l15498r0458Q1938J17465M6392j10530k59740k43871p5003
41143d72808N2319Q3873J82123L52192K87908j80614p04907p51624k25404M32557
41133i44385P14435M91247M6745k29125j87693J4390J80956K83469L24340J96524
$$ y = [150815, -225022, -380289, -256080, -159089, -210999, -227002, -189822, -347115, -701096, -884894, -763686, -711599, -1008608, -1366903, -1399874, -1213916, -1142518, -1172254, -1057692, -806362, -621650, -492241, -244401, 75970, 243736, 215132, 109680, -82640, -409673, -652864, -531200, -186251, -39919, -150992, -150439, 118306, 350475, 310618, 177510, 160777, 181085, 185224, 397630, 926837, 1422735, 1489703, 1227954, 1016619, 931411, 740402, 376497, 60999, -29459, 52479, 169944, 216336, 105806, -153934, -397805, -472808, -420489, -336616, -154493, 197699, 485607, 304993, -399914, -1151538, -1376942, -944385, -229950, 261297, 308042, 78917, -108776, -94386, 86570, 370039, 694379, 890903]
41123H90903r5239k58439q9227J14273p1718m85377n32579p1911L73552M10078
41113A84316K53088J89063P1724k81019n94512m87930p7926J70270N9506j86111
41103f99531k80254j42341J00133K12891Q3320o3579R8945M63488N20655Q9341
41093C83068l64616l93237j66241o9627p6217M2447J74181N2851j86061j49365
41083g52817J76259L82480K35620o0109k16881j79386p2633n7573j98751l07917
41073a051708p3993M41712O76634K48047m61292p74647n73210k53403l1655J92580
41063a660935L91147L75723K12533J76490K65630K18821L3628n970J47282K34044
41053C88393J86418J88527J74795j63565p17913q94436m71270J7707R0678K716
$$ y = [890903, 795664, 537225, 447998, 562271, 490553, 5176, -527403, -599314, -225762, 184316, 437404, 626467, 698191, 417172, -177340, -665270, -743196, -572926, -513420, -699531, -979785, -1122126, -1021993, -809102, -725782, -789361, -690416, -226928, 293727, 383068, 18452, -374785, -541026, -610653, -686870, -644423, -470242, -417391, -603452, -752817, -576558, -194078, 41542, -18567, -235448, -414834, -487467, -545040, -743791, -1051708, -1125701, -683989, -7355, 240692, -220600, -995247, -1568457, -1821860, -1853515, -1660935, -1269788, -894065, -681532, -505042, -239412, -20591, 13037, 7067, 154349, 388393, 574811, 763338, 938133, 774568, 56655, -837781, -1309051, -1291344, -1200666, -1197950]
41043a197950J98875N23319N02595J32834j51760j53960q2620j05165j40523j04967
41033e79322m2120J6238P5852P3497l8696j32788n0445J17544J28367l4951j14910
41022e81734M1486K60108K94269J52699M4400P1489J09828M737k07978l44144
41012a54840l00605j54195k1928O8122J05281J7687k00059l61975k65362L0512
41002a237362K52117K34858O7227p6347j09498m0959O6166J32422J44225J70019
40992c97132K28191K32120J58673J23505J45879L0631k89279m92894k78987J16338
40982d22955J96807q0458k79249j48599J07806K55179K99275K53092L7949k49853
40972c1006l30998j44568M9380O7761q385j04747k43337k92210m8314L16647L46062
$$ y = [-1197950, -999075, -475756, 26839, 159673, 7913, -146047, -228667, -333832, -474355, -579322, -621442, -605204, -529352, -455855, -494551, -627339, -677784, -560240, -431873, -466824, -581734, -540248, -280140, 14129, 166828, 211228, 282717, 392545, 397282, 189304, -154840, -455445, -609640, -631568, -563446, -458165, -440478, -640537, -1002512, -1267874, -1237362, -985245, -750387, -683160, -759507, -869005, -909964, -843798, -711376, -567151, -397132, -168941, 63179, 221852, 345357, 491236, 521867, 232588, -260306, -539293, -422955, -226148, -306606, -585855, -734454, -626648, -371469, -72194, 180898, 218847, -31006, -362004, -506572, -457192, -389431, -397816, -502563, -745900, -1038110, -1086424, -769777, -423715]
40961d23715j884k15057j0209K23170O2844l02802m27469k30481Q0920L63246
40951h81437M71016K01262l26560n86413l27963J2512o660j36144O1351L74205
40941a144831K55967k35124m76833j98455K40480M86976N62540N36707L29568
40932C56995k6629l03518l74939l27554k35616q7275O2782J20875J15269J08467
40922e91143L3549j44884k44506j23727K9779j2459j16849l6102J23100R8499
40912i84743l2665j7928P0560N889q1630N5657J65056j85164o95970n41907L52098
40901a890747J012380P33702J8987k49839j0903J64028M1417j07159j09777r9563
40891d97474j39528q1327J21470K48642Q4040k82122n17438l99855o6628J53846
$$ y = [-423715, -425599, -640656, -650865, -427695, -364851, -667653, -1095122, -1325603, -1244683, -881437, -410421, -209159, -535719, -1122132, -1450095, -1437583, -1444243, -1580387, -1519036, -1144831, -888864, -1123988, -1600821, -1799276, -1558796, -1071820, -509280, 27427, 356995, 330366, 26848, -348091, -675645, -911261, -998536, -935754, -814879, -699610, -591143, -557594, -702478, -946984, -1070711, -1040932, -1053391, -1170240, -1206342, -1083242, -984743, -1017408, -1035336, -964776, -958887, -1040517, -984860, -819804, -1004968, -1700938, -2242845, -1890747, -878367, -144665, -125678, -375517, -386420, -222392, -180975, -288134, -397911, -497474, -637002, -718329, -596859, -348217, -264177, -546299, -1063737, -1463592, -1530220, -1376374]
40881a376374J62315J79722L34006M07433K25778L2559J03571K16928k459l68208
40871h4729l51775K9619J82143j26923m25281l07737K4534K27375K86746K76656
40861b69372J38364m5407k6433J36829Q1513j87839k15707P7516J60697j76426
40851c26265l88120j39772M3972k74090n80186k92640J40555j1250m23981k18846
40841b470623N08989Q10310M38863J59394L96465O30581M07155J3305k11284m19385
40831B63770o97283o82364k09610K49096K51532M053q6552j8947K3564N6004Q8122
40820g58615k9350k13192p5840L85974N54391J06844l54463j72055L39404M32656
40810B15754J16910l266J42044O354n14124p88283m42966N9554J84492J01624
$$ y = [-1376374, -1214059, -1034337, -700331, -292898, -67120, -34561, 69010, 285938, 283479, -84729, -436504, -406885, -224742, -351665, -776946, -1084683, -1060149, -832774, -546028, -269372, -131008, -176415, -202848, -66019, 15494, -172345, -388052, -310536, -149839, -326265, -714385, -854157, -810185, -1084275, -1664461, -1957101, -1816546, -1827796, -2251777, -2470623, -1961634, -1151324, -712461, -553067, -156602, 473979, 881134, 894439, 683155, 263770, -433513, -1115877, -1325487, -1076391, -824859, -820806, -907358, -926305, -902741, -846737, -758615, -787965, -1001157, -1076997, -691023, -136632, -29788, -384251, -556306, -216902, 215754, 332664, 329398, 471442, 477796, -36328, -824611, -1267577, -1208023, -1023531, -921907]
40800i21907K63989O01954O19417J33208m56508o08846j66177N06584Q04592M26343
40790A202649k70927o03184l26359J19293K27586L0576j21642j43307k34416m17308
40780e37039m23037j18971K22180K45669l1800k50944j44994J76064L83929K94093
40770a84850K5562j68700j68816o3212n308n3750j37339j19001Q7515L88578N20830
40759A21509L11367o2112k21919n9663J11317m547k55345k63925J3164K17943
40749i2211J04334j27364j22965J71083M89936N81489M11841R8439k18061m25673
40739H70848m60806l29004j06280Q1439J12950l0215k21222l12280l01064k89281
40729i84915k82514j64686Q3466K72403K02853r9035m07192m86873k45951J74608
$$ y = [-921907, -657918, -55964, 563453, 696661, 240153, -368693, -534870, -28286, 776306, 1202649, 931722, 328538, 2179, 121472, 349058, 379634, 257992, 114685, -119731, -537039, -960076, -1079047, -856867, -611198, -642998, -893942, -1038936, -862872, -478943, -184850, -159288, -327988, -496804, -560016, -565324, -619074, -756413, -875414, -787899, -399321, 121509, 432876, 370764, 148845, 89182, 200499, 195952, -59393, -323318, -310154, -92211, 12123, -115241, -238206, -67123, 422813, 1004302, 1416143, 1514582, 1296521, 870848, 410042, 81038, -25242, 56197, 169147, 138932, -82290, -394570, -695634, -984915, -1267429, -1432115, -1348649, -1076246, -873393, -972428, -1379620, -1866493, -2112444, -1937836]
40719a937836M31730K81763p2783j41546K25612N94990N25476J58359n3501j6598
40709d334k1107j84717k90258k13497j21890j17514k0412K85975N47641M29890
40699B89777j7298l94651l97560q6690K37884L28467J80993o675p5925q6437j95822
40688b23937m07164n44148m49795j17165L09434N56735L78585j26189m90241m06004
40678a519889j20066o411M1838L37797O84590N65422N3616j68421J17116K76237
40668B61829j39716o37798n82855j87583o0685j92377j07124K39425M35416L45059
40658f26409J93524O487l58698o45305l74040L01336N95534J88049k76132j09050
40648a104704M87247P97068N37471L2195l19711l87866k62705j47589k10981l57338
$$ y = [-1937836, -1506106, -1224343, -1297126, -1438672, -1213060, -618070, -92594, 65765, 12264, -4334, -25441, -210158, -500416, -713913, -835803, -953317, -973729, -687754, -140113, 289777, 272479, -122172, -519732, -606422, -368538, -40071, 140922, 134247, 58322, -28115, -223937, -631101, -1175249, -1625044, -1742209, -1432775, -876040, -497455, -623644, -1113885, -1519889, -1639955, -1646366, -1604528, -1266731, -582141, -16719, 36897, -131524, -14408, 261829, 122113, -515685, -1098540, -1286123, -1346808, -1539185, -1646309, -1406884, -971468, -626409, -432885, -426398, -785096, -1430401, -1804441, -1503105, -907571, -719522, -995654, -1104704, -617457, 179611, 717082, 749277, 429566, 41700, -221005, -368594, -579575, -936913]
40638i36913k62722J89769O38384O02346N2025n26855o16893j52554M35613O37431
40628E9631L73480M8857K0744J47277P1980j80707k44681k5333J19410p9034m10474
40617i8850n03277k72758R3559L60609L29669m4447m72476n19945j38897K32214
40607a034599K50592P0572k2169n5382j57592j82375O6111L94610M08153Q3362
40597a78717j98447j95900p2169o4240j61060k12880j55069n063K13716M19624
40587f10205M46458K11476j17005k48044j08643L8702p3602l23450l20353M0267
40577a064399L78540L52656J56848K04414M72104N57510L42979J47972J30990
40568A679614k043m52903q70717p77714k26701K91728M55843L42886J60709K3621
$$ y = [-936913, -1199635, -1009866, -371482, 230864, 282889, -243966, -860859, -1013413, -577800, 59631, 433111, 481968, 502712, 649989, 721969, 541262, 296581, 271248, 390658, 311624, -98850, -602127, -874885, -781326, -420717, -91048, -135495, -607971, -1127916, -1266813, -1034599, -784007, -713435, -735604, -790986, -948578, -1130953, -1064842, -670232, -262079, -178717, -377164, -573064, -645233, -709473, -870533, -1083413, -1238482, -1243545, -1029829, -610205, -163747, 47729, -69276, -317320, -425963, -387261, -460863, -784313, -1104666, -1064399, -685859, -333203, -176355, 28059, 500163, 1057673, 1400652, 1548624, 1679614, 1677571, 1224668, 353951, -423763, -650464, -358736, 97107, 439993, 600702, 624323]
40558F24323m3227q0929j58241k35631j51095J36605M01525L89805J11864k21346
40548G73653m41202m89251l74555j87261m1305P3494K26711K92958K6662m92581
40538f32677p91846n82588j26237K00812L96533N91215O36791L57454j3423j01732
40528f5698L9615O8786n4837q4620j6534r3514k65147j67428K29834M39053J46588
40517A76098l05145m07377j58358N5078M5147j6035O1229K32887L24389K47314
40507B55227P6875n5830j31318k34956l40189k48821Q3302L12409R3965l67978
40497e57314n17596k13406Q8634L1335j61848j33933L7152P6893O2300K71770
40487a016013N78017M79646j49082p41916p24218k41420J14432J39342J70205
$$ y = [624323, 581096, 500167, 341926, 106295, -44800, 91805, 493330, 883135, 994999, 773653, 332451, -156800, -531355, -718616, -759921, -686427, -459716, -166758, -140096, -632677, -1424523, -2007111, -2133348, -1932536, -1536003, -944788, -307997, 49457, 36034, -65698, -26083, 42703, -12134, -96754, -113288, -206802, -471949, -639377, -409543, 29510, 176098, -129047, -536424, -694782, -639704, -594557, -610592, -549363, -316476, 7913, 255227, 332102, 276272, 144954, -90002, -430191, -679012, -595710, -283301, -189336, -557314, -1074910, -1288316, -1199682, -1168347, -1330195, -1464128, -1426976, -1350083, -1287783, -1016013, -437996, 41650, -107432, -849348, -1573566, -1814986, -1700554, -1561212, -1391007]
40478a391007L97413M73933O8181n06710o16056j37170M24219O33856N53742M08036
40468C08437K32157L0405o7438l7836o0323j61283p5602K67639M59052J80543
40458A075751k24862k00772K11211M77291L44633K9933k63531n14193o06678l95998
40448f7215p5187n581j38701q4196J90646K53369o5880l60127k84440m2049M1016
40437f38345J2967O0757J30239R8987L9062J9171q4293l08939m15079k50023l2178
40426a367674J3995K7974K01746L76310L24145K00704K93154M78935L72339n8812
40416H62816m27933m74298l20860j63820k2921J25031K11207J71747L8300j08793
40406a09524j85061j29548J7248J28536J66217K17473K67790J43839j51721k92535
$$ y = [-1391007, -993594, -519661, -451480, -958190, -1574246, -1711416, -1287197, -653341, -99599, 308437, 540594, 570999, 503561, 465725, 405402, 244119, 168517, 436156, 895208, 1075751, 850889, 650117, 861328, 1338619, 1683252, 1713185, 1449654, 935461, 328783, -67215, -142402, -147983, -286684, -370880, -180234, 73135, 7255, -352872, -637312, -679361, -638345, -625378, -564621, -434382, -335395, -296333, -277162, -361455, -670394, -1085473, -1335496, -1367674, -1353679, -1325705, -1123959, -747649, -423504, -222800, 70354, 549289, 921628, 862816, 434883, -39415, -360275, -524095, -547016, -421985, -210778, -39031, -731, -109524, -294585, -424133, -406885, -278349, -112132, 105341, 373131, 516970, 365249, 72714]
40396G2714q4628J52338J9655l09134l06766J05093M43225L97893K09822J51801
40386H52013P6895k14386m91290l77012N0047L30328K52368M8500o9627k03244
40376B54592m30713n08086k23779J46970J50847j33501j52329K54364N24850K14670
40366I7885k63591k17613K98673O16052M53292J47651q8935m30671q01140p00383
40356h88780l8082M77315K83780j86274j70082K92267N17668K31950j76586l48040
40346d864l02190j18852J90751M40228L59906J3155k58209l35279l84492m14289
40336h14135k24584J13790J91041j32235m29131k76259J55839L46469R1525k99444
40326a277124l98619j08712K65783L60365J66689J3714P8052J27560n1995k22888
$$ y = [72714, -11914, 140424, 160079, -149055, -455821, -350728, 92497, 490390, 700212, 852013, 928908, 714522, 223232, -153780, -103733, 226595, 478963, 527463, 457836, 254592, -176121, -684207, -907986, -761016, -610169, -743670, -895999, -641635, -116785, 97885, -165706, -383319, -84646, 531406, 984698, 1132349, 1043414, 612743, -188397, -888780, -926862, -449547, -165767, -352041, -522123, -229856, 287812, 519762, 343176, -4864, -307054, -425906, -235155, 205073, 564979, 578134, 319925, -15354, -399846, -814135, -1038719, -924929, -733888, -866123, -1295254, -1571513, -1415674, -1069205, -977680, -1277124, -1675743, -1784455, -1518672, -1158307, -991618, -977904, -899852, -772292, -824287, -1047175]
40316a047175m2088L35448M42769K05532r854k8096m0358j02579M039K61970K90625
40305B70233k2950k38868k5390L04857K87292m063j64901j09744q8244j89977
40295A8245k23598o3844J63339K54908J34464q7587j86547o2753P2368l2795j95742
40284b09542L7941O24676Q61611L17668m61653o33483j69440K25471J47472j08233
40274F32488j81942j55613k58797m40400m54246j80579K66497O18625O03246J82892
40264F32171l19117m94453k88736l2178k9702k61483m82186m70646j90576J61488
40254a775418K99696J73341P4855K52405N09924M36193k1932m88391o48613n28124
40244a716064k61126J06256M78840O54227N57028L35567J12842j47879m16175
$$ y = [-1047175, -1089263, -753815, -311046, -105514, -115368, -143464, -183822, -286401, -282362, -20392, 270233, 247283, 8415, -16975, 287882, 575174, 571111, 406210, 296466, 208222, 18245, -205353, -269197, -105858, 149050, 283514, 195927, 9380, -53373, 18995, -13800, -209542, -171601, 453075, 1314686, 1632354, 1170701, 537218, 367778, 593249, 740721, 632488, 450546, 294933, 36136, -404264, -858510, -1039089, -772592, -153967, 449279, 632171, 313054, -181399, -470135, -502313, -532015, -793498, -1275684, -1746330, -1936906, -1775418, -1475722, -1302381, -1227526, -975121, -465197, -29004, -50936, -539327, -1187940, -1716064, -1977190, -1870934, -1392094, -737867, -180839, 154728, 267570, 119691, -296484]
40235b96484m87122k89154p5026o9694j16258M8045L10461L12699K339k89672
40225i49866l37830k49458j31783J03364M15927M63082P1482l55576k98711J42045
40215a127324M04898L09732K42670M08024M40957O5356l36018k78645K8343P744
40205A65737l47472m74839j51888K10672K92622K89504L83038L36625j8131l44813
40195C41055k96790j01387j61973l36766j63756L16458N22011J58684l77284n56645
40185f56393l21554J9315K10824J83068l0669l02023m16522k29985J62155M49752
40175i32032L52230p8597m13520k69555J83584L75928J03889j59382M5233M75795
40165c16427N76678L12851J22786J52615Q6369k15557m25026k70800M8380J92149
$$ y = [-296484, -783606, -1072760, -1147786, -1217480, -1333738, -1285693, -975232, -662533, -660194, -949866, -1287696, -1537154, -1668937, -1565573, -1149646, -686564, -615082, -970658, -1269369, -1127324, -722426, -412694, -170024, 238000, 678957, 744313, 408295, 129650, 157993, 165737, -181735, -656574, -808462, -597790, -305168, -15664, 367374, 703999, 685868, 341055, 44265, -57122, -219095, -555861, -719617, -403159, 118852, 277536, -99748, -656393, -977947, -958632, -747808, -564740, -595409, -897432, -1313954, -1543939, -1381784, -932032, -579802, -658399, -1071919, -1341474, -1157890, -781962, -678073, -837455, -792222, -316427, 260251, 573102, 695888, 848503, 934872, 719315, 294289, 23489, 71869, 264018]
40155B64018J19724O272m2112k5144Q080m3987j98351k27056Q5967N07749N42604
40144I97764J39123j93162j24149O4668J5632j66496k34994k67198l95039l89552
40134e53403p633M43366M02956j33839n56447m26161K9729K83670J08508k60607
40124f69861m06058j49612K29725K97758M9882m8137K37532M96313K79867j94124
40114A23285l93119k75938k04170k13931r858L47034M18420J70702J23580M69955
40104E55960O55373K15762m71098p36898n41473l33881k64085p6807L05411N76518
40094a15218M72810R1414k62807l55277j71132N9121O1961j25046j65553N7452
40084d52275J94311k9319k88918q8603M56234P31476M64894L40k75975l30884
$$ y = [264018, 383742, 390014, 347902, 322758, 330838, 286851, 88500, -138556, -52589, 455160, 997764, 1136887, 943725, 819576, 884244, 899876, 733380, 498386, 231188, -163851, -553403, -561036, -117670, 285286, 151447, -405000, -831161, -801432, -517762, -409254, -669861, -1075919, -1225531, -995806, -698048, -648166, -696303, -458771, 37542, 317409, 123285, -269834, -545772, -749942, -963873, -973731, -626697, -208277, -37575, 86005, 555960, 1211333, 1427095, 955997, 219099, -322374, -656255, -920340, -997147, -691736, -115218, 357592, 449006, 186199, -169078, -340210, -281089, -219128, -344174, -509727, -452275, -257964, -287283, -576201, -664804, -208570, 522906, 987800, 988140, 712165, 381281]
40074C81281k34953K6772L22205L38213N469l36537l95830k74783j78592p4281
40064d21036J24516K94013K80766J36413m8335l01068n20125l68234K32588P54740
40054A64238O55962J51132q3455J21785K89662J29612o4489k0604M1431j27746
40044A257528k92678j09158K43378K57611j71870o08490o60277l84058n8154J74559
40034c51609L26528M06265L66378J62517j59823m12183l82882j15482M1041j52963
40024b72213m43648l66123J05857M82621M05261Q8858m0825Q3350J97578J49844
40014C90560M6708M980q315o0344j35150j69578j17817J1840J15424N4365j41177
40003h504k27987o0446J60521J58018l532n4607K35q0086k41351r9636L87596
$$ y = [381281, 146328, 173100, 495305, 833518, 838987, 502450, 106620, -168163, -346755, -421036, -296520, -2507, 278259, 414672, 366337, 65269, -454856, -823090, -590502, 164238, 820200, 971332, 887877, 1009662, 1299324, 1428936, 1364447, 1343843, 1385274, 1257528, 964850, 855692, 1099070, 1356681, 1184811, 576321, -83956, -468014, -526168, -351609, -25081, 381184, 747562, 910079, 750256, 338073, -44809, -160291, -119250, -272213, -715861, -1081984, -976127, -493506, -88245, 613, -40212, 43138, 240716, 390560, 437268, 442248, 433933, 373589, 238439, 68861, -48956, -37116, 78308, 132673, -8504, -236491, -296937, -136416, 21602, 18070, -36537, -36302, -116388, -357739, -457375, -69779]
39992f9779O70037L52224j81317l09472m6983J22886O9229Q1543K04828J33225
39982A026421j66012l12064j54933j1585m4751L6718L49710M65597J10667k50617
39972A049151r1415K98221K46367k31104m66881j54018L01096M32810J76458l22471
39962A238214q19588q90520l17407L91228M66572l4449k45930K33891P73897P19908
39952A515816K93545L2209n2759j85545k11176O0873K81115L0672l94797l71680
39942I98273O1539L04751J74034N1783Q9505J8722j55711l7693L63909M53652
39932B322764J8503k93706M4860N51719M40250j91208n61202l72389p9398k3318
39922A856875M6231M14482Q64564R75445O72709K55694N2680J93212N49792P73478
$$ y = [-69779, 600258, 952482, 771165, 461693, 414710, 537596, 606825, 688368, 893196, 1026421, 860409, 548345, 393412, 381827, 337076, 373794, 723504, 1189101, 1299768, 1049151, 957736, 1255957, 1502324, 1271220, 804339, 650321, 951417, 1384227, 1560685, 1238214, 418626, -471894, -789301, -398073, 68499, 34050, -211880, 22011, 795908, 1515816, 1809361, 1841570, 1788811, 1603266, 1392090, 1452963, 1734078, 1764750, 1369953, 998273, 1059812, 1364563, 1538597, 1590380, 1679885, 1698607, 1542896, 1505203, 1869112, 2322764, 2341267, 2047561, 2092421, 2644140, 3084390, 2893182, 2331980, 1959591, 1880193, 1856875, 1903106, 2317588, 3182152, 4157597, 4830306, 5086000, 5138680, 5331892, 5881684, 6655162]
39912F655162N47570n9602o25161q53443q56570q28837o72449k23769K92051M12160
39902C787112P3721k47820j83474N1127O6261o7236L3562L90724N69161L22061
39892D795199m5294j49963p7300j75692m83068o70257n16810j83550L4407N1696
39882B579368J7139Q8720K51297L43139K48153L8995j08409j02078M4278K98906
39872C699508N49070N23877P1629m69674n31313o7176L08755J40524k78691m25822
39862C520687k97193k24094k29433p9287J82574K69149J60770J08263J49274P7967
39852C638677r7782j21128M8435J59560J16856J04804K16773L52827N05346P19264
39842E643632P69402L86389j49093j98447L30213Q35341R30296Q89647R72148
$$ y = [6655162, 7202732, 7143130, 6517969, 5664526, 4807956, 3979119, 3306670, 3082901, 3374952, 3787112, 3860833, 3613013, 3429539, 3480666, 3546927, 3479691, 3513253, 3903977, 4473138, 4795199, 4749905, 4599942, 4522642, 4346950, 3863882, 3193625, 2676815, 2493265, 2527672, 2579368, 2596507, 2685227, 2936524, 3279663, 3527816, 3566811, 3458402, 3356324, 3400602, 3699508, 4248578, 4772455, 4844084, 4374410, 3843097, 3775921, 4084676, 4225200, 3946509, 3520687, 3223494, 2999400, 2769967, 2690680, 2873254, 3142403, 3303173, 3411436, 3560710, 3638677, 3540895, 3419767, 3468202, 3627762, 3744618, 3849422, 4066195, 4419022, 4924368, 5643632, 6413034, 6799423, 6650330, 6451883, 6782096, 7617437, 8547733, 9437380, 10409528]
39833A0409528R55926P01234N67146Q26106J184412J332653J491245J972534K686882
39824B2127666L509492M581329N748676O306201N923272N297337N293491O063436
39816F4850900P667089J0738973J5604959K1594392K8294497L6101566M3286487
39809B28138863M3500645L0011716M064384k3311745m0051192m2785146l6915125
39802A62652400k9093904k2191124j6521308j2351788r807133q173152o802721
39795E7711270n950257n882354n951716n382782m357351l531874k972536k342912
39787B1339488j751816j594415j757690j745656j506219j421965j487024j222280
39779H852423n73004k16113o12668j247899j265347n63920J70975L63596O1951
$$ y = [10409528, 11365454, 12066688, 12633834, 13459940, 14644352, 15977005, 17468250, 19440784, 22127666, 25637158, 30218487, 35967163, 42273364, 48196636, 53493973, 58787464, 64850900, 72517989, 83256962, 98861921, 120456313, 148750810, 184852376, 228138863, 271639508, 301651224, 305715608, 282403863, 242352671, 199567525, 162652400, 133558496, 111367372, 94846064, 82494276, 72687143, 64513991, 57711270, 51761013, 45878659, 39926943, 34544161, 30186810, 26654936, 23682400, 21339488, 19587672, 17993257, 16235567, 14489911, 12983692, 11561727, 10074703, 8852423, 8279419, 8063306, 7450638, 6202739, 4937392, 4373472, 4544447, 4908043, 4969994]
39770D969994l80045p24746q59658o95875k75749J35180K48895N7076j54403j25489
39760B195180Q1987J65167l1884k96254l12106q9100N7288l1299j44508p8357
39750A516114M961j62170m71694n28899k07985J62440K30021R589k38135l23231
39740h989k19631p095J54030J01280j60238m22475m70832k74801J5295J87078
39730a106378J18439o8563n3869L14107P37311P56843L06369k34164n09031m61576
39720b00512j77155K17120M67038L57634N2290n5696J06146K43717K38011K62266
39710A510859K63324q6892o74198p92599j23388O90802R39470P74749O75377N40701
39700C718205Q6257l20425j55085K12476k7131p24865q90608k96256J15536k49659
$$ y = [4969994, 4589949, 3865203, 3005545, 2309670, 2033921, 2169101, 2417996, 2475072, 2320669, 2195180, 2277167, 2442334, 2410450, 2114196, 1802090, 1712990, 1770278, 1738979, 1594471, 1516114, 1521075, 1358905, 887211, 358312, 150327, 312767, 542788, 552377, 314242, -8989, -228620, -235715, -81685, 19595, -140643, -563118, -1033950, -1308751, -1293456, -1106378, -987939, -1056502, -1110371, -796264, -58953, 697890, 1004259, 770095, 261064, -200512, -377667, -160547, 306491, 664125, 716415, 660719, 766865, 1010582, 1248593, 1510859, 1774183, 1687291, 1013093, 220494, 97106, 787908, 1727378, 2502127, 3177504, 3718205, 3804462, 3484037, 3328952, 3541428, 3514297, 2789432, 1898824, 1602568, 1718104, 1468445]
39690A468445p11781m62633J78626L55339m9092m32698m21367j68594O8623J35306
39680c9826p6464m61091o24345l33694J10479K71344J62674J12894K17002K81607
39670c79420K14134J35432J28920J18099j349k27820m13318l35662M4204M02323
39660c14457L72581O2084o6697J30728L05406K06009K0670l6240n5051j39454
39650D85579j90102j88739k80070l75783j65228K53007L22437p5371l04156J5238
39640e03188L27977O1439l99648l85045o8790q9513m14078m51831p3046L09896
39630a685827N04538N97767M37867j15188n71837l27425K84760L64176j55264
39621f66433m36088j40068J17550n2739j81382J11903M23261L17533L2219p0724
$$ y = [1468445, 756664, 294031, 472657, 827996, 778904, 346206, -75161, -243755, -175132, -39826, -116290, -577381, -1201726, -1535420, -1424941, -1153597, -990923, -878029, -661027, -379420, -165286, -29854, 99066, 217165, 215816, -12004, -425322, -760984, -716780, -314457, 58124, 120208, 53511, 184239, 489645, 695654, 716324, 680084, 625033, 485579, 295477, 106738, -173332, -549115, -714343, -461336, -138899, -214270, -518426, -503188, -175211, -113772, -513420, -898465, -967255, -1056768, -1470846, -1922677, -1995723, -1685827, -1181289, -583522, -145655, -260843, -832680, -1160105, -875345, -511169, -666433, -1102521, -1242589, -1125039, -1177778, -1359160, -1247257, -823996, -506463, -474244, -544968]
39611e44968r4163j65222m2219L36446N10675K22814q4505j7041R4992j55732
39601F1077m77271l94748p1682N2694L6239J68205L05472J76296J5919J68118
39591D0319L43170N6205m17936l72620J51365L75161M544l82163l21739p6442
39581f00136L489N1388K63838M43500L39455N6450j80473l32314l77053j95088
39571e26944J21760K02354p4688l08009j40858J94152K49559L6821p5118J6013
39561c04958M3529j27563k68226j44082J51040L46101L21911J72812K8587p6445
39551A42706j75601k82948l58107l36141j74276J07209L85873M63111K32989j43041
39541a38226l44358k46534n6824n037m3793j1981N1137M133o6353P8860L98311
$$ y = [-544968, -639131, -804353, -846572, -510126, 549, 223363, 138858, 121817, 216809, 61077, -416194, -810942, -882624, -829930, -793691, -625486, -320014, -143718, -127799, 40319, 383489, 439694, 21758, -350862, -199497, 175664, 180208, -201955, -523694, -600136, -596647, -545259, -281421, 162079, 501534, 557984, 377511, 45197, -331856, -526944, -405184, -202830, -277518, -585527, -726385, -532233, -282674, -245853, -320971, -304958, -261429, -388992, -657218, -801300, -650260, -304159, 17752, 190564, 219151, 142706, -32895, -315843, -673950, -1010091, -1184367, -1077158, -691285, -228174, 4815, -138226, -482584, -729118, -785942, -790979, -834772, -846753, -795616, -791483, -857836, -778976, -380665]
39530c80665N10582J98876k51156l95693j67459J19122K08698J51685J09426Q4439
39520A87855n1141l14200n14650m53371j61555J36658K71889K39080Q9154j19144
39510f89425k33724q9037K19981L49807J57737o0868l656J66637Q4053k32522
39500c31017m24632l65373k80585k72271j41583J72700L65451K18495j7052J1205
39490a064662K16667K27191l3680k46803j75539L5701J21008M7805j9713J250
39480h90775K4056l0669j05809j28089j63805l04251m22774k63906J42747L94170
39470a749105K39901j1707P9359L99921M39083R8742j26958Q2634L82011L17730
39460A51611K0683m5591J93664L67905K38740l6810k18642k55515k12102j68864
$$ y = [-380665, 129917, 328793, 77637, -318056, -485515, -366393, -157695, -6010, 103416, 187855, 136714, -177486, -692136, -1145507, -1307062, -1170404, -898515, -659435, -570281, -689425, -923149, -1012186, -792205, -442398, -284661, -345529, -349185, -182548, -98495, -331017, -755649, -1121022, -1401607, -1673878, -1815461, -1642761, -1277310, -1058815, -1075867, -1064662, -847995, -620804, -654484, -901287, -1076826, -1041125, -920117, -872312, -892025, -890775, -866719, -897388, -1003197, -1131286, -1295091, -1599342, -2022116, -2286022, -2143275, -1749105, -1509204, -1520911, -1441552, -1041631, -602548, -503806, -630764, -548130, -166119, 151611, 172294, 126703, 320367, 688272, 927012, 890202, 671560, 416045, 203943, 35079]
39450C5079k24191l79502m10354r2452M00821N79573K28881k82821m28725j13182
39440f86873K96891M12064J53517k66517n50715n33886l04590j07997p9721j19186
39430a787013p4594K6476L4023p8847j45461M80L28100O25506O82116M68211J68701
39419B47698J3374L6555N1454q5344k66800l11383k71202l53158n19424m27661
39409a885891P1968N87400N98645J34408k49660j73078J68807L82085L72704K90308
39399B97696J98066N6470q2909j29112j46529k50825l29224j35746K76400M78646
39389B32933J76356l81687o79861n19539j63463M0152J4511o1701l523J84163
39379a161659L16012K34644K4196m9648J36194L84126M20326K40310O7138J4752
$$ y = [35079, -189112, -568614, -978968, -1071420, -670599, -91026, 137855, -144966, -573691, -686873, -389982, 22082, 175599, -90918, -641633, -1175519, -1480109, -1588106, -1667827, -1787013, -1861607, -1835131, -1801108, -1879955, -2025416, -2024936, -1696836, -1071330, -389214, 78997, 247698, 261072, 297627, 349081, 263737, -3063, -314446, -585648, -938806, -1458230, -1885891, -1813923, -1226523, -627878, -493470, -743130, -916208, -747401, -365316, 7388, 297696, 495762, 552232, 469323, 340211, 193682, -57143, -386367, -522113, -245713, 232933, 409289, 27602, -652259, -1171798, -1335261, -1295109, -1280598, -1342299, -1345822, -1161659, -845647, -611003, -586807, -636455, -500261, -116135, 304191, 544501, 611639, 626391]
39369F26391j3696p6270o2183P4435J43542j3812k10068j31135J54238K10532
39359G01974j36170m68356l03104K47897O39481O06740L76755J81214n5267l97700
39349A393464o09209m48816o3238J89388J83197N1010j05874k51334k50660p653
39339H0275K48170J61005j96646l15679M0619M30567L00480k58173o33640m77015
39329f20037m7937K23028K29547J43865R2644O1814L3563L5514M2819k9585j65881
39318f46j78587P0822M11300M89136K12420r4009j14432J5944p8109m20064n90373
39307b76598l02366J84100L98493K40113J1680l6928K8869K6084p8984j81614
39297A2849k00865j30587K1785K43402M41258M36741J30034l17702n57355l89545
$$ y = [626391, 612695, 536425, 474242, 548677, 692219, 678407, 468339, 337204, 491442, 701974, 565804, 97448, -205656, 42241, 681722, 1288462, 1665217, 1846431, 1791164, 1393464, 784255, 335439, 272201, 461589, 644786, 695796, 589922, 338588, 87928, 80275, 328445, 489450, 292804, -22875, 17744, 448311, 748791, 490618, -143022, -620037, -667974, -444946, -215399, -71534, 21110, 82924, 116487, 152001, 194820, 165235, -646, -179233, -108411, 302889, 792025, 1004445, 910436, 796004, 811948, 733839, 313775, -276598, -578964, -394864, 3629, 243742, 255422, 218494, 247363, 273447, 194463, 12849, -188016, -318603, -296818, -53416, 387842, 824583, 954617, 636915, 79560, -309985]
39287c09985N389K54372J87222l5836j67593j31885k2844N0001O6121R1236J81011
39276A67209K53936J17904k76722o70214p39349m89367k20132j02456r796J75197
39266a793790L30772L11734J98782J55994J76062J32196k5225k57832m92309n52548
39256a816164k29651L65972P05948M07657k03139m32640r1870L28352L91570K30439
39246c43526J57790J24185j12076m76478o04271l41631O3682L04277L27701K59827
39236f40520K06075K13950K84417L20947J79286j36388m23412n15353m56975l38518
39226a306491j02274K84245N70946M37060k6451l40687k42114J1526Q6306L4581
39216e93353O2795R6094n8842k71147k27190K9406J29313o564k0922K63048M99803
$$ y = [-309985, -304596, -50224, 136998, 101162, -66431, -198316, -221160, -171159, -105038, -13802, 167209, 421145, 539049, 262327, -407887, -1147236, -1636603, -1856735, -1959191, -1968987, -1793790, -1463018, -1151284, -952502, -796508, -620446, -488250, -513475, -771307, -1263616, -1816164, -2045815, -1679843, -973895, -566238, -769377, -1202017, -1293887, -965535, -573965, -343526, -185736, -61551, -173627, -650105, -1254376, -1596007, -1532325, -1228048, -900347, -640520, -434445, -220495, 63922, 384869, 564155, 427767, 4355, -510998, -967973, -1306491, -1408765, -1124520, -553574, -116514, -142965, -483652, -725766, -714240, -627934, -593353, -530558, -434464, -493306, -764453, -991643, -962237, -832924, -839488, -860410, -597362, -97559]
39205i7559L58888N3689j2784J24066J10010j28039l06146k66495j59479j03084
39195d26933m920J53805J49500j58270n16391n39099k15664P0393N6924p0861
39185a501516l774K02592K24617K6911j7581K80265N36807L27982j21669k31758
39175b77124O4869K68606J39502N343R4471J47862o253n2082K03453L18656j22025
39164G85278p24232p98174l77507m8768L6309K33056N62909N84031J98120j37465
39154C13557j90777k67737m88213m28627J14513N93822M50379n5767k73808q5973
39144c18631J14510J19094N6321r479j53762l15683l30720k13384j08611k3721
39134a184066J12652K11273J35308j5001j1818J54615K85591K68110J36637o4342
$$ y = [-97559, 261329, 315018, 302234, 426300, 536310, 408271, 102125, -164370, -323849, -426933, -431853, -278048, -128548, -286818, -803209, -1342308, -1557972, -1487579, -1430655, -1501516, -1505290, -1302698, -1078081, -1051170, -1068751, -788486, -251679, 76303, -45366, -277124, -212255, 56351, 195853, 201196, 295667, 443529, 437276, 385194, 588647, 907303, 785278, 61046, -737128, -1114635, -1163403, -1127094, -894038, -331129, 252902, 451022, 313557, 122780, -144957, -633170, -1061797, -947284, -353462, 96917, 41150, -232658, -318631, -204121, -85027, -28706, -38185, -191947, -507630, -838350, -1051734, -1160345, -1184066, -1071414, -860141, -724833, -739834, -751652, -597037, -311446, -43336, 93301, 28959]
39124B8959k48236k37897j0261J39239k7914k78927k10445J33508L22103J71111
39114b18760p3580j90115k26978k34849j26641P4844J67963Q9328L5996J48577
39104e54215L11120L71978L31400K11689k5531l25261n12035n06043l78415j64837
39094a240150J33563L54369K93958O4505k6417j3198k48268o99825p87883k28599
39084b397945M32948N63126L11725K31404L62204L19598R3120O6904K67819K57928
39074E08831j06331m04672l47921k05292k55019k88024l2732L04936L52792J60854
39064c12578N5725R0449O0385m6692l9327P3259O4853r0253j54385n9508m6199
39053d04271k25339l32101j44203J20598J12624j22737k37103r6768J10393K42930
$$ y = [28959, -219277, -457174, -467435, -328196, -356110, -635037, -845482, -711974, -389871, -218760, -292340, -482455, -709433, -944282, -1070923, -996079, -828116, -738788, -702792, -554215, -243095, 128883, 460283, 671972, 646441, 321180, -190855, -696898, -1075313, -1240150, -1106587, -752218, -458260, -393755, -420172, -433370, -681638, -1381463, -2169346, -2397945, -1964997, -1401871, -1090146, -858742, -496538, -176940, -83820, -16916, 250903, 508831, 402500, -2172, -350093, -555385, -810404, -1098428, -1131160, -826224, -473432, -312578, -256853, -166404, -106019, -152711, -192038, -118779, -53926, -144179, -298564, -358072, -404271, -629610, -961711, -1105914, -985316, -872692, -995429, -1232532, -1329300, -1218907, -975977]
39043i75977L36527L30913M1239m29929n96508k01984L25850M06654J15495k213
39033f49933J57066J08363l22296n50708q1967O45528Q04963L06363j98534k99216
39023h0371k03451j36161M884K21169K02444j63462n04609m90453k65587o9509
39013a485106J70403N01533N98305K28326k32855k66694K7815J58531M2816J9410
39003b37516J68953K22669J33424J45440K38281Q5004l07538m79284k33344M5895
38993b18016K2521j31055j63717j57137j96493q1974K59589M66384K46251j29192
38983h2839k19003k0166J73501K33774J70448n6684l31529l02288R4214L55101
38973A4529J00606k92617k54286J07697K85442K30534K53018K71458o6989n79107
$$ y = [-975977, -639450, -308537, -267298, -697227, -1293735, -1495719, -1169869, -763215, -647720, -649933, -492867, -384504, -706800, -1257508, -1339475, -693947, 111016, 417379, 218845, -80371, -283822, -419983, -415099, -193930, 8514, -154948, -659557, -1150010, -1415597, -1485106, -1314703, -813170, -214865, 13461, -219394, -486088, -458273, -299742, -256926, -237516, -68563, 154106, 287530, 432970, 671251, 756255, 448717, -30567, -263911, -218016, -195495, -326550, -490267, -647404, -843897, -925871, -666282, -199898, 46353, -82839, -301842, -322008, -148507, 85267, 255715, 199031, -132498, -434786, -340572, 14529, 115135, -177482, -431768, -324071, -38629, 191905, 444923, 716381, 649392, 70285]
38963G0285o31554j16660L49781L41924R8926o5147j92037l04697k01679R6588
38953e54270K16680K0498j52418p4983L0266K813O9177L30600M34273J55685j39851
38942C38470o1959J53390K4752m20197p11246n71268j41384K59231L48100O7251
38932g14860k51394j84857J71270K82589K0737j08769J42445K73063j10045n47668
38922a027489m60489r8571k4650q3747K56432Q10454Q38687K44000k50297k03018
38912A312J8078j4791j64240j04797J56955L74312L53655N5721l27603m38734
38902i0132j93401L728j46131k92591k0929L17876J08194l91098l09876M28292
38892e86068R01658N74294p833k08033j45891j50050j36527j8327o1713l31760
$$ y = [70285, -561269, -677929, -328148, 13776, 112702, 47555, -144482, -449179, -650858, -554270, -337590, -317092, -469510, -544493, -514227, -511414, -442237, -111637, 322636, 478321, 338470, 276511, 429901, 454653, 34456, -676790, -1248058, -1389442, -1130211, -782111, -714860, -966254, -1151111, -979841, -697252, -676515, -785284, -642839, -369776, -479821, -1027489, -1487978, -1586549, -1611199, -1694946, -1438514, -628060, 210627, 454627, 204330, 1312, 19390, 4599, -159641, -264438, -107483, 266829, 620484, 676205, 348602, -90132, -283533, -279805, -425936, -718527, -739456, -421580, -313386, -704484, -1014360, -586068, 315590, 889884, 882051, 674018, 528127, 378077, 241550, 223223, 161510, -170250]
38882a70250l93726n7789J91129K4178j10263J94368M88984K16110k62799k33363
38872a13421J69023K19788j59967l26601j8635K79813J62071j89367m34683m70123
38862h82102k90891O4014L57858L54994J82699J20367J26248K0212j2775L17363
38852C57987P28418O10905j6545m52388l22009o259R3093O6148M2001j27330l95924
38841E78097l41835J21479L89931J8821n34274n72599j87689J312j20950p6814
38831g24521L28067O75322N86449K04775j48329m05651o18440o73666m20881K8478
38821a168397L36294K79749k2357k41617j87539j029M9750o1869j00330N2870
38811a064475J99739J34365l8329r5910o1905j19185k46604k26087o465J96605
$$ y = [-170250, -563976, -621765, -430636, -406458, -516721, -322353, 166631, 382741, 119942, -113421, 55602, 275390, 115423, -211178, -229813, 50000, 212071, 22704, -411979, -882102, -1172993, -1108979, -751121, -396127, -213428, -93061, 33187, 53399, 40624, 357987, 1086405, 1697310, 1680765, 1228377, 906368, 900109, 993202, 1059350, 1101351, 974021, 578097, 236262, 357741, 747672, 766493, 232219, -340380, -528069, -526757, -647707, -724521, -396454, 278868, 865317, 1070092, 921763, 516112, -102328, -775994, -1196875, -1168397, -832103, -552354, -574711, -816328, -1003867, -1004896, -955146, -1017015, -1117345, -1064475, -864736, -730371, -768700, -864610, -926515, -1045700, -1292304, -1518391, -1524856, -1328251]
38801a328251K03224O0086j02544j94643j19205J57652M24681L72528M0787j40363
38791f26048P2146L69339L44168P4721p3578m3215o3601j27833J2206K77853K21278
38780D37436k24944m49533o290O30555O67928J06021l28614k57042l7234k6239
38770E12044o8414N0441J65833R3964J1986Q7689O8972l07992p46422p17271k38462
38759a087632J48283J46777J940j9343j2832j41840k87305k18627O3703L32490
38749a074386L87070K06690o8308k52074k66698j83225p1084J00064L08779L78811
38739e34361K23571O3667J39024L02891K20090q1369k23002o8755P1381n1649
38729F1488k54619k40201j6342J98854K75317J87688p4242m16866o08967n11005
$$ y = [-1328251, -1125027, -1064941, -1167485, -1362128, -1481333, -1323681, -899000, -526472, -485685, -626048, -553902, -184563, 159605, 234326, 160748, 117533, 53932, -73901, -61695, 216158, 437436, 212492, -237041, -243331, 387224, 1055152, 1161173, 832559, 575517, 538283, 512044, 443630, 494071, 659904, 753868, 765854, 853543, 922515, 614523, -131899, -849170, -1087632, -939349, -792572, -790632, -809975, -822807, -964647, -1251952, -1470579, -1406876, -1074386, -687316, -480626, -548934, -801008, -1067706, -1250931, -1322015, -1221951, -913172, -534361, -310790, -247123, -108099, 194792, 414882, 333513, 110511, 41756, 113137, 61488, -193131, -433332, -449674, -250820, 24497, 212185, 137943, -278923, -887890, -1398895]
38719a398895k38332Q933J45973J53953J8840j59590j80315m209J55960J35417
38709a362265L4645O527J5477l3908j06036j36585j54322j43464K1181L19427
38699a539323M71784L02770L1439l7243P6289J83322K89294M59152M79957O8596
38689G86037o24461j093711j075013p43286l25483J15294M62194N05374K80853
38680a712202J31977K40425L59550K21938k9128p6768P5551J44474K4733q5477
38670g04927m1640J2923j09960l19967l42178j06418J20513P8555j12184r6005
38660a621288J98723L99037J84610k22840l08369N8200M56307M64880J42024j52059
38650d00775k19650j51272j00271j00604q2409L2934K33537L62961K36785j09482
$$ y = [-1398895, -1637227, -1628294, -1482321, -1328368, -1309528, -1469118, -1649433, -1653642, -1497682, -1362265, -1327620, -1321093, -1305616, -1339524, -1445560, -1582145, -1736467, -1879931, -1858750, -1539323, -1067539, -764769, -733330, -770573, -694284, -510962, -221668, 237484, 717441, 786037, 161576, -932135, -2007148, -2750434, -3075917, -2960623, -2498429, -1993055, -1712202, -1580225, -1339800, -980250, -758312, -787440, -864208, -788657, -644183, -619450, -704927, -746567, -733644, -843604, -1163571, -1505749, -1612167, -1491654, -1413099, -1525283, -1621288, -1422565, -1023528, -838918, -1061758, -1370127, -1311927, -855620, -390740, -248716, -400775, -620425, -771697, -871968, -972572, -1054981, -1022047, -788510, -425549, -188764, -298246]
38640b98246l71913l01416k5132J04412k7775j59809l7961K27675L45664K69777
38630b74724K14737K56096J80109j42616m63498m70477k47665j26035j50194n2539
38620a276806K07680K77973k2762l15163j52251L16330N31435K79233q0767j39444
38610c74542R0825K81655J77008j63300m04452k74617M2282K7019m64305q46658
38600a909085n28471J96379M88884J44836j60616O8281M54755M37639J27916R5
38590f79387R8519R9616m5749q4008Q617j4579j61247j26680J69917L94786L02140
38579c8055O9013n7326j20127k29412k66475j10213N0599l0729k09812j06626
38569a049163K99379N60823L44212j42604m60774m78882l89429l08165j29959
$$ y = [-298246, -670159, -971575, -996707, -892295, -920070, -1079879, -1117840, -890165, -544501, -274724, -59987, 196109, 376218, 233602, -229896, -700373, -948038, -1074073, -1224267, -1276806, -1069126, -791153, -813915, -1129078, -1281329, -964999, -433564, -154331, -235098, -374542, -283717, -2062, 174946, 11646, -392806, -667423, -625141, -598122, -1062427, -1909085, -2437556, -2241177, -1752293, -1607457, -1768073, -1699792, -1245037, -807398, -679482, -679387, -580868, -481252, -527001, -611009, -602392, -616971, -778218, -904898, -734981, -340195, -38055, 30958, -26368, -146495, -375907, -642382, -752595, -701996, -732725, -942537, -1049163, -749784, -188961, 155251, 12647, -448127, -927009, -1316438, -1624603, -1754562]
38560a754562J84043M11014L25118N0229m0508K00330M73911L95393m429k87932
38550d7393j44021K21304L45615R8054j75911j54982k775j23825n38114p85338
38540a307386n36492m4777K11689J50163P3275J40305J73979K2550j76776k14587
38530a508057r1402L0969K2099j28820k67346j15193M08616Q94141P97351J87347
38520B29705k41759r4590K09567J58182o0329Q361K13837N0679l90483m83535
38510d00365j13570R3560j97476m77768k46837J91305K84116J03973R5933K89732
38500c77397L48384J92845L3429p7006k17952k66654j01472j1288l33127p57546
38490a567784o28196L6548M76610K92385k4135P7649M33354N90728N05193L70240
$$ y = [-1754562, -1570519, -1159505, -834387, -784158, -824666, -624336, -150425, 244968, 240539, -47393, -191414, 29890, 375505, 473559, 297648, 142666, 139891, 16066, -522048, -1307386, -1843878, -1888655, -1676966, -1526803, -1453528, -1313223, -1139244, -1116694, -1293470, -1508057, -1599459, -1568490, -1546391, -1675211, -1942557, -2057750, -1649134, -754993, 42358, 229705, -12054, -106644, 102923, 261105, 200776, 209137, 422974, 473653, 83170, -400365, -513935, -420375, -617851, -1095619, -1342456, -1151151, -867035, -763062, -667129, -377397, -29013, 163832, 197261, 120255, -97697, -364351, -465823, -477111, -810238, -1567784, -2195980, -2159432, -1682822, -1390437, -1414572, -1336923, -903569, -312841, 192352, 562592]
38480E62592J56726k08089n01864m97430l52141k98371j97271J55914N18831N01501
38470a59602K16855J06606K10586J46536j92571m38608l11872N8454M35054O67002
38460G38440N48532k5256o52194o74692l9395N41122N09835J11612j42433k00427
38450G15144k80252l34328j72795J01019K08826J23437L5108K0580M2312J16164
38440E75215J82238J0413m15386o34793k74905K87539L45505j26285m37447k05058
38430f92964J58696J67352m8810q8100Q0900J96793J63744P2958n7665k29727
38420b76823k74084m5253K54580K61506l4529k41312r2508K12072L01523R2647
38410A57819j78732k72125j52304N6994K02653J93808O3472m2323p499J04135
$$ y = [562592, 719318, 511229, 9365, -488065, -840206, -1138577, -1335848, -1179934, -661103, -159602, 57253, 163859, 374445, 520981, 328410, -110198, -422070, -363616, 71438, 738440, 1286972, 1261716, 609522, -65170, -104565, 436557, 946392, 1058004, 915571, 715144, 434892, 100564, -72231, 28788, 237614, 361051, 396159, 416739, 459051, 575215, 757453, 767866, 352480, -282313, -557218, -269679, 75826, -50459, -487906, -692964, -534268, -366916, -415726, -503826, -422926, -226133, -62389, 10569, -47096, -276823, -550907, -596160, -341580, -80074, -114603, -355915, -448423, -236351, 65172, 157819, -20913, -293038, -445342, -388348, -185695, 8113, 71585, 29262, 21763, 125898]
38400A25898J17805k732p7133L1253J75576J09691j37775k94899k75594l14752
38390e42662n42385o81020m28448K9830K20660L0726j87196j68835m2531L1423
38380b280438J68439M57697O26748L69160j06486k32411J70801O15157N56056
38371C44723N3976l72763m03313j72538O6078K46942L83964M03894K72436J30723
38361I54122R6816M4026j82828m19092l58897o7606M1130j77511l75688k82699
38351g28227j27349k00017l23146j63099J61542K47787O0568n5592L1333J21432
38341i74768J77456M26717Q26469R11147M40618j73670l97687k48693j34024k40050
38331F13515m03457m51744l75161k25096o7936N669j4709j2213Q2904J81101K01096
$$ y = [125898, 243703, 240971, 163838, 195091, 370667, 480358, 342583, 47684, -227910, -542662, -1085047, -1766067, -2194515, -2164685, -1944025, -1913299, -2100495, -2269330, -2311861, -2280438, -2111999, -1654302, -1027554, -658394, -764880, -997291, -826490, -211333, 344723, 398699, 25936, -377377, -549915, -483837, -236895, 147069, 550963, 823399, 954122, 1050938, 1094964, 912136, 493044, 134147, 66541, 107671, -69840, -445528, -728227, -855576, -1055593, -1378739, -1541838, -1380296, -1132509, -1071941, -1127533, -1096200, -974768, -797312, -370595, 455874, 1367021, 1807639, 1633969, 1236282, 987589, 853565, 613515, 210058, -241686, -616847, -841943, -909879, -904210, -918919, -931132, -848228, -667127, -466031]
38320d66031J93997J80660O6335j15770j02141K18772N21505M30952L7528k81175
38310F84632m03590m67826m52359j99736J51029K27313K5945L175L54540O30746
38300E53869M04719l2033r6632J81237K24055j65200n02927m07702j65996j79817
38290a86427k67904k2639L82271L55842j56004m90994k22562K48554L58710J59625
38280A58472J4291p1551k64948l49663p223M73752M47344j00663m60252k37109
38270c97550J24394J07942j34548j58333R4005L61815M84227M13179J00938l18795
38260F77274n10028l66140j81454j62299j23793O2213J38143o5009k41415j15862
38250h88370P4727P0924J23788M63525O61845K46749l69015l88382J33800M06960
$$ y = [-466031, -272034, -91374, -25039, -140809, -242950, -24178, 497327, 928279, 965807, 684632, 281042, -186784, -639143, -838879, -687850, -460537, -434592, -431417, -76877, 553869, 958588, 926555, 829923, 1011160, 1235215, 1070015, 567088, 159386, -6610, -186427, -454331, -476970, -94699, 261143, 105139, -385855, -608417, -359863, -1153, 158472, 172763, 101212, -163736, -513399, -520622, -46870, 400474, 299811, -160441, -397550, -273156, -165214, -299762, -458095, -364090, -2275, 481952, 895131, 996069, 677274, 167246, -198894, -380348, -542647, -666440, -604227, -466084, -531093, -772508, -888370, -813643, -742719, -618931, -155406, 506439, 753188, 384173, -4209, 129591, 536551]
38240E36551J79387J1309K07273L47412J05076k39687l88792m45558m60180k19140
38230c66349J96594K96897j5443j75626R7344K46252j98756p43139o32006K9725
38220a264507N39047O17171M86880K22108k40680n94516l99563J63884M08745
38211f1431Q5205l23193l50659j15848J4421o9967k34897l29584k52795o769K25506
38200a420011K45012J19919J12524K96605M34954K72667j85045o76774q52439
38191a652588n18567J30620O15606O53536M22113K16818O6567r6891j53321j2442
38181c28549J04480k850q7266J83508N79054N45723N0006l51824l24865j18990
38171B48427l2482k7980m0888j77239l79017l34612J4465K66892J32198j49215
$$ y = [536551, 715938, 727247, 934520, 1281932, 1387008, 1147321, 758529, 312971, -147209, -366349, -169755, 127142, 111699, -63927, 33417, 279669, 80913, -662226, -1294232, -1264507, -725460, -108289, 378591, 600699, 360019, -234497, -634060, -470176, -61431, 23774, -299419, -650078, -765926, -751505, -821472, -1056369, -1385953, -1638748, -1645517, -1420011, -1174999, -1055080, -942556, -645951, -210997, 61670, -123375, -800149, -1652588, -2171155, -2040535, -1424929, -771393, -349280, -132462, -65895, -162786, -316107, -328549, -224069, -226919, -314185, -130677, 448377, 994100, 1044106, 692282, 367417, 248427, 215945, 187965, 147077, -30162, -409179, -743791, -729326, -462434, -330236, -479451]
38161d79451k27261j26007n756J98833N25993O72733L66848j36490l37180j51072
38151C01190O1659K4123k21812n05382o45840m82206q0894J93917J10424o7284
38141a312105K4294K46697J78400j65327l24738j19950J10279J05296N9423K08545
38131i89186M32270N07567M40868L10803O8685k55693m13315k70911o3433m8909
38121b81254j28995r3439k1544r9982k15126j08941J60881K98748K55825K52914
38111A9087L24854K35149q3634l59128l65618j83387L4116K52361L89950K69637
38101E33387q1567l45709l21388j85064j59162j64299k7389J85255K93478K79323
38091F865K00822J6935k49967l66513j87488O3105R9634n983k3811K707r4938
$$ y = [-479451, -706712, -832719, -838475, -639642, -113649, 559084, 925932, 789442, 452262, 301190, 362849, 386972, 165160, -340222, -986062, -1468268, -1549162, -1355245, -1244821, -1312105, -1287811, -1041114, -862714, -1028041, -1352779, -1472729, -1362450, -1257154, -1197731, -989186, -556916, -49349, 391519, 702322, 771007, 515314, 101999, -168912, -232345, -281254, -410249, -503688, -525232, -625214, -840340, -949281, -788400, -489652, -233827, 19087, 343941, 579090, 495456, 136328, -229290, -412677, -378561, -126200, 263750, 533387, 451820, 106111, -215277, -400341, -559503, -723802, -751191, -565936, -272458, 6865, 207687, 224622, -25345, -391858, -579346, -516241, -416607, -422590, -446401, -443694, -538632]
38080e38632j90510l8121K26751K39408K8938p221K16312L30879J62958J9337
38070D50099J28467K60525J62107l1521j00294j05482j65121j75273l8205J15744
38060E01046J93011L21055N03495M31398l1457n00128n87944m80345n62733p32694
38050i45296n71377m1342M59769O50786N56428K48699j77640m55211l92763k08451
38040h76398k10915k51844K9278M92480N92184K27895o1571Q5227L40174K28080
38030E94590k21132o21155p14230m73634K193M65600O06182L64109M726k20712
38020b13463k92897k47505o0449J77765K53763J45999R6765K28001L39138K42883
38010F70000N2419m2479o1562j16015j95025k29604k03422r2109J19459K88130
$$ y = [-538632, -729142, -767263, -540512, -301104, -272166, -279387, -63075, 267804, 430762, 450099, 578566, 839091, 1001198, 969677, 869383, 763901, 598780, 423507, 385302, 501046, 694057, 1015112, 1518607, 1950005, 1918548, 1418420, 830476, 350131, -212602, -945296, -1516673, -1558015, -1098246, -447460, 108968, 357667, 180027, -275184, -667947, -876398, -1087313, -1339157, -1309879, -817399, -225215, 2680, -58891, 26336, 366510, 594590, 373458, -247697, -961927, -1435561, -1433368, -967768, -361586, 2523, 7249, -213463, -506360, -753865, -814314, -636549, -382786, -236787, -140022, 87979, 427117, 670000, 722419, 679940, 618378, 502363, 307338, 77734, -125688, -217797, -98338, 189792]
38000A89792K23489K0811r216J65888K23927L9748q8152J4199M3247k41722m96733
37989H5278k62274K96157N88316L97343M1711j66915k00428q3502J99394N11295
37979A406375O06049M44646K30550R6556j9079j67626k88088l46843l91272m39860
37969A131408m71087m99618n02742l33530P6417M71206M82115J00797k89019l83954
37959b18007k43482o0386J04579K48971L01004K32977J68979K09032K31111N8180
37949A032958j96671j68020K69033P07368O37197J20957k51073j61936N483k07067
37939A788229n90351n85536j61526J73842K03750K33619L77775K65259k28557
37930A476504n54382k80514J52214M4207n15843q19805n53957n7167L11882M92290
$$ y = [189792, 413281, 434092, 424876, 590764, 814691, 854439, 766287, 780486, 823733, 582011, 85278, -176996, 119161, 707477, 1104820, 1146531, 979616, 779188, 695686, 895080, 1406375, 2012424, 2457070, 2687620, 2784176, 2765097, 2597471, 2309383, 1962540, 1571268, 1131408, 660321, 160703, -342039, -675569, -599152, -127946, 354169, 454966, 165947, -218007, -461489, -521875, -417296, -168325, 132679, 365656, 534635, 743667, 974778, 1032958, 836287, 668267, 937300, 1644668, 2281865, 2402822, 2151749, 1989813, 1995296, 1788229, 1197878, 612342, 450816, 624658, 828408, 1062027, 1439802, 1705061, 1476504, 922122, 641608, 793822, 838029, 322186, -497619, -1051576, -1108743, -796861, -304571]
37920c04571M59574K02657k0864Q8480L51329K92904j15626l99615l38019k43292
37910b7043l23609l03668K3655L22567J90969j82909k51306J38540N57589N41992
37900F86777J09174l00548l07750O834K24355J37639J8625J67146L94291L00049
37890A436592n9966k38972j21688q5493l22864m91962k82605Q4688K29466J51231
37880B98427P8918M5684n9550k07496k83075k70454j64055J01473M07673M01450
37870C48995K918k80705L7566O57319P99796K58681l24507l42198L8886K53697
37860A450448J40500K0695J14903K54249K35036J56307J91890K11650n5260n05608
37850B214810o52656k63642K82439M94288L85055L09129L87117M43532L83365
$$ y = [-304571, 155003, 357660, 336796, 425276, 776605, 1069509, 953883, 554268, 216249, -27043, -350652, -654320, -630665, -308098, -117129, -300038, -551344, -412804, 144785, 686777, 795951, 495403, 187653, 194487, 418842, 556481, 575106, 742252, 1136543, 1436592, 1376626, 1137654, 1015966, 930473, 607609, 115647, -166958, -82270, 147196, 298427, 377345, 423029, 363479, 155983, -127092, -397546, -561601, -460128, -52455, 348995, 351913, 71208, 108774, 766093, 1565889, 1824570, 1500063, 1157865, 1196751, 1450448, 1590948, 1611643, 1726546, 1980795, 2215831, 2372138, 2564028, 2775678, 2720418, 2214810, 1562154, 1298512, 1580951, 2075239, 2460294, 2769423, 3156540, 3600072, 3983437]
37841C983437K60816O3745k00504l05784j12366L9185k41412o44836m96984J08217
37831B453514K70728l58527r39143o41612J58697N21882K86909M7590R7546J61193
37821B058777O9965J1965O3192L2327j27425j97130q2612L2555j193j32502k80448
37810A447471l94963l60023j22048J13873R9361r7049k27056k53333k61786j18496
37800a74049L26024P50717O17321j3340m30179k19489J81511J30916l72591p73006
37790B3835o41743m3903N87021P61276L13290l65712o50009l59133P2544J90668
37780a11866K0671j62510k57556k84993j64745J38145L93364L44567J00258J507
37770A6842J23839J92871M6767p7349J21453N41459P61687N72845K21630K7316
$$ y = [3983437, 4244253, 4307998, 4107494, 3801710, 3689344, 3728529, 3487117, 2842281, 2345297, 2453514, 2724242, 2365715, 1426572, 784960, 943657, 1465539, 1752448, 1800038, 1897584, 2058777, 2128742, 2140707, 2203899, 2236226, 2108801, 1911671, 1829059, 1861614, 1860421, 1727919, 1447471, 1052508, 692485, 570437, 684310, 783671, 686622, 459566, 206233, -55553, -174049, 151975, 902692, 1520013, 1506673, 1076494, 857005, 1038516, 1169432, 796841, 23835, -617908, -661811, -74790, 686486, 999776, 634064, -15945, -375078, -302534, -111866, -91195, -253705, -511261, -796254, -960999, -822854, -429490, -84923, 15335, 16842, 140681, 333552, 380319, 302970, 424423, 965882, 1727569, 2300414, 2522044, 2549360]
37760B549360p2278l52020p36537p55607k19600L60829L49837j80168n59214m19218
37750c4616r8982p3092l26009m92218l80999j18030J23290L08200M59214N33347
37740i9895M52250K36205N0560M0231J17560M5427k06216l48170j53846J94570
37730C28676L31157J65090q2105j93528j11483J05299K63237J20756k50670l73426
37720C03003K9137N11026M32206j12139m20237k15672L8711l3606j78928n5101
37710B98400J95545K68468J99004J76915J68334P3653L226N5163L8788k42902
37700A234594o02547o65758l35432J69611N77494O60388K95114l06647o32713
37691C94104m22309j0715J41705N2671L0076Q9221k4383l16364m58911k59576
$$ y = [2549360, 2477082, 2125062, 1388525, 632918, 413318, 774147, 1123984, 943816, 384602, -34616, -133598, -206690, -532699, -1024917, -1405916, -1523946, -1400656, -1092456, -633242, -99895, 352355, 588560, 639120, 679351, 796911, 842338, 636122, 287952, 134106, 328676, 659833, 824923, 742818, 549290, 437807, 543106, 806343, 927099, 676429, 303003, 332140, 843166, 1275372, 1163233, 742996, 527324, 566035, 532429, 353501, 298400, 493945, 762413, 961417, 1138332, 1306666, 1380319, 1383545, 1438708, 1477496, 1234594, 632047, -33711, -369143, -199532, 377962, 1038350, 1333464, 1026817, 394104, -28205, -38920, 102785, 155456, 185532, 274753, 250370, -65994, -524905, -784481]
37681g84481Q7574K71213J71358j10429l44560l08063J0342L55439M67153L30516
37671A46062Q4189j61695k88615j56737J68452L60831K31121R416L679J62548
37661E59251K29522J39641j1533j93058l37611k43717P7169K08711q5074l33144
37651A0157K7720O82969P53435O9207n58931m94543n4505J59517J36017K20656
37641I51699M10410L86085P4169k38333l01578j36050J00314K73941L20849K66236
37631B107742J93772J47593J10596P5587M0238m1858j65034j68896Q3362M65548
37621B848650P41036Q96738J061737J167959J055671Q98928J091244J629572K060173
37612A3451708K188723K375502K860697L225988K891116J826786M27714j007015
$$ y = [-784481, -696907, -425694, -254336, -364765, -709325, -1017388, -1007046, -651607, -184454, 146062, 230251, 68556, -220059, -376796, -208344, 152487, 383608, 393024, 396703, 559251, 788773, 928414, 916881, 723823, 386212, 142495, 219664, 428375, 343301, 10157, 37877, 720846, 1474281, 1543488, 984557, 490014, 435509, 595026, 731043, 951699, 1362109, 1748194, 1822363, 1584030, 1282452, 1146402, 1246716, 1520657, 1841506, 2107742, 2301514, 2449107, 2559703, 2635290, 2675528, 2633670, 2468636, 2299740, 2383102, 2848650, 3589686, 4486424, 5548161, 6716120, 7771791, 8670719, 9761963, 11391535, 13451708, 15640431, 18015933, 20876630, 24102618, 26993734, 28820520, 29248234, 28241219]
37604B8241219k265992k990090k959005k499899k168733k079159j921407j565712
37596I791222j228254j051741r31526q12509p94284q52661p77845n00361k11554
37587B630487o8448k9855n3755j73662k83350j54032J72158K95600r761m17860
37577A907522m65835j64605R4319J15260O3396R2508J18263K3882j42090k65750
37567A376870l02644k42917q9801O4402R2662L5804Q6625K67944L04003q433m32156
37556A152359n23811j90183K09982L25590J68092m2444j93076l18076m24210l97185
37546b32962r8935M24127Q21505O67629l6412p16160q24568m95071k70990k60610
37536a022447m5180M88690P86654M17406k32976m94379k92011j7091J73162L57812
$$ y = [28241219, 25975227, 22985137, 20026132, 17526233, 15357500, 13278341, 11356934, 9791222, 8562968, 7511227, 6579701, 5767192, 4972908, 4120247, 3342402, 2842041, 2630487, 2562039, 2532184, 2478429, 2304767, 2021417, 1867385, 2039543, 2335143, 2325382, 1907522, 1441687, 1277082, 1371401, 1486661, 1550057, 1642565, 1760828, 1784710, 1642620, 1376870, 1074226, 831309, 741508, 805910, 898572, 934376, 1021001, 1288945, 1592948, 1584515, 1152359, 628548, 438365, 648347, 973937, 1142029, 1099585, 906509, 588433, 164223, -232962, -331897, 92230, 913735, 1581364, 1544952, 828792, 4224, -490847, -761837, -1022447, -1067627, -578937, 207717, 625123, 392147, -102232, -394243, -411334, -238172, 119640]
37526A19640L77700J7688m09188l28817J86439M20750P8535k78741j24874K75394
37516C34526L82606J87631N2936Q3804J10197Q0981P1608L7635j03731k55761
37506I82432k75782k06026j41441k1326K12643M12635M16732K85063J25344j16110
37496A674164m39746n95509m13739j37520q3963j52805n0801J52257J36395p6846
37486A1887j16612J21288K84402J06689k16282l51498k48365p2213O7650J63880
37476b49174K22252K42808K13826J02012o0343j24180r724J17928O5251m8296
37466D72360O9326L92725N20050K04628k91459n20526l63240q0967L2754p4499
37456C61152k31956k50159j24897m8298j74154l97436m57479k58951N093Q4433
$$ y = [119640, 497340, 515028, 105840, -222977, -36538, 384212, 462747, 184006, 59132, 334526, 717132, 904763, 957699, 1041503, 1151700, 1232681, 1304289, 1341924, 1238193, 982432, 706650, 500624, 359183, 337857, 550500, 963135, 1379867, 1664930, 1790274, 1674164, 1234418, 638909, 225170, 87650, 3687, -149118, -199919, -47662, 88733, 11887, -104725, 16563, 300965, 407654, 191372, -160126, -408491, -480704, -413054, -249174, -26922, 215886, 429712, 531724, 471381, 347201, 337477, 455405, 520656, 472360, 541686, 934411, 1454461, 1659089, 1367630, 847104, 483864, 402897, 435651, 361152, 129196, -120963, -245860, -294158, -468312, -865748, -1323227, -1582178, -1577085, -1492652]
37446a492652k6192o4132J89578N75808O53786K59746j70865j27972K05645J54272
37436A57022m08138p47077k96841M81825P37081L49637j23230l47196m29602l94551
37426a021070j05169K85034L99018K26142J24113J78778J04402j35822j88161
37417a32735M8879J97854M3131j23398n6364M2478k8512j00144l2193k0001j43269
37406c04274o9107L71986P40039N92922J63497p7844j78589m32888o50734l87999
37396b32991K21160N34164L04641p5526k74790l74981m17891j87897L05138O11922
37386D12949M32957O0071q7125o1058j74630m26632n37685m48277l81222l91015
37376a601667k18265K50266O49063N32407jl61496j98638J95145L18910J05428
$$ y = [-1492652, -1518844, -1582976, -1393398, -817590, -163804, 95942, -74923, -202895, 2750, 157022, -251116, -998193, -1295034, -813209, -76128, 273509, 150279, -196917, -626519, -1021070, -1126239, -841205, -442187, -216045, -91932, 86846, 191248, 55426, -132735, -83856, 113998, 157129, 33731, -22633, 19845, -8667, -108811, -141004, -161005, -304274, -373381, -1395, 738644, 1331566, 1495063, 1417219, 1238630, 805742, 155008, -232991, -11831, 522333, 826974, 751448, 476658, 101677, -316214, -504111, -198973, 412949, 845906, 905977, 818852, 757794, 583164, 156532, -381153, -829430, -1210652, -1601667, -1819932, -1569666, -920603, -388196, -388197, -749693, -948331, -753186, -434276, -328848]
37366c28848j11140j29626o3646l926J60301M61643O69059N72455K77145L9948
37356A543365n2354q1914r6769p2554p555O2760R7249M8423p9743j64463j00721
37345A095724l117o9841k46807k92512j92012j67746k23278j00383J62665J17730
37335H0423l54673o65068l05684L65814O41552M52064K68814K46829J09245j88967
37325F50349l14243j34190Q9586J85753K68461L32763J32517l41164o69473n44124
37315c43765j87960Q663L2923J72239N18212P71185N61613q5725o54964o37063
37305A55358j64514R6917j55708m12687j34713L56625L21749k64882o80676n21512
37295a404043j40391P6052K20098M25870N00853L17401J11713O9179P574k16660
$$ y = [-328848, -439988, -569614, -633260, -637186, -476885, -15242, 653817, 1226272, 1503417, 1543365, 1491011, 1409097, 1312328, 1239774, 1232219, 1294979, 1392228, 1440651, 1360908, 1196445, 1095724, 1092607, 1022766, 775959, 483447, 291435, 123689, -99589, -199972, -37307, 80423, -274250, -939318, -1245002, -879188, -237636, 214428, 483242, 730071, 839316, 650349, 336106, 201916, 291502, 477255, 745716, 1078479, 1210996, 869832, 200359, -343765, -531725, -523062, -490139, -317900, 200312, 971497, 1533110, 1447385, 792421, 155358, -9156, 87761, -67947, -480634, -615347, -258722, 63027, -201855, -882531, -1404043, -1544434, -1468382, -1248284, -822414, -321561, -4160, 107553, 176732, 184306, -32354]
37285c2354l61405j89663J16322K55989K37919J99537Q0029j98833m55391m64370
37275h12220k71698m7712J71843L69577L94387J74351j00306k08871j42112O356
37265d66405J50429J34777j22508l42412j74608J50625M9761l79374l22830L79540
37255i43005P14689M3366o72954k32296Q33851R36791j79993j094413q41462q4437
37245a519863K42311K69694M88104O54062K93128k92724l98282J1013L40776L03839
37235C92058J65054J37243J09595m707j04471j38765j78204k25132k14716j78478
37225b40523j64575o8097J89853L95335K64366j12554l68099l81505l65503m11378
37215a262680l25751l9675J82597J65429J49118L86343O28605M14329j88928n43436
$$ y = [-32354, -393759, -583422, -467100, -211111, 26808, 226345, 306374, 107541, -347850, -812220, -1083918, -1131630, -959787, -590210, -195823, -21472, -121778, -330649, -472761, -466405, -315976, -181199, -303707, -646119, -820727, -670102, -620341, -999715, -1322545, -943005, -228316, -184950, -857904, -1090200, -256349, 680442, 500449, -593964, -1435426, -1519863, -1277552, -1007858, -519754, 134308, 427436, 134712, -263570, -252557, 88219, 392058, 557112, 694355, 803950, 799243, 694772, 556007, 377803, 152671, -62045, -240523, -405098, -473195, -283342, 111993, 376359, 263805, -104294, -485799, -851302, -1262680, -1588431, -1628106, -1445509, -1280080, -1130962, -744619, -116014, 298315, 109387, -434049]
37205d34049k61579K61107L66859k5483l99982l67882q8493P4522K7191q2058
37195i29847j68442k75138m00489m34533k73674P8438M93717P53742O82787L35947
37185a37492p008j16969k9996O2700M1533q6372k31031k33158J5380L49405M03943
37174C0935P9140k41226j61043J82406L09103L4510l58748n24755l59287M7605
37164i61360M78050O27347L62719n4688k61697k78003m06257o77667p59191m62436
37154b393183O057L88063O24371O62238L91970l6672j85254J19911M66726L66006
37144D10233j08472m47534l41929L4139K92641K26021j1159n7623K18317M76998
37134F91632L26349p6292k15406j6156M8564k13615l60308j10238Q7042k00643
$$ y = [-434049, -695628, -434521, -67662, -93145, -493127, -861009, -949502, -874980, -847789, -929847, -1098289, -1373427, -1773916, -2208449, -2482123, -2403685, -1909968, -1156226, -473439, -137492, -144500, -261469, -291465, -228765, -187232, -273604, -504635, -737793, -722413, -373008, 30935, 110075, -131151, -292194, -109788, 199315, 233825, -124923, -649678, -1008965, -961360, -483310, 144037, 506756, 452068, 190371, -87632, -493889, -1171556, -1930747, -2393183, -2387126, -1999063, -1374692, -712454, -320484, -357156, -542410, -422499, 44227, 410233, 301761, -145773, -487702, -453563, -160922, 65099, 53940, -3683, 214634, 691632, 1017981, 941689, 726283, 710127, 758691, 545076, 184768, 74530, 161572, -39071]
37124c9071n53414k94115L93715O91105L50394o4688j38289p5144r7672o3754
37114A09067P0612K3473k48995k97200J15767N06608L28532k15696n02387l67387
37104d77606j52238m8232N8254J25734j06322n76852p41408k37091N33891P86288
37094h35582K60850m59555n88651Q881O91039P72717K81054j63936j73031j5248
37084b21462r9858l31384l14452l5541J03578m6117j24567J36602M32311L25483
37074a75407p7153k74745q3275J90341K71604K33339J96656P1278k00246l96259
37064b43867k68982R9855M09038M85853L38921J5125l48410m53511j33488L22440
37054B22974M44409J90474k8395K1066P8478j46054m91641n69100k75400J42834
$$ y = [-39071, -592485, -886600, -492885, 198220, 548614, 483926, 345637, 270493, 172821, 109067, 179679, 203152, -45843, -343043, -227276, 279332, 607864, 392168, -110219, -477606, -629844, -678076, -619822, -494088, -600410, -1177262, -1918670, -2155761, -1621870, -835582, -574732, -1034287, -1622938, -1614057, -923018, -150301, 130753, -33183, -206214, -221462, -321320, -652704, -967156, -1002697, -899119, -945236, -1069803, -933201, -500890, -175407, -252560, -527305, -610580, -420239, -148635, 84704, 281360, 352638, 152392, -243867, -512849, -412994, -3956, 481897, 820818, 835943, 487533, 34022, -99466, 222974, 667383, 857857, 829462, 850528, 929006, 782952, 291311, -277789, -553189, -410355]
37044d10355M16751M50432K86322N6054q9288j16470j09826q3218M7809K29506
37034F77717K33529J0392j55318n3327J20933J04443j992J7608K9596k22187n54293
37023B07101n18244j27286J09897k4021j46158M5094K59055J12649k33040l35606
37013f50559j27601Q7952J52725J87807K74719L28218K84816J69888j0925k33369
37003D63671l43855k15409M469K9191j78328l60598l18465j09986J08266K27592
36993f93452J62477q5658k93956j91278J46538L13298J08673j76661j82193M0888
36983h51324K00586K22451K33812K11004j356l24926m44546k57018l0763J0853
36973a031227n970R9304K08725J11892j00391j48645j725Q2617m7769k50114l24302
$$ y = [-410355, 6396, 456828, 743150, 799204, 709916, 593446, 483620, 400402, 448211, 677717, 911246, 921638, 766320, 712993, 833926, 938369, 936377, 953985, 983581, 761394, 207101, -311143, -438429, -328532, -352553, -498711, -453617, -194562, -81913, -314953, -650559, -778160, -690208, -537483, -349676, -74957, 253261, 538077, 707965, 697040, 463671, 119816, -95593, -91124, -61933, -240261, -600859, -919324, -1029310, -921044, -693452, -530975, -616633, -910589, -1101867, -955329, -642031, -533358, -710019, -892212, -851324, -650738, -428287, -194475, 16529, 15173, -309753, -754299, -1011317, -1042080, -1031227, -1037197, -937893, -729168, -617276, -717667, -866312, -868037, -785420, -833189, -1083303, -1407605]
36962a407605k34849o2536P9661O4723j11286j90130J11340O60951R52363O92726
36952E55358J26242l36758n60593n99901m48594j31671J40495J81544P7704J2632
36942i83542j3695o7736n0967J39540L57748M01015L19039K32804K5333l87619
36932b8080o36719k81872M04424O12883R4363m53608l52997J61864L65324J3845
36922a00573m78108o26761l28703J35051L25692M1837l60496k95489K46583N79762
36912h61205K71565j93113j16503L93057O48461L95020j751k48347l76238l36860
36902d25914j429L48943J93712l55062m90930J30528P61488N81148j32854m68766
36892A40864k00118N5623j08845l72084l34487j07569R874L0117J35364K96849
$$ y = [-1407605, -1642454, -1704990, -1625329, -1560606, -1671892, -1862022, -1750682, -1089731, -137368, 555358, 681600, 344842, -215751, -815652, -1264246, -1395917, -1255422, -1073878, -996174, -983542, -997237, -1064973, -1115940, -976400, -618652, -217637, 101402, 334206, 359539, -28080, -664799, -946671, -542247, 70636, 164999, -288609, -641606, -479742, -114418, -100573, -578681, -1205442, -1534145, -1399094, -1073402, -1031565, -1392061, -1687550, -1440967, -861205, -589640, -782753, -899256, -506199, 142262, 537282, 535531, 287184, -89054, -425914, -427343, -78400, 115312, -239750, -730680, -600152, 161336, 742484, 609630, 140864, -59254, -3631, -112476, -484560, -819047, -926616, -916742, -886625, -751261, -454412]
$$ [...]
##END NTUPLES=NMR SPECTRUM
##END=
