##TITLE=31P_DE-80H_X3
 64 sc D2O
 26.2.2025
##JCAMPDX= 6.0         $$ Bruker NMR JCAMP-DX V2.0
##DATA TYPE= NMR SPECTRUM
##DATA CLASS= XYDATA
##ORIGIN= UXNMR, Bruker Analytische Messtechnik GmbH
##OWNER= root
$$ XWIN-NMR		Version 3.5
$$ Thu Jul 17 14:23:04 2025 Russian Standard Time (UT+4h)  Yarkov@DPX200
##.OBSERVE FREQUENCY= 81.013821
##.OBSERVE NUCLEUS= ^31P
##.ACQUISITION MODE= SIMULTANEOUS
##.ACQUISITION SCHEME= undefined
##.AVERAGES= 64
##.DIGITISER RES= 17
##SPECTROMETER/DATA SYSTEM= spect
##.PULSE SEQUENCE= zgpg30
##.SOLVENT NAME= MeOD
##.SHIFT REFERENCE= (INTERNAL, MeOD, 0, 198.062)
##AUDIT TRAIL= $$ (NUMBER, WHEN, WHO, WHERE, WHAT)
$$ ##TITLE= Audit trail, XWIN-NMR		Version 3.5
$$ ##JCAMPDX= 5.01
$$ ##ORIGIN= Bruker BioSpin GmbH
$$ ##OWNER= Yarkov
$$ C:/Bruker/XWIN-NMR/data/yarkov2/nmr/P31/2/pdata/1/auditp.txt
$$ ##AUDIT TRAIL=  $$ (NUMBER, WHEN, WHO, WHERE, WHAT)
(   1,<2025-07-17 14:22:07.18 +0400>,<Yarkov>,<DPX200>,
      <created by zg, POWCHK disabled, PULCHK disabled
       configuration hash MD5:
       00 E9 B6 7A A2 85 ED C7 34 08 36 98 17 FE 4E 26
       data hash MD5: 32K
       3C F4 09 EE 6F B5 65 1E D8 85 A0 4B C0 FA 5E 39>)
(   2,<2025-07-17 14:22:36.67 +0400>,<Yarkov>,<DPX200>,
      <Start of raw data processing
       efp BC_mod = 2 LB = 1.5 FT_mod = 6 PKNL = 1 PHC0 = 1662.243 PHC1 = 49.15953 SI = 64K 
       data hash MD5: 64K
       54 D4 0B A8 EB D5 BA 3E 29 41 9A 0B 4F 31 68 F2>)
$$ ##END=
$$ 
$$ hash MD5
$$ 02 EA 49 37 E4 51 8B 10 4D BC B1 7B 0F 7A BC 8B
##$RELAX= 
##$RELAX= 
##$RELAX= 
##$RELAX= 
##$RELAX= 
##$RELAX= 
##$RELAX= 
##$RELAX= 
$$ Bruker specific parameters
$$ --------------------------
##$DU= <C:/Bruker/XWIN-NMR>
##$EXPNO= 2
##$NAME= <P31>
##$PROCNO= 1
##$TYPE= <nmr>
##$USER= <yarkov2>
##$AMP= (0..31)
100 100 100 100 100 100 100 100 100 100 100 100 100 100 100 100 100 100 
100 100 100 100 100 100 100 100 100 100 100 100 100 100 
##$AQSEQ= 0
##$AQ_mod= 1
##$AUNM= <au_zg>
##$AUTOPOS= <>
##$BF1= 81.014009
##$BF2= 200.13
##$BF3= 200.13
##$BF4= 200.13
##$BF5= 200.13
##$BF6= 200.13
##$BF7= 200.13
##$BF8= 200.13
##$BYTORDA= 1
##$CFDGTYP= 0
##$CFRGTYP= 5
##$CHEMSTR= <none>
##$CNST= (0..31)
1 1 145 1 1 1 1 1 1 1 1 1 1 1 1 1 1 1 1 1 1 1 1 1 1 1 1 1 1 1 1 1 
##$CPDPRG= <waltz16>
##$CPDPRG1= <>
##$CPDPRG2= <waltz16>
##$CPDPRG3= <>
##$CPDPRG4= <mlev>
##$CPDPRG5= <mlev>
##$CPDPRG6= <mlev>
##$CPDPRG7= <mlev>
##$CPDPRG8= <mlev>
##$CPDPRGB= <>
##$CPDPRGT= <>
##$D= (0..31)
0 1 0 0 0 0 0 0 0 0.06 0 0.03 2e-05 3e-06 0 0 0.0002 0 0 0 0 0 0 0 0 0 
0 0 0 0 0 0 
##$DATE= 1752747726
##$DBL= (0..7)
120 120 120 11 120 120 24 19 
##$DBP= (0..7)
150 150 150 150 150 150 150 150 
##$DBP07= 0
##$DBPNAM0= <>
##$DBPNAM1= <>
##$DBPNAM2= <>
##$DBPNAM3= <>
##$DBPNAM4= <>
##$DBPNAM5= <>
##$DBPNAM6= <>
##$DBPNAM7= <>
##$DBPOAL= (0..7)
0.5 0.5 0.5 0.5 0.5 0.5 0.5 0.5 
##$DBPOFFS= (0..7)
0 0 0 0 0 0 0 0 
##$DE= 6
##$DECBNUC= <off>
##$DECIM= 4
##$DECNUC= <off>
##$DECSTAT= 4
##$DIGMOD= 1
##$DIGTYP= 9
##$DL= (0..7)
0 0 52 120 120 21 21 25 
$$ [...]
##$SPNAM4= <gauss>
##$SPNAM5= <gauss>
##$SPNAM6= <Gaus1.1000>
##$SPNAM7= <Gaus1.1000>
##$SPNAM8= <gauss>
##$SPNAM9= <gauss>
##$SPOAL= (0..31)
0.5 0.5 0.5 0.5 0.5 0.5 0.5 0.5 0.5 0.5 0.5 0.5 0.5 0.5 0.5 0.5 0.5 0.5 
0.5 0.5 0.5 0.5 0.5 0.5 0.5 0.5 0.5 0.5 0.5 0.5 0.5 0.5 
##$SPOFFS= (0..31)
0 0 0 0 0 0 0 0 0 0 0 0 0 0 0 0 0 0 0 0 0 0 0 0 0 0 0 0 0 0 0 0 
##$SUBNAM0= <"">
##$SUBNAM1= <"">
##$SUBNAM2= <"">
##$SUBNAM3= <"">
##$SUBNAM4= <"">
##$SUBNAM5= <"">
##$SUBNAM6= <"">
##$SUBNAM7= <"">
##$SUBNAM8= <"">
##$SUBNAM9= <"">
##$SW= 400.765351723535
##$SWIBOX= (0..15)
0 1 3 0 0 0 0 0 0 0 0 0 0 0 0 0 
##$SW_h= 32467.5324675325
##$TD= 32768
##$TD0= 1
##$TE= 0
##$TE2= 300
##$TE3= 300
##$TEG= 300
##$TL= (0..7)
0 120 53 12 22 120 120 120 
##$TP= (0..7)
150 150 150 150 150 150 150 150 
##$TP07= 0
##$TPNAME0= <>
##$TPNAME1= <>
##$TPNAME2= <>
##$TPNAME3= <>
##$TPNAME4= <>
##$TPNAME5= <>
##$TPNAME6= <>
##$TPNAME7= <>
##$TPOAL= (0..7)
0.5 0.5 0.5 0.5 0.5 0.5 0.5 0.5 
##$TPOFFS= (0..7)
0 0 0 0 0 0 0 0 
##$TUNHIN= 0
##$TUNHOUT= 0
##$TUNXOUT= 0
##$USERA1= <user>
##$USERA2= <user>
##$USERA3= <user>
##$USERA4= <user>
##$USERA5= <user>
##$V9= 5
##$VALIST= <valist>
##$VCLIST= <CCCCCCCCCCCCCCC>
##$VD= 0
##$VDLIST= <DDDDDDDDDDDDDDD>
##$VPLIST= <PPPPPPPPPPPPPPP>
##$VTLIST= <TTTTTTTTTTTTTTT>
##$WBST= 1024
##$WBSW= 4
##$XGAIN= (0..3)
0 0 0 0 
##$XL= 0
##$YL= 0
##$YMAX_a= 1512
##$YMIN_a= -1403
##$ZGOPTNS= <>
##$ZL1= 120
##$ZL2= 120
##$ZL3= 120
##$ZL4= 120
##$ABSF1= 0
##$ABSF2= 0
##$ABSG= 0
##$ABSL= 0
##$ALPHA= 0
##$AQORDER= 0
##$ASSFAC= 0
##$ASSFACI= 0
##$ASSFACX= 0
##$ASSWID= 0
##$AUNMP= <proc_1d>
##$AZFE= 0.1
##$AZFW= 0.5
##$BCFW= 0
##$BC_mod= 2
##$BYTORDP= 0
##$COROFFS= 0
##$CY= -3
##$DATMOD= 1
##$DC= 0
##$DFILT= <>
##$DTYPP= 0
##$F1P= 0
##$F2P= 0
##$FCOR= 1
##$FTSIZE= 65536
##$FT_mod= 6
##$GAMMA= 0
##$GB= 0
##$INTBC= 1
##$INTSCL= 9.790993e-09
##$ISEN= 30
##$LB= 1.5
##$LEV0= 0
##$LPBIN= 0
##$MAXI= 10000
##$MC2= 0
##$MEAN= 0
##$ME_mod= 0
##$MI= 50
##$NCOEF= 0
##$NC_proc= -14
##$NLEV= 6
##$NOISF1= 182.463
##$NOISF2= 159.3651
##$NSP= 0
##$NTH_PI= 0
##$NZP= 0
##$OFFSET= 198.0616
##$PC= 4
##$PHC0= 1662.243
##$PHC1= 49.15953
##$PH_mod= 1
##$PKNL= yes
##$PPARMOD= 0
##$PSCAL= 0
##$PSIGN= 0
##$REVERSE= no
##$SF= 81.0140089999434
##$SI= 65536
##$SIGF1= 159.3651
##$SIGF2= -187.1042
##$SINO= 113.3802
##$SIOLD= 16384
##$SREGLST= <1H.CDCl3>
##$SSB= 0
##$STSI= 65536
##$STSR= 0
##$SW_p= 32467.5324675325
##$SYMM= 0
##$S_DEV= 0
##$TDeff= 32768
##$TDoff= 0
##$TI= <>
##$TILT= no
##$TM1= 0
##$TM2= 0
##$TOPLEV= 0
##$USERP1= <user>
##$USERP2= <user>
##$USERP3= <user>
##$USERP4= <user>
##$USERP5= <user>
##$WDW= 1
##$XDIM= 65536
##$YMAX_p= 118640604
##$YMIN_p= -392968180
$$ End of Bruker specific parameters
$$ ---------------------------------
##XUNITS= HZ
##YUNITS= ARBITRARY UNITS
##XFACTOR= 0.49542278885378
##YFACTOR= 1
##DELTAX= -0.49542278885378
##NPOINTS= 65536
##FIRSTX= 16045.7642231865
##FIRSTY= 0
##LASTX= -16421.768244346
##MAXY= 118640604
##MINY= -392968180
##XYDATA= (X++(Y..Y))
$$ [...]
6492b1106249J3222876P308616j652728l107938p98466l494538q566073p000453
6484b5194953Q75314O324686N548385K207271p67330l087718l252029q54087k57719
6475a8458180m242078o943834j591667P317436Q932245J908180m055346k724140
6467a9857384J491333K206649j016812n462847r064903r134197l426105M993991
6459c9270275R157961O725433K475185O70256J00635j221155j898846r57466j158054
6450b5376326m493751p745051o571177j757479K251766L347752K853866J845728
6442c5644672q1329k473107l408310j985497M96235K641767M721910P149144Q276891
6433b0306968N687838p5923m924653n662541l665596k302109j946992l78095K517548
$$ plain form
6492 -21106249 -7883373 -574757 -2227485 -5335423 -6133889 -9628427 -18194500 -25194953
6484 -25194953 -24319639 -17994953 -12446568 -10239297 -11006627 -14094345 -17346374 -18200461 -18458180
6475 -18458180 -22700258 -29644092 -31235759 -23918323 -14986078 -13077898 -17133244 -19857384
6467 -19857384 -18366051 -16159402 -17176214 -22639061 -31703964 -40838161 -44264266 -39270275
6459 -39270275 -30112314 -23386881 -20911696 -20241440 -20140805 -21361960 -23260806 -24218272 -25376326
6450 -25376326 -29870077 -37615128 -44186305 -45943784 -43692018 -40344266 -37490400 -35644672
6442 -35644672 -35726001 -38199108 -41607418 -43592915 -43096680 -40454913 -35733003 -28583859 -20306968
6433 -20306968 -14619130 -14695053 -19619706 -25282247 -28947843 -31249952 -33196944 -33575039 -31057491
6424c1057491M089820L372603K357199J776890j72565l043961k811456J299310
6416b4189651L236023j540086p625135n971719K973725R049781N613794k805049
6408b1258317p535956n647797o57559K948419L330952J546163J13091L82736R30961
6399b5847307k54929k570072l696282k889071r86756J713419M509801M586254
6391b5434943N18365l273128q24090O148780Q901133L372738m091433n853976
6383b0536554l155393k748097o475337r246304o574155k02752M299689L586787
6375d1052116j68637j556792J918324O546698P381491N512142N967442Q213171
6367g238277N212007m954536j3076491j0398648j233357L559433K136832J586112
$$ plain form
6424 -31057491 -26967671 -23595068 -21237869 -19460979 -19633544 -22677505 -25488961 -24189651
6416 -24189651 -20953628 -22493714 -30118849 -36090568 -33116843 -24067062 -18453268 -21258317
6408 -21258317 -28794273 -34442070 -35099629 -32151210 -28820258 -27274095 -27161004 -26778268 -25847307
6399 -25847307 -26102236 -28672308 -32368590 -35257661 -36244417 -34530998 -30021197 -25434943
6391 -25434943 -24916578 -28189706 -29013796 -22865016 -13963883 -10591145 -14682578 -20536554
6383 -20536554 -23691947 -26440044 -32915381 -42161685 -48735840 -48938592 -44638903 -41052116
6375 -41052116 -41220753 -42777545 -40859221 -34312523 -26931032 -21418890 -15451448 -7238277
6367 -7238277 -2026270 -6980806 -20057297 -30455945 -31689302 -28129869 -25993037 -24406925
6359b4406925L955262L187922k243577m450836R68559O434287M295376m19176
6351a2679108J137893N607072K299775p908848j1651180l417444N218304K839540
6343a8553996n001826n007506M107262J0967529Q010633n06441o821370q350424
6335b1156139o775444m457187l641083m918521n176839p15801P025907J2550859
6327b7264248J3198466J0849983O982164J266179m289888n550459k477752l5770
6319g321325q00330j669173k16139Q96183j197089n086871q423461j0766287j0256526
6310d4841018l443675P443507J3180922Q934152J425595j146201m70020k127906
6302b1044644m087038q29338M942135N455447J001535p34518J818598J961385
$$ plain form
6359 -24406925 -20451663 -17263741 -19507318 -23958154 -22989595 -16555308 -12259932 -12679108
6351 -12679108 -11541215 -5934143 -3634368 -11543216 -23194396 -26611840 -21393536 -18553996
6343 -18553996 -23555822 -28563328 -24456066 -13488537 -5477904 -5984345 -12805715 -21156139
6335 -21156139 -27931583 -32388770 -36029853 -40948374 -46125213 -46841014 -39815107 -27264248
6327 -27264248 -14065782 -3215799 3766365 5032544 742656 -4807803 -7285555 -7321325
6319 -7321325 -8121655 -9790828 -10006967 -9110784 -10307873 -15394744 -23818205 -34584492 -44841018
6310 -44841018 -48284693 -40841186 -27660264 -18726112 -17300517 -18446718 -18916738 -21044644
6302 -21044644 -25131682 -25961020 -21018885 -15563438 -14561903 -15296421 -13477823 -11516438
6294a1516438k690164n885257l769948o04076K42658J910559N995593P362845
6286h954228K755218k774221m092744l821526n415818n150908Q97617P276875
6278a9279735N783554j533992m961885j022358M575754O992586O912270M819633
6270B285827j150800r380134j3390917r422436r46396O293456R451439P552399
6262h707562O98598p011085q572956j876369O669999R365308N348327q69348n395295
6253a0350383o201231k158924M284682O079129r78713j0736665j2491609m608510
6245c7162224L447984M094496O25976M6470K560898L687626K973851L719984N475687
6236a0529252L901306j099803l458618M30218O089444O897434J880631m985772
$$ plain form
6294 -11516438 -14206602 -20091859 -23861807 -24465883 -24223225 -22312666 -16317073 -8954228
6286 -8954228 -6199010 -8973231 -13065975 -16887501 -22303319 -27454227 -26556610 -19279735
6278 -19279735 -13496181 -15030173 -19992058 -21014416 -16438662 -9446076 -2533806 2285827
6270 2285827 1135027 -8245107 -21636024 -31058460 -32004856 -25711400 -16259961 -8707562
6262 -8707562 -8008964 -15020049 -23593005 -25469374 -18799375 -9434067 -4085740 -4955088 -10350383
6253 -10350383 -16551614 -18710538 -14425856 -8346727 -9325440 -20062105 -32553714 -37162224
6245 -37162224 -33714240 -29619744 -28993768 -28947298 -26386400 -22698774 -19724923 -16004939 -10529252
6236 -10529252 -6627946 -7727749 -11186367 -10756149 -4666705 2230729 4111360 -874412
6228h74412r641195r647680m929107M26972J133521j726209j034730M958798Q024142
6219a3309900K718450k971372Q94500R084079P589333m590250j3081238r215869
6211b2882267r15504J844512P57430J477931K223277q93997m429467l027036P03285
6202b5141836P20299j854108j420883J813366L081280K547699M539986Q028765
6194g685432O799282J3543n357147m614530j285829q26917l788471p108010p518118
6185c1371629k620282O393457J2246728P660342m302559j1695996p898258J054414
6177c0533783N942230N264323K756005k29776l877999n251988j293018M804887
6169b2419119O257277K048082j239285J794800Q394969J1225435O616135k289032
$$ plain form
6228 -874412 -10515607 -20163287 -25092394 -24665422 -23531901 -25258110 -26292840 -21334042 -13309900
6219 -13309900 -10591450 -13562822 -12668322 -3584243 4005090 -585160 -13666398 -22882267
6211 -22882267 -23797771 -21953259 -21195829 -19717898 -17494621 -18388618 -22818085 -25845121 -25141836
6202 -25141836 -24421537 -26275645 -27696528 -25883162 -22801882 -20254183 -15714197 -7685432
6194 -7685432 -886150 -872607 -6229754 -10844284 -12130113 -12957030 -16745501 -23853511 -31371629
6185 -31371629 -33991911 -27598454 -15351726 -7691384 -11993943 -23689939 -31588197 -30533783
6177 -30533783 -24591553 -19327230 -16571225 -16801001 -20679000 -25930988 -27224006 -22419119
6169 -22419119 -16161842 -14113760 -15353045 -13558245 -5163276 6062159 12678294 10389262
6161A0389262r069021r432948m261054J373313K536256j392738o788548r834679
6153b6480157r666899p388416l704193O99770L427309K045350j741408k618475
6145d5427119J353936M846285J980107m713855o804638j197466O276596R514619
6137c4171535R028144P831392N764053J966215j125013j009981N45830Q62912
6129a0307983J259476L891282O300205M497797m15242m195850o349636r051035
6121a4370986j0382434n719575L454149Q738786N117239k782499o862064m067654
6113b6875038K885214R392280J1542672P884823P03836n804786q824350p282709
6105a6378058j285452N564411O241070j726169j0244585r201188N077O661215
$$ plain form
6161 10389262 1320241 -8112707 -12373761 -11000448 -8464192 -9856930 -16645478 -26480157
6153 -26480157 -36147056 -43535472 -47239665 -46539895 -43112586 -41067236 -42808644 -45427119
6145 -45427119 -44073183 -39226898 -37246791 -41960646 -48765284 -49962750 -43686154 -34171535
6137 -34171535 -25143391 -17311999 -11547946 -9581731 -10706744 -11716725 -11170895 -10307983
6129 -10307983 -9048507 -5157225 1142980 5640777 5225535 1029685 -5319951 -14370986
6121 -14370986 -24753420 -30472995 -27018846 -18280060 -13162821 -15945320 -22807384 -26875038
6113 -26875038 -23989824 -14597544 -3054872 4829951 5533787 -270999 -9095349 -16378058
6105 -16378058 -17663510 -12099099 -5858029 -7584198 -17828783 -27029971 -27024894 -20363679
6097b0363679N924161L319779L116004J637350m102841r349302q633593l931235
6089c2383356o91462l37290q95096p91331J366910O256191J0288098P872305n3248
6080i368279n766148n767810m822527n620272l285190M062098Q290753L108217
6072a9169158m620828m912690J91516J812300n80668n74967J887662O03074m302010
6063b9665769n026741J403488Q403898R340549M616050j629488n488275l943433
6055b1989721K149967O304879L727199j256939j753831O20667k50199k856716
6047a5304694o79775M630115M716951n97105k346536J834442L555579j446067
6039e637090o554038o680865n112278k871605N369987J7197558J7791844N43461
$$ plain form
6097 -20363679 -14439518 -11119739 -8003735 -6366385 -10469226 -19818528 -28452121 -32383356
6089 -32383356 -33074818 -33412108 -34307204 -35098535 -33731625 -27475434 -17187336 -9315031 -9368279
6080 -9368279 -15134427 -20902237 -25724764 -31345036 -34630226 -30568128 -22277375 -19169158
6072 -19169158 -23789986 -28702676 -28511160 -26698860 -27279528 -27854495 -25966833 -25363759 -29665769
6063 -29665769 -34692510 -33289022 -24885124 -15544575 -10928525 -12558013 -18046288 -21989721
6055 -21989721 -19839754 -13534875 -9807676 -11064615 -12818446 -12197779 -12447978 -15304694
6047 -15304694 -15984469 -11354354 -6637403 -7234508 -9581044 -7746602 -4191023 -5637090
6039 -5637090 -12191128 -18871993 -23984271 -26855876 -21485889 -4288331 13503513 14046974
6031A4046974j8676938k0717341q244281J441912J510301r69090j686679l375374
6023c6670516m787952m96728O669364O350466k805274r102061m950823K411777
6015d3381747L434812M39218J317017N414747M997135j484638n953910j872991
6007c7090357O635648R876874M392274l615366o737648n034477l502520l088289
5999c8163861J50487O147195P852674J660834m617763j244153Q798442J2419353
5991f996792L555580r183458j3575499p265818J879951N276918J701570k093466
5983b6701014J277899J0169630J3676712M661994r488312j4728363p551733K185912
5975b6497275N321232L020729J001432J218793K543644M245334N239773L886214
$$ plain form
6031 14046974 -4629964 -25347305 -33591586 -32149674 -30639373 -31608463 -33295142 -36670516
6023 -36670516 -41458468 -41955196 -35285832 -28935366 -31740640 -40842701 -45793524 -43381747
6015 -43381747 -39946935 -39507717 -38190700 -32775953 -27778818 -29263456 -35217366 -37090357
6007 -37090357 -30454709 -20577835 -16185561 -19800927 -26538575 -31573052 -35075572 -38163861
5999 -38163861 -38013374 -31866179 -24013505 -22352671 -26970434 -28214587 -19416145 -6996792
5991 -6996792 -3441212 -12624670 -26200169 -33465987 -31586036 -26309118 -24607548 -26701014
5983 -26701014 -25423115 -15253485 -1576773 3085221 -6403091 -21131454 -28683187 -26497275
5975 -26497275 -21176043 -18155314 -17153882 -15935089 -13391445 -9146111 -3906338 -20124
5967b0124J173346K13100P26615j037176m673592m005536K870399P906992L702902
5958F856926m568752n434417K551573Q579092M493830m888652r500856p154242
5950i065498m037868m027647l162628L033707J0463198R875072l79509j0185631
5942g486804r559137r89584M932677L751158Q59395J657654M625634N599900L278678
5933F669571j603541p592454j0913288p630236L7534M467799K426349r96694j179889
5924a6314849o82069k683263l766080J65508N199413M229117j870539n053011
5916b0775773j231350N454260R019558P077769O69927o192909p605010j639558
5908a5223086N439025N980500J117686j625000j69341l07417n310162j0125061
$$ plain form
5967 -20124 1153222 1366322 2092937 1055761 -3617831 -7623367 -4752968 3154024 6856926
5958 6856926 2288174 -3146243 -594670 7984422 12478252 7589600 -1911256 -9065498
5950 -9065498 -13103366 -17131013 -20293641 -17259934 -6796736 3078336 2698827 -7486804
5942 -7486804 -17045941 -18035525 -13102848 -9351690 -8492295 -6834641 -2209007 3390893 6669571
5933 6669571 5066030 -2526424 -13439712 -21069948 -21032414 -16564615 -14138266 -15134960 -16314849
5924 -16314849 -16996918 -19680181 -23446261 -23280753 -18081340 -13852223 -15722762 -20775773
5916 -20775773 -22007123 -16552863 -7533305 -455536 214391 -5978518 -13583528 -15223086
5908 -15223086 -9784061 -3803561 -2685875 -4310875 -4480216 -4787633 -10097795 -20222856
5900b0222856q871801k722594L022260N603310N489829L844899K208628K077573
5892i570752K650480J549863p60898o13104K979495N696364L758614q72808m104416
5883G12838n446803o531201o437082l043896J950105L910296J781532q5646J490590
5874a1699267L005579j169850r398427j2301464m341404P119066R513083J407629
5866a7865055n156861j081777P429775Q366527P48779n698866n071951j053552
5858a9382981J320196J346121q46839n412374q263527l286680P481231J3045806
5850a3999047P207988l026471p287638m240522O33312L723561L997727L42459
5842a2648631n295581o444297l37415O166979N343633n30926l863918l309448
$$ plain form
5900 -20222856 -29094657 -31817251 -28794991 -23191681 -17701852 -13856953 -11648325 -9570752
5892 -9570752 -6920272 -5370409 -6131307 -6744411 -3764916 1931448 5690062 4817254 712838
5883 712838 -4733965 -11265166 -17702248 -20746144 -18796039 -14885743 -13104211 -13189857 -11699267
5874 -11699267 -8693688 -9863538 -19261965 -31563429 -35904833 -28785767 -19272684 -17865055
5866 -17865055 -23021916 -24103693 -16673918 -8307391 -7558612 -13257478 -18329429 -19382981
5858 -19382981 -18062785 -16716664 -17563503 -22975877 -31239404 -34526084 -27044853 -13999047
5850 -13999047 -6791059 -9817530 -17105168 -21345690 -20712378 -16988817 -12991090 -12648631
5842 -12648631 -17944212 -24388509 -24725924 -18558945 -13215312 -13746238 -17610156 -20919604
5834b0919604k762653k337170N61283L548565K437581P58359N500191J3282053
5826F8605J2396787J284118o592368j843150O982130O464365k569488q478154
5818G712845o557696l244160l773152m867636k092986J887085R18769n092368
5810a5109299q610132l913156M277033N674600j503544o779033j868236O448129
5802b1383638N907602k173918m579019K781135Q010803K074561p038485p165258
5794b3566217J38813M589348L407609J678519R16242j478745l594681p49800M606651
5785a4052261M701838j360685o276533o048756l798411j182622M201473J0409005
5777a3406952R876862Q90003p905794r174245n722799k995635l10760M440919
$$ plain form
5834 -20919604 -23682257 -26019427 -25458144 -21909579 -19471998 -18713639 -13213448 68605
5826 68605 12465392 13749510 7157142 5313992 12296122 18760487 16190999 7712845
5818 7712845 1155149 -2089011 -5862163 -10729799 -12822785 -10935700 -10016931 -15109299
5810 -15109299 -23719431 -27632587 -23355554 -17680954 -19184498 -25963531 -27831767 -21383638
5802 -21383638 -15476036 -17649954 -22228973 -19447838 -11437035 -9362474 -16400959 -23566217
5794 -23566217 -23427404 -18838056 -15430447 -13751928 -12835686 -14314431 -17909112 -18658912 -14052261
5785 -14052261 -9350423 -10711108 -16987641 -23036397 -26834808 -28017430 -23815957 -13406952
5777 -13406952 -3530090 -2640087 -10545881 -19720126 -25442925 -28438560 -28749320 -24308401
5769b4308401Q018413O610664K315387j370042n461299j0511522j1194917l846820
5761c9748537M823024N326748r55777m341568j193010L178782N093627O632388
5753b1184323Q241430O146205k6273m409723l254729l57619o94730l393424m324590
5744b3257776j951030K006411M640302L259563j750035n032707j871356M118609
5736a9838019N006736R21753N11743O479780R557241K467916q005908j0616878
5728a3515636n240256j69897J642201L936053P080676O538400J518272l242366
5720a452553n287692o716221p756833n499516p40753J091115j532110l313586
5712c1208149q49517J870619N41366k322038j845056J913060N579895P764242
$$ plain form
5769 -24308401 -16289988 -9679324 -7363937 -8733979 -14195278 -24706800 -35901717 -39748537
5761 -39748537 -34925513 -29598765 -30554542 -34896110 -36089120 -32910338 -27816711 -21184323
5753 -21184323 -12942893 -6796688 -6822961 -11232684 -14487413 -14845032 -15539762 -18933186 -23257776
5744 -23257776 -25208806 -23202395 -18562093 -15302530 -17052565 -22085272 -23956628 -19838019
5736 -19838019 -14831283 -13909530 -13397787 -6918007 2639234 5107150 -2898758 -13515636
5728 -13515636 -18755892 -18925789 -17283588 -13347535 -6266859 271541 1789813 -1452553
5720 -1452553 -6740245 -13456466 -21213299 -26712815 -27453568 -26362453 -27894563 -31208149
5712 -31208149 -32057666 -30187047 -29645681 -31967719 -33812775 -31899715 -26319820 -18555578
5704a8555578Q439091O364013J663206j701934n20365K693557L367086J385233
5696C134309j57301n12559r84958r64905N86204R25020l466559r660178r825493
5687b0926420j567865P915035J0159505M361834l945729r622043j0682307p240618
5679c1548608j281903L441404M045954J223105j839930k797026j586904M81663
5671b9862245J854198J652888P46458J403148M580132P841256P443599K778349
5663a562217k575081m957917m610688m135641l877525j470718L335602O304524
5655a3549661L814977j355568k907854O26260M040954K640906k245140o378220
5647a5313346p883443p149894m336323M8838L881955N423439N356463N016183
$$ plain form
5704 -18555578 -10116487 -3752474 -2089268 -3791202 -4311567 -1618010 1749076 3134309
5696 3134309 2977008 2464449 1479491 514586 1100790 2025810 -1440749 -11100927 -20926420
5687 -20926420 -22494285 -14579250 -4419745 -57911 -4003640 -13625683 -24307990 -31548608
5679 -31548608 -32830511 -29389107 -25343153 -24120048 -25959978 -28757004 -30343908 -29862245
5671 -29862245 -28008047 -26355159 -25608701 -24205553 -19625421 -11784165 -4340566 -1562217
5663 -1562217 -4137298 -9095215 -13705903 -17841544 -21719069 -23189787 -19854185 -13549661
5655 -13549661 -9734684 -11090252 -13998106 -13371846 -9330892 -6689986 -8935126 -15313346
5647 -15313346 -23196789 -30346683 -34683006 -34634168 -30752213 -25328774 -19972311 -14956128
5639a4956128M424854L792423M248807M709772J364618o086021j1022503p792114
5631b1316292m66757K330981k20269j019737K737514M987251J015904m504740
5623a6456145m289264J255594N452956M512532P85942j915545k498402k100213
5615a5252545j858795j758931j075308P5132L17299o93194q58745J043819K124752
5606a7936516n94531l974694k046137M282073P208674L589554k38081J206156
5598h503502L945196J826565l112251m640305k857243k851396m875536l998013
5590b5066485N03266K974997J87053l940907m593306j913938J604669M964792
5582b5279859P417781P361778M974191K544092L45668l684613p988658o437944
$$ plain form
5639 -14956128 -10531274 -6738851 -2490044 2219728 3584346 -2501675 -13524178 -21316292
5631 -21316292 -21783049 -19452068 -19672337 -20692074 -17954560 -12967309 -11951405 -16456145
5623 -16456145 -20745409 -19489815 -14036859 -9524327 -8738385 -10653930 -13152332 -15252545
5615 -15252545 -17111340 -18870271 -19945579 -19870447 -19553148 -20246342 -21105087 -20061268 -17936516
5606 -17936516 -18531047 -22505741 -24551878 -20269805 -13061131 -9471577 -9709658 -8503502
5598 -8503502 -4558306 -2731741 -5843992 -10484297 -13341540 -16192936 -21068472 -25066485
5590 -25066485 -24563219 -21588222 -21401169 -25342076 -29935382 -31849320 -30244651 -25279859
5582 -25279859 -17862078 -10500300 -5526109 -2982017 -2636349 -6320962 -14309620 -20747564
5574b0747564K281289R122237N126656n325910r445188l733238J654591j307340
5566b2374467o629463m321237L777627P162124L290339R16325N036121Q105463
5558e037168K067266q007786j0654586m582290N47997j019960m378139l520175
5550c4584841M22044L900647P065717J0390698J0476940M749871l125454p574335
5542h278713q150688p658166o095077j897485K625462K891021j124118m377869
5534c2065633l456690j55075J816340P50122k206217l625831k50301O438310R779704
5525b2975271N587522j445035l308519N46593K914663q44572o953273q553248
5517c5031140l325097M890443R400394N954352k455990p221797l784527K232660
$$ plain form
5574 -20747564 -18466275 -9344038 -4217382 -9543292 -18988480 -22721718 -21067127 -22374467
5566 -22374467 -29003930 -33325167 -29547540 -22385416 -19095077 -18178752 -13142631 -5037168
5558 -5037168 -2969902 -10977688 -21632274 -26214564 -25666567 -26686527 -31064666 -34584841
5550 -34584841 -34162797 -30262150 -23196433 -12805735 -2328795 2421076 -704378 -8278713
5542 -8278713 -16429401 -24087567 -30182644 -32080129 -29454667 -26563646 -27687764 -32065633
5534 -32065633 -35522323 -35677398 -33861058 -33110936 -35317153 -38942984 -39193285 -32754975 -22975271
5525 -22975271 -17387749 -18832784 -22141303 -21594710 -18680047 -19524619 -26477892 -35031140
5517 -35031140 -38356237 -33465794 -24065400 -18111048 -20567038 -27788835 -31573362 -29340702
5509b9340702K797428j110549j988631J952516M667566K517259j188339l404739
5501b5098191n480328p436231n448960J127800O589823O879890N011379M470503
5493a9384315L348033k662j652256J059933K549355l455766j2802082j5304470
5485d5644230q537061K03292M972607O886313Q106253P060650K477942k384624
5477b6858858k892145J374058N918853N575808m44537o872714o977482l21878
5469c1498895N849396N008263r59210n026803l678022J006456N593551P425963
5461a6279301M250153l355614r711813q905685k298561K761399K149832q09548
5453c2199138j016851J962851M477946L536982j55886k959129k291189k46349
$$ plain form
5509 -29340702 -26543274 -27653823 -29642454 -27689938 -23022372 -20505113 -21693452 -25098191
5501 -25098191 -30578519 -38014750 -43463710 -42335910 -35746087 -28866197 -23854818 -19384315
5493 -19384315 -16036282 -16038944 -17691200 -16631267 -14081912 -17537678 -30339760 -45644230
5485 -45644230 -54181291 -53977999 -49005392 -42119079 -34012826 -26952176 -24474234 -26858858
5477 -26858858 -29751003 -28376945 -22458092 -16882284 -17326821 -24199535 -31177017 -31498895
5469 -31498895 -25649499 -20641236 -21600446 -26627249 -30305271 -29298815 -23705264 -16279301
5461 -16279301 -12029148 -15384762 -25096575 -34002260 -36300821 -33539422 -31389590 -32199138
5453 -32199138 -33215989 -31253138 -26775192 -23238210 -23394096 -26353225 -28644414 -28890763
5445b8890763r53942l201730r0445J0132222J7618692J2249703j411161q955133
5437c502557n145437J114770J956662N59488J692540J768332l885889j0419542
5429a5861633r360864j768879L329581K195502l41799p74443j526983l634631
5421b7744149k845712K481363N842266J026737p810340j1006733o307101m17783
5413d6781452J763248K633261N153675P093562N602007K666478J569698J491528
5405a8807995K39514q34626J87497Q99851j130248j882119L340453R271849N894074
5396b821750m761011q321490R51796R973139N656437n508441p886073k30154M438905
5387h508642m4690n523156m617617j273564j705356m063165l157022N56940K433343
$$ plain form
5445 -28890763 -29844705 -33046435 -33136880 -23004658 -5385966 6863737 5452576 -3502557
5437 -3502557 -8647994 -7533224 -5576562 -5017074 -3324534 -1556202 -5442091 -15861633
5429 -15861633 -25222497 -26991376 -23661795 -21466293 -21808092 -22582535 -24109518 -27744149
5421 -27744149 -30589861 -28108498 -22266232 -21239495 -29049835 -40056568 -46363669 -46781452
5413 -46781452 -45018204 -42384943 -37231268 -30137706 -24535699 -21869221 -20299523 -18807995
5405 -18807995 -18568481 -19403107 -19215610 -18315759 -19446007 -21328126 -17987673 -8715824 -2821750
5396 -2821750 -7582761 -15904251 -14952455 -4979316 677121 -4831320 -12717393 -12947547 -8508642
5387 -8508642 -8553332 -14076488 -18694105 -19967669 -21673025 -25736190 -28893212 -28336272 -25902929
5378b5902929N95213k631660l856258j002652M742542Q226201N028192k266209
5370a7067560o401593m650143j125464N68953J427988K591080K754863J915303
5362a9986573J847197J099370l758769r667223p936879K308864R878824O834769
5354a9380420K63296O94862N581830M590281k980190p426477m150015O22168Q51672
5345b1332993j492163k163548j029812L55676K084872L825216L529859N97674
5337a5625219k786741m703457m816287k396967K939839P980221P869764K677964
5329h860883j987585k359444p03998o51960k199915l444095m014695m404344m117121
5320c2744040k302017J227821N908885R294195O968652k246433j1301178j0879140
$$ plain form
5378 -25902929 -25307716 -27939376 -31795634 -32798286 -28055744 -19829543 -14801351 -17067560
5370 -17067560 -23469153 -28119296 -29244760 -28675807 -27247819 -24656739 -21901876 -19986573
5362 -19986573 -18139376 -17040006 -20798775 -30465998 -38402877 -36094013 -26215189 -19380420
5354 -19380420 -19117124 -18422262 -12840432 -8250151 -11230341 -18656818 -22806833 -22184665 -21332993
5345 -21332993 -22825156 -24988704 -26018516 -25662840 -23577968 -19752752 -16222893 -15625219
5337 -15625219 -18411960 -23115417 -27931704 -30328671 -27388832 -19408611 -11538847 -8860883
5329 -8860883 -10848468 -13207912 -13911910 -14563870 -16763785 -20207880 -24222575 -28626919 -32744040
5320 -32744040 -35046057 -33818236 -27909351 -18615156 -11646504 -13892937 -25194115 -36073255
5312c6073255j896384M071290K27928n623181k521560P048359J0334608K969542
5304b1462653m474532j729340O420460P267287j201917p210505k391053N602031
5296a9180222M108956n495380r525969k815780L193961j404668q587587m434489
5288d4141178Q635591J4707326P673832j796979m263208l028621k799524M7734
5280b4965027P127350R104303r71471j3050611j1987449M61411Q853528O873042
5272a8554924L015756L283127K537167k972422p236170n240061j868119k464971
5264b9500617k986964J900654P703958O547040J81268k909938p16065J060844
5256a8719820k93611j302942j18501L26236j420407k439883r65685M93716k42063
$$ plain form
5312 -36073255 -37969639 -33898349 -33670421 -39293602 -41815162 -34766803 -24432195 -21462653
5304 -21462653 -25937185 -27666525 -21246065 -13978778 -15180695 -22391200 -24782253 -19180222
5296 -19180222 -15071266 -20566646 -30092615 -32908395 -29714434 -31119102 -39706689 -44141178
5288 -44141178 -35505587 -20798261 -13124429 -14921408 -19184616 -22213237 -25012761 -24965027
5280 -24965027 -17837677 -8733374 -9704845 -22755456 -34742905 -34281494 -25427966 -18554924
5272 -18554924 -15539168 -12256041 -9718874 -12691296 -19927466 -25167527 -27035646 -29500617
5264 -29500617 -32487581 -30586927 -22882969 -16335929 -16154661 -19064599 -19780664 -18719820
5256 -18719820 -19013431 -20316373 -20434874 -20108638 -21529045 -23968928 -24934613 -24440897 -24682960
5247b4682960j567672j143124J109528M270821P280281P883658M458450o34338
5239c025356l500348m607019p392343j0788563r296094k136011M023253M402488
5231c2319993K347778K765628N000197O410679P563283Q949086P672848K938383
5223A1327889o6284K039773L938136k41009o285082o073820j045993M21452k617643
5214A397419k752281J845950L486482k054456q325752q439111m259998m39805
5206a9541552L067746O654355O172549l29704o129173l851415L151432M753174
5198f052588k187293j0323870j1449124m583797N050937J0981141R962449M840456
5190c761689J931422L090025K995619k432467q645150q763100m275963k747691
$$ plain form
5247 -24682960 -26250632 -27393756 -26284228 -22013407 -14733126 -6849468 -2391018 -3025356
5239 -3025356 -6525704 -11132723 -18525066 -29313629 -38609723 -40745734 -36722481 -32319993
5231 -32319993 -29972215 -27206587 -22206390 -15795711 -8232428 716658 8389506 11327889
5223 11327889 11261605 13301378 17239514 16998505 10713423 4639603 3593610 4015062 1397419
5214 1397419 -1354862 491088 3977570 1923114 -6402638 -14841749 -19101747 -19541552
5206 -19541552 -16473806 -9819451 -3646902 -3976606 -10105779 -13957194 -10805762 -6052588
5198 -6052588 -8239881 -18563751 -30012875 -34596672 -29545735 -18564594 -8602145 -3761689
5190 -3761689 -1830267 1259758 4255377 1822910 -6822240 -15585340 -19861303 -22608994
5182b2608994o145513q420945m990862J825302Q023734J2547624J4628600J2003712
5174F862658N039090j371826l331651k485829k322089k760055j598045Q01193
5166a166554J821125O73288r60561k233420m261392p140906q117425m742566R54388
5157b5174023L817362J732187j697291k335949j266073k138904m296018l470284
5149c4828993M55603K203622j88844j338645K547155O065985K296201n591634
5141b8379550p949830k441037L242025K752689j471601l470473q05029N190538
5133c3332268J1106140J1939701N002497m853607q882156n276225j219855j856861
5125b7372634l132012L88848O003933O941460K431714k334442m405242n424117
$$ plain form
5182 -22608994 -28754507 -37175452 -42166314 -40341012 -32317278 -19769654 -5141054 6862658
5174 6862658 11901748 10529922 7198271 4712442 2390353 -369702 -1967747 -1166554
5166 -1166554 654571 1327859 367298 -1866122 -6127514 -13268420 -21385845 -26128411 -25174023
5157 -25174023 -21356661 -19624474 -21321765 -23657714 -24923787 -27062691 -31358709 -34828993
5149 -34828993 -34373390 -32169768 -32358612 -33697257 -31150102 -25084117 -22787916 -28379550
5141 -28379550 -36329380 -38770417 -35528392 -32775703 -34247304 -37717777 -38522806 -33332268
5133 -33332268 -22226128 -10286427 -5283930 -10137537 -19019693 -24295918 -25515773 -27372634
5125 -27372634 -30504646 -30115798 -24111865 -17170405 -14738691 -17073133 -21478375 -26902492
5117b6902492o451926n857278l048316M3206K478041N888756J0908465J4531983
5109h409561J2945274N792672l455472j0384955j2258391r124244l593292J008657
5101b7479312L238349M169543N047284N068965K777127o02779j379139J668357
5093g491605M385453K191773k683314k885709L807232R853069O891618l314545
5085A0753972j1094604j0707376n474141j269938L98791J318356K326068K671830
5077a1077042J594083j398022o265397j0862473j1231033n731659J653446M417326
5069c8900771Q14667l324386j037594O507311J0032463L699483o001904p679862
5061c5890593k05154O210264N131714J973284K677398K705759m322077j3153819
$$ plain form
5117 -26902492 -33354418 -39211696 -42260012 -42216806 -39738765 -33850009 -22941544 -8409561
5109 -8409561 4535713 10328385 6872913 -3512042 -15770433 -24894677 -28487969 -27479312
5101 -27479312 -24240963 -20071420 -15024136 -9955171 -7178044 -7780823 -9159962 -7491605
5093 -7491605 -3106152 -914379 -3597693 -6483402 -2676170 7176899 14068517 10753972
5085 10753972 -340632 -11048008 -16522149 -17792087 -17393296 -16074940 -13748872 -11077042
5077 -11077042 -9482959 -10880981 -17146378 -28008851 -39239884 -44971543 -43318097 -38900771
5069 -38900771 -38086104 -41410490 -42448084 -35940773 -25908310 -22208827 -28210731 -35890593
5061 -35890593 -36095747 -29885483 -24753769 -22780485 -20103087 -17397328 -21719405 -34873224
5053c4873224j3057448m607785J323572J055625K462749R392133J3793269R294367
5045a5216742K338725J453208L289993o31479q203127q664898Q11056J0109839
5037a4713425R561974J223766o110959p962330o467404m679856k779203J45309
5029c1782128L300831M744312L974071K283412L13550k683966n927532n952215
5021c1729665j095993M992589Q018299R200545J1687865J2344326M461926j0032318
5013G847574j8616120j2800617N59484P765121M520922j742121l590146j591035
5005a7646938j27109k13411M15288K036854J591126k063898m361317m06551O697956
4996a4078000Q354160K549917k937689k734745j958689n904007q940029l355472
$$ plain form
5053 -34873224 -47930672 -52538457 -51214885 -50159260 -47696511 -38304378 -24511109 -15216742
5045 -15216742 -12878017 -11424809 -8134816 -8766295 -16969422 -25634320 -24823264 -14713425
5037 -14713425 -5151451 -3927685 -10038644 -18000974 -24468378 -29148234 -31927437 -31782128
5029 -31782128 -28481297 -23736985 -19762914 -17479502 -17165952 -19849918 -25777450 -31729665
5021 -31729665 -32825658 -27833069 -19814770 -10614225 1073640 13417966 17879892 7847574
5013 7847574 -10768546 -23569163 -23009679 -15244558 -10723636 -12465757 -16055903 -17646938
5005 -17646938 -17774047 -17987458 -17572170 -15535316 -13944190 -16008088 -20369405 -20775956 -14078000
4996 -14078000 -5723840 -3173923 -6111612 -8846357 -10805046 -16709053 -25649082 -29004554
4988b9004554O111315Q356597L473028J565984N229274O549143K179385k281673
4980B178499m953573j0385200j5941476j0687250N435244J5706602R074109l988494
4972a3561539q182869m532688l351766n834563n350439l59388N407049J0370352
4964b5395851J3271698R856799K84547o637525n266513j918620l206187m321454
4956b3333106P65504O410254M599552r59707k561191k325435n084499n719212
4948b8207840J434213Q106557L541665n865811n854278J903491L791933j569773
4940b2719843k594092L194250N640925J154720k731078l251687n287350o988986
4932c3583141o88557R342595Q508690m542069j3732433j0206870l975805m565737
$$ plain form
4988 -29004554 -22893239 -14536642 -11063614 -9497630 -4268356 2280787 4460172 2178499
4980 2178499 -2775074 -13160274 -29101750 -39789000 -34353756 -18647154 -9573045 -13561539
4972 -13561539 -21744408 -26277096 -29628862 -35463425 -40813864 -41173252 -35766203 -25395851
4964 -25395851 -12124153 -2267354 -1982807 -8620332 -13886845 -15805465 -19011652 -23333106
4956 -23333106 -22567602 -16157348 -11557796 -12517503 -15078694 -17404129 -22488628 -28207840
4948 -28207840 -26773627 -18667070 -15125405 -20991216 -26845494 -24942003 -21150070 -22719843
4940 -22719843 -25313935 -22119685 -16478760 -15324040 -18055118 -21306805 -26594155 -33583141
4932 -33583141 -34271698 -24929103 -16420413 -20962482 -34694915 -44901785 -48877590 -53443327
4924e3443327o637100k944276K971525N540319O350968P354820O047542L030324
4916c1729205L195882N240459K162267m507300m868915J311692K113082n965958
4908c3047996j0826134m840416L155300L628876P5544o96442Q74505K956788O417556
4899c2302419Q039334K467559n781192o474956j435479j574669n998154m346274
4891d7406250J62221n124069j4167912p997299P794472N736679j5418000k3489882
4883i9910040o793652N879054k561351r750899k691888n890064k7857587l2484725
4875a82061152r257784j4577009p5516692j04723560o831983J56693483K17556685
4868a8718012J21044983o942408m0746760m709183R099146j3210120k0910352
$$ plain form
4924 -53443327 -60080427 -63024703 -60053178 -54512859 -48161891 -40807071 -34759529 -31729205
4916 -31729205 -28533323 -23292864 -21130597 -25637897 -30506812 -29195120 -27082038 -33047996
4908 -33047996 -43874130 -48714546 -45559246 -41930370 -41854826 -42551268 -41676763 -38719975 -32302419
4899 -32302419 -24263085 -21795526 -27576718 -34051674 -35487153 -37061822 -43059976 -47406250
4891 -47406250 -47244029 -52368098 -66536010 -74533309 -66738837 -61002158 -76420158 -99910040
4883 -99910040 -106703692 -100824638 -103385989 -113136888 -115828776 -121718840 -149576427 -182061152
4875 -182061152 -191318936 -205895945 -281412637 -386136197 -392968180 -236274697 -18718012
4868 -18718012 102326971 95384563 54637803 49928620 59027766 45817646 24907294
4861B4907294k860638N522603m502686o257964N850729Q848213j672079n114971
4853B4720501K678814L338436o462856q853905k6103K496640o539440j0314662
4845A037425j202350O028795J359602m612531k108063J785298m55297k156648
4837c23769M074336J1980389J1678432M200329k590974n083979m741075m093080
4829A5100609n890303j0737694j3831919r769741q05581N749136P248421O178368
4821f758704L210963k223556o601636n910827k506869o12622J306276N007385
4813a5089590M826087k931501q385922m46980J2822462J2977109m89487q571695
4805e289517k083360N537811J320578p710471q175855q33797M133189L693610
$$ plain form
4861 24907294 22046656 27569259 23066573 16808609 22659338 31507551 29835472 24720501
4853 24720501 27399315 30737751 24274895 15420990 15394887 17891527 11352087 1037425
4845 1037425 -164925 5863870 7223472 2610941 502878 2288176 1832879 -323769
4837 -323769 3750567 15730956 27409388 31609717 29018743 23934764 19193689 15100609
4829 15100609 9210306 -1527388 -15359307 -25129048 -25934629 -20185493 -12937072 -6758704
4821 -6758704 -3547741 -5771297 -12372933 -18283760 -20790629 -21403251 -20096975 -15089590
4813 -15089590 -10263503 -13195004 -21580926 -22027906 -9205444 3771665 3282178 -5289517
4805 -5289517 -7372877 -1835066 -514488 -8224959 -16400814 -17234611 -13101422 -9407812
4797i407812K685118L214800K833311M84546k527674n346855o907091n342753
4789b0314410j311635J685586K798386M991357Q278798P629945J258332m821313
4781A95046n184728k724047k654493l449953k58054N571099P361508L111533j302950
4772F64961n27229K684832J290921n937593j1472852q023545J590442P754371
4764a1975692P118742O146192Q773768P993214k765269j5511146j6035284m681310
4756b0936785L154155q64303o970394l512376N845330R243036M101060j714737
4748a1655014k684090q65840P63749K669286N213123O221138M282206J181423
4740E125981q29829j978214l513006m908058m581915l012059k993598n659049
$$ plain form
4797 -9407812 -6722694 -3507894 -674583 -190037 -2717711 -8064566 -14971657 -20314410
4789 -20314410 -21626045 -19940459 -17142073 -12150716 -3871918 3758027 5016359 195046
4781 195046 -4989682 -7713729 -10368222 -13818175 -14076229 -8505130 -1143622 1967911 664961
4772 664961 137732 2822564 4113485 -1824108 -13296960 -21320505 -19730063 -11975692
4764 -11975692 -4856950 1289242 10063010 18056224 15290955 -220191 -16255475 -20936785
4756 -20936785 -17782630 -18646933 -25617327 -29129703 -23284373 -14041337 -9940277 -11655014
4748 -11655014 -14339104 -15204944 -14441195 -11771909 -6558786 -337648 3944558 5125981
4740 5125981 4296152 2317938 -1195068 -6103126 -10685041 -13697100 -16690698 -22349747
4732b2349747p673721m717053K404578P710423O835564J391533m338277p892152
4724b8628852q102224l759006L846066R664404R780841N820580J762573j094911
4716a0710529k987799k760046j07213K196107K466311L185360N389951M358514
4708A030656k805122r650548q723130l962541m717134r350608o714505N036345
4700c9856587J3396170R591041Q35315k014883J42798J00348j659936J405050
4692a8060684R078250J2643257O759885l410065q885451o762511j577243R66466
4684i248096k89375k262594k466178j861011k026726j615664J492537N660853
4676a2616254O763432L878503L38846j060321p79046m36159j056307l176824n632542
$$ plain form
4732 -22349747 -30023468 -34740521 -32335943 -24625520 -17789956 -16398423 -20736700 -28628852
4724 -28628852 -36731076 -40490082 -36644016 -26979612 -17198771 -11378191 -9615618 -10710529
4716 -10710529 -13698328 -16458374 -16565587 -14369480 -11903169 -8717809 -3327858 1030656
4708 1030656 -1774466 -11425014 -20148144 -24110685 -28827819 -38178427 -44892932 -39856587
4700 -39856587 -26460417 -16869376 -16034061 -18048944 -17906146 -17805798 -19465734 -18060684
4692 -18060684 -8982434 3660823 10420708 7010643 -1874808 -8637319 -10214562 -9248096
4684 -9248096 -9537471 -11800065 -14266243 -16127254 -18153980 -19769644 -18277107 -12616254
4676 -12616254 -5852822 -1974319 -1635473 -2695794 -3474840 -3910999 -4967306 -8144130 -13776672
4667a3776672n033056p6987M688769L791170j408168m635702l372147k40166L032616
4658a7030343O395545O872199J024963p211703r290292m541867j667119m816626
4650c0265243o787753r49899P918650J1221723Q737436O012647M302340R04492
4642A094393l159360l418607M92339L575113K555148k7896j31394J952235J741239
4633D673210l641365j0594321j1844767n433687J773841K831636P05q7335K192993
4624b0129090R46714l229342k355739N779188J2787633J1855588O516320K641714
4616A4812986m54134n146425q714849q026760n581824m841241m443715k440036
4608b4835998q82513p38906J713232P207748Q753154K255844m337240j775678
$$ plain form
4667 -13776672 -18809728 -18886715 -14197946 -10406776 -11814944 -16450646 -19822793 -20062959 -17030343
4658 -17030343 -10634798 -3762599 -2737636 -9949339 -19239631 -23781498 -25448617 -30265243
4650 -30265243 -37052996 -38002895 -30084245 -18862522 -10125086 -4112439 189901 1094393
4642 1094393 -2064967 -5483574 -4991235 -1416122 1139026 1111130 979736 2931971 4673210
4633 4673210 1031845 -9562476 -21407243 -26840930 -25067089 -22235453 -22234748 -22322083 -20129090
4624 -20129090 -19182376 -22411718 -24767457 -18988269 -6200636 5654952 12171272 14812986
4616 14812986 14358852 9212427 497578 -7529182 -13111006 -17952247 -22395962 -24835998
4608 -24835998 -25718511 -26457417 -24744185 -17536437 -8783283 -6527439 -10864679 -12640357
4600a2640357N702055O751553N46552l283503p93975J831605Q50580Q76326M820539
4591D661375P275792L223720l338261n211067k152520J34731j265137l602082
4583b73449l699523k254845j938488l388890m825407m910951l868710j337249
4575b6497512M033023J0577651J2100454M745677o166224j1226385q081687k257230
4567b2772233K041682N210616O774678M701586J186097R63619K512408j78363
4559D40090n579167n069743J649367L745890k938847p967471l671235K296425
4551a7094691J463442q91553K296520N115930K80583m915666o73884O001675K243847
4542f173797p237692p508628J96661P67384p251007q381991K782665J2190931
$$ plain form
4600 -12640357 -6938302 -186749 359803 -2923700 -3717675 -1886070 -1035490 -159164 4661375
4591 4661375 11937167 15160887 11822626 6611559 4459039 4593770 3328633 -273449
4583 -273449 -3972972 -6227817 -8166305 -11555195 -16380602 -21291553 -25160263 -26497512
4575 -26497512 -22464489 -11886838 213616 4959293 -1206931 -12433316 -20515003 -22772233
4567 -22772233 -20730551 -15519935 -8745257 -4043671 -2857574 -1893955 618453 440090
4559 440090 -5139077 -10208820 -8559453 -4813563 -7752410 -15719881 -19391116 -17094691
4551 -17094691 -15631249 -16522802 -14226282 -9110352 -8829769 -13745435 -14419319 -8417644 -6173797
4542 -6173797 -13411489 -20920117 -20723456 -19956072 -27207079 -35589070 -32806405 -20615474
4534b0615474R803836L618881K523734K240703k224267n118679j495571K173603
4526i093234p41852n802285o996049p151662r260222p516596K202988J1622389
4518c2736523J1151298M765094K802240N693069N911773J917140n66588J015327
4510d7170L220606K870477m16020n691729r314461n917056L520262R156562M421926
4501A803397l993871n607715j022066J202996j065810j991919P39278K300507
4493g635203m77057m387012n998903o677051q756091j0401375p092254K546273
4485d8878673J3348012J7035841J0905605K158181k51359K636604K185164l489897
4477d350522o073996j083714L778708O40109n928447o594089j778790O29452j631063
$$ plain form
4534 -20615474 -10811638 -7192757 -4669023 -2428320 -4652587 -9771266 -11266837 -9093234
4526 -9093234 -9835086 -15637371 -22633420 -29785082 -39045304 -46561900 -44358912 -32736523
4518 -32736523 -21585225 -16820131 -14017891 -8324822 -2413049 -495909 -1062497 -47170
4510 -47170 3173436 6043913 5627893 -63836 -9378297 -15295353 -11775091 -2618529 1803397
4501 1803397 -2190474 -7798189 -8820255 -7617259 -8683069 -10674988 -9935710 -7635203
4493 -7635203 -8112260 -12499272 -18498175 -25175226 -33931317 -44332692 -51424946 -48878673
4485 -48878673 -35530661 -18494820 -7589215 -5431034 -5682393 -3045789 -860625 -4350522
4477 -4350522 -10424518 -11508232 -7729524 -7089415 -13017862 -19611951 -21390741 -20761289 -22392352
4468b2392352l388644j468157J891156M011131L779682J69126n305108o637813
4460b9340979j04825Q755457J1038161N666644j162197n506189q008234q484559
4452b7146721n465522p95579J637175J769026K698531M772705N407015L933276
4444a3190094J888791j07429j316570N89071M735629M496266l284202j0128332
4436a6316870n895107N363496R536529K051167o753424p085434r96345M165048
4428a5930940M841603P87286o355524j0497572m908970P173956J2935137N950075
4420f004949m559791n986650J554498P599027N915362J88777l182140k474664
4412f950530o49977j078987l732493n097949k902606q5856p70916k874198j02177
$$ plain form
4468 -22392352 -25780996 -27249153 -25357997 -21346866 -17567184 -17398058 -22703166 -29340979
4460 -29340979 -29445804 -20690347 -9652186 -3985542 -5147739 -10653928 -18662162 -27146721
4452 -27146721 -32612243 -33407822 -31770647 -30001621 -27303090 -22530385 -17123370 -13190094
4444 -13190094 -11301303 -11408732 -12725302 -12136231 -7400602 -2904336 -6188538 -16316870
4436 -16316870 -22211977 -16848481 -7311952 -5260785 -12014209 -19099643 -20095988 -15930940
4428 -15930940 -11089337 -10302051 -16657575 -27155147 -32064117 -24890161 -11955024 -6004949
4420 -6004949 -10564740 -16551390 -14996892 -7397865 -1482503 -1293726 -4475866 -6950530
4412 -6950530 -7600507 -8679494 -12411987 -17509936 -20412542 -20498398 -21269314 -24143512 -24245689
4403b4245689P515410J1196868M966134n377280r433657m818556K035589N000977
4395a3160204L281587j107717n881465q263302n999647J5420N734364P381332
4387a7999632M571970M16595j215942O26565K866789J954820j783004m931368
4379a5493207n487690m134370j581703J907094M206401K665426j007085j350451
4371b0275585L115702O665367M124583j417921k928211N47656L006238L95235
4363f766936m127840n329091k886970n15333J10304J074256L545070M661444J595145
4354h639951l135818m092761m39317K942537K845214J964329L387270N129567
4346c8930M077095J838239J708617K432990N81307k695305l419119k276473l701376
$$ plain form
4403 -24245689 -16730279 -5533411 -567277 -5944557 -15378214 -20196770 -18161181 -13160204
4395 -13160204 -9878617 -10986334 -16867799 -25131101 -31130748 -31115328 -25380964 -17999632
4387 -17999632 -13427662 -13011067 -14227009 -13600444 -10733655 -8778835 -10561839 -15493207
4379 -15493207 -20980897 -25115267 -26696970 -24789876 -20583475 -17918049 -18925134 -20275585
4371 -20275585 -17159883 -10494516 -6369933 -7787854 -10716065 -10168409 -7162171 -6766936
4363 -6766936 -10894776 -16223867 -19110837 -19626170 -19515866 -18441610 -14896540 -10235096 -8639951
4354 -8639951 -11775769 -15868530 -16307847 -13365310 -10520096 -8555767 -5168497 -38930
4346 -38930 4038165 5876404 7585021 10018011 10599318 7904013 4484894 2208421 -1492955
4337a492955p422732p848846l184981J506370K469790J927097J703919r63737
4329a3306075o624330q818346k647134O028684P209496N65618m403379j812923
4321b3808389L415877L356617k954917r987487j2813532j0726648n503456Q69212
4313e8152723O507319R594907R401205P191487N156234L903184J738437k626297
4305a7286247p303021q705972n776780j287728J272917Q55133j124647k354652
4297d1710997j018985K670895N756889M917072M21839l517747l223934N56339
4289c5148629L946518M257186K221725N25486R02386K534316K859182j314n189140
4280b3092284r136749q049634j612588N384963O921642K701536p72579J393151
$$ plain form
4337 -1492955 -8915687 -16764533 -19949514 -18443144 -15973354 -14046257 -12342338 -13306075
4329 -13306075 -19930405 -28748751 -31395885 -25367201 -18157705 -17592087 -21995466 -23808389
4321 -23808389 -20392512 -17035895 -19990812 -29978299 -42791831 -53518479 -59021935 -58152723
4313 -58152723 -51645404 -42050497 -32649292 -25457805 -20301571 -16398387 -14659950 -17286247
4305 -17286247 -24589268 -33295240 -39072020 -40359748 -39086831 -38231698 -39356345 -41710997
4297 -41710997 -42729982 -40059087 -34302198 -29385126 -28963287 -32481034 -35704968 -35148629
4289 -35148629 -31202111 -26944925 -24723200 -24197714 -23295328 -20761012 -17901830 -17903144 -23092284
4280 -23092284 -32229033 -40278667 -41891255 -36506292 -29584650 -26883114 -27655693 -26262542
4272b6262542N343846M046617j921319n498633m655534m904804q354345q698682
4264e0905396j835586O066870P646752N274699N436107P480647O509348L457380
4256a0869179K974286L719021L16449n944284p640935k908520J728738J375334
4248a7249090j738330m065335n262259n314159l055147P93915L603096M282163
4240b8005146L000636q60390n778433o155140L45363O901152O564333L331136
4232b0656489M863230Q232165M922706k610089l389371L354122O460240J597210
4224B773724k769187j442336j46372k437529k991487K40528P03566l588026n075388
4215a4732507j613026j993250q382069q608832L145840J3017946Q484305r23148
$$ plain form
4272 -26262542 -20918696 -16872079 -18793398 -24292031 -28947565 -33852369 -42206714 -50905396
4264 -50905396 -52740982 -46674112 -39027360 -33752661 -28316554 -20835907 -14326559 -10869179
4256 -10869179 -7894893 -4175872 -3859423 -9803707 -17444642 -20353162 -18624424 -17249090
4248 -17249090 -18987420 -23052755 -28315014 -33629173 -36684320 -35890405 -32287309 -28005146
4240 -28005146 -25004510 -25864900 -31643333 -37798473 -37453110 -30551958 -23987625 -20656489
4232 -20656489 -15793259 -7561094 -2638388 -5248477 -8637848 -5283726 1176514 2773724
4224 2773724 4537 -1437799 -1584171 -4021700 -7013187 -6772659 -6069093 -9657119 -14732507
4215 -14732507 -16345533 -18338783 -26720852 -35329684 -32183844 -19165898 -10681593 -11604741
4207a1604741K0465O771740M203970p022419j2322740o822216P00646M972242
4199b1103053Q633862J0595735N883347k232638m196901L93080K169444j799459
4191a656583l713291O65849N044293L505853j263552m341712n312547n484964
4183a2556654m743513l479673k615905r39779K938177O590968O552134L571044
4175d683201K48803l960849r909052j4006359j2341547o631401o67760N273585
4167d6677781J1121638J3180440R608132M527462J429463r62586j950790K168825
4159g555197P209734K435083r644931j1083506K904670J1975567K769537p785667
4151h774710k467642M739038m552851j5646368n967028J0195463N320923p798913
$$ plain form
4207 -11604741 -11584276 -4812536 -608566 -7630985 -19953725 -26775941 -26075295 -21103053
4199 -21103053 -12469191 -1873456 4009891 1777253 -2419648 -2026568 142876 -1656583
4191 -1656583 -5369874 -4704025 340268 3846121 2582569 -1759143 -7071690 -12556654
4183 -12556654 -17300167 -20779840 -23395745 -24335524 -21397347 -14806379 -8254245 -4683201
4175 -4683201 -4434398 -8395247 -18304299 -32310658 -44652205 -51283606 -51951366 -46677781
4167 -46677781 -35556143 -22375703 -12767571 -8240109 -6810646 -7773232 -9724022 -7555197
4159 -7555197 -345463 2089620 -7555311 -18638817 -15734147 -3758580 -989043 -8774710
4151 -8774710 -11242352 -6503314 -11056165 -26702533 -32669561 -22474098 -17153175 -24952088
4143b4952088N77968Q318617l7044941j17085276j34728156m3963935P2747972
4136b76129839J07542016O1719040J8801142J7750522K2655027N642872j0451446
4129e2470666l174506J0890832R916579Q53158j360203p3865l318429n787368
4121d4524468j163252M355645M156159K590297M028940M142575P31563k140M209078
4112b1475603N893585J368322k591197j998217k408048n728450l963314N613443
4104b5289479J1901366O245607l674854o096407j977725J98440j483126l129955
4096b3306133l783411m592753l792799J89584M279641M983065L531644K837615
4088a9653547L357773M722740O492842N423047j503028r352893q575301Q43899
$$ plain form
4143 -24952088 -24374120 -16055503 -53100444 -170185720 -304913876 -348877811 -276129839
4136 -276129839 -168587823 -106868783 -88067641 -70317119 -47662092 -42019220 -52470666
4129 -52470666 -55645172 -44754340 -34837761 -33984603 -35344806 -35418671 -38737100 -44524468
4121 -44524468 -45687720 -41332075 -37175916 -34585619 -30556679 -26414104 -25682541 -25684681 -21475603
4112 -21475603 -15582018 -14213696 -16804893 -18803110 -21211158 -26939608 -30902922 -25289479
4104 -25289479 -13388113 -7142506 -10817360 -16913767 -18891492 -18693052 -20176178 -23306133
4096 -23306133 -27089544 -31682297 -35475096 -35285512 -31005871 -26022806 -22491162 -19653547
4088 -19653547 -16295774 -11573034 -5080192 342855 -1160173 -10513066 -19088367 -18244468
4080a8244468P151523L155406l802946l932858J015267L013965N12746j852365
4072a2983730j856513q93558M16585K006552K090372l50026k986295l324093j886251
4063a9766957J18779K905967N708549O039960L484569O00930j248780k800324
4055d957307l099663k20239L640587M127196K570803M460052Q658599O679746
4047B1859774m124809j4782579j6298291j0043940k792476J636290K091211j404729
4039b3859549n067382m093141q04061k144796o714011m521661O367484J4348936
4031b6488181J1511007M984078L428140L576163j67277l487003r55844K256968
4023e341949k33776l206845O11809N735047K835862l928011l890795O29025j696039
$$ plain form
4080 -18244468 -11092945 -7937539 -11740485 -15673343 -14658076 -11644111 -11131365 -12983730
4072 -12983730 -14840243 -15733801 -15317216 -13310664 -11220292 -11570318 -14556613 -17880706 -19766957
4063 -19766957 -19648178 -16742211 -11033662 -4993702 -1509133 -908203 -2156983 -4957307
4055 -4957307 -8056970 -8277209 -4636622 -509426 2061377 6521429 15180028 21859774
4047 21859774 17734965 2952386 -13345905 -23389845 -26182321 -24546031 -22454820 -23859549
4039 -23859549 -28926931 -33020072 -33824133 -35968929 -42682940 -47204601 -40837117 -26488181
4031 -26488181 -14977174 -9993096 -6564956 -2988793 -3156070 -6643073 -7598917 -5341949
4023 -5341949 -5575725 -8782570 -8170761 -2435714 400148 -3527863 -7418658 -6789633 -8485672
4014h485672j0195175j2039011l440681M820263N335414L020424K644187Q34822
4006a7505429m483435q079666o239444k374884L87969L472484O233520M181372
3998b4407513k255463n720534k518760K705083N741355P532189P382070J642230
3990i899343o608052p167461J910709Q461076L210732o269288p336208n39398
3982b4237233L585320O86929m087284n799445m204943k96470M653164P757208
3974b1942754P404769N810408M870184K736755j509650m270489l547232l758734
3966a4206743q057347j0382053l145104R880341J6454491J0788237j102496j0192332
3958i963006j2428331q492121j563340M159717O626281P102368N788643j7885
$$ plain form
4014 -8485672 -18680847 -30719858 -34160539 -29340276 -24004862 -20984438 -18340251 -17505429
4006 -17505429 -21988864 -30068530 -36307974 -38682858 -38294889 -34822405 -28588885 -24407513
3998 -24407513 -26662976 -32383510 -34902270 -32197187 -26455832 -18923643 -11541573 -9899343
3990 -9899343 -16507395 -23674856 -21764147 -13303071 -10092339 -16361627 -23697835 -24237233
3982 -24237233 -20651913 -19964984 -24052268 -29851713 -34056656 -34353126 -29699962 -21942754
3974 -21942754 -14537985 -8727577 -3857393 -1120638 -2630288 -6900777 -10448009 -14206743
3966 -14206743 -22264090 -32646143 -35791247 -25910906 -9456415 1331822 229326 -9963006
3958 -9963006 -22391337 -30883458 -32446798 -28287081 -21660800 -14558432 -8769789 -8787674
3950h787674r132665j2996598o256222L235987L881734l025040o129911j879554
3942d1089943J881836Q27574N54375M449881O435504K024376k661151m77811N274741
3933b2780618O843954L925808J616225P19702j770258n164144n676161l126937
3925b5412429m81604K063952O156106R251531N990961l805183j3508310j6616034
3917c6361010j1758374j858922P470957J0381600O792154M221818P816224J1046949
3909b248604M548334p488232j0789174k220844M721644P63931m882284l00083
3901a7895312R262672J0137636K302024k130486L0214q52242q260935j1789452
3893a9195881m621369M029561L258901k526427k123380L751854M829820r14136
$$ plain form
3950 -8787674 -17920339 -30916937 -37173159 -33937172 -30055438 -33080478 -39210389 -41089943
3942 -41089943 -39208107 -38380533 -37826158 -33376277 -26940773 -24916397 -27577548 -28055359 -22780618
3933 -22780618 -15936664 -12010856 -10394631 -9674929 -11445187 -16609331 -22285492 -25412429
3925 -25412429 -25894033 -23830081 -17673975 -8422444 -2431483 -6236666 -19744976 -36361010
3917 -36361010 -48119384 -49978306 -42507349 -32125749 -25333595 -21111777 -13295553 -2248604
3909 -2248604 2299730 -5188502 -15977676 -18198520 -13476876 -12712945 -17595229 -17895312
3901 -17895312 -8632640 1504996 3807020 1676534 1706748 854506 -7406429 -19195881
3893 -19195881 -23817250 -19787689 -16528788 -19055215 -21178595 -17426741 -12596921 -13511057
3885a3511057m603810j746651J621956P57225m25790J378341J433123m290074
3877a9386737r986966p869287n06445L233487J793872J567979M765101N811434
3869b0577562J644679k621366k176117r7490j445452m705755m837363j545324
3861c6361750J389458L071596N841004R294719R618266N581933N79569k247761
3853c232966k786689j115619L316110P893463P055602m10951p959671q833898
3845f074619m200013j9181J537043K889576M811731M556909O31787m511276p562391
3836g940434p458769m944960j554576O15234M89365l33660L76583K002568K102293
3827a6646356N24746m75639m285R41797K516152N496007P419488M235001k603450
$$ plain form
3885 -13511057 -18114867 -19861518 -18239562 -17482337 -17908127 -16529786 -15096663 -19386737
3877 -19386737 -29373703 -37242990 -37749435 -34515948 -32722076 -31154097 -26388996 -20577562
3869 -20577562 -18932883 -21554249 -23730366 -23827856 -25273308 -29979063 -34816426 -36361750
3861 -36361750 -34972292 -31900696 -26059692 -16764973 -7146707 -1564774 -985205 -3232966
3853 -3232966 -6019655 -7135274 -3819164 4074299 11129901 10718950 2759279 -6074619
3845 -6074619 -10274632 -10293813 -8756770 -5867194 -1055463 3501446 4133233 -378043 -7940434
3836 -7940434 -15399203 -20344163 -21898739 -21283505 -20794140 -21127800 -20751217 -18748649 -16646356
3827 -16646356 -16121610 -16597249 -16601534 -15659737 -13143585 -7647578 -228090 4006911 1403461
3818A403461n873294k408690J660996j63765m754682m155318K120147O368410
3810e802735M156144M1794l10814J308412j080373q238785j3685751j1432626
3802c5044734l327690K917209K578196r53572j177834K688563M997498K200473
3794b5121891j778146j432589K090367K996598k17693k692556o78390L161779
3786b3672521L936243J090359j739934j889569k93082P00025M18539J86712R81981
3777b0281247J525548k49378l625845m702130j058749M501098O998347N158297
3769a1734059J878503k77313r17676L88943M068981P358279N424596j732154o857891
3760b399791l545706N229832J0405943P557011N99338m693138o662685o456950
$$ plain form
3818 1403461 -4469833 -6878523 -5217527 -5381292 -10135974 -14291292 -12171145 -5802735
3810 -5802735 -1646591 -1604797 -1915611 -607199 -1687572 -9926357 -23612108 -35044734
3802 -35044734 -38372424 -35455215 -32877019 -33830591 -35008425 -32319862 -27322364 -25121891
3794 -25121891 -26900037 -28332626 -26242259 -23245661 -23463354 -26155910 -26834300 -23672521
3786 -23672521 -19736278 -18645919 -20385853 -22275422 -22568504 -21868479 -21449940 -21263228 -20281247
3777 -20281247 -18755699 -19005077 -22630922 -27333052 -28391801 -23890703 -16892356 -11734059
3769 -11734059 -9855556 -10132869 -11050545 -10661602 -6592621 765658 6190254 4458100 -2399791
3760 -2399791 -5945497 -715665 9690278 17247289 17846627 13153489 6490804 33854
3752C3854m812491k551024j609813k852083m463823m810617n103794o473307o329266
3743c8972364j812120M022178M665711l36478l697255o62259M253692M931919
3735b7606976L156141M138619O076806K630665m864973o863590J07541O824546
3727a6401221M166638l773085o089156n02426N111098N090025K547113K458060
3719g392954L944820K444707l228735q642304q135628r35362O858986P386560
3711g699910o98226j0174348j2907010q237804k142796K29798j142426k853425
3703d5626147j462706L756036R154896R136036K727324l838527m138745K90807
3695c0001026K378343q88678n239225n429009j180907L707938N327928K241930
$$ plain form
3752 33854 -4778637 -7329661 -8939474 -11791557 -16255380 -21065997 -26169791 -32643098 -38972364
3743 -38972364 -40784484 -36762306 -32096595 -32433073 -36130328 -36792587 -32538895 -27606976
3735 -27606976 -24450835 -20312216 -14235410 -11604745 -16469718 -23333308 -23225767 -16401221
3727 -16401221 -12234583 -16007668 -22096824 -22599250 -17488152 -12398127 -9851014 -7392954
3719 -7392954 -3448134 -1003427 -4232162 -12874466 -21010094 -21945456 -15086470 -7699910
3711 -7699910 -8398136 -18572484 -31479494 -39717298 -41860094 -41630296 -42772722 -45626147
3703 -45626147 -47088853 -43332817 -34177921 -25041885 -22314561 -26153088 -30291833 -30001026
3695 -30001026 -27622683 -28511361 -33750586 -39179595 -40360502 -36652564 -31324636 -29082706
3687b9082706l416221o947818n201327n6350L542895K824165n13985k319303M51435
3678d0719215O441941R632557N444337k069797l862042J371195M447853k71525
3670a9584696n511742k842231L243751L274742n09487J708446R011389J0035486
3662a174342K591485j627099L538163Q082236K068840q782421j2939614r711278
3654a7954030o155133l930741M63936O281086Q667732O223868J379789m379057
3646i402550r439137r383633k303886N697202P131553L349970J696815M190569
3638h463097N657893K373914l351460p059883o139376q19174M902498N085740
3630g812945j302921p506546p050962k035196R63340o8383k664821n340598o966762
$$ plain form
3687 -29082706 -32498927 -39446745 -44648072 -44704422 -41161527 -38337362 -38851347 -41170650 -40719215
3678 -40719215 -34277274 -24644717 -19200380 -21270177 -25132219 -23761024 -19313171 -19584696
3670 -19584696 -25096438 -27938669 -24694918 -21420176 -21929663 -20221217 -11209828 -1174342
3662 -1174342 1417143 -209956 3328207 11410443 13479283 4696862 -8242752 -17954030
3654 -17954030 -24109163 -28039904 -27575968 -21294882 -12627150 -6403282 -5023493 -9402550
3646 -9402550 -18841687 -28225320 -30529206 -24832004 -17700451 -14350481 -12653666 -8463097
3638 -8463097 -2805204 -431290 -3782750 -10842633 -16982009 -17801183 -12898685 -7812945
3630 -7812945 -9115866 -16622412 -23673374 -25708570 -24745230 -24813613 -27478434 -32819032 -39785794
3621c9785794m170451L826679J0650929J0073504N151134K812447K388714j801145
3613a0853983q642623j0675394n883640K9403L200136M677997L926992j333356
3605b5554468p785175q300854k818115J341941J598810L224286Q156453J0526434
3597a9610688O901210J891366l48562j562411k721239j077452K231494J497494
3589a2798788k276303n08835O868772P139118m590468j3363382n690977Q024904
3581a7195959Q268651m094954j0931229n497804P12019J5760q51755L370614O157037
3572b0047620K438364q88869K979768Q185133N660640k137201n925059l964460
3564a3699304k063857k377780j565334R70939J433199j205188l322622l258224
$$ plain form
3621 -39785794 -43956245 -40129566 -29478637 -19405133 -14253999 -11441552 -9052838 -10853983
3613 -10853983 -19496606 -30172000 -36055640 -36026237 -32826101 -28148104 -24221112 -25554468
3605 -25554468 -33339643 -41640497 -44458612 -43116671 -41517861 -38293575 -30137122 -19610688
3597 -19610688 -12709478 -10818112 -11166674 -12729085 -15450324 -16527776 -14296282 -12798788
3589 -12798788 -15075091 -15583926 -8715154 -1576036 -6166504 -19529886 -25220863 -17195959
3581 -17195959 -8927308 -13022262 -23953491 -29451295 -28739276 -28723516 -29575271 -26204657 -20047620
3572 -20047620 -17609256 -18498125 -15518357 -7333224 -1672584 -3809785 -9734844 -13699304
3564 -13699304 -15763161 -18140941 -19706275 -18735336 -17302137 -18507325 -21829947 -25088171
3556b5088171l840252o306545o931497k858663K495233L639145N65523j501046
3548c9826273P43770M963629P134497O651584N751260N118113K546172l217524
3540a0134772q831375q660749j324017P309767R281492K924877n227834p868609
3532b2531220m972608k281493k422300j514577L428085P760001M949609k586206
3524b0170709m833974K239729J0335310R640976J489274m802362m865178l125819
3516a4092753m350777p029078o797724k597567K773489O022220N631754K420577
3508a8019859q00470j318967O61542K163301J101898j056453j066139K176196
3500a6158951O138041P134429M184378l176k451822l608629n734713p805185n385662
$$ plain form
3556 -25088171 -28928423 -35234968 -42166465 -45025128 -42529895 -38890750 -38325227 -39826273
3548 -39826273 -39082503 -34118874 -26984377 -20332793 -14581533 -9463420 -6917248 -10134772
3540 -10134772 -18966147 -27626896 -28950913 -21641146 -12359654 -9434777 -14662611 -22531220
3532 -22531220 -27503828 -29785321 -32207621 -33722198 -30294113 -22534112 -17584503 -20170709
3524 -20170709 -25004683 -22764954 -12429644 -2788668 -1299394 -6101756 -10966934 -14092753
3516 -14092753 -18443530 -25472608 -32270332 -34867899 -32094410 -26072190 -20440436 -18019859
3508 -18019859 -18820329 -20139296 -19477754 -17314453 -16212555 -17269008 -18335147 -16158951
3500 -16158951 -10020910 -2886481 1297897 1294721 -1157101 -4765730 -10500443 -18305628 -23691290
3491b3691290K485798R363073Q037796k64175p151715p202861l200730q42103
3483b2466207j708439k987264j767735K080203N996550O707677L221602j608538
3475a2532151l622908j715246J434055K787922J607363j051677l515092m030443
3467b0638177k034213Q15048K420349K829668L125789K422835r27465n106086
3459a7092252n632301j788007J284343p06618n188969o398157l111832N75779
3451c8058014J275657j25192j017282m72291R13533K796842N087564O542335M948197
3442a8108651L2683m284613l060445K790515N446987l98428q835145q933756J59029
3433c5191824O914191L101839m684370m922544K418259P467067O084505M363255
$$ plain form
3491 -23691290 -21205492 -11842419 -3804623 -4068798 -11220513 -18423374 -21624104 -22466207
3483 -22466207 -24174646 -27161910 -28929645 -26849442 -20852892 -14145215 -10923613 -12532151
3475 -12532151 -16155059 -17870305 -16436250 -13648328 -12040965 -13092642 -16607734 -20638177
3467 -20638177 -22672390 -21857342 -19436993 -16607325 -13481536 -11058701 -11986166 -17092252
3459 -17092252 -22724553 -24512560 -23228217 -23934835 -29123804 -35521961 -38633793 -38058014
3451 -38058014 -36782357 -36907549 -37924831 -38397122 -37483589 -34686747 -29599183 -23056848 -18108651
3442 -18108651 -18075968 -22360581 -25421026 -22630511 -17183524 -17581952 -26417097 -35350853 -35191824
3433 -35191824 -28277633 -25175794 -29860164 -34782708 -32364449 -24897382 -18812877 -14449622
3425a4449622O246453N929204k177557j2370428j3754995m742451N100090P302960
3417b2916346L274515q5162O06292K654483J663693l116889p233462n040658L432155
3408b6761379J0508893Q397052j303454q582548o455645J382785O097765M399830
3400a2316701P70537K59805K601951M289984L806969K522527J335913q46847m251442
3391a827304n973808l346308R77164R72226m249750p538264k858557N293638O872765
3382a1678198r1103o849637o261682j788150n66395k400954j300832M361883R184992
3373a7390076Q460637M047414R79869Q44389L30840m157610j1120973j4089316
3365c2094826q781735M72311M997660K969004J426227M943289Q284547N221561
$$ plain form
3425 -14449622 -8203169 -2273965 -4451522 -16821950 -30576945 -35319396 -30219306 -22916346
3417 -22916346 -19641831 -19726993 -19120701 -16466218 -14802525 -17919414 -25152876 -30193534 -26761379
3408 -26761379 -16252486 -7855434 -9158888 -17741436 -24197081 -22814296 -16716531 -12316701
3400 -12316701 -11546164 -11286359 -8684408 -4394424 -587455 1935072 3270985 2424138 -1827304
3391 -1827304 -7801112 -11147420 -10170256 -9198030 -13447780 -20986044 -23844601 -18550963 -11678198
3382 -11678198 -11769301 -18618938 -24880620 -26668770 -27235165 -29636119 -30936951 -26575068 -17390076
3373 -17390076 -8929439 -4882025 -3902156 -3057767 -2726927 -6884537 -18005510 -32094826
3365 -32094826 -40876561 -40404250 -35406590 -32437586 -31011359 -26068070 -17783523 -12561962
3357a2561962r09220k784196j222932k816022p346327p275986l09665O557429
3349b8668881P443262M055151j42421m072121n074609L05340P994209P903957
3341a0256113j379746q424849n471829J59365r39606n064173l751858M08961o73466
3332c5393314m324998q70034Q039220R481843n73352j0311255r347447j803424
3324d5102761L050385L460719K236599o66861n311038p410763l884078J303357
3316e2324441K870770K227226L963033P362157P457440L051100j507345k120342
3308b9020402J055945M766473N344461J721280k102198m5971P869671J3243322
3300B832581Q955843j343559p784341o390547j704541J469494L047362L726035
$$ plain form
3357 -12561962 -13471182 -16255378 -17478310 -20294332 -27640659 -34916645 -35226310 -28668881
3349 -28668881 -21225619 -17170468 -17312889 -21385010 -26459619 -26154279 -18160070 -10256113
3341 -10256113 -11635859 -20060708 -25532537 -25373172 -26312778 -31376951 -35128809 -34719848 -35393314
3332 -35393314 -39718312 -40588346 -32549126 -23067283 -23640635 -33951890 -43299337 -45102761
3324 -45102761 -42052376 -38591657 -36355058 -37021919 -42332957 -49743720 -53627798 -52324441
3316 -52324441 -49453671 -47226445 -43263412 -35901255 -28443815 -25392715 -26900060 -29020402
3308 -29020402 -27964457 -23197984 -17853523 -16132243 -18234441 -18280412 -10410741 2832581
3300 2832581 11788424 10444865 2660524 -3730023 -5434564 -3965070 -917708 2808327
3292B808327J817258l095730p280168p195957m296569j988703K71411N300180
3284a3659951J1112446J1113833L666435l517551l265644L75261j846435r289783
3276e311389j1104958k872761N528008M237169k066083k280727L847767O753220
3268c269754K910134j077629p63326j76382l024793o067998n382966k616191q57903
3259b0326808K25726J374529Q60524j813126l888468l941329l673609k766471
3251c3949032J875027Q432721Q735721k68436r812382j0294346l735421J238605
3243c7777543J935495J699823J505201k89074j999719k21091L657879N134506
3235b6354523L694208K235077J165121m38717J84697N662407J0940824Q162011
$$ plain form
3292 2808327 4625585 1529855 -5750313 -12946270 -17242839 -19231542 -18960131 -13659951
3284 -13659951 -2547505 8566328 12232763 8715212 5449568 5824829 3978394 -5311389
3276 -5311389 -16416347 -19289108 -13761100 -9523931 -11590014 -13870741 -10022974 -3269754
3268 -3269754 -359620 -1437249 -2200575 -2376957 -5401750 -11469748 -16852714 -19468905 -20326808
3259 -20326808 -20101082 -18726553 -17866029 -19679155 -23567623 -27508952 -31182561 -33949032
3251 -33949032 -32074005 -23641284 -14905563 -15173999 -24986381 -35280727 -39016148 -37777543
3243 -37777543 -35842048 -34142225 -32637024 -32926098 -34925817 -35146908 -31489029 -26354523
3235 -26354523 -22660315 -20425238 -19260117 -19698834 -19514137 -13851730 -2910906 5251105
3227E251105p89148n526549k536424j97990m744225r737598n979390L982247Q974160
3218a1303812M442635k374941k940270K031511M955252J994804j991713l25851
3210e512385N693822P788828K309506l972021l538284N77183l25635o651401r619853
3201a3250240m972215Q16360J474305N71833M049131Q408096M684867p152401
3193e370264j5834291j3003833l772420J173591l0797j92396L855551N699378
3185b7475481N28843m656136R8187J1498777J5355447O164423n283580p854135
3177a1623655m464399l753399n492070m050849q41737j807293m919483j883297
3169c8836182P337778J2595131Q512245J793104R5498K118903L238983L527931
$$ plain form
3227 5251105 4461957 -1064592 -3601016 -3799006 -8543231 -18280829 -24260219 -20277972 -11303812
3218 -11303812 -6861177 -9236118 -12176388 -10144877 -5189625 -3194821 -5186534 -5512385
3210 -5512385 181437 7970265 10279771 6307750 2769466 3346649 3021014 -3630387 -13250240
3201 -13250240 -18222455 -17406095 -15931790 -15359957 -11310826 -2902730 1782137 -5370264
3193 -5370264 -21204555 -34208388 -37980808 -36807217 -36838014 -37030410 -33174859 -27475481
3185 -27475481 -26946638 -31602774 -31504587 -20005810 -4650363 1514060 -3769520 -11623655
3177 -11623655 -16088054 -19841453 -25333523 -29384372 -30226109 -32033402 -36952885 -38836182
3169 -38836182 -31498404 -18903273 -10391028 -8597924 -8502426 -6383523 -3144540 383391
3161C83391M552259L871628j149420p312487q542478l581481K248447K347305
3153g182836m479337j1209183q314718M256984J3894657J0204905k22407k953844
3145f005779K958224N184424l71043l406654J045395K470353o340269j4388024
3137a8853373r294854J982050M290073j905606m180645m38557o6847m359624l244962
3128c6072345O052098J2682939R417010K975299J150278J311179j117136k957279
3120f557957m49542K069413m35602l889463j723048L338405L316672j901156m456724
3111a0689002q93254L334261K750522j196875m115790m700235m196381l109919
3103b2816673j152656J054794K206173J885735J173971J774519M271927O808727
$$ plain form
3161 383391 4935650 8807278 7657858 345371 -8197107 -11778588 -9530141 -7182836
3153 -7182836 -11662173 -22871356 -31186074 -26929090 -13034433 -2829528 -3051935 -6005779
3145 -6005779 -3047555 2136869 1765826 -1640828 -595433 1874920 -4465349 -18853373
3137 -18853373 -28148227 -26166177 -21876104 -23781710 -27962355 -28400912 -28467759 -32827383 -36072345
3128 -36072345 -30020247 -17337308 -7920298 -4944999 -3794721 -2483542 -3600678 -6557957
3120 -6557957 -7007499 -4938086 -5373688 -9263151 -10986199 -7647794 -4331122 -6232278 -10689002
3111 -10689002 -11582256 -8247995 -5497473 -6694348 -10810138 -15510373 -19706754 -22816673
3103 -22816673 -23969329 -22914535 -20708362 -18822627 -17648656 -15874137 -11602210 -4793483
3095d793483O306833K177561j825157j273710L104559N039923k17992r038376
3087e19842j2009636m875677M975093O319411j789325q207618m162607N021500
3079a5248701P500990J143947m671756l100502J731945K912440R95548J061989
3071g674100L482016L590180n36602n081734n899465l348533o06472K77928o95726
3062a6492508k649173m211489l652376m70725K975975L044233p22278l664390
3054b5842731p78831O466760J0858195Q366550L387572K147679L592657J691228
3046I889079m353844q239304o072642j946485r27544j451200N58886L516113K125161
3037f901780l666730p534250n435491o63233J629630J170161J151119K768692
$$ plain form
3095 -4793483 1513350 3690911 1865754 592044 3696603 8736526 8518534 -519842
3087 -519842 -12529478 -17405155 -12430062 -6110651 -7899976 -16107594 -20270201 -15248701
3079 -15248701 -7747711 -6603764 -11275520 -14376022 -12644077 -9731637 -8736089 -7674100
3071 -7674100 -4192084 -601904 -1138506 -6220240 -12119705 -15468238 -16074710 -15796782 -16492508
3062 -16492508 -19141681 -23353170 -27005546 -27476271 -24500296 -21456063 -22178341 -25842731
3054 -25842731 -26621562 -20154802 -9296607 -930057 2457515 4605194 8197851 9889079
3046 9889079 5535235 -2704069 -8776711 -10723196 -11650740 -13101940 -12543054 -9026941 -6901780
3037 -6901780 -10568510 -18102760 -23538251 -24201484 -22571854 -21401693 -20250574 -17481882
3029a7481882M467070N358105O047788N988713L048834k808116p401825o250048
3021i031361j98447M939498M785048O16865l716815o994257j0250350j2337552
3013c2187371r637952j550915O610199Q916061N679250K247434J593832J428886
3005a6900576o25621k435814n87246L728392N472060K196217l230964o917861
2997a9301413q238573q442255p292276l429218K821155Q836576J1682881J0145315
2989a3217808N886796K901796L599544M698315M29141q259475j2094082n201234
2981b1257007N576954R085690M502001J21587l75095j049818l055982j510010
2973g961680L829306M919355j979994q977021q548784m604680l527880k153662
$$ plain form
3029 -17481882 -13014812 -7656707 -1608919 4379794 7428628 4620512 -2781313 -9031361
3021 -9031361 -9229808 -4290310 494738 1111603 -2605212 -9599469 -19849819 -32187371
3013 -32187371 -41825323 -43376238 -36766039 -27849978 -22170728 -19923294 -18329462 -16900576
3005 -16900576 -17526197 -19962011 -20549257 -16820865 -11348805 -9152588 -12383552 -19301413
2997 -19301413 -27539986 -35982241 -43274517 -46703735 -43882580 -35046004 -23363123 -13217808
2989 -13217808 -7331012 -4429216 -829672 3868643 4297784 -3961691 -16055773 -21257007
2981 -21257007 -15680053 -6594363 -2092362 -1970775 -2345870 -3395688 -6451670 -7961680
2973 -7961680 -4132374 786981 -1193013 -10170034 -18718818 -23323498 -26851378 -29005040
2965b9005040M947618J2518707J1129926L019091r40231J545419K183333k874705
2957B524118q046757r604975j0204298r757570l514207O729725J0633349M142673
2949a7097942l328930k595553L158958O109666N207275L097737l84056m320245
2941a0153090l778916J590662L395682k829209q305278l968128M428395N519844
2933a4100038N39184q56703J242877k082114j0342226j1411636n60761J1151244
2925b6420173J2474152N578070j202242n049623o932543n757267j193858K591858
2917b5911626J887635j359792l419486m123720m648514l749568m4700M856908
2909c6512863Q329009R064995O107968k51637n430477m118400J089943J339600
$$ plain form
2965 -29005040 -24057422 -11538715 -408789 2610302 1670071 3215490 5398823 2524118
2957 2524118 -5522639 -15127614 -25331912 -35089482 -38603689 -31873964 -21240615 -17097942
2949 -17097942 -20426872 -23022425 -19863467 -13753801 -8546526 -5448789 -5832845 -10153090
2941 -10153090 -13932006 -12341344 -8945662 -11774871 -20080149 -24048277 -19619882 -14100038
2933 -14100038 -13560854 -14417557 -13174680 -15256794 -25599020 -37010656 -37571417 -26420173
2925 -26420173 -13946021 -8367951 -9570193 -14619816 -21552359 -27309626 -28503484 -25911626
2917 -25911626 -24023991 -25383783 -28803269 -32926989 -37575503 -41325071 -41369771 -36512863
2909 -36512863 -28183854 -19118859 -13010891 -13262528 -18693005 -22811405 -21721462 -20381862
2901b0381862n039775q412703k391868N350245M771987o08296J72959P392895
2893a9146418J0200951L799500l888655m892536j203523J438595J791203N73679
2885a1327204l447131r071249r663531j268520R349755J1387950L485917n293214
2877a5847227p597774n141789k892722j467488J292150M612251N056787J812350
2869b0173462j663909j928435N91785K895910L099678J733449L25348M0122J412059
2860a3667455M065964O224521N262003l43371r108443j6412241j6887352q557624
2852d9423998M402081J4076493J5532220J0811980N171330N89309m483629r683351
2844a3007565j1144198p014128j253407J012497j29037q44088O9308J63617j466893
$$ plain form
2901 -20381862 -25421637 -33834340 -36226208 -30875963 -26103976 -26712272 -26539313 -19146418
2893 -19146418 -8945467 -5145967 -9034622 -13927158 -15130681 -13692086 -11900883 -11327204
2885 -11327204 -14774335 -23845584 -33509115 -34777635 -25427880 -14039930 -10554013 -15847227
2877 -15847227 -23445001 -28586790 -31479512 -32947000 -31654850 -27042599 -21985812 -20173462
2869 -20173462 -21837371 -23765806 -23174021 -20278111 -17178433 -15444984 -15119636 -15079514 -13667455
2860 -13667455 -9601491 -3376970 1885033 1541662 -7566781 -23979022 -40866374 -49423998
2852 -49423998 -45021917 -30945424 -15413204 -4601224 570106 1159415 -3324214 -13007565
2844 -13007565 -24151763 -31165891 -32419298 -31406801 -31535838 -32379926 -32310618 -32147001 -33613894
2835c3613894j970883Q42384M763778N919349L533124J26401j854228j920379
2827b4174348q49345L47824J098406J816574L128862L884196J492887l951480
2819a7206424p238704k852122P424135J4536780J1395307L38933j0137214j4272729
2811a8012038j2251449o147171K842002J1741144J4461083P529440l732666r189945
2803a2759600n368556N39010N15404l660991l916917J779002O504199M832741
2795a1535708L35911r35848L99726K07227L701N151189J3682130J5029114L912497
2786B6249939j0262678j3618962m397250O279203Q723420L985362j505508n036053
2778A0417473q212257j1230033j0491394l069581P601992J2742839P040223m221940
$$ plain form
2835 -33613894 -35584777 -34742393 -29978615 -24059266 -20526142 -20399741 -22253969 -24174348
2827 -24174348 -25023693 -24675869 -23577463 -21760889 -18632027 -14747831 -13254944 -17206424
2819 -17206424 -24445128 -27297250 -19873115 -5336335 6058972 6397905 -3739309 -18012038
2811 -18012038 -30263487 -36410658 -33568656 -21827512 -7366429 163011 -3569655 -12759600
2803 -12759600 -18128156 -17589146 -17073742 -20734733 -24651650 -22872648 -16368449 -11535708
2795 -11535708 -11199797 -12135645 -11735919 -11528692 -11524991 -6373802 7308328 22337442 26249939
2786 26249939 15987261 2368299 -2028951 4250252 12973672 16959034 15453526 10417473
2778 10417473 2205216 -9024817 -19516211 -22585792 -14983800 -2240961 4799262 577322
2770E77322j0167905p069835j952667j647219l518814j514016L427247N793169
2762a6072718N113008N208627N579995K333561k575993k627388J331554O29404
2754a079950o291749r025684j430213P129111N495607k444300n207947j810127
2746a4665252l20683k141445r73532L163636K128154n533622r803961m206981
2738c2353686M108316N468465R48600k378387l032634m046629m645696j465800
2730c7397451L577635M341136j00941l208867l9044N857451P151852J710284n730477
2721b3838422r578968q532566m602524N61031O252587J0552259J0728966O886684
2713a1570953K634978M62448r49113k699794k342394J673996N196094L062831
$$ plain form
2770 577322 -9590583 -16660418 -18613085 -20260304 -23779118 -25293134 -21865887 -16072718
2762 -16072718 -10959710 -5751083 -171088 2162473 -413520 -3040908 -1709354 -1079950
2754 -1079950 -7371699 -16397383 -17827596 -10698485 -5202878 -7647178 -12855125 -14665252
2746 -14665252 -14985935 -17127380 -18100912 -14937276 -12809122 -18342744 -28146705 -32353686
2738 -32353686 -28245370 -22776905 -21828305 -24206692 -27239326 -31285955 -35931651 -37397451
2730 -37397451 -33819816 -29478680 -29579621 -32788488 -32827532 -26970081 -19818229 -18107945 -23838422
2721 -23838422 -33417390 -41949956 -46552480 -45991449 -39738862 -29186603 -18457637 -11570953
2713 -11570953 -8935975 -8473527 -9422640 -12122434 -14464828 -12790832 -7594738 -4531907
2705d531907l255491p948033r073602q610527o125450M9895N997810N386878N27356
2696b7583071Q77024P737109J0368865K576949o428840n595819J502099L490830
2688a3054854j213288m435800k691184o25427o99884K97530L054408K985238j489514
2679a7872775n031834l048149K190354N963200O959934O187377M378108L049565
2671B775780M157002O054836L533442n025048j3425509j3818473n475379M810781
2663a6412568R716735P256787J182866l050797l586965l588327o066556q530575
2655b3079400o289072n74177J731327j993995n546589k577015M223954P059428
2647b7045539L487221j894862m824465n373946m477810j290344M094549Q639979
$$ plain form
2705 -4531907 -7787398 -15735431 -24809033 -33419560 -39545010 -39495115 -33497305 -28110427 -27583071
2696 -27583071 -26706047 -18968938 -8600073 -6023124 -12451964 -18047783 -16545684 -13054854
2688 -13054854 -14268142 -18703942 -21395126 -22020553 -22720437 -22422907 -19368499 -16383261 -17872775
2679 -17872775 -22904609 -25952758 -23762404 -17799204 -10839270 -4651893 -273785 2775780
2671 2775780 6932782 12987618 16521060 11496012 -1929497 -15747970 -21223349 -16412568
2663 -16412568 -6695833 560954 1743820 -1306977 -4893942 -8482269 -14548825 -23079400
2655 -23079400 -29368472 -29942649 -28211322 -30205317 -35751906 -38328921 -34104967 -27045539
2647 -27045539 -23558318 -25453180 -30277645 -35651591 -40129401 -41419745 -37325196 -28685217
2639b8685217R655066Q223135P012731N961401K802463k417561o105508n373544
2631h927034j493354K359674N056568O958012O681690J830838o549307j3188900
2623g271813j3742054q843232k126025L422944N973501M807737K142119K211840
2615a3424983N460567O319058Q83552n530932m247611L967535Q427840K608398
2607D463424p105879j0319979n719747l99345R12134K8125o36868k195822n475097
2598b6449054p532420n488601j314815R77534J519569L699148P361864P917901
2590a9308874L914313M06725R28706N83697o613237j6130977j6605311n440646
2582e8265604P002107J1106780Q707021O483276N742878M420209L337834L429068
$$ plain form
2639 -28685217 -19030151 -10807016 -3794285 2167116 4969579 2552018 -3553490 -8927034
2631 -8927034 -10420388 -8060714 -3004146 3953866 10635556 12466394 5917087 -7271813
2623 -7271813 -21013867 -29857099 -31983124 -28560180 -22586679 -17778942 -15636823 -13424983
2615 -13424983 -7964416 -1645358 -761806 -6292738 -10540349 -6572814 1855026 4463424
2607 4463424 -2642455 -12962434 -18682181 -19081526 -18169392 -18141267 -18778135 -20973957 -26449054
2598 -26449054 -33981474 -39470075 -40784890 -39807356 -38287787 -34588639 -27226775 -19308874
2590 -19308874 -15394561 -14987836 -14059130 -13475433 -20088670 -36219647 -52824958 -58265604
2582 -58265604 -51263497 -40156717 -31449696 -24966420 -19223542 -14803333 -11465499 -8036431
2574h036431J191071n301513r231806k770206R543031J4375917P058877l237414
2566C591526p417187o752563n762169l367978K355010O658768L483793m133764
2558a1344564o618718j108028M097703P84592p720259j0411689k527950Q728152
2550b6120761J3670846J1441297P857569M639260k079967j1504499j4638253o467966
2542b3202474M386132N917535r15993m446268P41901P675641Q094336J867570
2534A18380n969409j0682092q913824r64391O314061N276915k211272o634279
2526b3665911m262435j185700j815180k006971J939053N379770K741002k982019
2518b5858391m644986j038179K852413K777109j409143o194740n776922K560717
$$ plain form
2574 -8036431 -6845360 -12146873 -21378679 -24148885 -14605854 -229937 6828940 3591526
2566 3591526 -3825661 -10578224 -16340393 -19708371 -17353361 -10694593 -7210800 -11344564
2558 -11344564 -17963282 -19071310 -14973607 -14189015 -21909274 -32320963 -34848913 -26120761
2550 -26120761 -12449915 -1008618 6848951 11488211 9408244 -2096255 -16734508 -23202474
2542 -23202474 -18816342 -12898807 -13814800 -18261068 -17519167 -9843526 -1749190 118380
2534 118380 -5851029 -16533121 -25446945 -26411336 -20097275 -14820360 -17031632 -23665911
2526 -23665911 -27928346 -29114046 -30929226 -32936197 -30997144 -25617374 -22876372 -25858391
2518 -25858391 -30503377 -31541556 -28689143 -25912034 -27321177 -33515917 -39292839 -36732122
2510c6732122J2226854J2318548J689613q503562r546345m884141j109069J745866
2502c2794358M707169L826114j886040m591230O18887N420452N84492p934922
2494c2049436p624218Q37877N759897L258647L92720J000104J720261J829196
2486b4874952M033643N152558p12019q636139o560359M820096J0294267K982435
2478a3500470n342861l723617J876642J464234k045566p65556K446409m29001
2470b0019786o839827o731156Q09045N671664J872045m799226o033500j052728
2462c7123469M720645O478683L730904l32721k432166k730481l289628l076619
2454c4054852J098428P171355P262729j458253j0578892j0372190j765609O877871
$$ plain form
2510 -36732122 -24505268 -12186720 -10497107 -19000669 -28547014 -33431155 -34540224 -32794358
2502 -32794358 -28087189 -24261075 -26147115 -30738345 -30119458 -24699006 -24114514 -32049436
2494 -32049436 -39673654 -38835777 -33075880 -29817233 -29424513 -28424409 -26704148 -24874952
2486 -24874952 -20841309 -15688751 -16400770 -25036909 -31597268 -26777172 -16482905 -13500470
2478 -13500470 -18843331 -22566948 -20690306 -19226072 -21271638 -22037194 -19590785 -20019786
2470 -20019786 -26859613 -33590769 -32781724 -27110060 -25238015 -30037241 -36070741 -37123469
2462 -37123469 -32402824 -25924141 -22193237 -22525958 -24958124 -27688605 -30978233 -34054852
2454 -34054852 -32956424 -25785069 -18522340 -19980593 -30559485 -40931675 -42697284 -35819413
2446c5819413J0695576R992457N155267k399726o675229k658441N067806O591614
2438a0050089n6832o532566o039345j221601J872087K197063K725010M514585
2430a2591688N261262K763648j950331m988106l370062J154703L537495J665088
2422h517991j143743j540852r03550j730588k514404n15848K747213L550209J766634
2413h802920q8607j833779m350966m929202j26092P200151J0102286P110351L281014
2404G562236J127005k249796o988164p318624j201979L602708j44452p221475
2396a2832541o185377M105491J2077617Q765664j015873o171937l366890J177870
2388c445976J624889j088000l102803l153756j972086K44219K397455J160826
$$ plain form
2446 -35819413 -25123837 -15131380 -9976113 -12375839 -19051068 -21709509 -16641703 -10050089
2438 -10050089 -10106921 -16639487 -22678832 -23900433 -22028346 -19831283 -17106273 -12591688
2430 -12591688 -7330426 -4566778 -6517109 -11505215 -14875277 -13720574 -10183079 -8517991
2422 -8517991 -9661734 -11202586 -12106136 -13836724 -16351128 -16866976 -14119763 -10569554 -8802920
2413 -8802920 -8891527 -10725306 -15076272 -20005474 -20131566 -12931415 -2829129 4281222 7562236
2404 7562236 8689241 6439445 -548719 -7867343 -9069322 -5466614 -5611066 -12832541
2396 -12832541 -19017918 -14912427 -2834810 5930854 4914981 -1256956 -4623846 -3445976
2388 -3445976 -1821087 -2909087 -6011890 -9165646 -11137732 -10893513 -8496058 -7335232
2380g335232m613364r847607q687333l159385m20431j341337O37525P099031R608749
2371a8059384K608460o037371n496314K186996N975656K390349j843636k505344
2363b0780588k694096l630899p87119O856976J1935776Q366150m0019n610029
2355f383848o528000n585174l554981N12324M930041O524995N110331L004532
2347a969780R15794k494472p239189j0567432r316962l252983L627986O025270
2339b4271768L281001J014847L823111Q096453O932811R99786k067533N38007
2331a653285K979853Q51654k307459k146356k84183N58765J805445M137695L433557
2322G375686k279086p216682n850121j687133j127617l303109l711096l373886
$$ plain form
2380 -7335232 -11948596 -21796203 -30483536 -33642921 -34063352 -35404689 -34767164 -27668133 -18059384
2371 -18059384 -15450924 -21488295 -26984609 -24797613 -18821957 -16431608 -18275244 -20780588
2363 -20780588 -23474684 -27105583 -27892702 -21035726 -9099950 -733800 -773819 -6383848
2355 -6383848 -12911848 -18497022 -22052003 -21539679 -16609638 -10084643 -4974312 -1969780
2347 -1969780 -1053986 -3548458 -10787647 -21355079 -30672041 -33925024 -30297038 -24271768
2339 -24271768 -20990767 -19975920 -16152809 -8056356 -1123545 -123759 -2191292 -1653285
2331 -1653285 1326568 2178222 -129237 -2275593 -2559776 -2001011 -195566 3942129 7375686
2322 7375686 5096600 -2120082 -7970203 -9657336 -10784953 -14088062 -17799158 -21173044
2314b1173044n456177o567155j550499N438283N367582j042405m002256l62648
2306b9348319K439602O9448k142038j67436J427067j235848l257224J391832J0283885
2297b0539031J6039611J4431192N571762o708791j3730325q415702K934314M643958
2289e773012o710223j4955847p098869O931283R248999N5407o072597m085208
2281b8460067j934660k489059M58758O529319O083252j823304m337954M648659
2273b1325056J2580728O922803n535816r846058m825368r96372k115650j928097
2265b7068886K500276N784483L310154l050415q841804j0212976m275287O846047
2257c5008408J3761980R347941l75462l044313K805792O391650J525791m919885
$$ plain form
2314 -21173044 -26629221 -33196376 -34746875 -29308592 -23941010 -24983415 -28985671 -29348319
2306 -29348319 -26908717 -26839269 -28981307 -29148743 -27721676 -28957524 -32214748 -30822916 -20539031
2297 -20539031 -4499420 9931772 15503534 8794743 -4935582 -13351284 -10416970 -5773012
2289 -5773012 -12483235 -27439082 -34537951 -27606668 -18357669 -18302262 -24374859 -28460067
2281 -28460067 -30394727 -32883786 -32425028 -25895709 -19812457 -21635761 -25973715 -21325056
2273 -21325056 -8744328 -1821525 -7357341 -17203399 -22028767 -23025139 -25140789 -27068886
2265 -27068886 -24568610 -18784127 -15473973 -18524388 -27366192 -37579168 -41854455 -35008408
2257 -35008408 -21246428 -11898487 -12273949 -15318262 -12512470 -6120820 -4595029 -9514914
2249i514914m826288m36025J194389j108519l228368k600894M98892M924163P660923
2240g436641M361247m751796j2359670j1657545m393276K220135M465346M419081
2232b5133119N008956O382697O732466M489414m6243m522363o821112p037608
2224b0946912n449879o00090O474214Q605402M18504j0896404j1995976k022079
2216c6413220N366259J986369m079024l601138j52078L62793K469590J0293051
2208b3767398J3835147K857749j1945443j0714537M962827J3078248M306800o183811
2200a3570418n619447k220190o119847r417532j081458J0766290R553588l371855
2192b1080869j0383163l354788P498224J1043395Q003705L553704j380273o531211
$$ plain form
2249 -9514914 -14341202 -14777227 -13582838 -14691357 -17919725 -20520619 -20021727 -15097564 -7436641
2240 -7436641 -3075394 -7827190 -20186860 -31844405 -36237681 -34017546 -29552200 -25133119
2232 -25133119 -20124163 -13741466 -7009000 -2519586 -2565829 -7088192 -13909304 -20946912
2224 -20946912 -26396791 -26996881 -20522667 -11917265 -11498761 -22395165 -34391141 -36413220
2216 -36413220 -31046961 -29060592 -33139616 -36740754 -36892832 -36530039 -34060449 -23767398
2208 -23767398 -9932251 -7074502 -19019945 -29734482 -24771655 -11693407 -7386607 -13570418
2200 -13570418 -19189865 -21410055 -27529902 -36947434 -38028892 -27262602 -17709014 -21080869
2192 -21080869 -31464032 -34818820 -27320596 -16277201 -8273496 -4719792 -6100065 -12631276
2184a2631276q379130n354813j676679j462624k760180j276887K708967M976642
2176b5855980L857432K876898N798035J0355613R553265Q89124q155347q330262
2168i011222j395045J679491l640755r223926p340358k057586j064548k929438
2160c4983387j312238K832681L140302n58670k266646n08825L27038o92841M54838
2151c3567748M025296N154544K990266K628406N417616N629427L51650m843361
2143a2213904m411915o10218J503532J102440m25618l016268n365027m145353
2135b7582331P1476J395763k546974n760385k834935K427830L187410M412j214095
2126c2851829J498424N073418P227398P661183N315165j60431n399659o406139
$$ plain form
2184 -12631276 -21010406 -26365219 -28041898 -29504522 -32264702 -33541589 -30832622 -25855980
2176 -25855980 -21998548 -19121650 -13323615 -2968002 6585263 7474387 -680960 -9011222
2168 -9011222 -10406267 -8726776 -12367531 -21591457 -28931815 -30989401 -32053949 -34983387
2160 -34983387 -36295625 -33462944 -30322642 -30881312 -33147958 -33656783 -33329745 -34022586 -33567748
2151 -33567748 -29542452 -24387908 -21397642 -18769236 -13351620 -7722193 -7370543 -12213904
2143 -12213904 -16625819 -17236037 -15732505 -14630065 -15055683 -18071951 -23436978 -27582331
2135 -27582331 -27510855 -26115092 -28662066 -34422451 -37257386 -34829556 -31642146 -31637734 -32851829
2126 -32851829 -31353405 -26279987 -19052589 -11391406 -6076241 -6236672 -11636331 -18042470
2118a8042470l711296j019755m21418j897424m749730o256189k685284M262250
2110c4521316O495305M12952n877438l217494M817363P404565K960105J95408
2102b1330550L267733O085554L353673j715942m070316l763136k628734m93299
2094b1295017J563825R3766m527190o074692r76909N693048P116917L767667J125851
2085a3512734J394122J683836j431429q272932j4850110j4163281k976438J0966572
2077d1162394J4409922M950376m248059j567995P408633R287654K868874r82860
2069i035849K219562M208521j256778p850508p235395k467839k411266o857620
2061c0687172o453629K589694J1830829J1884202M850254N19923K989592O739983
$$ plain form
2118 -18042470 -21753766 -22773521 -23194939 -25092363 -29842093 -36098282 -38783566 -34521316
2110 -34521316 -28026011 -27613059 -33490497 -36707991 -31890628 -24486063 -21525958 -21330550
2102 -21330550 -18062817 -11977263 -8623590 -10339532 -14409848 -18172984 -20801718 -21295017
2094 -21295017 -19731192 -19637426 -24164616 -30239308 -31216217 -25523169 -18406252 -14638585 -13512734
2085 -13512734 -12118612 -10434776 -11866205 -20139137 -34989247 -49152528 -52128966 -41162394
2077 -41162394 -26752472 -21802096 -26050155 -27618150 -20209517 -10921863 -8052989 -9035849
2069 -9035849 -6816287 -2607766 -3864544 -11715052 -18950447 -21418286 -23829552 -30687172
2061 -30687172 -37140801 -34551107 -22720278 -10836076 -5985822 -5465899 -2476307 4263676
2053D263676N929803K001639n58949j673377m210443p360284p063858l003817
2045a1675610K22220L47151Q05873M123800O461629K969298m413531r029172p720384
2036a7908726l069519J137266K787285J000992k994971n063892k166986K964038
2028b3314513M761735K223394l67506p4472J419098J824482J606832J911680K208713
2019g800557J478512m03471l092739n486015n294604j818766J344511J84137l357521
2010b4246513l555732J60400J949461j035591l708014r69984M204108N143164
2002b2058701P14735m294699n897226l973627j65901L579892N066771L217600
1994b3811156p86126m643152n891882k053857O389852J2666734Q937234k707977
$$ plain form
2053 4263676 10193479 12195118 11636169 9962792 5752349 -1607935 -8671793 -11675610
2045 -11675610 -11453390 -11106239 -10300366 -6176566 285063 3254361 -1159170 -10188342 -17908726
2036 -17908726 -20978245 -19840979 -17053694 -16052702 -19047673 -24111565 -26278551 -23314513
2028 -23314513 -18552778 -16329384 -16696890 -16771362 -15352264 -13527782 -11920950 -10009270 -7800557
2019 -7800557 -6322045 -6725516 -9818255 -15304270 -20598874 -22417640 -21073129 -20888992 -24246513
2010 -24246513 -27802245 -27641845 -25692384 -26727975 -30435989 -31405973 -27201865 -22058701
2002 -22058701 -21343966 -25638665 -31535891 -35509518 -35675419 -32095527 -27028756 -23811156
1994 -23811156 -24597282 -29240434 -35132316 -37186173 -30796321 -18129587 -9192353 -11900330
1986a1900330j0413954p661702k048060l333642q820555q733330j776808M152852
1978e0535529M652812K764652R19762j744348l356008M48652Q317379J3062988
1970b5469640J1785149Q702316O203281J392056n767966r579455q035556o917437
1962b7687252r425573r662006k777665N557529P323429M047983K764628M698481
1954b5160446N751746M477530J972829k697153r151964j1037572l395091P409728
1946c1830393J0053429L704784j525506M77464N056553O011311L388494k32286
1938d896150m068943o779452n639214j099382K380242K205957K50524j486912
1930a9133330k996435l069735M04179N205068N395926l40600n795051n080513
$$ plain form
1986 -11900330 -22314284 -29975986 -32024046 -35357688 -44178243 -52911573 -54688381 -50535529
1978 -50535529 -45882717 -43118065 -42198303 -43942651 -47298659 -46850007 -38532628 -25469640
1970 -25469640 -13684491 -4982175 1221106 2613162 -3154804 -12734259 -20769815 -27687252
1962 -27687252 -37112825 -46774831 -49552496 -43994967 -36671538 -32623555 -29858927 -25160446
1954 -25160446 -19408700 -14931170 -12958341 -15655494 -24807458 -35845030 -39240121 -31830393
1946 -31830393 -21776964 -18072180 -19597686 -19120222 -14063669 -8052358 -4663864 -4896150
1938 -4896150 -8965093 -15744545 -21383759 -22483141 -20102899 -17896942 -17646418 -19133330
1930 -19133330 -22129765 -25199500 -24795321 -19590253 -14194327 -14534927 -20329978 -25410491
1922b5410491R09262P645253J1777672J1028101M642043l461224o907478m790929
1914d567791k655078l636926m522538l223366l302878o635162p971837k657919
1906c9173495N308489Q937352P693589N399857K879337p82022l117872j387750
1898a4242515J664438J850534J199667M579204J0038808R911218J935300o877791
1890A0058863q671498k762411N053583P718348K344164n951359p502894M26536
1882G13332Q363491O307878k306469n703404q34125L434563K81443o698942j0883420
1873g325653j0454945o258142Q75379P328750P614325J655547m174375n901954
1865a6641068n971414o065582l247746K698334N483937J697556k345099J65875
$$ plain form
1922 -25410491 -24501229 -16855976 -5078304 5949797 10591840 7130616 223138 -4567791
1914 -4567791 -7222869 -10859795 -15382333 -18605699 -21908577 -28543739 -36515576 -39173495
1906 -39173495 -33865006 -24927654 -17234065 -11834208 -8954871 -9736893 -12854765 -14242515
1898 -14242515 -12578077 -10727543 -9527876 -4948672 5090136 15001354 16936654 10058863
1890 10058863 1387365 -1375046 3678537 11396885 13741049 7789690 286796 713332
1882 713332 9076823 15384701 13078232 7374828 6540703 9975266 10256709 3557767 -7325653
1873 -7325653 -17780598 -24038740 -23163361 -15834611 -8220286 -6564739 -10739114 -16641068
1865 -16641068 -22612482 -28678064 -31925810 -29227476 -23743539 -22045983 -24391082 -24225207
1857b4225207N815894O932727L942506L480436O762967Q163742M600927q94987
1849A4579005m869869o393880m560780O34426M742930K499587m121259p373380
1841d863220m395267n92256p83619k825871k600931n7958K919237O071319Q568776
1832A440210P172545O65152o605297r257635o826950k318635K392799O137370
1824g200441O033895K14925p863996j1806497q993120k365760L667320O427384
1816b1886290N254674J868771k38325L28195P34821j209022k125958J973237P284995
1807h014902N721848k447863p040232k239915M622465L950297k345228n171021
1799a2964551k317163K82845l27320n96840J229430J650678m73113j48067N508781
$$ plain form
1857 -24225207 -18409313 -11476586 -7534080 -4053644 2709323 10873065 15473992 14579005
1849 14579005 9709136 3315256 -1245524 -611098 4131832 6631419 2510160 -4863220
1841 -4863220 -9258487 -9850743 -10634362 -13460233 -16061164 -16119122 -13199885 -7128566 1440210
1832 1440210 8612755 9277907 2672610 -6585025 -13411975 -15730610 -13337811 -7200441
1824 -7200441 -1166546 -951621 -8815617 -20622114 -29615234 -31980994 -28313674 -21886290
1816 -21886290 -16631616 -14762845 -15001170 -14672975 -13938154 -15147176 -17273134 -15299897 -8014902
1807 -8014902 -2293054 -4740917 -11781149 -14021064 -9398599 -5448302 -7793530 -12964551
1799 -12964551 -15281714 -14998869 -15326189 -15923029 -14693599 -13042921 -13516034 -13664101 -8155320
1790h155320J0962132R448639K436013l328831n072202m845267l488874J56890
1782a886820M633435O076468L758461R69158m97797k596124o468155r563652r453987
1773a5029013p391444n544010l245349Q58429M594901M040217m27105l384586
$$ plain form
1790 -8155320 2806812 12255451 14691464 11362633 6290431 1445164 -2043710 -1886820
1782 -1886820 2746615 8823083 12581544 13550702 13052905 10456781 3988626 -5575026 -15029013
1773 -15029013 -22420457 -27964467 -31209816 -30351387 -25756486 -21716269 -22143374 -25527960
$$ [...]
##END=
