##TITLE=31P_DE-80H_X3
 64 sc D2O
 26.2.2025
##JCAMPDX= 6.0         $$ Bruker NMR JCAMP-DX V2.0
##DATA TYPE= NMR SPECTRUM
##DATA CLASS= NTUPLES
##ORIGIN= UXNMR, Bruker Analytische Messtechnik GmbH
##OWNER= root
$$ XWIN-NMR		Version 3.5
$$ Fri Jul 11 10:15:23 2025 Russian Standard Time (UT+4h)  Yarkov@DPX200
##.OBSERVE FREQUENCY= 81.013821
##.OBSERVE NUCLEUS= ^31P
##.ACQUISITION MODE= SIMULTANEOUS
##.ACQUISITION SCHEME= undefined
##.AVERAGES= 64
##.DIGITISER RES= 17
##SPECTROMETER/DATA SYSTEM= spect
##.PULSE SEQUENCE= zgpg30
##.SOLVENT NAME= DMSO
##.SHIFT REFERENCE= (INTERNAL, DMSO, 0, 198.062)
##AUDIT TRAIL= $$ (NUMBER, WHEN, WHO, WHERE, WHAT)
$$ ##TITLE= Audit trail, XWIN-NMR		Version 3.5
$$ ##JCAMPDX= 5.01
$$ ##ORIGIN= Bruker BioSpin GmbH
$$ ##OWNER= Yarkov
$$ C:/Bruker/XWIN-NMR/data/yarkov2/nmr/P31/2/pdata/1/auditp.txt
$$ ##AUDIT TRAIL=  $$ (NUMBER, WHEN, WHO, WHERE, WHAT)
(   1,<2025-07-11 10:14:43.07 +0400>,<Yarkov>,<DPX200>,
      <created by zg, POWCHK disabled, PULCHK disabled
       configuration hash MD5:
       00 E9 B6 7A A2 85 ED C7 34 08 36 98 17 FE 4E 26
       data hash MD5: 32K
       18 8A 60 97 8B 04 A8 58 23 73 F7 46 14 68 AE EF>)
(   2,<2025-07-11 10:14:55.95 +0400>,<Yarkov>,<DPX200>,
      <Start of raw data processing
       efp BC_mod = 2 LB = 1.5 FT_mod = 6 PKNL = 1 PHC0 = 1676.443 PHC1 = 49.15953 SI = 64K 
       data hash MD5: 64K
       55 50 3D 91 30 5C DF 18 B8 8C 7E 33 25 16 2B 2F>)
$$ ##END=
$$ 
$$ hash MD5
$$ 44 10 59 E7 BC 6F 49 A8 78 BE E6 C3 76 10 84 0D
##$RELAX= 
##$RELAX= 
##$RELAX= 
##$RELAX= 
##$RELAX= 
##$RELAX= 
##$RELAX= 
##$RELAX= 
$$ Bruker specific parameters
$$ --------------------------
##$DU= <C:/Bruker/XWIN-NMR>
##$EXPNO= 2
##$NAME= <P31>
##$PROCNO= 1
##$TYPE= <nmr>
##$USER= <yarkov2>
##$AMP= (0..31)
100 100 100 100 100 100 100 100 100 100 100 100 100 100 100 100 100 100 
100 100 100 100 100 100 100 100 100 100 100 100 100 100 
##$AQSEQ= 0
##$AQ_mod= 1
##$AUNM= <au_zg>
##$AUTOPOS= <>
##$BF1= 81.014009
##$BF2= 200.13
##$BF3= 200.13
##$BF4= 200.13
##$BF5= 200.13
##$BF6= 200.13
##$BF7= 200.13
##$BF8= 200.13
##$BYTORDA= 1
##$CFDGTYP= 0
##$CFRGTYP= 5
##$CHEMSTR= <none>
##$CNST= (0..31)
1 1 145 1 1 1 1 1 1 1 1 1 1 1 1 1 1 1 1 1 1 1 1 1 1 1 1 1 1 1 1 1 
##$CPDPRG= <waltz16>
##$CPDPRG1= <>
##$CPDPRG2= <waltz16>
##$CPDPRG3= <>
##$CPDPRG4= <mlev>
##$CPDPRG5= <mlev>
##$CPDPRG6= <mlev>
##$CPDPRG7= <mlev>
##$CPDPRG8= <mlev>
##$CPDPRGB= <>
##$CPDPRGT= <>
##$D= (0..31)
0 1 0 0 0 0 0 0 0 0.06 0 0.03 2e-05 3e-06 0 0 0.0002 0 0 0 0 0 0 0 0 0 
0 0 0 0 0 0 
##$DATE= 1752214482
##$DBL= (0..7)
120 120 120 11 120 120 24 19 
##$DBP= (0..7)
150 150 150 150 150 150 150 150 
##$DBP07= 0
##$DBPNAM0= <>
##$DBPNAM1= <>
##$DBPNAM2= <>
##$DBPNAM3= <>
##$DBPNAM4= <>
##$DBPNAM5= <>
##$DBPNAM6= <>
##$DBPNAM7= <>
##$DBPOAL= (0..7)
0.5 0.5 0.5 0.5 0.5 0.5 0.5 0.5 
##$DBPOFFS= (0..7)
0 0 0 0 0 0 0 0 
##$DE= 6
##$DECBNUC= <off>
##$DECIM= 4
##$DECNUC= <off>
##$DECSTAT= 4
##$DIGMOD= 1
##$DIGTYP= 9
##$DL= (0..7)
0 0 52 120 120 21 21 25 
$$ [...]
##$SUBNAM2= <"">
##$SUBNAM3= <"">
##$SUBNAM4= <"">
##$SUBNAM5= <"">
##$SUBNAM6= <"">
##$SUBNAM7= <"">
##$SUBNAM8= <"">
##$SUBNAM9= <"">
##$SW= 400.765351723535
##$SWIBOX= (0..15)
0 1 3 0 0 0 0 0 0 0 0 0 0 0 0 0 
##$SW_h= 32467.5324675325
##$TD= 32768
##$TD0= 1
##$TE= 0
##$TE2= 300
##$TE3= 300
##$TEG= 300
##$TL= (0..7)
0 120 53 12 22 120 120 120 
##$TP= (0..7)
150 150 150 150 150 150 150 150 
##$TP07= 0
##$TPNAME0= <>
##$TPNAME1= <>
##$TPNAME2= <>
##$TPNAME3= <>
##$TPNAME4= <>
##$TPNAME5= <>
##$TPNAME6= <>
##$TPNAME7= <>
##$TPOAL= (0..7)
0.5 0.5 0.5 0.5 0.5 0.5 0.5 0.5 
##$TPOFFS= (0..7)
0 0 0 0 0 0 0 0 
##$TUNHIN= 0
##$TUNHOUT= 0
##$TUNXOUT= 0
##$USERA1= <user>
##$USERA2= <user>
##$USERA3= <user>
##$USERA4= <user>
##$USERA5= <user>
##$V9= 5
##$VALIST= <valist>
##$VCLIST= <CCCCCCCCCCCCCCC>
##$VD= 0
##$VDLIST= <DDDDDDDDDDDDDDD>
##$VPLIST= <PPPPPPPPPPPPPPP>
##$VTLIST= <TTTTTTTTTTTTTTT>
##$WBST= 1024
##$WBSW= 4
##$XGAIN= (0..3)
0 0 0 0 
##$XL= 0
##$YL= 0
##$YMAX_a= 1697
##$YMIN_a= -499
##$ZGOPTNS= <>
##$ZL1= 120
##$ZL2= 120
##$ZL3= 120
##$ZL4= 120
##$ABSF1= 0
##$ABSF2= 0
##$ABSG= 0
##$ABSL= 0
##$ALPHA= 0
##$AQORDER= 0
##$ASSFAC= 0
##$ASSFACI= 0
##$ASSFACX= 0
##$ASSWID= 0
##$AUNMP= <proc_1d>
##$AZFE= 0.1
##$AZFW= 0.5
##$BCFW= 0
##$BC_mod= 2
##$BYTORDP= 0
##$COROFFS= 0
##$CY= -3
##$DATMOD= 1
##$DC= 0
##$DFILT= <>
##$DTYPP= 0
##$F1P= 0
##$F2P= 0
##$FCOR= 1
##$FTSIZE= 65536
##$FT_mod= 6
##$GAMMA= 0
##$GB= 0
##$INTBC= 1
##$INTSCL= 9.790993e-09
##$ISEN= 30
##$LB= 1.5
##$LEV0= 0
##$LPBIN= 0
##$MAXI= 10000
##$MC2= 0
##$MEAN= 0
##$ME_mod= 0
##$MI= 50
##$NCOEF= 0
##$NC_proc= -9
##$NLEV= 6
##$NOISF1= 182.463
##$NOISF2= 159.3651
##$NSP= 0
##$NTH_PI= 0
##$NZP= 0
##$OFFSET= 198.0616
##$PC= 4
##$PHC0= 1676.443
##$PHC1= 49.15953
##$PH_mod= 1
##$PKNL= yes
##$PPARMOD= 0
##$PSCAL= 0
##$PSIGN= 0
##$REVERSE= no
##$SF= 81.0140089999434
##$SI= 65536
##$SIGF1= 159.3651
##$SIGF2= -187.1042
##$SINO= 113.3802
##$SIOLD= 16384
##$SREGLST= <1H.CDCl3>
##$SSB= 0
##$STSI= 65536
##$STSR= 0
##$SW_p= 32467.5324675325
##$SYMM= 0
##$S_DEV= 0
##$TDeff= 32768
##$TDoff= 0
##$TI= <>
##$TILT= no
##$TM1= 0
##$TM2= 0
##$TOPLEV= 0
##$USERP1= <user>
##$USERP2= <user>
##$USERP3= <user>
##$USERP4= <user>
##$USERP5= <user>
##$WDW= 1
##$XDIM= 65536
##$YMAX_p= 337185200
##$YMIN_p= -9260560
$$ End of Bruker specific parameters
$$ ---------------------------------
##NTUPLES= NMR SPECTRUM
##VAR_NAME=  FREQUENCY,     SPECTRUM/REAL,   SPECTRUM/IMAG
##SYMBOL=    X,             R,               I
##VAR_TYPE=  INDEPENDENT,   DEPENDENT,       DEPENDENT
##VAR_FORM=  AFFN,          ASDF,            ASDF
##VAR_DIM=   65536,         65536,           65536
##UNITS=     HZ,            ARBITRARY UNITS, ARBITRARY UNITS
##FACTOR=    0.49542278885378, 1,            1
##FIRST=     16045.7642231865, 0,            0
##LAST=      -16421.768244346, 0,            0
##MIN=       -16421.768244346, -9260560,     0
##MAX=       16045.7642231865, 337185200,    0
$$ Real data points
##PAGE= N=1
##DATA TABLE= (X++(R..R)), XYDATA
$$ [...]
##PAGE= N=2
##DATA TABLE= (X++(I..I)), XYDATA
39170a64907j60891j03270O4943J22663j1082j08414J7252K01674J83153l481
39160C7640j20867r5021m4717j8022O0380J89401K39302J32397m8975j53348q7790
39149I0380J12009K70365J97963q3432l17863l06523j29088K4944J19382K12297
39139A90434K49413J27227q4447j86724j21838l3861m1786q8843m8757J09909
39129G0727K81080K94217P0304k41532l63637k03964K6121R5717K5371m5523r9803
39118i0922j65569j49905Q773J36996M4803j34716j14673R2297K04410J33684
39108c4822Q0160J34796J38598K8632j2488J01810J72720M4709j42393k17685
39098B94037k45295l14851k98742o9633K18288L19823K38878J49800J03916M3325
$$ y = [-164907, -325798, -429068, -364125, -241462, -252544, -360958, -343706, -142032, 41121, 37640, -83227, -178248, -222965, -240987, -180607, 8794, 248096, 380493, 331518, 178170, 90380, 202389, 472754, 670717, 587285, 269422, -37101, -166189, -141245, -21863, 190434, 439847, 567074, 482627, 295903, 174065, 140204, 98418, 9575, -39182, 70727, 351807, 646024, 716328, 474796, 111159, -92805, -66684, 29033, 54404, 8881, -90922, -256491, -406396, -397623, -260627, -215824, -350540, -465213, -372916, -168506, -34822, 45338, 180134, 318732, 347364, 334876, 436686, 609406, 654115, 511722, 294037, 48742, -266109, -564851, -634484, -416196, -96373, 142505, 292305, 396221, 439546]
39088D39546o449M709r464j39556k62661j91140J9401J44530J28868J12368J44993
39077C85145J20758Q501q0179r2444j05083j49381j41998l6461J07760K30471
39067B47089K94720K13607n0460l01091k53708O6900K96930K04582k0725r0987
39057F06857l1743o5353k15427k72072j29161M6407L8964j34509k38852r2881
39047d87770K08498L75577K48616j1852j38409j02434r5012j81967j88968P30
39037c72991K36364L19971K72994K23632J67200K9744j27683j73310j21437r7331
39027C57153j21437j09802o0965n2768o4505J42J02015Q1384p5473j81437j26030
39016b51723k1935Q736J1683N5057Q0421L7246J4427P9310J17570J1508j31566
$$ y = [439546, 433097, 437806, 428342, 288786, 26125, -165015, -145614, -1084, 127784, 240152, 385145, 505903, 514404, 434225, 341781, 236698, 87317, -54681, -91142, 16618, 247089, 541809, 755416, 704956, 403865, 150157, 217057, 513987, 718569, 697844, 606857, 575114, 509761, 294334, 22262, -106899, -60492, -21528, -156037, -394889, -487770, -279272, 96305, 344921, 333069, 194660, 92226, -2786, -184753, -373721, -372991, -136627, 183344, 456338, 679970, 847170, 876914, 749231, 575921, 454484, 357153, 235716, 125914, 64949, 12181, -52324, -52182, 49833, 131217, 55744, -125693, -251723, -273658, -264922, -253239, -198182, -117761, -80515, -66088, 13222, 130792, 142300, 10734]
39005A0734j27038q746L3815l7556r1088r4660j56413k54640j77548J41916M28284
38994c32940L80049P2354j32977l2580K12863L11063J58519r2812k15390j27875
38984B00274L0787N0070j10083k56520j81522Q5307L00805K79080Q7161n0034
38974D35325j2437Q7883O4099r0958j88008j07230K0699J528j34103j88713j10965
38963b22880n5099j02638j29933l5013R5465J61983K08943K58013J78665o3552
38953B93954k02575K082L44061L95474J15872r9231j1266J58771J34331k2748
38943A108725j12962j40669k14142k78603k00787j9965J07932J48343J68204J37882
38933G03958k9621k53947l09089j14354J47277K56154J93439J00975P8677P4011
$$ y = [10734, -116304, -125050, -91235, -128791, -219879, -314539, -470952, -725592, -903140, -761224, -332940, 47109, 119463, -13514, -46094, 166769, 477832, 636351, 543539, 328149, 200274, 231061, 281131, 171048, -85472, -266994, -181687, 119118, 398198, 485359, 435325, 422888, 510771, 574870, 483912, 295904, 188674, 209373, 210901, 76798, -111915, -222880, -277979, -380617, -510550, -545563, -450098, -288115, -79172, 178841, 357506, 293954, 91379, 93461, 437522, 832996, 948868, 849637, 838371, 997142, 1131473, 1108725, 995763, 855094, 640952, 362349, 161562, 141597, 249529, 397872, 566076, 703958, 674337, 420390, 111301, -3053, 144224, 400378, 593817, 694792, 773469, 847480]
38923H47480m0573k80562m56282l52526k6439K05357J61582L3111Q0716K37248
38913D09112K29306Q303j95867k30927j77237j19660j2378J51084K48232K11288
38903E21256J25981N8321m0792j67338j94444r3778l7605j27121j98454q5214
38893b39188Q8362J00243j0230k6296Q3604J48454J06319P2593Q5378L4158j01675
38882C41722j73036j11320n7161j21510j90864j15871L7416Q4873q611j08350
38872d22712j09665k7880Q3630J83029K11440J24636k0701q9764j5787J18484
38862C4710J71885R1385n1616j53384j80606j73287j60868j12141P497J54575
38852c71850K26996J65522J0454j35301j79676j02991K2502J01774J30968J87111
$$ y = [847480, 806907, 526345, 70063, -282463, -308902, -103545, 58037, 91148, 171864, 409112, 638418, 646721, 450854, 219927, 42690, -76970, -89348, 61736, 309968, 521256, 647237, 705558, 664766, 497428, 302984, 209206, 171601, 44480, -153974, -239188, -150826, -50583, -60813, -87109, -3505, 144949, 251268, 323861, 409239, 443397, 341722, 168686, 57366, 205, -121305, -312169, -428040, -390624, -305751, -314362, -422712, -532377, -560257, -476627, -293598, -82158, 42478, 21777, -67987, -83774, 34710, 206595, 297980, 246364, 92980, -87626, -260913, -421781, -533922, -526425, -371850, -144854, 20668, 31122, -104179, -283855, -386846, -364344, -262570, -131602, 55509]
38842E5509K66159K30078J7955j86377j65516P350O0157p0944j58527n7947P8238
38831G6135P9718K9104P1782J35875P0101n7713m6714J05228J89749J04267k8321
38820G29211q4159r9288j47237j98798j78419p4558N3359J22471P7126m6404j26844
38809B6460r9917m8626o2855p8624Q968J36682J52205O7853M0792J04394J23740
38798C71072M3824k6149k9805n7061j35928j31713K2541J66514J31894o727m9038
38787B99424M9812J44209R0548j08424l00046k91613n5260J71012J34552p0730
38777F3484j04788J11673K59655J16780r6390q6541M7455J8896j55697k05461
38767c0934n4501R4867R3995j0029j35988k19991j47136J02988K86370J65297
$$ y = [55509, 321668, 551746, 569701, 383324, 217808, 225158, 285315, 214371, 55844, -2103, 76135, 155853, 184957, 256739, 392614, 462715, 405002, 358288, 463516, 653265, 757532, 729211, 645052, 545764, 398527, 199729, 21310, -53248, 111, 122582, 199708, 153304, 26460, -73457, -122083, -184938, -263562, -254594, -117912, 34293, 102146, 142938, 247332, 371072, 414896, 388747, 358942, 301881, 165953, 34240, 56781, 223295, 355189, 348462, 299424, 349236, 493445, 583993, 475569, 175523, -116090, -171350, -338, 134214, 63484, -41304, 70369, 330024, 446804, 350414, 263873, 311328, 330224, 174527, -30934, -85435, 9432, 103427, 93398, -42590, -262581, -409717, -306729, -20359, 144938]
38757A44938q0663n1435K54682L99509J75592p5493j8974J48829M1142k95200
38747F42927m56428k80373l3362J1867q1145p9585P8506K31178K17981O2853q2884
38736B31535j28090j04523m5359Q1170K36720K36418k3058l33365l78963j45153
38726c72668Q8851J50526J28893J16773O9935r213j4658L6030k0544j71515j66149
38715a63739O1455K02703L8822j76732r6349J79431K75856J13296m3800k8330
38705C62613O2828J10959R9209J1110j43067k22977j17391L4934K4171r1660r6792
38694C3937j550K723o5814L87J68003J43514j19325k74291j13816J00953O5834
38683e9445j09398j38284j4972N8116L3311K3031N1062N5447N9953J08923R9671
$$ y = [144938, 64275, 12840, 267522, 667031, 842623, 767130, 748156, 896985, 938127, 642927, 186499, -93874, -127236, -115369, -196514, -276099, -197593, 33585, 251566, 314419, 231535, 103445, -1078, -46437, 34733, 271453, 507871, 484813, 151448, -227515, -372668, -283817, -133291, -4398, 112375, 182310, 173097, 158439, 194469, 173925, 2410, -163739, -102284, 100419, 139241, -37491, -133840, 45591, 321447, 434743, 390943, 362613, 425441, 536400, 635609, 646719, 503652, 280675, 163284, 198218, 222389, 130729, 33937, 32387, 35110, -30704, -30317, 137686, 281200, 161875, -112416, -226232, -125279, -59445, -168843, -307127, -322099, -263983, -230672, -207641, -156579, -101132, -41179, 67744, 167415]
38672A67415q7296l32061l72471j48578J39273L04989L27163K37802O3512r0481
38662B09267q3694O0509J39602L2945j31296j51897j8621Q5802J7211j58885k37394
38651b36451j05999J06287J58814l385j58005q1717J52137K68946J53247k3388
38641B30486n2541N6738J31406N7574j15619k44623k09645k785K46731L53468
38631D51190K33766n008j54878j02790O3860J54372P7830p2680j53546j41377
38621C50739j03095l4936J32418L38338L63197J17574j61062j83525j9150j0312
38611G90186k60408m41309k35756K04555M37764K87972J6383o8970J4208L0696
38601G75321j14473k65923k41796n5946J17251J40949L6243p0499q3085j7823
$$ y = [167415, 80119, -251942, -624413, -772991, -633718, -328729, -1566, 236236, 299748, 209267, 125573, 186082, 325684, 358629, 227333, 75436, 56815, 142617, 159828, 943, -236451, -342450, -236163, -77349, -80734, -238739, -320456, -168319, 100627, 253874, 230486, 177945, 234683, 366089, 423663, 308044, 63421, -146224, -149009, 97722, 451190, 684956, 679948, 525070, 422280, 486140, 640512, 718342, 645662, 492116, 350739, 247644, 212708, 345126, 683464, 1046661, 1164235, 1003173, 819648, 800498, 790186, 529778, 88469, -147287, 57268, 495032, 783004, 799387, 730417, 744625, 775321, 660848, 394925, 153129, 97183, 214434, 355383, 391626, 321127, 238042, 220219]
38591B20219L0769j981q2118j22942q7081j4887M3548P6680P6269J4886q7708
38580F5654j22712j866J98733K87153J68540n1976j98080j93088q1043N2259J35508
38569B59082J45355J32810J72203K43414K20817L4887k10460l52969l55892k92302
38559c055j92305k8189J50726K00465N8795j43763k15663j00116J05339K70553
38549A02787L18463K38011Q7271l2164o4857n8847q6275j27158j00477p075M0736
38538C10415l4377j60630k00018j11262J5527O7067J3334p9545j15310o1135J1043
38527c44891Q783m4966k6781R5274J70875O6682j08652j21681O0192K19658J99005
38516A73498J00004Q9317J40049J00111o2179k20657k67662k10377j04466L500
$$ y = [220219, 250988, 249007, 166889, 43947, -43134, -58021, -14473, 62207, 138476, 153362, 65654, -57058, -58924, 139809, 426962, 595502, 543526, 345446, 152358, 71315, 123574, 259082, 404437, 537247, 709450, 952864, 1173681, 1208568, 998108, 645139, 289247, -3055, -195360, -223549, -72823, 127642, 186437, 42674, -172989, -273105, -167766, 102787, 421250, 659261, 746532, 714368, 649511, 590664, 504389, 377231, 276754, 269679, 310415, 276038, 115408, -84610, -195872, -180345, -113278, -99944, -179489, -294799, -355934, -344891, -336108, -381074, -407855, -312581, -141706, -75024, -183676, -305357, -245165, -25507, 173498, 273502, 362819, 502868, 602979, 540800, 320143, 52481, -157896, -262362, -258862]
38506b58862O2470L4654m9233j05338q2907r650M1099J4105o4179p7012O0333
38495d34520K47820K71411Q4327r6845p4599O3723J00027R477m3593K2639J24083
38484B73950J78698J83980J30438M314j16777j29550p1321n9870p1704K7094K09063
38473E58315K58679Q4965j35090k14068j73829j09153j6012J07923J48877K8547
38463E39154j31084j43077Q814J78669K36758J54820p023j19557p6978N7623R4730
38452G92849k7725j47569j10937K4035J06525R0640J4133r6693j93558j93454
38442B58246j01058k9578j8172K5101J13250J03489m2056j23766r107J25258P0389
38431C71996p3337p9104L2037P2050K6191K9582Q1732O1344k3426n5307l2576
$$ y = [-258862, -196392, -161738, -210971, -316309, -399216, -408866, -367767, -353662, -417841, -494853, -434520, -186700, 84711, 169038, 72193, -2406, 61317, 161344, 170821, 127228, 149867, 273950, 452648, 636628, 767066, 771380, 654603, 525053, 453732, 393862, 322158, 349252, 558315, 816994, 901959, 766869, 552801, 378972, 269819, 253807, 361730, 510607, 539154, 408070, 264993, 273807, 452476, 689234, 844054, 837031, 717474, 640496, 698119, 792849, 765124, 617555, 506618, 530653, 637178, 727818, 741951, 645258, 451700, 258246, 157188, 127610, 109438, 134539, 247789, 351278, 309222, 185456, 176349, 301607, 371996, 298659, 219555, 251592, 323642, 349833, 379415, 461147, 522491, 499065, 443758, 411182]
38420D11182l3413j9601P3273J28958J7940j05944l131K11685J96160o1255k06363
38409F09491r3450J4803o0145j26016k5101M1488j27635l34998k57811N7957K66530
38398c4887J85722l7241j57309o3922J51603K50192O3492k61654l80546j90844
38388d75394L7397P7467N0264J31347J97576M6574j95305k05666N4143K84084
38378B487K74154J37608O5987N7216r791j48214k23330j26167O6273J53931O5380
38367C15534k3483O7148K20056J56844j32396l34339k45641j6334J34742J86527
38357C28658J60422j7041k82969l36465m8158K48241J88161q1019j35416Q4597
38347A09011K45762J60483k3766j55261k35057k21464k7905K19209K42389K5080
$$ y = [411182, 377769, 358168, 431441, 560399, 578339, 472395, 469264, 680949, 877109, 815854, 609491, 516041, 530844, 470699, 344683, 319582, 361070, 233435, -101563, -359374, -301417, -34887, 150835, 113594, -43715, -107637, 43966, 294158, 357650, 95996, -284550, -475394, -437997, -360530, -310266, -178919, 18657, 65231, -130074, -335740, -281597, 2487, 276641, 414249, 480236, 537452, 527661, 379447, 156117, 29950, 96223, 250154, 315534, 292051, 359199, 579255, 736099, 603703, 269364, 23723, 7389, 142131, 328658, 489080, 472039, 189070, -147395, -195553, 52688, 240849, 159830, 24414, 109011, 354773, 515256, 491490, 336229, 101172, -120292, -148197, 71012, 313401, 338481]
38337C38481j27147l5638J17442J16971J0934n9013q4493r8278o2677P689L938
38326A28209o7883l8450J29327K15814Q2983q0072n6401N2588K5061j01165j23945
38315A66066l9296j6521o7958l2342J16105K09886J71244J07692P3207k2194j74426
38304D91463j94997o565J71803J25977k1149m624J58891K05522N7209n6518J9462
38293I46474J10637l786k34585l15944j90771m5700o214j4327j5409n0900j03632
38282G5843m5275J52473L04188K35799J7523j43313j51595o1848L9223P5632p64
38271D97886j18367j05243P1423J90022O1258j64991j83908K7533J83869J01733
38261E61215q1328j50021q5634q318J7877J9547K6527K7227q764p7036r8605O789
$$ y = [338481, 211334, 175696, 293138, 410109, 421043, 362030, 277537, 179259, 116582, 124271, 128209, 60326, 21876, 151203, 367017, 450000, 369928, 313527, 366115, 391176, 290011, 166066, 126770, 110249, 42291, 9949, 126054, 335940, 507184, 614876, 688083, 665889, 491463, 296466, 289901, 461704, 587681, 566532, 561908, 720799, 926321, 983530, 927012, 946474, 1057111, 1053325, 818740, 502796, 312025, 266325, 260111, 245784, 230375, 179475, 75843, 30568, 183041, 487229, 723028, 740551, 597238, 445643, 383795, 423018, 498650, 497886, 379519, 274276, 345699, 535721, 596979, 431988, 248080, 275613, 459482, 561215, 479887, 329866, 244232, 235914, 253791, 273338, 299865, 327092, 318328, 241292, 142687, 149476]
38249A49476J63105J62776m4599k13568j24821P1303P2573r5433j19565Q6278
38239A07525K31821J00554j42762k32799j46459r358J22294K13616J76622L1029
38229D52083k1378J28845K90465K26850m869j62492j58416r5087n3822m8607j16758
38218D36814k52609l04275j40109J12526J93480O5902m4638J9982J63458K19698
38208D70229J63380O4933m2192j56997k34791j96577k2748J78377K26470N4709
38198E04793j62096j70908K8958J51290O878k20142k27629j0046J73237J71809
38188B46144P8241J5644j994J5408O9052Q4199l8878k31541k73083p8351J63242
38177D8083K26664J24454M2465P4857J27471O7696r9604k25624j81728k3429N0242
$$ y = [149476, 312581, 475357, 430758, 217190, 92369, 163672, 236245, 140812, 21247, 107525, 339346, 439900, 297138, 64339, -82120, -91478, 30816, 244432, 421054, 452083, 430705, 559550, 850015, 1076865, 1071996, 909504, 751088, 656001, 602179, 553572, 436814, 184205, -120070, -260179, -147653, 45827, 111729, 67091, 87073, 250531, 470229, 633609, 698542, 656350, 499353, 264562, 67985, 45237, 223614, 450084, 504793, 342697, 171789, 200747, 352037, 358915, 138773, -88856, -98902, 74335, 246144, 324385, 340029, 338035, 353443, 422495, 506694, 467816, 236275, -36808, -115159, 48083, 274747, 399201, 441666, 516523, 643994, 711690, 612086, 386462, 204734, 181305, 231547]
38166B31547o7487k47428k74476r0740J79646L83787M23458K59098k8024k19194
38156E50187j59762L3023J07648Q565r4349r9743r8966j61005j90065r7288L8649
38145a63106R5029P3652M4954K5317O281J6364O4201R8961R9249J13416J47139
38134F21457J18907M290r2761j03111r9537j31442r7681N6804J53590J1445k16560
38123B25401j93811J12424L42977K19196j03084k73386j87163l3271J1114l2724
38113H7673n8115m0829l2873m6697k3156O9885J59431J47269N1412j2727l377
38102B97896j510m2584k5476J02068J87544Q1471p5784q020K56597L51133O5761
38091A189096l39849m70194k74301j5589J11367J26102R3430K6653l8580m8928
$$ y = [231547, 164060, -83368, -357844, -448584, -268938, 114849, 538307, 797405, 769381, 550187, 390425, 423448, 531096, 539661, 445312, 345569, 246603, 85598, -104467, -201755, -163106, -68077, 5575, 50529, 75846, 82127, 98491, 162692, 261653, 360902, 474318, 621457, 740364, 744654, 651893, 548782, 449245, 317803, 220122, 276926, 430516, 441961, 225401, 31590, 144014, 486991, 706187, 603103, 329717, 142554, 109283, 120397, 87673, 29558, -11271, -44144, -90841, -113997, -44112, 115319, 262588, 314000, 301273, 297896, 296386, 253802, 228326, 330394, 517938, 599409, 523625, 515605, 772202, 1123335, 1189096, 849247, 379053, 104752, 89163, 200530, 326632, 420062, 446715, 408135, 359207]
38081C59207l6449p7648j34693p9660R5898K35776K25243J10948k9240j90905
38071D78477l42075l57339j69806J01773K81072L14133K39183P9852j14489k12930
38061B97851j34475J2849N4428k9300j21006j49792j18919r347J69822K65774
38051B37885J16771j79025l18105j63328J07181K71648L02478K56220J24189o2346
38041F93568j34880J3351K10308J68124j51818m68430m82792j71325K15048L89224
38031B80378K82851R3254M3099J05381P0478j12902k39255j63067k6185k1109
38021C12923q8197m7535Q3849J33679O8723J9796L7042L7501K35Q327O8839P5840
38009G11022j0628j12683j83586k36615k09909p963K72104L68389J97580k2600
$$ y = [359207, 322758, 245110, 110417, 30757, 126655, 362431, 587674, 698622, 669382, 478477, 136402, -220937, -390743, -288970, -7898, 306235, 545418, 625270, 510781, 297851, 163376, 176225, 230653, 201353, 80347, -69445, -188364, -197711, -27889, 237885, 354656, 175631, -142474, -305802, -198621, 73027, 375505, 631725, 755914, 693568, 558688, 572039, 782347, 950471, 798653, 330223, -152569, -323894, -108846, 280378, 563229, 656483, 699582, 804963, 875441, 762539, 523284, 360217, 334032, 312923, 224726, 177191, 261040, 394719, 463442, 483238, 520280, 557781, 558016, 566343, 635182, 711022, 700394, 587711, 404125, 167510, -42399, -50362, 221742, 590131, 787711, 765111]
37999G65111r3651q0535j08450j21305l1309N6812r30j17630r3074N7478J23750
37988C56267L4735n0522j6714M5613K5580k6152q958M5410J9974j06989k18792
37977I9452j87511m081K02164K62799J32030l6749l4212J56099L15375K44539
37967A149905J630j88338k11069j43798p6182N113R4333O8391j40768l45623k68955
37956e5361P0311L24165K51795J7840q3491m4190o3581j51759r9463J33339K74116
37945E73721J09108k02511l45973k43480o6155M2088P6255O2420P575m9693o3234
37934i9879n1753n6676n6905k1179k51m6818q3748J636J49971J82507P9252L1835
37922B7992J54170K96719K56147N4374j12908j27628l1086Q7282J61299J41489
$$ y = [765111, 671460, 590925, 482475, 361170, 329861, 386673, 385743, 268113, 175039, 232517, 356267, 391002, 340480, 323766, 369379, 394959, 368807, 359849, 405259, 425233, 318244, 99452, -88059, -92140, 110024, 372823, 504853, 468104, 433892, 589991, 905366, 1149905, 1151535, 963197, 752128, 608330, 532148, 537261, 631594, 699985, 559217, 213594, -55361, 14950, 339115, 590910, 608750, 525259, 481069, 417488, 265729, 166266, 299605, 573721, 682829, 480318, 134345, -109135, -175290, -133202, -56947, 5473, 13048, -36645, -99879, -151632, -208308, -265213, -286392, -286643, -333461, -417209, -415573, -265602, -83095, -3843, 27992, 182162, 478881, 735028, 789402, 676494, 548866, 517780, 605062, 766361, 907850]
37912I07850L4311o1935n8683j005R898n719N6003J61026J24648j04743l06508
37901G55143k66157p3653K7807P518M5120J83961K35109J01493l2047J0534R6085
37890A090913n425k13764k10254P8551L17983J90562j88109m24120l22063n8566
37880B55708R2659P2580K8762P4747J47149J20060K620n7749K2723J43741J56698
37869A059698N0616p5508j62192k04771j68772k7244J30620J70421J06076Q4041
37859I62985J46342J57306K4675j49879k28574k17657j81906r5648P8063K35590
37849G31297K18909L5921j34110j59428p6241J7882Q6868J29560J07639j9510
37839I38787j93638k57853j18821R8180J41614o1819k73010k21485L3622J80339
$$ y = [907850, 942161, 880226, 821543, 820538, 830436, 824717, 880720, 1041746, 1166394, 1061651, 755143, 488986, 415333, 443140, 450658, 495778, 679739, 914848, 1016341, 984294, 994828, 1090913, 1085488, 871724, 661470, 740021, 1058004, 1248566, 1060457, 636337, 314274, 255708, 348367, 420947, 449709, 524456, 671605, 791665, 794285, 736536, 759259, 903000, 1059698, 1110314, 1034806, 872614, 667843, 499071, 471827, 602447, 772868, 878944, 962985, 1109327, 1266633, 1291308, 1141429, 912855, 695198, 513292, 417644, 495707, 731297, 950206, 986127, 852017, 692589, 616348, 634230, 721098, 850658, 958297, 938787, 745149, 487296, 368475, 466655, 608269, 546450, 273440, 51955, 85577, 265916]
37829B65916P9328p6951p8702K1649N6702O687l8413n6883o4337Q976K25291M60924
37817H10187M91514K58721p4311l23947m19870l54082j45888J04885K43727K01735
37807G92671N7675o2682j02927q8638p6193r7633j24220r3526L601R3965J09011
37796D11104N9611m478n1844n2912J6842J07396J12059J7894m8892Q60R0620J04475
37784G62735M0562m8207j48634k17222j50684L2951J18366k7145k19908k06228
37774f3414l0704P1524N5010O8790J36693J22446J3155m0966l991r614q4947p1760
37762A62222R2611K39282K07788L8106j42531k42841j81870M6183K45535J98518
37752F63003J3223J2164K12638K55255j4700k54825j49119R7539R9978j19497
$$ y = [265916, 345244, 268293, 189591, 211240, 267942, 274629, 236216, 179333, 114996, 123972, 349263, 810187, 1301701, 1560422, 1486111, 1162164, 742294, 388212, 242324, 347209, 590936, 792671, 850346, 787664, 684737, 596099, 519906, 422273, 298053, 204527, 208128, 302093, 411104, 470715, 466237, 414393, 361481, 378323, 485719, 597778, 615672, 566780, 567640, 658260, 762735, 803297, 755090, 606456, 389234, 238550, 271501, 389867, 362722, 142814, -63414, -94118, -22594, 32416, 101206, 237899, 360345, 373500, 332534, 328543, 318929, 233982, 162222, 254833, 494115, 701903, 740009, 597478, 354637, 172767, 218950, 464485, 663003, 676226, 688390, 901028, 1156283, 1141583, 886758, 737639, 835178, 935156, 815659]
37742H15659k30486j14358N8437J66962K36750K57502J83558P5660J0220q1245
37732A378659k52961l34764j60531Q9140R3762j14406k04267p1062N1373K8851
37722E03794N984N9680L3961j28559k12728q0933P7972N9468l8300l1298L0943
37711B79984R710l9248Q718P6825J5353r9126p2079N9300O7991p6727j37908K0839
37699A13632K29417K65602J33870j1542p8452o7172l289N2247R228j30400k13740
37688B99401j02645J25300K32788R3119j52871k42865q0254J57372K20025P4957
37678F24327o9548m4414P1303R8666K6177j3859P671k2179j24325j45166q488
37667D00165J08110N884k23273k96581j18140J11478J75364Q2095j9505m7355
$$ y = [815659, 585173, 470815, 529252, 696214, 932964, 1190466, 1374024, 1449684, 1459904, 1378659, 1125698, 790934, 630403, 719543, 813305, 698899, 494632, 423570, 474943, 503794, 509778, 569458, 603419, 474860, 262132, 181199, 259171, 318639, 280339, 249041, 279984, 289694, 250446, 259164, 335989, 351342, 252216, 180137, 239437, 307428, 230701, 92793, 113632, 343049, 608651, 742521, 730979, 652527, 585355, 582066, 634313, 643541, 513141, 299401, 196756, 322056, 554844, 647963, 495092, 252227, 171973, 329345, 549370, 624327, 554779, 510365, 581668, 680334, 706511, 692652, 700323, 678144, 553819, 408653, 400165, 508275, 514159, 290886, -5695, -123835, -12357, 163007, 245102, 225597, 178242]
37657A78242l0960j9589j9262K402P9997J95604K59402J93326L5777r6011j47100
37646F31828j53629j31682m3323R4849J78693J52453Q2509L1539l4289j24190
37636F84758j24776L6039K09152J80471k2636j50996o9374Q4658J17360J4232
37626I58888j08844j78097j97973j82560j32210n3569L7419J11268J19367M0688
37616D14377o1902r1422l1275M8011R4218J13789J10788P6042M6744Q0864J51523
37605I51757J61944Q9112J3577j7926m7181q7209p4738L258N6304L2350n557j7578
37593A058113o8748j74403k04760q3527L9956j1368j62275j93066p1545K4645
37583A53022K374l3785M946N0306K6347m258N3737J64649K01852J09895l9307
$$ y = [178242, 147282, 127693, 108431, 110833, 190830, 386434, 645836, 839162, 874939, 778928, 631828, 478199, 346517, 303194, 398043, 576736, 729189, 811698, 843237, 808948, 684758, 559982, 596021, 805173, 985644, 963008, 812012, 742638, 827296, 944656, 958888, 850044, 671947, 473974, 291414, 159204, 105635, 143054, 254322, 373689, 414377, 352475, 261053, 229778, 277789, 372007, 485796, 596584, 672626, 719370, 800234, 951757, 1113701, 1202813, 1216390, 1198464, 1151283, 1064074, 989336, 992594, 1048898, 1081248, 1075691, 1058113, 989365, 814962, 610202, 526675, 566631, 555263, 392988, 199922, 128377, 153022, 155396, 121611, 126557, 176863, 203210, 198952, 252689, 417338, 619190, 729085, 689778]
37572F89778j30292j08393j9918L7236K2883L593N2844J23512R2872n9346j95130
37561E09639j79254m6111M5011N764p6612n5195P6253J62248J03472K0764Q5550
37550F51529K28325K00137m2060k23962j47201R605j5928j43898j00138R8660
37540E15069J34956j12075l61276l21546m4171K36615L93443L91895J97964j03549
37530I27325k57346j23378Q9729Q7166r9197j85438p1474M8621K6359l6828j0083
37519C95456M8065K7600k5428k536N5850J6540j05247j24158N8276K93167L51339
37508I88924J86026l9824j53984j34740p5781n3563o0778m6929R344P5947J04424
37497G99066Q1532M0400K2904L6497M9355K4653l9401j01160j16227r3701r0087
$$ y = [689778, 559486, 451093, 431175, 468411, 491294, 494887, 547731, 671243, 764115, 704769, 509639, 330385, 284274, 329285, 335049, 258437, 203242, 279495, 441743, 545215, 565979, 651529, 879854, 1079991, 1037931, 813969, 666768, 676373, 660445, 516547, 416409, 515069, 650025, 537950, 176674, -144872, -189043, 47572, 441015, 832910, 1030874, 927325, 669979, 546601, 636330, 723496, 624299, 438861, 367387, 416008, 442367, 405539, 395456, 443521, 471121, 445693, 443157, 499007, 515547, 410300, 286142, 344418, 637585, 988924, 1174950, 1135126, 981142, 846402, 770621, 717058, 656280, 609351, 618695, 694642, 799066, 880598, 920998, 943902, 980399, 1029754, 1054407, 1015006, 913846, 797619, 703918, 613831]
37486F13831j23402j26514m5462M0219k541j44931j87169l6425J29206J01656
37476B18468m7430o7602J08537K90092L08367J88982K4835j33799k13384j31253
37466E45813M0642R7764j4789j06570l1415J03751J50267J54744K09437K30571
37456A380215J02126q0807j36736p6032l6998k6726M4234J35259J25764M7612
37446A477911K7677L9543l1741j14016l1979J34829J03573j45642k87909j56740
37436A015506n490p9139k16481j37313R1151J69192K2560j32618j32920m0533
37426E53915K0761J6139l1413q8824j09489o7037N821N9985P8070M9415k7084
37415D60259p8041o495J28584J21243q6259k55589j54844R9187J88330K4822j53881
$$ y = [613831, 490429, 363915, 318453, 358672, 356131, 211200, 24031, -12394, 116812, 218468, 171038, 103436, 211973, 502065, 810432, 999414, 1024249, 890450, 677066, 545813, 586455, 684219, 669430, 562860, 531445, 635196, 785463, 940207, 1149644, 1380215, 1482341, 1401534, 1264798, 1188766, 1151768, 1125042, 1169276, 1304535, 1430299, 1477911, 1505588, 1545131, 1513390, 1399374, 1367395, 1502224, 1605797, 1460155, 1172246, 1015506, 1010016, 930877, 714396, 577083, 668234, 837426, 859986, 727368, 594448, 553915, 574676, 590815, 559402, 470578, 361089, 294052, 299873, 359858, 437928, 487343, 460259, 382218, 375723, 504307, 625550, 539291, 283702, 128858, 228045, 416375, 441197, 287316]
37404B87316j17042R3719K60707K39668P8267n1898l0971P4359R0417k3987j08478
37393G92077l3417J11102J64735J27506R8917P8116j484r6043r5044j5556K7469
37382A158378L3424J07628K26939K17498L0318j46711j55649r2875j33864k49591
37372I95495k56536r5866Q7842J47090R3875L1543O414k0145q3966j47186j26707
37361F31853P251J68514K17504J06457n8099j28245p2527K3964J01940J84357
37351A182969K57725K01507m7472l15827l41780j17026Q2816O6080m8283p6267
37341H44442n7793j16043j77223q2700R6683J32180Q391m7819O1214J69970J53686
37330I84988J03757R4612L1745j16183j66374J480K00147J74875m3860k17794
$$ y = [287316, 170274, 263993, 524700, 764368, 842635, 790737, 759766, 834125, 924542, 900555, 792077, 758660, 869762, 1034497, 1162003, 1260920, 1339036, 1337552, 1241509, 1146465, 1130909, 1158378, 1191802, 1299430, 1526369, 1743867, 1774185, 1627474, 1471825, 1378950, 1245086, 995495, 738959, 643093, 730935, 878025, 971900, 1003443, 1009857, 989712, 905746, 758560, 631853, 639104, 807618, 1025122, 1131579, 1073480, 945235, 872708, 896672, 998612, 1182969, 1440694, 1642201, 1594729, 1278902, 937122, 820096, 902912, 968992, 920709, 844442, 786649, 670606, 493383, 410683, 507366, 639546, 647937, 600118, 661332, 831302, 984988, 1088745, 1183357, 1215102, 1098919, 932545, 934025, 1134172, 1309047, 1265187, 1047393]
37320A047393k21533j14835J586M1715n3276k08277k25155l8815J61744K04635
37310E95182J67051J69774J30670l9779j65662k5436K58629L53447J81985k9710
37300A596151j31639j79461j93828r2941Q7876J72964J08681K7257r95n9487j73484
37289A161094k19261j18470N2483J96246K69943K11614o730k27460k28634m2184
37279A048641O8708j032o9583p59Q6301N6036k8823p5250j30638k20772k07452
37268E25377j279K26865K44918P8091m4702o87J16397J56814P4328n2407r9133
37257A224582l3014K1441n9101j80897j28433R9693K38070J14825j16927k17392
37247I62847j60935o4841K8515J33352J95452J52401N4947j338q166o309J3077
$$ y = [1047393, 825860, 711025, 712611, 754326, 701050, 492773, 267618, 228803, 390547, 595182, 762233, 932007, 1062677, 1022898, 857236, 831800, 1090429, 1443876, 1625861, 1596151, 1464512, 1285051, 1091223, 998282, 1086158, 1259122, 1367803, 1395060, 1394065, 1334578, 1161094, 941833, 823363, 875846, 1072092, 1342035, 1553649, 1546919, 1319459, 1090825, 1048641, 1117349, 1116317, 1046734, 1045975, 1132276, 1188312, 1159489, 1084239, 953601, 732829, 525377, 524098, 750963, 995881, 1073972, 1029270, 1028583, 1144980, 1301794, 1376122, 1323715, 1224582, 1191568, 1213009, 1153908, 973011, 844578, 944271, 1182341, 1297166, 1180239, 962847, 801912, 737071, 765586, 898938, 1094390, 1246791, 1301738, 1300400, 1292234, 1285925, 1299002]
37236A299002O6735J05898Q0145J7259l2298o1601o1749l239P5101O4478n2765
37225A496966j45219j11692j5517L0471L192p2702j82080k60871k08983m0308
37215D93257J04731J56682J79108J85519R7213l3944j480K12376L09586R3362
37205A796410k03980k51049q9364j891n6608q2628j8098J1198o3930j73631k52912
37194F13517k70902j64889N7238K14308J62106L3852M6172J48836J30992P808
37184I79038k292J34304K10471J32244L2173j6587j06899k42203k53830q0154
37174G86265J17870K22820K99586L63705K76216K3923j43321n4384J04796O4891
37164B062367j38764k64693k17004q4884N9533J86156K12256R7976j8564J1956
$$ y = [1299002, 1365737, 1471635, 1551780, 1569039, 1536741, 1475140, 1413391, 1410152, 1485253, 1549731, 1496966, 1351747, 1240055, 1224538, 1255009, 1258201, 1185499, 1003419, 742548, 533565, 493257, 597988, 754670, 933778, 1119297, 1216510, 1182566, 1181086, 1393462, 1703048, 1796410, 1592430, 1341381, 1252017, 1250126, 1193518, 1110890, 1092792, 1103990, 1040060, 866429, 613517, 342615, 177726, 234964, 449272, 611378, 645230, 691402, 840238, 971230, 979038, 976746, 1111050, 1321521, 1453765, 1485938, 1469351, 1362452, 1120249, 866419, 786265, 904135, 1126955, 1426541, 1790246, 2066462, 2090385, 1947064, 1892680, 1997476, 2062367, 1923603, 1658910, 1441906, 1357022, 1416555, 1602711, 1814967, 1912943, 1894379, 1906335]
37154A906335R0848l048k41665l36356j50226Q9672J04468o7584j58623l9269
37144A194552J50520K18518J43184M6201J9569L9937L5516j3330o5600r5105j32219
37133A541743k02700k51003j85800k0028R6938N0913o8688o4951J00994K50512
37123A247930K36534J34327R0659R3874M3960k8128q268O0432L210j92148l22633
37112A359749k77317j82725j45209p4771Q6062J79003Q2866l8082J7169J46740
37102A153485J34932N4185J46031L57800L57688M9389k59423l02476j80179j05829
37092A405603q7450m1616j0399n0789n8057P9762K44965K23849L5565p6204Q633
37081A673862J26592Q2917p5587j53369r4429l0153l4447R932J90898L29409J63611
$$ y = [1906335, 1997183, 1994135, 1752470, 1416114, 1265888, 1355560, 1460028, 1392444, 1233821, 1194552, 1345072, 1563590, 1706774, 1752975, 1772544, 1812481, 1847997, 1834667, 1769067, 1673962, 1541743, 1339043, 1088040, 902240, 882212, 979150, 1030063, 961375, 896424, 997418, 1247930, 1484464, 1618791, 1709450, 1803324, 1847284, 1819156, 1810888, 1871320, 1874530, 1682382, 1359749, 1082432, 899707, 754498, 679727, 765789, 944792, 1027658, 989576, 1006745, 1153485, 1288417, 1342602, 1488633, 1846433, 2204121, 2253510, 1994087, 1691611, 1511432, 1405603, 1318153, 1276537, 1266138, 1215349, 1157292, 1237054, 1482019, 1705868, 1741433, 1665229, 1673862, 1800454, 1883371, 1807784, 1654415, 1559986, 1529833, 1495386, 1505318, 1696216, 2025625, 2189236]
37070B189236k44842n09340l92462q2302J11778J35181J01319L2907p9684j20991
37060A140800j7032O0706n9750k04881p6637K44978L75088J90961l6984j15056
37050A502193j50976k18975j76544K5349J80472J56979Q9703P0173l3959k39714
37040A204701k67094J9283K92764K26042M523j479J50930J33007m5980p5097O5026
37029A706626M5637k10494l39396j13766J82176J94316J0031n2362M9895R3903
37019A566566l688q8078o4264m3568j19741j78396o0978J66361K53144Q1947j67651
37008A341654k35318q3994J03461J75274J31836K5863r2806j15882N2287K90557
36998A592932L14901N5669j94066j64420K0835O0350p8672j77673j39508p2960
$$ y = [2189236, 1944394, 1435054, 1042592, 960290, 1072068, 1207249, 1308568, 1341475, 1261791, 1140800, 1123768, 1184474, 1124724, 919843, 843206, 1088184, 1463272, 1654233, 1617249, 1502193, 1351217, 1132242, 955698, 981047, 1161519, 1318498, 1408201, 1478374, 1444415, 1204701, 937607, 956890, 1249654, 1475696, 1480219, 1478740, 1629670, 1762677, 1716697, 1641600, 1706626, 1752263, 1541769, 1202373, 1088607, 1270783, 1465099, 1475130, 1422768, 1472663, 1566566, 1562878, 1474800, 1410536, 1366968, 1247227, 1068831, 1007853, 1174214, 1427358, 1509305, 1341654, 1106336, 1022342, 1125803, 1301077, 1432913, 1458776, 1365970, 1250088, 1302375, 1592932, 1907833, 1963502, 1769436, 1605016, 1625851, 1686201, 1607529, 1429856, 1290348, 1217388]
36988A217388l7795K4016Q6274K5943j28196j66894j0605J51755J38393J4431
36978A314710n8122n6800n6162o8267n5868k4521M440N0195J23428J82837J94581
36967A550451J64138Q2478m9184j15559K6790K85515L41933O5439k51057k63469
36957A837475m5862N4666n7490j38386m3290M2248p7312k80407k91157m5724K51230
36946A205991L66871K34318k6233j95250j33151N3571J07654n0176k06661j67984
36936A188950l7150j3451n5213J2673J39639R9602r6003j49011O8230K91997K59665
36925A709928P5299j6196n214k1918l2027Q3661K34022J89036o5016k76372k46164
36914A629039j5856K45656L64500K13351j48929m13255l16321O422J79164Q0098
$$ y = [1217388, 1179593, 1203609, 1289883, 1315826, 1187630, 1020736, 1010131, 1161886, 1300279, 1314710, 1256588, 1199788, 1143626, 1075359, 1019491, 994970, 999410, 1049605, 1173033, 1355870, 1550451, 1714589, 1797067, 1747883, 1632324, 1659114, 1944629, 2286562, 2352001, 2100944, 1837475, 1791613, 1846279, 1788789, 1650403, 1607113, 1649361, 1572049, 1291642, 1000485, 954761, 1205991, 1572862, 1807180, 1780947, 1585697, 1452546, 1506117, 1613771, 1563595, 1356934, 1188950, 1151800, 1138349, 1083136, 1095809, 1235448, 1335050, 1239047, 1090036, 1158266, 1450263, 1709928, 1785227, 1769031, 1763817, 1741899, 1709872, 1793533, 2027555, 2216591, 2151575, 1875203, 1629039, 1613183, 1858839, 2223339, 2436690, 2287761, 1874506, 1558185, 1564607, 1743771, 1823869]
36904A823869o3831o5798J7592J00385J88693K17307N8755k01441k85999j44381
36894A645151n4880j59437k12826q887K48001K76562J62829J47778J80689M4869
36884B269849k06179l02234j83841m8708P1M9115J21646J15344K8053K753R4645
36873A940514J81160J40735k3692k30754l52161k55128J7885J86551N3073j88791
36863A469392j96588M0170K30922K40484K00405J72405M6511j56028k09338m5180
36853A793155R6244L7485o5372p242J27722J24976k3119j50157j75488j38577
36843A619627n3755Q7228K07620J94176M6320j22290k12034j92806p1972J03849
36833A605963K31783K17669P8561m8989k6389J38246K60149J62793p1520j38897
$$ y = [1823869, 1760038, 1694240, 1711832, 1812217, 2000910, 2218217, 2276972, 2075531, 1789532, 1645151, 1590271, 1430834, 1218008, 1209121, 1457122, 1733684, 1896513, 2044291, 2224980, 2269849, 2063670, 1761436, 1577595, 1528887, 1528958, 1578073, 1699719, 1815063, 1843116, 1845869, 1940514, 2121674, 2262409, 2238717, 2007963, 1655802, 1400674, 1418559, 1605110, 1658183, 1469392, 1272804, 1312974, 1543896, 1784380, 1984785, 2157190, 2203701, 2047673, 1838335, 1793155, 1889399, 1926884, 1861512, 1854270, 1981992, 2106968, 2083849, 1933692, 1758204, 1619627, 1565872, 1653100, 1860720, 2054896, 2101216, 1978926, 1766892, 1574086, 1502114, 1605963, 1837746, 2055415, 2133976, 2084987, 2058598, 2196844, 2456993, 2619786, 2548266, 2409369]
36823B409369R7854L65943L00958n9937l22302k59367n4761K6685k5180p3270
36813B405992q1964r8915j09990o4269J9690Q0199R4937O5805j6777j30266j99257
36802A965185j71380o4444Q2887K34135L15748K54540Q7479n6733j14158j34858
36792B398401j63018j76390j64399j50803j14927r572J19950J61714J05248M9404
36782B055608K3917l9866j29888j23552J798J02385R0136N4052P5037R2594N9006
36771B261227N1994J06330R8555m8542j90671j57839p535Q6452R8787J30765J95331
36760B624854J97579R9170l2813j17567j08516o003R0013K8466j78116k86249
36750B310818j21220J35151J41904j45502m03277l44238l4344K51762L59073L34380
$$ y = [2409369, 2507223, 2873166, 3174124, 3114187, 2791885, 2532518, 2477757, 2504442, 2479262, 2405992, 2324028, 2225113, 2115123, 2050854, 2070544, 2150743, 2245680, 2311485, 2294708, 2164442, 1965185, 1793805, 1729361, 1812248, 2046383, 2362131, 2616671, 2704150, 2647417, 2533259, 2398401, 2235383, 2058993, 1894594, 1743791, 1628864, 1619292, 1739242, 1900956, 2006204, 2055608, 2079525, 2039659, 1909771, 1786219, 1788017, 1890402, 1980538, 2034590, 2109627, 2202221, 2261227, 2313221, 2419551, 2518106, 2469564, 2278893, 2121054, 2113519, 2199971, 2298758, 2429523, 2624854, 2822433, 2921603, 2888790, 2771223, 2662707, 2656704, 2746717, 2775183, 2597067, 2310818, 2189598, 2324749, 2466653, 2321151, 1917874, 1573636, 1539292, 1791054, 2150127, 2484507]
36740B484507K50909Q6898j70780l76385l11433K5616L24217K88353M737j75586
36730B431053j01999K6768J0543p5650o7985P526J4533m9235o2323J8722J10690
36719B262643J32059P6149j9975r9947j08313m6425K2242N5675O8985O6881K5439
36708B435413k8825k2986L6730N1475q232m3371R001P1922O5062K9855L1730M0252
36696B668026l611q4117j46531j61120j12142j7017K8592m2204j04510L3094L02630
36685B361090L91223J68376j13419j64344n726J57572K16647J62575J624j69301
36675C006317j77673k6946M3208r5448k51378k27303j19058q2674l2131J52670
36665B189584L15007K40142L8495k3377L3151k8820k05126k22070J9014K76416
$$ y = [2484507, 2735416, 2822314, 2651534, 2275149, 1963716, 1989332, 2313549, 2601902, 2606639, 2431053, 2329054, 2355822, 2366365, 2290715, 2222730, 2230256, 2244789, 2195554, 2133231, 2151953, 2262643, 2394702, 2470851, 2450876, 2350929, 2242616, 2196191, 2218433, 2274108, 2343093, 2409974, 2435413, 2406588, 2383602, 2420332, 2471807, 2463575, 2420204, 2429205, 2501127, 2566189, 2596044, 2627774, 2668026, 2664415, 2580298, 2433767, 2272647, 2160505, 2143488, 2172080, 2129876, 2025366, 2058460, 2361090, 2752313, 2920689, 2807270, 2642926, 2637200, 2794772, 3011419, 3173994, 3175618, 3006317, 2828644, 2801698, 2844906, 2749458, 2498080, 2270777, 2151719, 2069045, 2036914, 2189584, 2504591, 2744733, 2783228, 2759851, 2793002, 2764182, 2559056, 2336986, 2356000, 2632416]
36655B632416L06971J35916n9875j48625r7946J1047L1866n3712o0910J24019
36645B821167L12825K72336R1031J9850M7999m1484k40274k85404r0346J10735
36635C018435J24129L2965j3673j2115p806J9082P8608J21790J15901N5497q4386
36624C448427k65857l15748j25081J31337J87168M6290p4964j04073j40789j76306
36614B610404r0831P3291J42459J27146J93953L05275K32627j2484j23807R602
36604C467635J08666l8564k47221k61913j29781k5912N2876J83253K91194K58780
36594C659013J23183n084r6206j41027r0921J4358K9873n1939l3658J58767K87051
36583C853410J43173j03486j47510j221O1950n1465j41798n9590O5185K7545j51966
$$ y = [2632416, 2939387, 3075303, 3015428, 2866803, 2768857, 2779904, 2811770, 2758058, 2697148, 2821167, 3133992, 3406328, 3497359, 3517209, 3565208, 3523724, 3283450, 2998046, 2907700, 3018435, 3142564, 3175529, 3161856, 3149741, 3141935, 3161017, 3239625, 3361415, 3477316, 3532813, 3448427, 3182570, 2866822, 2741741, 2873078, 3060246, 3106536, 3031572, 2927499, 2786710, 2610404, 2519573, 2592864, 2735323, 2862469, 3056422, 3361697, 3594324, 3581840, 3458033, 3467635, 3576301, 3537737, 3290516, 3028603, 2898822, 2872910, 2925786, 3109039, 3400233, 3659013, 3782196, 3777112, 3680906, 3539879, 3448958, 3463316, 3493189, 3441250, 3407592, 3566359, 3853410, 3996583, 3893097, 3745587, 3744366, 3806316, 3754851, 3613053, 3553463, 3618648, 3646193, 3494227]
36572C494227k44656j04277J39785K31590J13775N984R9116K78607K85632P5320
36562D375103j58394k66336k61030j80687m7442M3588Q603m4411O0448K54578
36552C784020K80250Q4871j02073j36686j27920j55063j06662O4130J85930J33753
36542C904550K2980j7773m9621j33411j48585N664K01217K59395J95198J22798
36532D362412O1710o174k5326L0330O2894k015q4336q1738j8904K9382M1608N456
36520D375299q4658j32507k2333J52849J64151J1389m6817P4022J19192p0452
36510D540135k51944j45724J33606K78579K33300J62986J16532o526k13689l60242
36500D487013l15609p7645K18165L46961J81546j10913k21850r7064K9245L5912
$$ y = [3494227, 3249571, 3145294, 3285079, 3516669, 3630444, 3636428, 3735544, 4014151, 4299783, 4375103, 4216709, 3950373, 3689343, 3508656, 3461214, 3504802, 3513405, 3468994, 3529442, 3784020, 4064270, 4149141, 4047068, 3910382, 3782462, 3627399, 3520737, 3584867, 3770797, 3904550, 3927530, 3909757, 3860136, 3726725, 3578140, 3583804, 3785021, 4044416, 4239614, 4362412, 4424122, 4417948, 4392622, 4422952, 4485846, 4483831, 4399495, 4317757, 4298853, 4328235, 4369843, 4375299, 4290641, 4158134, 4135801, 4288650, 4452801, 4464190, 4417373, 4491395, 4610587, 4540135, 4288191, 4142467, 4276073, 4554652, 4787952, 4950938, 5067470, 5060944, 4847255, 4487013, 4171404, 4093759, 4311924, 4658885, 4840431, 4729518, 4507668, 4410604, 4439849, 4475761]
36490D475761O4916J77985J89958J5024j28503o6221O3469R8602J19742J97602
36480E208335J79212n274j16150K0060J88951J51538M4170P6512J19026j7169
36470E849211j54634m0980J57785J19446o2610n7386R6095P5372j11559j28904
36460E741836P4043J67198K3428q2645J3688R3234k3011j43895l3949K03893L09817
36449F343637K51142K04473K41612K10084n8496m84377p36977n66752j32841J45010
36439E416515J02365p86Q1362K25373K07595Q2404L0312K7285m3157j06896k9914
36428E992458R1846O6750o8593j29980q7683l1118N0744J92120K76794K06691
36418F560029J17661J65483K39354J60167R611k4700K6086L3050M2103J24447
$$ y = [4475761, 4540677, 4718662, 4908620, 4923644, 4795141, 4728920, 4792389, 4890991, 5010733, 5208335, 5387547, 5382273, 5266123, 5286183, 5475134, 5626672, 5670842, 5747354, 5866380, 5849211, 5694577, 5653597, 5811382, 5930828, 5868218, 5810832, 5906927, 5982299, 5870740, 5741836, 5815879, 5983077, 6006505, 5923860, 5937548, 6030782, 6007771, 5863876, 5829927, 6033820, 6343637, 6594779, 6799252, 7040864, 7250948, 7192452, 6708075, 5971098, 5404346, 5271505, 5416515, 5518880, 5518094, 5599456, 5824829, 6032424, 6114828, 6145140, 6172425, 6129268, 6022372, 5992458, 6084304, 6151054, 6082461, 5952481, 5864798, 5833680, 5884424, 6076544, 6353338, 6560029, 6677690, 6843173, 7082527, 7242694, 7252305, 7227605, 7253691, 7286741, 7328844, 7453291]
36408G453291J47251J5849o5980P2354K09324R9454m6949Q2222K95975J88424
36398H451215j36125k08335K5220J53043J3382j08210m0905L1855j8152o3933
36388H099055j7639N6725J60667L34374M33090K99207R7521Q7400J59748M2079
36378I752227j52582r4117J35918J43352q5331j57621M5631K20017K05640J75858
36368A0188992K12701J96438J46903J87903J88023n1292l04152j87117J42549
36359A0720948J87488l4287l1498K58335L56658J18414l0102J21890K64112K24748
36349A2156706K37940L61755L16835J04702J01721L35317L65441R9759M542K57725
36339A4342443M23260K53195R0850J62853J81655r761q9346J01263K35642J58207
$$ y = [7453291, 7600542, 7616391, 7550411, 7622765, 7832089, 7931543, 7884594, 7966816, 8262791, 8451215, 8315090, 8106755, 8131975, 8285018, 8298400, 8190190, 8149285, 8181140, 8162988, 8099055, 8081416, 8138141, 8298808, 8633182, 9066272, 9365479, 9463000, 9550400, 9710148, 9752227, 9599645, 9505528, 9641446, 9784798, 9699467, 9541846, 9587477, 9807494, 10013134, 10188992, 10401693, 10598131, 10745034, 10932937, 11120960, 11069668, 10765516, 10578399, 10720948, 10908436, 10874149, 10842651, 11100986, 11457644, 11576058, 11545956, 11667846, 11931958, 12156706, 12394646, 12756401, 13073236, 13177938, 13279659, 13614976, 13980417, 14080176, 14084718, 14342443, 14765703, 15018898, 15109748, 15272601, 15454256, 15444495, 15355149, 15456412, 15692054, 15850261]
36329A5850261J86231M24984M74150J76457k2702J63933L98938L66139K42273
36320A8260664K11506J62353J33556L63636O69204N44727R2502k070L67999N53161
36310B1357238L64320L87946P65351Q27425L88954K05965O03255Q60042N73534
36301B6334030L92490P03681Q56060M71513K54468O43622R33963O50978N02648
36292C1743453R91777J400847J189226J048014J481339J754407J409425J328814
36284D2347302K027505K469263J975078J647631K354285L034248K719985K399514
36276F0974811K936875L065006J666340J66853K95511J397159K398838M139684
36268G7041077O938454Q519886P783862P695925J0361045J2692093J2045613J1454188
$$ y = [15850261, 16036492, 16461476, 16935626, 17112083, 17089381, 17253314, 17652252, 18018391, 18260664, 18472170, 18634523, 18768079, 19131715, 19800919, 20345646, 20438148, 20436078, 20804077, 21357238, 21721558, 22109504, 22874855, 23702280, 24091234, 24297199, 24900454, 25760496, 26334030, 26726520, 27430201, 28286261, 28757774, 29012242, 29655864, 30589827, 31240805, 31743453, 32735230, 34136077, 35325303, 36373317, 37854656, 39609063, 41018488, 42347302, 44374807, 46844070, 48819148, 50466779, 52821064, 55855312, 58575297, 60974811, 63911686, 66976692, 68643032, 68809885, 69105396, 70502555, 72901393, 77041077, 83979531, 92499417, 100283279, 107979204, 118340249, 131032342, 143077955, 154532143]
36260A54532143J1048560j158358l6267468q0975822j01577048p9614591l4072424
36253a68085008O80035J1239473R712916R409130J0542921R311744P437132P644589
36245a02107068Q041335O301267M274456M303895M984187M143850K751391K645877
36237f4660810L111549K655107J937425K239535K865744K509713J659964J485423
36229d6196350J689545J420709J072983J369044J764235J437273Q63964Q77414
36221c5701183J126691R09612N99320Q29650J136215P99401K57688L39358P87682
36212b8915566Q33314N91720O51036Q54222O97463M24137N62309Q31132O23025
36203b2847208J71039J60409N17903O09779L62207K28510K81746K28050J14583
$$ y = [154532143, 165580703, 164422345, 128154877, 47179055, -54397993, -134012584, -168085008, -167404973, -156165500, -146452584, -137043454, -126500533, -117188789, -109751657, -102107068, -94065733, -87764466, -83490010, -79186115, -74201928, -70058078, -67306687, -64660810, -61549261, -58894154, -56956729, -54717194, -51851450, -49341737, -47681773, -46196350, -44506805, -43086096, -42013113, -40644069, -38879834, -37442561, -36578597, -35701183, -34574492, -33664880, -33065560, -32235910, -31099695, -30300294, -30042606, -29703248, -28915566, -28082252, -27490532, -26839496, -25985274, -25287811, -24863674, -24301365, -23470233, -22847208, -22676169, -22515760, -21997857, -21388078, -21025871, -20797361, -20515615, -20287565, -20172982]
36194b0172982K10754L79444L01066J10990J40670K81305K58844K43171N05319
36185a7741419P66104N88113J56694j4641Q7169J12187P0586K26896M62508M20852
36175a4864951J61549O1218J78063K61400K55481K79743K67354J14706P538J26126
36165a3151773K47618J16580n3909L9023J98081P9608j41736q0286J30941P8366
36155a2537487j47890r3327K39932L83469J90937J8057Q8285K25675K62230K34769
36145a1135350J52943l543p5801Q0069K54512J56676p1717o5707J40151J89859
36135a0377908L4879l0024O5432P7151n0598p8354O9198J73355J24372O6499Q0508
36124i845490P8783O0032J30724K44612K39460J39776J18274J78939J82026J30142
$$ y = [-20172982, -19962228, -19582784, -19281718, -19170728, -19030058, -18748753, -18489909, -18246738, -17741419, -16975315, -16387202, -16230508, -16245149, -16157980, -16045793, -15975207, -15748311, -15285803, -14864951, -14703402, -14642184, -14464121, -14202721, -13947240, -13667497, -13400143, -13285437, -13277899, -13151773, -12904155, -12787575, -12841484, -12802461, -12604380, -12524772, -12666508, -12746794, -12615853, -12537487, -12685377, -12778704, -12538772, -12155303, -11964366, -11946309, -11858024, -11632349, -11370119, -11135350, -10982407, -10985950, -11061751, -10981682, -10727170, -10570494, -10642211, -10707918, -10567767, -10377908, -10343029, -10373053, -10307621, -10230470, -10281068, -10359422, -10290224, -10116869, -9992497, -9925998, -9845490, -9766707, -9706675, -9575951, -9331339, -9091879, -8952103, -8833829, -8654890, -8472864, -8342722]
36114h342722J13227N3086j49154l07408j77803R6511J75282P0797O9657J83510
36104h215017J64127K8007M4266J79402R0852k35949l69989j12994J88786K18394
36094h020115J37443K12017L61427L60648K15462P8621m472o4083q7044p5421
36084f885517p5152o4356J7330Q9392j896j91420k13045K0013K85466L80490L54350
36073f284345L21335K47461L9615k81956n66359o13435l22525J19695L13178R5671
36063f931665k06586k09302M082Q4994j1418m2078M9364R7713R9441J96711L04409
36052f564335J99734j7839k1129J69190J95675N289m8076J41307K17393j092j95853
36041e919736j20617o113q3274j56357j2225J45268O3089r9293p8884J3842n7970
$$ y = [-8342722, -8229495, -8176409, -8325563, -8632971, -8810774, -8714263, -8538981, -8468184, -8398527, -8215017, -8050890, -8022883, -7978617, -7799215, -7708363, -7944312, -8314301, -8427295, -8238509, -8020115, -7882672, -7670655, -7309228, -6948580, -6733118, -6654497, -6658969, -6723052, -6810096, -6885517, -6960669, -7025025, -7007695, -6918303, -6920199, -7111619, -7324664, -7304651, -7019185, -6638695, -6284345, -5963010, -5715549, -5675934, -5957890, -6524249, -7137684, -7460209, -7340514, -7027336, -6931665, -7138251, -7347553, -7343471, -7258477, -7269895, -7311973, -7262609, -7164896, -7065455, -6868744, -6564335, -6364601, -6382440, -6403569, -6234379, -6038704, -6033415, -6081491, -5940184, -5722791, -5723883, -5919736, -6040353, -6046466, -6129740, -6286097, -6298322, -6153054, -6089965, -6189258, -6268142, -6254300, -6312270]
36030f312270j78105p4834J75927K60010J29760K6757O8931J45800J82576K15793
36020e359655K24102J28741m0018j55048j46726k5483J63422K94132K06862n9020
36010d768691k29215j44005K1416M7591j1638m700K0762n0886j35312q4177L2657
35999e306198N1390K0903J07792K62418K57963M5460j70729k16365j11743L9896
35989e019213J52320J54052M2978o5105o3555O555M9294O5859R0401P3481j7960
35978d530893p6516N042J49033K06745J70511J14347K9650r3864j30027J7771
35968d138201J87317J29451j30252l26929l30217k56659k08394j30191J8192J36435
35958e049448J21861K2998j5535Q5500K46973K81356R2195j52386j70662M5978
$$ y = [-6312270, -6490375, -6565209, -6389282, -6129272, -5999512, -5972755, -5903824, -5758024, -5575448, -5359655, -5135553, -5006812, -5046830, -5201878, -5348604, -5374087, -5210665, -4916533, -4709671, -4768691, -4997906, -5141911, -5120495, -5072904, -5084542, -5089242, -5068480, -5119366, -5254678, -5338855, -5306198, -5254808, -5233905, -5126113, -4863695, -4605732, -4560272, -4731001, -4947366, -5059109, -5019213, -4866893, -4712841, -4669863, -4734968, -4798523, -4791968, -4742674, -4676815, -4586414, -4512933, -4530893, -4607409, -4602367, -4453334, -4246589, -4076078, -3961731, -3932081, -4025945, -4155972, -4138201, -3950884, -3821433, -3951685, -4278614, -4608831, -4865490, -5073884, -5204075, -5185883, -5049448, -4927587, -4904589, -4920124, -4834624, -4587651, -4306295, -4214100, -4366486, -4537148, -4491170]
35948d491170J78249M1983j06630L8557L22774L35916L2853k12279j69721k1974
35938d051442O994k6793J9582J10144J28957P1699r601j09163j82913j02454J51753
35927c993237L54948K62136p3767l39967l10990o5406J43189J57152L1959p8137
35917c912120r7919n9477J2701J36951K57227K20228j3294k33991k19839m0527
35907c950060N6273J8144K5103J46156K04875P7756q8261j03384j9832j8234j17088
35896c768552j75146j28349n3615o623N2526J41983J85400J17105q024p0490k4987
35885c738772N8593Q5024L6773j9588j8398K9675N7537K8226k1202l0486N790
35874c526828K8317j8550j17215j83633j48382k6453J02297J73262J76457J24760
$$ y = [-4491170, -4312921, -4270938, -4377568, -4339011, -4016237, -3680321, -3647468, -3859747, -4029468, -4051442, -4044448, -4071241, -4051659, -3941515, -3812558, -3740859, -3750460, -3859623, -4042536, -4144990, -3993237, -3638289, -3376153, -3449920, -3789887, -4100877, -4166283, -4023094, -3865942, -3833983, -3912120, -4010039, -4069516, -4056815, -3919864, -3662637, -3442409, -3455703, -3689694, -3909533, -3950060, -3893787, -3875643, -3850540, -3704384, -3499509, -3421753, -3510014, -3613398, -3633230, -3651464, -3768552, -3943698, -4072047, -4125662, -4132285, -4079759, -3937776, -3752376, -3635271, -3643295, -3713785, -3738772, -3680179, -3595155, -3558382, -3577970, -3596368, -3566693, -3509156, -3480930, -3502132, -3532618, -3526828, -3498511, -3517061, -3634276, -3817909, -3966291, -3992744, -3890447, -3717185, -3540728, -3415968]
35864c415968K9213p1306r9202j4196J05668J18898j0957j40317r8677Q8489K04995
35853c303360J08748q6393j76200j40484j07871q9053L9080K43066K74829M8103
35843c189535j52135n9093J62026J72457r858q1584K3804P7066J7962N7145K14910
35832b766835J80358j63412m47459l30071N365J79983J81551K31876K97247J52385
35822b479012j53989k98914j57063N6876J46255J40971J05069R882j21128j65532
35812b916585q9019j0085j8961q0283j41534j81058j39703J6646J55176R6105
35802c309301r5596j49223K4152J96772J66413K7633k7358L094Q227k823O3330
35791c094680J82515K20832J31722J0012n9113r0976j09836o7450O6720J85895
$$ y = [-3415968, -3386755, -3458061, -3557263, -3571459, -3465791, -3346893, -3357850, -3498167, -3596844, -3508355, -3303360, -3194612, -3281005, -3457205, -3597689, -3705560, -3794613, -3755533, -3512467, -3237638, -3189535, -3341670, -3400763, -3238737, -3066280, -3076138, -3157722, -3133918, -3056852, -3038890, -2981745, -2766835, -2586477, -2749889, -3197348, -3527419, -3522054, -3342071, -3160520, -2928644, -2631397, -2479012, -2633001, -2931915, -3088978, -3032102, -2885847, -2744876, -2639807, -2629925, -2751053, -2916585, -3005604, -3015689, -3034650, -3114933, -3256467, -3437525, -3577228, -3560582, -3405406, -3309301, -3404897, -3554120, -3529968, -3333196, -3166783, -3139150, -3166508, -3163414, -3155187, -3158010, -3094680, -2912165, -2691333, -2559611, -2549599, -2608712, -2699688, -2809524, -2876974, -2810254, -2624359]
35781b624359J31364p8199k12036j11346P9249J10237k386j8802J10393J41564
35771b474321m2450j81802k7283K32964K22815o8985k89948k32836n7642N947
35761b913541p0632j82212k24876j23944J03207K93003K99414J99232J65513J78813
35751b276023Q7054p0892p2973J13507K34167J20830o6302r7095J1661P4854K417
35740a938795j34340k09709j44074K3336J36945R3966l438M201P1309K0860j39089
35729b218828k02581r4138K2940J6981o1805j58722k95781l89096k42960J32352
35719c491638M18459L69105J19095l4131N5R3296J13750K8006r2155q5765J29313
35708b432610L54988K81881p0847l23213k46540m8792%m0855K2651J63839K21245
$$ y = [-2624359, -2492995, -2571194, -2783230, -2894576, -2815327, -2705090, -2707476, -2726278, -2615885, -2474321, -2516771, -2698573, -2725856, -2492892, -2270077, -2339062, -2629010, -2861846, -2919488, -2913541, -2984173, -3166385, -3391261, -3515205, -3411998, -3118995, -2819581, -2620349, -2454836, -2276023, -2188969, -2259861, -2332834, -2219327, -1985160, -1864330, -1930632, -2027727, -2016066, -1941212, -1938795, -2073135, -2282844, -2426918, -2403582, -2266637, -2172671, -2176109, -2171908, -2100599, -2079739, -2218828, -2421409, -2515547, -2492607, -2475626, -2537431, -2696153, -2991934, -3381030, -3623990, -3491638, -3073179, -2704074, -2584979, -2619110, -2619055, -2525759, -2412009, -2384003, -2476158, -2561923, -2432610, -2077622, -1795741, -1866588, -2189801, -2436341, -2485133, -2485133, -2525988, -2503337, -2339498, -2118253]
35697b118253J69865Q0155m5179j88048k20622r4785K6696J7299j1366M7666O3839
35686b272733p2710j74137m3738J39809P6908j49022j98191k4645Q8379K3737
35676b606343k1996O7568J37808O7100l2408m4470m2808j22686k19098k17092
35666c034425j20425k4008m045o6115j20406k8378K19714M18434L69251J36071
35656b254332o3213j46450j77027j66743q0702J8103M4261N7291J40973J95822
35646b432017J03805R958J24633L07397K21067j03264k63825j18499P555j01929
35636b245119j89713K722K53449J95816j03846k65386j57109l540J3308l6068
35626b535486l5079j1430n4410j62554k24168j18159J42814L61584L36946J20037
$$ y = [-2118253, -1948388, -1868233, -1913412, -2101460, -2322082, -2416867, -2390171, -2372872, -2384238, -2336572, -2272733, -2345443, -2519580, -2563318, -2423509, -2346601, -2495623, -2693814, -2718459, -2630080, -2606343, -2628339, -2560771, -2422963, -2355863, -2388271, -2432741, -2475549, -2598235, -2817333, -3034425, -3154850, -3178858, -3182903, -3249018, -3369424, -3397802, -3178088, -2759654, -2390403, -2254332, -2317545, -2463995, -2641022, -2807765, -2888467, -2870364, -2826103, -2768812, -2627839, -2432017, -2328212, -2318254, -2193621, -1886224, -1665157, -1768421, -2032246, -2150745, -2143190, -2245119, -2434832, -2432110, -2178661, -1982845, -2086691, -2352077, -2509186, -2512726, -2499418, -2535486, -2570565, -2581995, -2636405, -2798959, -3023127, -3141286, -2998472, -2636888, -2299942, -2179905]
35616b179905l0523J1129R5195N9685m1098q7853j07202j69813k06443j04071
35606b760899R1043K20486K13988J29759N3645M6652J14703J55574M2248j66770
35596a859571k42955j09981J9391l7394j60633j57602q0448p6023p7511N7449
35586b725278K07809J27255j09765j50328R7636K98434J84201p1126j55425o5104
35576b361691k0113q4275j16649m1226N4675R8693J37445K11733K45688J37101
35566a738619q8428k70193k58763n9713J64482K43564J62368O2706O9114J37157
35556a576325J15201m8312k14668k09048l2382J41080J75286J10842O5667P6618
35546a396041J07953J46036J72973Q8841j85859n11451n89709l08833Q0129K33617
$$ y = [-2179905, -2210428, -2199299, -2104104, -2044419, -2085517, -2173370, -2280572, -2450385, -2656828, -2760899, -2669856, -2449370, -2235382, -2105623, -2051978, -2005326, -1890623, -1735049, -1692801, -1859571, -2102526, -2212507, -2193116, -2230510, -2391143, -2548745, -2629193, -2705216, -2782727, -2725278, -2517469, -2390214, -2499979, -2650307, -2552671, -2254237, -2070036, -2141162, -2296587, -2361691, -2381804, -2466079, -2582728, -2623954, -2569279, -2470586, -2333141, -2121408, -1875720, -1738619, -1827047, -2097240, -2356003, -2415716, -2251234, -2007670, -1845302, -1782596, -1713482, -1576325, -1461124, -1509436, -1724104, -1933152, -1965534, -1824454, -1649168, -1538326, -1472659, -1396041, -1288088, -1142052, -969079, -880238, -1066097, -1577548, -2167257, -2476090, -2395961, -2162344]
35536b162344R4705r1364r0460Q5457K35334J88151l0649k17705j97689k2215
35526b208779Q9739K1240j15665j51165n5068R0304K09952K53939J93495Q3698
35516a588310L4861L9830m9353k64043l82522k23861M0438R1684q3979j90966
35506b576221o2185J39497K02120J29717M2943m779r165M3807J15307J05664o89
35495a873984q4308o2177k160J3486K0858O8633R2406K4983n4395k5618P2887
35484a809389R6994K1919l0655N869M9784J6077n5931p9237m7331k2156m2201
35473a896257j00772j81764k54066k45129r2784J50075L16103K84385J21621M900
35463a893688Q357L7925o415r4133j45743j60177j62047r9498N9979J75498O2821
$$ y = [-2162344, -2067639, -2159003, -2249463, -2164006, -1928672, -1740521, -1771170, -1988875, -2186564, -2208779, -2119040, -2097800, -2213465, -2364630, -2419698, -2329394, -2119442, -1865503, -1672008, -1588310, -1553449, -1513619, -1562972, -1827015, -2209537, -2433398, -2392960, -2301276, -2385255, -2576221, -2638406, -2498909, -2296789, -2167072, -2124129, -2128908, -2138073, -2094266, -1978959, -1873295, -1873984, -1958292, -2020469, -2022629, -2009143, -1988285, -1919652, -1827246, -1802263, -1856658, -1882276, -1809389, -1712395, -1690476, -1721131, -1715262, -1665478, -1649401, -1705332, -1784569, -1831900, -1854056, -1896257, -1997029, -2178793, -2432859, -2677988, -2770772, -2620697, -2304594, -2020209, -1898588, -1893688, -1885331, -1847406, -1853821, -1947954, -2093697, -2253874, -2415921, -2515419, -2455440, -2279942, -2217121]
35452b217121j98600k82390l0160L12944M07428K33195L7968k2018L714M7716
35442a707324J10586J47352O6667r3402j51518l3007R7511N5316j15993k23907
35432a847719j75174l5122R7690J63510J33550M0211j6421J0118K8163m5580j12530
35421a759304k2392J54542J83868K1816r7054j4844J07461N1587j22221j99694
35411a696235j54049j31752j59032j11519K0766Q2134K6527K3340J77051L25240
35401a597529K65437N0407j04563j21097j02114j23266j35114p7777J9197P6805
35391a849614N0791k4494m9246M6100J88967K17673R2407l7990n1397k5900q3564
35380a526267j65430j26608R995Q1403M2448Q802L5065L7663j8868l6438M1280
$$ y = [-2217121, -2415721, -2698111, -2728271, -2415327, -2007899, -1774704, -1736736, -1758754, -1755040, -1707324, -1596738, -1449386, -1382719, -1476121, -1627639, -1660646, -1563135, -1507819, -1623812, -1847719, -2022893, -2058015, -1960325, -1796815, -1663265, -1623054, -1639475, -1629357, -1601194, -1646774, -1759304, -1781696, -1627154, -1443286, -1421470, -1518524, -1533368, -1425907, -1374320, -1496541, -1696235, -1850284, -1982036, -2141068, -2252587, -2231821, -2149687, -2123160, -2099820, -1922769, -1597529, -1332092, -1281685, -1386248, -1507345, -1609459, -1732725, -1867839, -1945616, -1926419, -1849614, -1798823, -1823317, -1872563, -1826463, -1637496, -1419823, -1327416, -1365406, -1416803, -1442703, -1526267, -1691697, -1818305, -1808310, -1726907, -1684459, -1675657, -1640592, -1602929, -1621797, -1658235, -1616955]
35369a616955J20699J13114O2407K2351o1781k24406l40827k68572o7716O5639
35359b196047O1353L9310J09918K28180K81854K42403J74394J29127P7131l8730
35349h91107j95090k76895k17727j13891j08419j72211j27570P3983K38644J89936
35339a600347K2429l8062N5346J52193J45722P1551j5672j02318j41228p2122
35329a522508M5981O2299n5198j65568j66030j20133r6935k7066J52230L21411
35319a571517L08472J32458l5453j10926j37246j15329J5931J97151K30941M2000
35309a043518j79925k09735o2529P2979R3075M1662k5277q8655r9088r320J07630
35298a402701J06388k1789j09348m7950M4931p889j87163l01604k33862n6049
$$ y = [-1616955, -1496256, -1383142, -1320735, -1298384, -1360165, -1584571, -1925398, -2193970, -2261686, -2196047, -2134694, -2095384, -1985466, -1757286, -1475432, -1233029, -1058635, -929508, -852377, -891107, -1086197, -1363092, -1580819, -1694710, -1803129, -1975340, -2102910, -2028927, -1790283, -1600347, -1577918, -1615980, -1560634, -1408441, -1262719, -1191168, -1206840, -1309158, -1450386, -1522508, -1476527, -1414228, -1469426, -1634994, -1801024, -1921157, -2018092, -2045158, -1892928, -1571517, -1263045, -1130587, -1166040, -1276966, -1414212, -1529541, -1513610, -1316459, -1085518, -1043518, -1223443, -1433178, -1495707, -1422728, -1329653, -1287991, -1313268, -1401923, -1501011, -1510331, -1402701, -1296313, -1318102, -1427450, -1475400, -1430469, -1438358, -1625521, -1927125, -2160987, -2217036]
35288b217036R1739J42332J10432M7335J8615O1435J25864J10173m032r9055o1574
35277a673772N4550Q3142l1481j48030j15869J3030N5409l6460j02196j8711R7185
35266a823203N2415j22138j96313o8284R4143J01473n315n2137K0071J26379J92318
35255a680591K11425J81371J01288K4328J2672M1873L5673j2860m4030m6749p3095
35244a248695j31716j60492j22777n1517J3374N6451N8615K7035M5713J80559
35234a333450L23472K67515j1141k71194k85362j03458M8418M7541m3004j11178
35224a471841j13165p2612l1277L568P8434K17550L24227K51166Q674j99036k15169
35213a219481j14921o3992q3831p2067O505P4546O3185j9368j20490j68642j00962
$$ y = [-2217036, -2125297, -1982965, -1872533, -1825198, -1806583, -1745148, -1619284, -1509111, -1513143, -1612198, -1673772, -1619222, -1536080, -1567561, -1715591, -1831460, -1818430, -1763021, -1799481, -1901677, -1920388, -1823203, -1770788, -1892926, -2089239, -2157523, -2063380, -1961907, -1967222, -2019359, -1999288, -1872909, -1680591, -1469166, -1287795, -1186507, -1162179, -1149507, -1107634, -1071961, -1084821, -1128851, -1175600, -1248695, -1380411, -1540903, -1663680, -1715197, -1701823, -1645372, -1586757, -1559722, -1514009, -1333450, -1009978, -742463, -753604, -1024798, -1310160, -1413618, -1365200, -1317659, -1360663, -1471841, -1585006, -1657618, -1688895, -1685327, -1606893, -1389343, -1065116, -813950, -805276, -1004312, -1219481, -1334402, -1398394, -1482225, -1554292, -1547787, -1473241, -1410056, -1429424, -1549914, -1718556, -1819518]
35202a819518N9572J96250K37265K37793K41071J50461j20578m35525n40907l72697
35192b166813j12823N0431P8952J7865o6226p1682N3127J89203J68910M0812L4609
35181a783635K16632L74445L29312J71173N8769l0080j75148k90317k39691r4698
35171a463238n7424j50560j78229j4768K24932L44019K77969J13554k1235n8761
35161i83741l9232n6024j15242j07436N376O4337p6561k78288k57128L201J99426
35150a641312J34975j2148J8181J78301K07558K6874j62181j62451n052J39330
35140a277925J56368N7921n8953q5370N313J07376P6936j01012k84877l32251
35130a736474k33984p5005P4239J78126J99025J22330J6730m519Q1221J55945
$$ y = [-1819518, -1759946, -1563696, -1326431, -1088638, -847567, -697106, -817684, -1253209, -1794116, -2166813, -2279636, -2229205, -2150253, -2132388, -2198614, -2270296, -2217169, -2027966, -1859056, -1818244, -1783635, -1567003, -1192558, -863246, -692073, -633304, -663384, -838532, -1128849, -1368540, -1463238, -1520662, -1671222, -1849451, -1864219, -1639287, -1295268, -1017299, -903745, -924980, -983741, -1022973, -1078997, -1194239, -1301675, -1296299, -1231962, -1308523, -1586811, -1843939, -1840738, -1641312, -1506337, -1518485, -1500304, -1322003, -1114445, -1087571, -1249752, -1412203, -1417255, -1277925, -1121557, -1063636, -1122589, -1207959, -1202646, -1095270, -1018334, -1119346, -1404223, -1736474, -1970458, -2045463, -1971224, -1793098, -1594073, -1471743, -1455013, -1459532, -1378311, -1222366]
35120a222366R8446n0662j24731l7148J12230J66402Q7915m4251j58049k24986
35110a397200k06287p3373J01075J70710Q3235m4994o8238K6889J37039J65977
35100a105167R3599k5948r5689n5730L8405P7927N7376O9891J16285O7045r6921
35089h58927j73262l4643J10176p124k68050k96220k6676J77717P5128r5938k218
35078a400037K76750L87006K08360l7927j29998o2773N8747J44591J28866J4191
35068d12224q5124p7223m8440j35146k72508k62904r5928J0238o7160j92025k05448
35057a843892j31499m4720P7593K26446K53040P5229j29933j40009j0165K5650
35047a642260p2968j04687L7880J96090J82672L3609p3971n2706L6495R3061P1707
$$ y = [-1222366, -1123920, -1174582, -1299313, -1336461, -1224231, -1057829, -969914, -1014165, -1172214, -1397200, -1603487, -1676860, -1575785, -1405075, -1321840, -1366834, -1435072, -1408183, -1271144, -1105167, -1011568, -1037516, -1133205, -1188935, -1150530, -1072603, -1015227, -945336, -829051, -762006, -858927, -1032189, -1066832, -956656, -963780, -1231830, -1528050, -1554726, -1377009, -1301881, -1397819, -1400037, -1123287, -736281, -527921, -565848, -695846, -758619, -699872, -555281, -426415, -412224, -497348, -574571, -623011, -758157, -1030665, -1293569, -1389497, -1379259, -1446419, -1638444, -1843892, -1975391, -2020111, -1942518, -1716072, -1463032, -1387803, -1517736, -1657745, -1667910, -1642260, -1715228, -1819915, -1782035, -1585945, -1403273, -1369664, -1443635, -1496341, -1459846, -1366785, -1295078]
35036a295078L570l7726j7333J2114j0019m6700k6162M981p5515k42418k91376
35025b021662j12419J32908K22834J60747J10390J23599J00087j0039j32512k11567
35015a637634k72364k99762k01192K8689K23394K33470J28491J00816K03823K88486
35005a203783K01321k6594k04821j68858N2076K37770J85437n8338k29140j52451
34995a367381M8833J31366M9232k6123K3448J12035R8156k9874j71488k37009
34985a368805k01680j00062j3788j3127p2743r2802k7317O7287J29128J55669
34975a538240J41541N0841q5715j38587l4150J24903J84169J27768N5518K3471
34965a088481O018k2327o4791j30828j96701j75003k1442J62564K36363J96658
$$ y = [-1295078, -1291508, -1329234, -1346567, -1334453, -1344472, -1391172, -1417334, -1412353, -1487868, -1730286, -2021662, -2134081, -2001173, -1778339, -1617592, -1507202, -1383603, -1283516, -1293555, -1426067, -1637634, -1909998, -2209760, -2410952, -2382263, -2158869, -1925399, -1796908, -1696092, -1492269, -1203783, -1002462, -1029056, -1233877, -1402735, -1350659, -1112889, -927452, -985790, -1214930, -1367381, -1318548, -1187182, -1137950, -1164073, -1140625, -1028590, -930434, -960308, -1131796, -1368805, -1570485, -1670547, -1684335, -1697462, -1770205, -1863007, -1890324, -1823037, -1693909, -1538240, -1396699, -1345858, -1431573, -1570160, -1604310, -1479407, -1295238, -1167470, -1111952, -1088481, -1082463, -1104790, -1169581, -1300409, -1497110, -1672113, -1693555, -1530991, -1294628, -1097970]
34955a097970J45601J26598J12136J07343J19084O3684j17989k80666k23172k3067
34945a068418K4381j36398j95477M3910L13961K49197p2579k45479j10686P4124
34935a123464M7843j27590k29821j73829m1614O1872Q2907K3388n1384m9770N6004
34924a525458J99446K82422K35056M5923j93290l03703j86268L2841J34307Q1437
34914a197287L1675N9507M0638j07022k33212j57567M8183J60996J34683J33003
34904a086403K31171K81114J54944l0787o6612N7406J47453O3955j36353l11188
34894f95300l69120k73543l0645K49582L61469J85336j46643l47311k60362j1293
34884a337830J38897O2675j23819k05535j08614K5567K6097q3360j22421j1575
$$ y = [-1097970, -952369, -825771, -713635, -606292, -487208, -423524, -541513, -822179, -1045351, -1068418, -1044037, -1180435, -1375912, -1332002, -1018041, -768844, -841423, -1086902, -1197588, -1123464, -1075621, -1203211, -1433032, -1606861, -1648475, -1586603, -1503696, -1480308, -1531692, -1581462, -1525458, -1326012, -1043590, -808534, -762611, -955901, -1259604, -1445872, -1413031, -1278724, -1197287, -1165612, -1106105, -1065467, -1172489, -1405701, -1563268, -1515085, -1354089, -1219406, -1086403, -855232, -574118, -419174, -449961, -516573, -459167, -311714, -247759, -384112, -695300, -1064420, -1337963, -1368608, -1119026, -757557, -572221, -718864, -1066175, -1326537, -1337830, -1198933, -1136258, -1260077, -1465612, -1574226, -1548659, -1522562, -1605922, -1728343, -1739918]
34874a739918J18925J25232M2718q568j2990k8706m3035n176M6576M4470L7804
34863a422668J09437J79589R7446p7202j17139J3014R3771K7309K867J33377J96994
34852g63205j6030l10926l42341j24050L5212L2089O1977K00128K30610J6794
34842i79742k25313k12198J4223J69970J19794J1131L1267J61774K20574R5395
34832e93125j18769k30627j72724n6000m961k1961n0800p7931r7329o5445J4847
34821a474825N0365K473j5304Q8895K06963J82012N4974j9570l2781q7543j51231
34810a195572p9498J08828K10487J32146J811o2422r8681j54750j80750j44841
34800a463242r8280o1773M394P6501P9110N1789J10880K06827J47690o3694j64259
$$ y = [-1739918, -1620993, -1495761, -1453043, -1461611, -1474601, -1503307, -1546342, -1551518, -1504942, -1460472, -1422668, -1313231, -1133642, -1036196, -1113398, -1230537, -1217523, -1123752, -1096443, -1093576, -960199, -763205, -779235, -1090161, -1432502, -1556552, -1521340, -1489251, -1427274, -1227146, -996536, -979742, -1205055, -1417253, -1403030, -1233060, -1113266, -1102135, -1070868, -909094, -688520, -593125, -711894, -942521, -1115245, -1171245, -1176206, -1198167, -1248967, -1326898, -1424227, -1489672, -1474825, -1424460, -1421987, -1437291, -1348396, -1141433, -959421, -904447, -924017, -956798, -1044341, -1195572, -1275070, -1166242, -955755, -823609, -821798, -884220, -982901, -1137651, -1318401, -1463242, -1561522, -1623295, -1618901, -1542400, -1463290, -1411501, -1300621, -1093794, -946104, -1009798, -1174057]
34789a174057k3716J36523Q1023r7201j63705q9762o970L3146M6078q783j28701
34778a396125j57127J4984K27807K39963O1399j02299j65610k06982k44291j89416
34768a917697k7964J39556K44818K89772K52142J13485k4092j6151J05142J34782
34758g06207l9738k85210l77186k35210K2116K08305K41807K01332J91148J79009
34748e99834O5118j01172j41473k8984M3788l0469j07848o7852l5668j32979k09852
34737a347225p8172J46210K07141Q8390m3559j54905k99813l63045j85507J06361
34727a924124K29934J69376J31571J18259o2010l34113l37596J2293L30943L02920
34717a362547P8975m7756m4334o368Q0970K04626J95728m510j61023p6410Q8103
$$ y = [-1174057, -1197773, -1061250, -980227, -1077428, -1241133, -1330895, -1337865, -1304719, -1258641, -1267424, -1396125, -1553252, -1538268, -1310461, -1070498, -1009099, -1111398, -1277008, -1483990, -1728281, -1917697, -1945661, -1806105, -1561287, -1271515, -1019373, -905888, -929980, -946131, -840989, -706207, -745945, -1031155, -1408341, -1643551, -1621435, -1413130, -1171323, -969991, -778843, -599834, -534716, -635888, -777361, -806345, -762557, -793026, -900874, -968726, -1004394, -1137373, -1347225, -1425397, -1279187, -1072046, -983656, -1027215, -1182120, -1481933, -1844978, -2030485, -1924124, -1694190, -1524814, -1393243, -1274984, -1336994, -1671107, -2008703, -1996410, -1665467, -1362547, -1283572, -1331328, -1375662, -1382030, -1301060, -1096434, -900706, -905216, -1066239, -1142649, -1054546]
34706a054546Q1447k8670n922J32164J52100J84j27707j05591k5778j714j2057
34695i96090J3294P8174J27267J03262N728p3061l5040O5068N5040j06278k47827
34684a010463k27470j04709J5961J39035K53775K42505P5596p0782o3360o863
34674g56775j3244J7761J56174J96523l4747l03278k63914j3512N4623j12244
34664a072633j69990J9051J68061P1432p2020l4219Q0758Q1150J6719J5340J7617
34653h78734o6691j21992j4248J28283R4502n3696q2957K0192M9978l8482m6419
34642a010264J05880K03265O2751j70804k39435j41857q0884j17685j05522K6817
34632a467738J41047J15898K7508j8325p5072j97057k19780M3425M23214N03426
$$ y = [-1054546, -973099, -1001769, -1007691, -875527, -723427, -723243, -850950, -956541, -982319, -984033, -996090, -982796, -904622, -777355, -674093, -668365, -741426, -776466, -711398, -656358, -762636, -1010463, -1237933, -1342642, -1326681, -1187646, -933871, -691366, -615770, -686552, -749912, -756775, -770019, -752258, -596084, -399561, -434308, -737586, -1001500, -1015012, -960389, -1072633, -1242623, -1223572, -1055511, -984079, -1056099, -1090318, -1009560, -928410, -911691, -896351, -878734, -945425, -1067417, -1081665, -953382, -858880, -912576, -995533, -975341, -925363, -963845, -1010264, -904384, -701119, -638368, -809172, -1048607, -1190464, -1271348, -1389033, -1494555, -1467738, -1326691, -1210793, -1183285, -1201610, -1276682, -1473739, -1693519, -1650094, -1226880, -723454]
34622g23454J75711j80567k06901j3921P3441R277m068Q7916J24672K8092r3505
34611g23307j53559j81589j85489j16290k483N6199N5887Q3186J29544R1265k4041
34600i70677p8204k3501L7700M3459L4441L809r9770j85796q4038J43204K14659
34589i64714N5803o4605L5596J70464J30450L0416N4336R8675j3865j59465j07536
34578g34445M3469L815k01233k52994p1952N5195l8953j45036n4163J10797J42747
34567a142753R1738J24382K04055J58266j2085j14633n0753N4599M5376o2010
34557g03818j30561r6032l0390n689L2792J68313L06796K20739j20285m09571
34547g67706l58011q6936M4027n7775j38349k7240J26400J35204M8385O561J6853
$$ y = [-723454, -547743, -728310, -935211, -949132, -875691, -866414, -870482, -782566, -657894, -629802, -723307, -876866, -1058455, -1243944, -1360234, -1362717, -1306518, -1250631, -1167445, -1037901, -946636, -970677, -1048881, -1072382, -1034682, -991223, -956782, -952973, -1052743, -1238539, -1322577, -1179373, -964714, -908911, -973516, -937920, -767456, -637006, -606590, -552254, -453579, -467444, -626909, -734445, -690976, -687161, -888394, -1141388, -1213340, -1158145, -1197098, -1342134, -1396297, -1285500, -1142753, -1051015, -926633, -722578, -564312, -576397, -691030, -741783, -687184, -641808, -703818, -834379, -930411, -960801, -966490, -933698, -765385, -458589, -237850, -358135, -767706, -1125717, -1212653, -1168626, -1226401, -1364750, -1391990, -1265590, -1130386, -1082001, -1075440, -1058587]
34536a058587K5285M9086Q0637J0344j87127l26241k47821n9631M1833O1294J07267
34525a503661J34097M5411l7418P8043K68952J98765j36610l03370l0698L66417
34515i20072M02754O9807k03561j46815O1739J14437k4529j34790o2181P9948
34505g63263N5997j74242l59775k50407P3586K97590K75902J60357J05887P0147
34495e08221L680J0297J36750J94485K7462j87670j83466m4878r6211l71282n25665
34484a544719l40177j7415J42108J12141M5692J9386L6963J19519K28498K34209
34474i63795J05507k506J5203M2290l8921j20155n7207O0683O2619m888J3021
34463h88149O9856N479j18537r0141N6827N7278j20458j72715M3697K41738J43150
$$ y = [-1058587, -1033302, -984216, -903579, -893235, -1080362, -1406603, -1654424, -1714055, -1672222, -1610928, -1503661, -1369564, -1324153, -1361571, -1283528, -1014576, -815811, -952421, -1255791, -1286489, -920072, -517318, -447511, -651072, -797887, -736148, -621711, -646240, -781030, -843211, -763263, -707266, -881508, -1241283, -1491690, -1418104, -1120514, -844612, -684255, -578368, -508221, -504541, -494244, -357494, -163009, -135547, -323217, -506683, -551561, -647772, -1019054, -1544719, -1884896, -1902311, -1760203, -1648062, -1602370, -1582984, -1546021, -1426502, -1198004, -963795, -858288, -860794, -845591, -803301, -842222, -962377, -1019584, -958901, -896282, -901170, -888149, -818293, -812814, -931351, -1021492, -964665, -907387, -1027845, -1200560, -1156863, -915125, -771975]
34452g71975q8635j28889R05K3132j15803j87160q3995J8491k8736j21019r4575
34441a578259K2835R0847Q3081R8903J83319K45721J82164K3333q5590n2673N1276
34430g35043Q3540M71j18056j86552j69106m2115J62817K74873J23338j76994
34420g82827k75843m3013K22225K10091L0433k1307N0128K1888q8948m8168J22479
34409f02862J11896j50021l30819k30757r2907j36840j55520P7832L17225J99633
34399i93140j20356j85222K2153P2101j66641l06366j08114J16660L3898j80742
34389a815769j73013K3594J25017R7362J33629K41112K30774R2646L6773J21937
34379h85938J45302j2472j81960j59262K2533J85533K24229J40271r299j15748
$$ y = [-771975, -860610, -989499, -988594, -965462, -1081265, -1268425, -1352420, -1333929, -1362665, -1483684, -1578259, -1555424, -1464577, -1381496, -1282593, -1099274, -853553, -671389, -648056, -733646, -786319, -735043, -651503, -651032, -769088, -955640, -1124746, -1166861, -1004044, -729171, -605833, -782827, -1058670, -1101683, -879458, -669367, -638934, -660241, -610113, -588225, -677173, -725341, -602862, -490966, -640987, -971806, -1202563, -1295470, -1432310, -1587830, -1509998, -1192773, -993140, -1113496, -1298718, -1276565, -1204464, -1371105, -1677471, -1785585, -1668925, -1635027, -1815769, -1988782, -1965188, -1840171, -1742809, -1609180, -1368068, -1137294, -1044648, -1007875, -885938, -740636, -753108, -935068, -1094330, -1071797, -886264, -662035, -521764, -531063, -646811]
34369f46811q3876L7433R1084J9077q3355j43961j85001j78059k5220K19727L11300
34358f67662J42211o0320m7333R5652J17688K291n4574K629K5876n1357j15013
34347f09912r3663n7638l9476K8218J13177L8916k24931m13348k87550K2530J90866
34336a332811J28702M1547Q1774J52485J06173k6422j07679r8564q0687j03448
34326a238930j04866o885J62767K83705K67817J44829K0434k9980j5590L452j4514
34315e27761n0039m4138K0708O6026n609j60518k31765j27443K2600K4203j16755
34304a130491k06543j30790K1912J27840J81713K13688J77054L6765j03746r7409
34294i10007M0682J31589N1353j25934k25100j52747L8220K17230K74861J84238
$$ y = [-646811, -730687, -693254, -602170, -583093, -666448, -810409, -995410, -1173469, -1198689, -978962, -667662, -525451, -585771, -633104, -537452, -419764, -417473, -472047, -469418, -443542, -494899, -609912, -703575, -761213, -800689, -772471, -659294, -620378, -845309, -1258657, -1546207, -1523677, -1332811, -1204109, -1162562, -1080788, -928303, -822130, -848552, -956231, -1054795, -1135482, -1238930, -1343796, -1350681, -1187914, -904209, -636392, -491563, -471129, -501109, -516699, -513247, -527761, -577800, -621938, -601230, -535204, -540813, -701331, -933096, -1060539, -1037939, -1013736, -1130491, -1337034, -1467824, -1445912, -1318072, -1136359, -922671, -745617, -708852, -812598, -910007, -869325, -737736, -686383, -812317, -1037417, -1190164, -1151944, -934714, -659853, -475615]
34284d75615J1423j26720j43760n4080L6332L4573l7972q2064o6459p4889j61494
34273a140725k29193j50202K9492J29785Q3891J8819M8744J07016O1124r0450
34263a131699k22829k33594j18783M9663J59236J24201r399p3113L0277J81854
34253a244186J85650L0209r1893m3141P2242M6636j42928k68879j17937K20303
34243a353924M21697L09996O9363j3817P1667J00311k3065j45185j41235r2322
34233g96514q7812m7657J02144K31696J75286k727r8672n9011n45K938k7528r1859
34221g00261j84891j86831L675K28034J97994p7033k29851k5249K90584L09539
34211c74290j888k87393k65806j9847J88727K29736J60274P5197J1313k0343l085
$$ y = [-475615, -464192, -590912, -734672, -788752, -752420, -717847, -755819, -837883, -904342, -979231, -1140725, -1369918, -1520120, -1490628, -1360843, -1276952, -1258133, -1209389, -1102373, -1041249, -1131699, -1354528, -1588122, -1706905, -1657242, -1498006, -1373805, -1383204, -1456317, -1426040, -1244186, -1058536, -1028327, -1120220, -1163361, -1091119, -1044483, -1187411, -1456290, -1574227, -1353924, -932227, -622231, -552868, -566685, -495018, -394707, -417772, -562957, -704192, -796514, -884326, -931983, -829839, -598143, -422857, -425584, -524256, -583267, -583812, -580874, -608402, -700261, -885152, -1071983, -1068308, -840274, -642280, -719313, -949164, -974413, -683829, -374290, -376178, -663571, -929377, -949224, -760497, -530761, -370487, -295290, -283977, -304320, -307405]
34200c07405M1530L3576p1099j90074k04734j37969j25458j79142j29934R1908
34190a178801K66628J56317j25566k37292p3921J21815J42185P4950Q4068J33278
34180f36339R0788j7980m1609N6860J29926K2815k47941m90849m94671k31927
34170a860927P5774J65282K8009q6796O741K16155L31609K83129J47306L984r3981
34159g83715q5509L0202J28800Q5740m9908j09414k5885Q6307P8166o9725k27638
34148i42579k25612j6577K29655K58412K2554k26458k30537l6870J05396R8071
34138i64545P1044J15772J37049M3680p1725p0962O347k11j24252k15398j53343
34127a226544k0412L298j25218k48513j88726M6682K67229K98435J50942j7285
$$ y = [-307405, -265875, -232299, -303398, -493472, -698206, -836175, -961633, -1140775, -1270709, -1178801, -912173, -755856, -881422, -1118714, -1192635, -1070820, -928635, -853685, -769617, -636339, -545551, -563531, -605140, -548280, -418354, -395539, -643480, -1134329, -1629000, -1860927, -1785153, -1619871, -1591862, -1678658, -1671917, -1455762, -1124153, -841024, -693718, -689734, -783715, -869224, -839022, -710222, -624482, -674390, -783804, -809689, -723382, -645216, -714941, -942579, -1168191, -1184768, -955113, -696701, -674147, -900605, -1131142, -1168012, -1062616, -964545, -893501, -777729, -640680, -597000, -668725, -739687, -733340, -733551, -857803, -1073201, -1226544, -1246956, -1243658, -1368876, -1617389, -1806115, -1759433, -1492204, -1193769, -1042827, -1060112]
34117a060112q1146n8858m4796p0000o6506K8220J67374K32246J69657N3356q491
34106g39056M803K5040p788q1678j36885j30662q4863p1169j16461j27695J0572
34095a455842K37526L26123J75397j8587k2436R9990J09287j2671m5274P3002
34085e33485J17414l1511j39405J9028K55043K16570o7279k17918p9370O0367
34075d00546p4115l31143l68115j38978Q1045R7889J1273j555N8454O7230j1127
34064a009688q3226o5410K9899J41375K08925J73404K3014j29169j18732N1403
34054g78205J64092N8012j46155k19864j42621o5579j7756J14240K97438L01452
34044d34946M6103k15211k22267n7849J0428q0390j55527r5642K7192R9098J04003
$$ y = [-1060112, -1141258, -1200116, -1244912, -1314912, -1381418, -1353198, -1185824, -953578, -783921, -730565, -739056, -734253, -709213, -717001, -798679, -935564, -1066226, -1151089, -1222258, -1338719, -1466414, -1455842, -1218316, -892193, -716796, -735383, -757819, -657829, -548542, -561213, -606487, -533485, -416071, -447582, -586987, -567959, -312916, -96346, -163625, -381543, -460913, -400546, -474661, -805804, -1173919, -1312897, -1231852, -1133963, -1122690, -1124245, -1065791, -998561, -1009688, -1092914, -1158324, -1128425, -987050, -778125, -604721, -581707, -710876, -829608, -778205, -614113, -556101, -702256, -922120, -1064741, -1130320, -1148076, -1033836, -736398, -434946, -388843, -604054, -826321, -884170, -873742, -954132, -1109659, -1205301, -1178109, -1079011, -975008]
34033i75008R7172J28968J98261K36716J77329O4325L359k9477j73338l96111
34023f67804m23679j29637J89110J77934o5975j46222M2810K06194J32664l8052
34013g22657j09552r5327o3492K7258J69615J96136J6062j92252k11202q4644
34003a070055j0768l7472n3594j7789n480m4121o3316k1306M3736J03997J73837
33992a002331K23575J58698n2549k76468l07075q3923K04958K86116R3675j47558
33982i02882j88962n3471M2448K1519L0069J59128K65899J88982M432q8480n5834
33971e77152l9371j12351j85798j72529j08593o3949l4279J5003O7881R1061J03832
33960a016245J38902J52803O4061r4440j49191K307K02068J82742p5562k77062
$$ y = [-975008, -877836, -748868, -550607, -313891, -136562, -72237, -68878, -98355, -271693, -667804, -1091483, -1221120, -1032010, -854076, -920051, -1066273, -1023463, -817269, -684605, -722657, -832209, -927536, -991028, -963770, -794155, -598019, -581957, -774209, -985411, -1070055, -1080823, -1118295, -1171889, -1189678, -1195158, -1239279, -1302595, -1323901, -1280165, -1176168, -1002331, -778756, -620058, -672607, -949075, -1256150, -1340073, -1135115, -848999, -755324, -902882, -1091844, -1145315, -1102867, -1081348, -1051279, -892151, -626252, -437270, -432838, -521318, -577152, -616523, -728874, -914672, -1087201, -1195794, -1259743, -1294022, -1279019, -1211138, -1120077, -1016245, -877343, -724540, -660479, -754919, -904110, -901803, -699735, -516993, -592555, -869617]
33950h69617j78698R2580K21747J19448j7049k3088M1228M6638k4379j18130j96450
33939i05770k07365q8342J11010K10345J06835p0081j14729m715R6775O9960k7855
33928h23932o5540q018M7751q546j61113k66426k06519j5297J80728L01778L30943
33917f94191K44350L7177j95620l18841l05713k34626j50386l8827P8172J55476
33907a423029K21221L13107L34647J61231j05110k04507q4607L3040J9036Q757
33897g26214Q8300Q5499j18066l05379k24032L541O1023q1891j65290n8487R9951
33886a341045J74055J83721J54835L8194j60665l30638l77571k81599m6906K61652
33876a725967M56329L76795J11675q4752j00362m1460j7604k6703n6529j15338
$$ y = [-869617, -1048315, -955735, -733988, -614540, -631589, -654677, -613449, -566811, -591190, -709320, -905770, -1113135, -1201477, -1090467, -880122, -773287, -843368, -958097, -962812, -866037, -796077, -823932, -889472, -897490, -849739, -858285, -1019398, -1285824, -1492343, -1507640, -1326912, -1025134, -694191, -449841, -412664, -608284, -927125, -1232838, -1467464, -1617850, -1656677, -1578505, -1423029, -1201808, -888701, -554054, -392823, -497933, -702440, -787047, -754007, -734971, -726214, -637914, -552415, -670481, -975860, -1199892, -1196351, -1135328, -1217219, -1382509, -1440996, -1341045, -1166990, -983269, -828434, -790240, -950905, -1281543, -1659114, -1940713, -1987619, -1725967, -1269638, -892843, -781168, -865920, -966282, -1007742, -1025346, -1052049, -1108578, -1223916]
33866a223916j37992m0015J05208J24028J5984j8384J16998K66961K67621J60207
33856c63300N8367l5409j49759k14133j58044n4610k6577o1522m0319P6119J82117
33845g87070J45372n6676l00830l99122k60420N447J87675J87722Q4255j319k2420
33834a217386P319N0943N6002R851j0410O4598J59813J36040N941o9374j7370
33823h24033N8451N9917J0201n7551j65178k71167k45705o0530J34050K17595
33813a143950K46040K86447K57920Q3722j22717j92494j38039r5289r6246o2987
33803i77593J2853M8817K6152K5135Q2824J21001N5159q0667j47888l8367J87334
33792f85240L12864J90179n2553j40792j2313J03605K9578j08765j05202L471
$$ y = [-1223916, -1361908, -1401923, -1296715, -1172687, -1156703, -1175087, -1058089, -791128, -523507, -363300, -304933, -340342, -490101, -704234, -862278, -916888, -943465, -1004987, -1045306, -969187, -787070, -641698, -698374, -999204, -1398326, -1658746, -1653299, -1465624, -1277902, -1193647, -1194966, -1217386, -1210067, -1159124, -1103122, -1093271, -1103681, -1039083, -879270, -743230, -737289, -806663, -824033, -765582, -705665, -695464, -753015, -918193, -1189360, -1435065, -1495595, -1361545, -1143950, -897910, -611463, -353543, -269821, -392538, -585032, -723071, -818360, -914606, -977593, -964740, -915923, -889771, -864636, -781812, -660811, -605652, -686319, -834207, -872574, -685240, -372376, -182197, -234750, -375542, -387855, -284250, -254672, -363437, -468639, -465168]
33782d65168J9638j01867k14553k13606j39960o6389j7698N757L1235J07559K02277
33771h52775J78372l212j48647o8402J24483J55807j4193j60258j47798q0103
33761a016726n2295J315J16276J62216M2159j17347j23364K6776J67209J74197
33751f19584N7923r2778j68839r9413O5469J71086J21288j1209q2433l6725P1449
33740f23766J56470J52994M1030j25539k44842k52604j61421k7187P0242M5464
33730i69159r0937j69448m0392J79285K09766L146j59329o4676J31198J62326
33720h08220M5410m488N8279P2824l5837j59708k11215k16131j73878k3725J89087
33709a267602K90872K06363O2493j1302m0642p6244o0060M9134J40743R5859j8662
$$ y = [-465168, -445530, -547397, -761950, -975556, -1115516, -1181905, -1199603, -1193846, -1162611, -1055052, -852775, -674403, -677615, -826262, -894664, -770181, -614374, -628567, -788825, -936623, -1016726, -1069021, -1067706, -951430, -789214, -747055, -864402, -987766, -960990, -793781, -619584, -561661, -654439, -823278, -922691, -857222, -686136, -564848, -576057, -658490, -695215, -623766, -467296, -314302, -273272, -398811, -643653, -896257, -1057678, -1084865, -1014623, -969159, -1060096, -1229544, -1269936, -1090651, -880885, -877739, -1037068, -1101744, -970546, -808220, -762810, -767298, -709019, -636195, -672032, -831740, -1042955, -1259086, -1432964, -1456689, -1267602, -976730, -770367, -707874, -719176, -759818, -836062, -896122, -846988, -706245, -610386, -629048]
33698f29048m8941J8385P8966J07768J61445K02767J07441j14756k63784j94370
33688e74127j0836O5461m4550k18052k82349j76324L799R1043J6225j05013j09280
33677a344003k17O8168K9281l812O3962J51959J43651P7848P3121J33870J65301
33666d40871J33266P4316j8611j73592l11648k93441j21493L6993P0106L9397
33656a005578K5654j0397j12375j74463m6104K33244M25353L48447P2476j71679
33646d15422k30290j34680o336P3726Q1979J0505j11266j78355r3735R2880K18776
33635f92218K03222J09907n229j61674l05213k68927k4785J80554J30105m7314
33625h81572p7560N4270J47981J41417J25297O7834j35273l45187k84505q463
$$ y = [-629048, -677989, -659604, -580638, -472870, -311425, -108658, -1217, -115973, -379757, -574127, -584963, -519502, -564052, -782104, -1064453, -1240777, -1236978, -1145935, -1129710, -1234723, -1344003, -1344220, -1276052, -1246771, -1250583, -1186621, -1034662, -891011, -813163, -740042, -606172, -440871, -307605, -233289, -251900, -425492, -737140, -1030581, -1152074, -1115081, -1044975, -1005578, -979924, -990321, -1102696, -1277159, -1323263, -1090019, -664666, -316219, -243743, -415422, -645712, -780392, -786728, -713002, -631023, -620518, -731784, -910139, -1003874, -910994, -692218, -488996, -379089, -384318, -545992, -851205, -1120132, -1144917, -964363, -834258, -881572, -959132, -904862, -756881, -615464, -490167, -422333, -557606, -902793, -1187298, -1195761]
33615a195761J10649k9844r7505Q7356K25669O9869j23548l5598J66376J51195
33605f71142R809L0713J08742p1138l78740l51887L6411K92403J75115J4125Q2196
33594g23393J66072L3412j22710n5975O9687k5123k32092k35664k7292J27616
33584a025462J29988J15360J41390J17157K8562l0253m8298r1331j16051k1416
33574h00354J13809Q4122j11523k14310o1119J88747K80475J69980k545j26928
33564d79646j88928j91616j28529k1199Q8693J78795K32156K00859M6079j66675
33554d30011k66616j41723R5708J89010L4883j72088j84170k0795J01237J11315
33544f83250J44718K33219J90482n6450k46623j24428J49984J99172l4323k30568
$$ y = [-1195761, -1085112, -1114956, -1212461, -1125105, -899436, -829567, -953115, -988713, -822337, -671142, -661333, -630620, -521878, -593016, -971756, -1323643, -1287232, -994829, -819714, -805589, -723393, -557321, -523909, -646619, -702594, -632907, -658030, -890122, -1125786, -1153078, -1025462, -895474, -780114, -638724, -521567, -493005, -523258, -571556, -662887, -778938, -800354, -686545, -602423, -713946, -928256, -989375, -800628, -520153, -350173, -352718, -479646, -668574, -860190, -988719, -1009918, -921225, -742430, -510274, -309415, -263336, -430011, -696627, -838350, -742642, -553632, -518749, -690837, -875007, -895802, -794565, -683250, -538532, -305313, -114831, -171281, -417904, -542332, -392348, -193176, -227499, -458067]
33534d58067j70071J1186J13465J54434K06504J66099q6370m01355m72627k33280
33524a170082M8589J14429L693q0221o3370k7543j3459L4934J18123J30075L6966
33513h67866j7474R1689K50768K35114K4151j66028j72304o1936J2990P315k3497
33502f87078j5336O3359J68485J65127j7311k06960j46852J23292K55872P1059
33492b26343j76030j72505R008P4718l3915j16940o8290J2231L4244J7107j6933
33481f63648n8293m5451L1889K7142j46129k70023q4454K50476L02770N470k32269
33470h82520j56771k1797j01658k19613q5096J73710K05506R284q6675K8535R7195
33459a039900o1219k62377k33575K8903K91227L37111J26220j82677l26639j74529
$$ y = [-458067, -628138, -616952, -503487, -349053, -142549, 23550, -62820, -464175, -936802, -1170082, -1121493, -1007064, -1003371, -1083592, -1146962, -1174505, -1187964, -1153030, -1034907, -904832, -867866, -885340, -793651, -542883, -307769, -283618, -449646, -621950, -683886, -670896, -663581, -687078, -702414, -639055, -470570, -305443, -322754, -529714, -676566, -553274, -297402, -226343, -402373, -574878, -565870, -491152, -525067, -642007, -710297, -698066, -663822, -646715, -663648, -721941, -767392, -735503, -708361, -854490, -1124513, -1208967, -958491, -655721, -650251, -882520, -1039291, -1061088, -1162746, -1382359, -1467455, -1293745, -1088239, -1078955, -1165630, -1137095, -1039900, -1101119, -1363496, -1597071, -1568168, -1276941, -939830, -813610, -996287, -1322926, -1497455]
33449a497455J05961K31891J51313N7105O5151Q6236N9679Q0202J77783J89086
33439b93048K2750j27835n3088J31117J61360M9102L1054J27462Q1308j84680
33429e4498l68714k30870K1953M6117j22662j63726J3261J73637J73043J38669
33419c73790J50505N4492k21611m19788k79546M8667K02255J26004Q8665K01352
33409d22795K45526P1734j18652p4970J20834J95655Q8837j5211r900r22r2474
33398a2338k13862k27154r8822Q9105K15878J80796j5340k06222j86806K5969
33388d48796J63278L4689k06331k67724j23795k8624j25298k44289j73088M5808
33378a374170K24173L04752L50069L34928J62005j18724l02604k89931j91778
$$ y = [-1497455, -1391494, -1159603, -1008290, -951185, -886034, -799798, -740119, -659917, -482134, -293048, -270298, -398133, -451221, -320104, -158744, -109642, -78588, 48874, 130182, -54498, -423212, -654082, -632129, -586012, -708674, -872400, -859139, -685502, -512459, -373790, -223285, -168793, -390404, -810192, -1089738, -1041071, -838816, -712812, -624147, -422795, -177269, -105535, -224187, -299157, -178323, 17332, 106169, 90958, 81058, 80136, -12338, -226200, -453354, -552176, -463071, -247193, -66397, -81737, -287959, -474765, -448796, -285518, -250829, -457160, -724884, -848679, -877303, -1002601, -1246890, -1419978, -1374170, -1149997, -845245, -495176, -160248, 1757, -116967, -419571, -709502, -901280]
33369i01280j21059m3826P1308J17879R836j39021j53104m1220M6565N4984O0239
33358a038699R8351J12065P3137K7031N341L741M1555J25795J67598P2553q4957
33347c96489j29653m4554M125n6719q6826K4485J67033J90495J30863R7881N5936
33336d3423q7959k49245k37040n7363N8632k0512j51305j55423q1537q4648j46021
$$ y = [-901280, -1022339, -1066165, -994857, -876978, -867142, -1006163, -1159267, -1200487, -1153922, -1098938, -1038699, -940348, -828283, -755146, -728115, -722774, -719033, -677478, -551683, -384085, -311532, -396489, -526142, -570696, -566571, -623290, -710116, -685631, -518598, -328103, -197240, -99359, -43423, -131382, -380627, -617667, -675030, -616398, -636910, -788215, -943638, -1025175, -1109823, -1255844]
$$ [...]
##END NTUPLES=NMR SPECTRUM
##END=
