##TITLE=31P_DE-80H_X3
 64 sc D2O
 26.2.2025
##JCAMPDX= 6.0         $$ Bruker NMR JCAMP-DX V2.0
##DATA TYPE= NMR SPECTRUM
##DATA CLASS= NTUPLES
##ORIGIN= UXNMR, Bruker Analytische Messtechnik GmbH
##OWNER= root
$$ XWIN-NMR		Version 3.5
$$ Fri Jul 11 10:31:22 2025 Russian Standard Time (UT+4h)  Yarkov@DPX200
##.OBSERVE FREQUENCY= 81.013821
##.OBSERVE NUCLEUS= ^31P
##.ACQUISITION MODE= SIMULTANEOUS
##.ACQUISITION SCHEME= undefined
##.AVERAGES= 64
##.DIGITISER RES= 17
##SPECTROMETER/DATA SYSTEM= spect
##.PULSE SEQUENCE= zgpg30
##.SOLVENT NAME= DMSO
##.SHIFT REFERENCE= (INTERNAL, DMSO, 0, 198.062)
##AUDIT TRAIL= $$ (NUMBER, WHEN, WHO, WHERE, WHAT)
$$ ##TITLE= Audit trail, XWIN-NMR		Version 3.5
$$ ##JCAMPDX= 5.01
$$ ##ORIGIN= Bruker BioSpin GmbH
$$ ##OWNER= Yarkov
$$ C:/Bruker/XWIN-NMR/data/yarkov2/nmr/P31/2/pdata/1/auditp.txt
$$ ##AUDIT TRAIL=  $$ (NUMBER, WHEN, WHO, WHERE, WHAT)
(   1,<2025-07-11 10:30:04.90 +0400>,<Yarkov>,<DPX200>,
      <created by zg, POWCHK disabled, PULCHK disabled
       configuration hash MD5:
       00 E9 B6 7A A2 85 ED C7 34 08 36 98 17 FE 4E 26
       data hash MD5: 32K
       D8 6D 93 13 A5 A7 B5 D7 46 BC 02 B2 15 81 AB BF>)
(   2,<2025-07-11 10:30:43.76 +0400>,<Yarkov>,<DPX200>,
      <Start of raw data processing
       efp BC_mod = 2 LB = 1.5 FT_mod = 6 PKNL = 1 PHC0 = 1676.443 PHC1 = 49.15953 SI = 64K 
       data hash MD5: 64K
       7E 0C 23 C4 CF DA 78 CD CA 34 E6 92 DE 9E 1A 2D>)
$$ ##END=
$$ 
$$ hash MD5
$$ 78 37 9C 6E 15 47 B6 7B D8 D2 44 7B F9 64 24 15
##$RELAX= 
##$RELAX= 
##$RELAX= 
##$RELAX= 
##$RELAX= 
##$RELAX= 
##$RELAX= 
##$RELAX= 
$$ Bruker specific parameters
$$ --------------------------
##$DU= <C:/Bruker/XWIN-NMR>
##$EXPNO= 2
##$NAME= <P31>
##$PROCNO= 1
##$TYPE= <nmr>
##$USER= <yarkov2>
##$AMP= (0..31)
100 100 100 100 100 100 100 100 100 100 100 100 100 100 100 100 100 100 
100 100 100 100 100 100 100 100 100 100 100 100 100 100 
##$AQSEQ= 0
##$AQ_mod= 1
##$AUNM= <au_zg>
##$AUTOPOS= <>
##$BF1= 81.014009
##$BF2= 200.13
##$BF3= 200.13
##$BF4= 200.13
##$BF5= 200.13
##$BF6= 200.13
##$BF7= 200.13
##$BF8= 200.13
##$BYTORDA= 1
##$CFDGTYP= 0
##$CFRGTYP= 5
##$CHEMSTR= <none>
##$CNST= (0..31)
1 1 145 1 1 1 1 1 1 1 1 1 1 1 1 1 1 1 1 1 1 1 1 1 1 1 1 1 1 1 1 1 
##$CPDPRG= <waltz16>
##$CPDPRG1= <>
##$CPDPRG2= <waltz16>
##$CPDPRG3= <>
##$CPDPRG4= <mlev>
##$CPDPRG5= <mlev>
##$CPDPRG6= <mlev>
##$CPDPRG7= <mlev>
##$CPDPRG8= <mlev>
##$CPDPRGB= <>
##$CPDPRGT= <>
##$D= (0..31)
0 1 0 0 0 0 0 0 0 0.06 0 0.03 2e-05 3e-06 0 0 0.0002 0 0 0 0 0 0 0 0 0 
0 0 0 0 0 0 
##$DATE= 1752215404
##$DBL= (0..7)
120 120 120 11 120 120 24 19 
##$DBP= (0..7)
150 150 150 150 150 150 150 150 
##$DBP07= 0
##$DBPNAM0= <>
##$DBPNAM1= <>
##$DBPNAM2= <>
##$DBPNAM3= <>
##$DBPNAM4= <>
##$DBPNAM5= <>
##$DBPNAM6= <>
##$DBPNAM7= <>
##$DBPOAL= (0..7)
0.5 0.5 0.5 0.5 0.5 0.5 0.5 0.5 
##$DBPOFFS= (0..7)
0 0 0 0 0 0 0 0 
##$DE= 6
##$DECBNUC= <off>
##$DECIM= 4
##$DECNUC= <off>
##$DECSTAT= 4
##$DIGMOD= 1
##$DIGTYP= 9
##$DL= (0..7)
0 0 52 120 120 21 21 25 
$$ [...]
##$SUBNAM2= <"">
##$SUBNAM3= <"">
##$SUBNAM4= <"">
##$SUBNAM5= <"">
##$SUBNAM6= <"">
##$SUBNAM7= <"">
##$SUBNAM8= <"">
##$SUBNAM9= <"">
##$SW= 400.765351723535
##$SWIBOX= (0..15)
0 1 3 0 0 0 0 0 0 0 0 0 0 0 0 0 
##$SW_h= 32467.5324675325
##$TD= 32768
##$TD0= 1
##$TE= 0
##$TE2= 300
##$TE3= 300
##$TEG= 300
##$TL= (0..7)
0 120 53 12 22 120 120 120 
##$TP= (0..7)
150 150 150 150 150 150 150 150 
##$TP07= 0
##$TPNAME0= <>
##$TPNAME1= <>
##$TPNAME2= <>
##$TPNAME3= <>
##$TPNAME4= <>
##$TPNAME5= <>
##$TPNAME6= <>
##$TPNAME7= <>
##$TPOAL= (0..7)
0.5 0.5 0.5 0.5 0.5 0.5 0.5 0.5 
##$TPOFFS= (0..7)
0 0 0 0 0 0 0 0 
##$TUNHIN= 0
##$TUNHOUT= 0
##$TUNXOUT= 0
##$USERA1= <user>
##$USERA2= <user>
##$USERA3= <user>
##$USERA4= <user>
##$USERA5= <user>
##$V9= 5
##$VALIST= <valist>
##$VCLIST= <CCCCCCCCCCCCCCC>
##$VD= 0
##$VDLIST= <DDDDDDDDDDDDDDD>
##$VPLIST= <PPPPPPPPPPPPPPP>
##$VTLIST= <TTTTTTTTTTTTTTT>
##$WBST= 1024
##$WBSW= 4
##$XGAIN= (0..3)
0 0 0 0 
##$XL= 0
##$YL= 0
##$YMAX_a= 483
##$YMIN_a= -314
##$ZGOPTNS= <>
##$ZL1= 120
##$ZL2= 120
##$ZL3= 120
##$ZL4= 120
##$ABSF1= 0
##$ABSF2= 0
##$ABSG= 0
##$ABSL= 0
##$ALPHA= 0
##$AQORDER= 0
##$ASSFAC= 0
##$ASSFACI= 0
##$ASSFACX= 0
##$ASSWID= 0
##$AUNMP= <proc_1d>
##$AZFE= 0.1
##$AZFW= 0.5
##$BCFW= 0
##$BC_mod= 2
##$BYTORDP= 0
##$COROFFS= 0
##$CY= -3
##$DATMOD= 1
##$DC= 0
##$DFILT= <>
##$DTYPP= 0
##$F1P= 0
##$F2P= 0
##$FCOR= 1
##$FTSIZE= 65536
##$FT_mod= 6
##$GAMMA= 0
##$GB= 0
##$INTBC= 1
##$INTSCL= 9.790993e-09
##$ISEN= 30
##$LB= 1.5
##$LEV0= 0
##$LPBIN= 0
##$MAXI= 10000
##$MC2= 0
##$MEAN= 0
##$ME_mod= 0
##$MI= 50
##$NCOEF= 0
##$NC_proc= -10
##$NLEV= 6
##$NOISF1= 182.463
##$NOISF2= 159.3651
##$NSP= 0
##$NTH_PI= 0
##$NZP= 0
##$OFFSET= 198.0616
##$PC= 4
##$PHC0= 1676.443
##$PHC1= 49.15953
##$PH_mod= 1
##$PKNL= yes
##$PPARMOD= 0
##$PSCAL= 0
##$PSIGN= 0
##$REVERSE= no
##$SF= 81.0140089999434
##$SI= 65536
##$SIGF1= 159.3651
##$SIGF2= -187.1042
##$SINO= 113.3802
##$SIOLD= 16384
##$SREGLST= <1H.CDCl3>
##$SSB= 0
##$STSI= 65536
##$STSR= 0
##$SW_p= 32467.5324675325
##$SYMM= 0
##$S_DEV= 0
##$TDeff= 32768
##$TDoff= 0
##$TI= <>
##$TILT= no
##$TM1= 0
##$TM2= 0
##$TOPLEV= 0
##$USERP1= <user>
##$USERP2= <user>
##$USERP3= <user>
##$USERP4= <user>
##$USERP5= <user>
##$WDW= 1
##$XDIM= 65536
##$YMAX_p= 424089669
##$YMIN_p= -20363826
$$ End of Bruker specific parameters
$$ ---------------------------------
##NTUPLES= NMR SPECTRUM
##VAR_NAME=  FREQUENCY,     SPECTRUM/REAL,   SPECTRUM/IMAG
##SYMBOL=    X,             R,               I
##VAR_TYPE=  INDEPENDENT,   DEPENDENT,       DEPENDENT
##VAR_FORM=  AFFN,          ASDF,            ASDF
##VAR_DIM=   65536,         65536,           65536
##UNITS=     HZ,            ARBITRARY UNITS, ARBITRARY UNITS
##FACTOR=    0.49542278885378, 1,            1
##FIRST=     16045.7642231865, 0,            0
##LAST=      -16421.768244346, 0,            0
##MIN=       -16421.768244346, -20363826,    0
##MAX=       16045.7642231865, 424089669,    0
$$ Real data points
##PAGE= N=1
##DATA TABLE= (X++(R..R)), XYDATA
$$ [...]
41581 -279187 -96978 -82686 -334122 -387765 73806 755210 1164524 1155795 865038 433002
41571 433002 44423 -34473 240502 536399 554106 419244 409151 482901 389572 94124
41561 94124 -226869 -496128 -711777 -717968 -375275 79908 227783 39299 -96766 36913
41551 36913 236887 311267 385940 591759 755674 643553 300335 -61478 -335779 -496250
41541 -496250 -471552 -263798 -65659 -47492 -105517 -4233 280782 512641 457695 104779
41531 104779 -331851 -559929 -433058 -92565 185585 305861 390553 493316 483036 294922
41521 294922 83833 -4561 -26068 -66267 -76884 -36169 -56374 -152417 -143014 -5364 -58281
41510 -58281 -477576 -883584 -824907 -481752 -399206 -630093 -700804 -441534 -254280 -379228
41500 -379228 -452212 -122923 326829 398077 107334 -119743 -87191 56475 217422 442766
41490 442766 623531 501493 61855 -364192 -490015 -349513 -103898 197457 511750 622356
41480 622356 277475 -488869 -1282298 -1639508 -1396465 -783576 -166035 296293 689354 1058920
41470 1058920 1217662 956649 385203 -99164 -216228 -91205 -99851 -469825 -1051433 -1456738
41460 -1456738 -1428296 -1084287 -775383 -704038 -761600 -754708 -656792 -540980 -387962 -123505
41450 -123505 206197 445186 485628 302062 -91599 -547828 -734058 -446555 14500 79890
41440 79890 -368103 -783498 -654080 -163833 133214 131680 274115 830453 1466610 1700846
41430 1700846 1504312 1200759 968122 757223 623548 777824 1210342 1533943 1378665
41421 1378665 797124 144173 -301887 -460746 -372650 -229415 -360751 -905398 -1523514 -1696848
41411 -1696848 -1320601 -755137 -305482 36967 298627 359428 266036 361895 820177 1299624
41401 1299624 1364078 1034307 620098 232065 -151337 -327621 -90207 250691 102434 -567743
41391 -567743 -1117153 -1123380 -919570 -958560 -1083342 -857991 -324574 74212 197790 331892
41381 331892 596541 706978 503006 333517 592534 1079380 1193562 747328 241177 191895
41371 191895 456688 505621 223175 52015 287292 622150 645005 492332 632429 1155233
41361 1155233 1682197 1929370 1952995 1826651 1514023 1169002 1120085 1341010 1334268 833001
41351 833001 269562 181734 435320 462880 85660 -354905 -585064 -653567 -595328 -284291
41341 -284291 255037 733726 964320 1100243 1359903 1695014 1866467 1722291 1317073 869780
41331 869780 637382 684675 748836 500328 -17480 -389060 -333004 -20390 219301 331955
41321 331955 503057 785788 962370 804577 364966 -61556 -255260 -296810 -426312 -716980
41311 -716980 -1009997 -1182553 -1298663 -1395634 -1312532 -925440 -425030 -147938 -216575 -520715
41301 -520715 -915287 -1209565 -1133059 -645797 -168376 -130337 -370760 -405678 -228137 -318934
41291 -318934 -814664 -1242125 -1273197 -1187250 -1273674 -1290685 -938542 -434778 -129836 83799
41281 83799 426761 596264 122794 -775562 -1340481 -1264084 -936356 -657361 -224272 495729
41271 495729 1124717 1231434 864924 353575 -114894 -454786 -531080 -347268 -149609 -73297
41261 -73297 80703 435501 666613 422154 -67269 -234739 37472 309158 270524 109658
41251 109658 79813 103568 38847 19753 212318 418046 260168 -290600 -853321 -1084518
41241 -1084518 -942292 -514616 111567 705743 900505 577200 103389 -38849 208592
41232 208592 500451 572720 482911 397965 392371 493405 686780 790652 552968 19028
41222 19028 -386299 -322374 55893 319749 274715 66662 -97991 -117258 40478 300429
41212 300429 447367 349542 194527 274516 543084 633860 355243 -83490 -415560 -641917
41202 -641917 -884415 -1117693 -1208929 -1090754 -774695 -329084 55183 149255 -24442 -152926
41192 -152926 -39518 123838 87388 -30754 76557 416180 692598 750828 713913 677320
41182 677320 586288 479525 531820 716493 725568 438634 222772 492449 1135540 1653323
41172 1653323 1747636 1480422 961706 258755 -370234 -541048 -205448 226202 399868 418307
41162 418307 532147 672747 587321 289455 43865 -45133 -108978 -168232 -32750 350913
41152 350913 726187 859936 845246 908838 1097562 1340698 1654880 2040774 2279926 2121656
41142 2121656 1677841 1380545 1471198 1724629 1780618 1583100 1341955 1175539 994577 733270
41132 733270 503920 423109 400764 255002 9370 -86120 117178 452207 646775 638189
41122 638189 552698 479859 449708 554282 850054 1152775 1186493 973578 815107 822372 774014
41111 774014 568507 475296 682047 895762 748711 378379 191829 199989 58901 -256603
41101 -256603 -317478 95626 611029 768384 596194 445236 467133 511928 422524 219561
41091 219561 39739 9004 130190 248075 210377 74354 18586 50256 -5017 -194340
41081 -194340 -345766 -345889 -268864 -152134 76648 324141 294772 -59579 -342319 -234922
41071 -234922 45471 137138 139334 398960 835522 970342 643124 248276 136662 166908
41061 166908 44634 -205346 -357207 -359294 -328915 -306254 -272730 -347664 -695285 -1190826 -1401750
41050 -1401750 -1050326 -395703 1089 -122654 -504556 -751147 -785846 -782171 -809749 -791538
41040 -791538 -754288 -824341 -925187 -774788 -314428 132938 309321 351664 437323 387024
41030 387024 -17876 -534078 -709334 -528972 -360730 -306625 -110937 237004 343239 53842
41020 53842 -213650 -87474 194085 194881 -48797 -172169 -76287 41569 110922 214512 252113
41009 252113 -4357 -492611 -854874 -903595 -773741 -576145 -268405 28201 -18426 -455490
40999 -455490 -834178 -788289 -559719 -602888 -871867 -921949 -633414 -385758 -457418 -655634
40989 -655634 -698162 -625124 -603565 -579233 -394237 -94748 124430 170285 39124 -304318
40979 -304318 -778374 -1034246 -766354 -132325 422957 719237 898544 974537 750734 275661
40969 275661 -50325 -22767 85505 22280 -48085 43933 54130 -242233 -518939 -354781
40959 -354781 -18656 -172661 -846214 -1344658 -1254195 -913481 -707881 -528014 -261921 -234462
40949 -234462 -643891 -1002345 -749442 -151906 52624 -217718 -293736 152680 563799 316882
40939 316882 -392954 -873704 -845563 -635045 -604512 -754137 -886307 -889495 -785123 -643831
40929 -643831 -507906 -319242 52117 598030 1034088 1046956 696859 383821 338068 343751
40919 343751 127429 -171058 -210934 -59823 -215004 -896329 -1637096 -1823832 -1418340 -841839
40909 -841839 -313089 292677 959712 1361136 1338002 1198161 1278056 1445705 1329208 885610
40899 885610 434640 189521 47944 -133252 -313039 -405325 -462844 -604213 -846254 -1088193
40889 -1088193 -1210332 -1148044 -919687 -615527 -330187 -102621 49210 70818 -68848 -255220
40879 -255220 -248419 112187 718827 1224905 1303647 940627 471904 261685 334589 414134
40869 414134 318541 157883 90033 88497 99255 231339 544548 772313 560931 -32311
40859 -32311 -559667 -727878 -651286 -506255 -243741 187254 593140 760563 757532 756012 691007
40848 691007 404646 65360 74200 467806 755164 572651 248260 378604 956252 1311079
40838 1311079 988979 330324 -43581 -38014 -30147 -154325 -85530 384775 929627 1064313
40828 1064313 715493 197478 -194775 -332696 -155249 273726 667310 759250 649014 656096
40818 656096 815581 778976 290835 -461247 -1072876 -1311478 -1181433 -789100 -286293 168868
40808 168868 502903 695201 642340 248507 -289197 -546564 -394728 -228552 -440339 -862527
40798 -862527 -1031376 -855805 -651442 -559557 -351211 88019 455167 448897 241676 251210
40788 251210 567506 875021 904963 728850 572944 527163 518425 463066 366128 318389 430847
40777 430847 720335 1030999 1126673 912437 542268 275506 242126 363113 466140 440586
40767 440586 296258 121931 11750 12186 101855 199883 208306 85618 -102649 -226168 -199137
40756 -199137 -36058 191797 400909 486689 366866 111625 -52880 -968 81980 -90583
40746 -90583 -497475 -802224 -785279 -568489 -333514 -78455 169170 168196 -187721 -518018
40736 -518018 -356306 156876 411892 197785 -21379 141472 410090 313495 -114718 -499204
40726 -499204 -732873 -974584 -1178363 -1111675 -850341 -808202 -1145769 -1496271 -1452334 -1067891
40716 -1067891 -708121 -609048 -754859 -1023176 -1269397 -1359797 -1260531 -1054851 -829003 -616938
40706 -616938 -449632 -316502 -88654 318052 695163 719800 446848 323682 567184 827684
40696 827684 703365 316335 71216 56583 47705 -38028 -84013 -112868 -275582 -465213 -319389
40685 -319389 261922 890579 1129772 947627 630085 457693 563726 875637 1071019 826315
40675 826315 262873 -80773 105407 514443 679309 563742 415041 270591 13062 -220223
40665 -220223 -143499 168115 320917 237248 311281 742775 1109851 900294 181057 -571591
40655 -571591 -1068374 -1290231 -1184845 -717129 -160752 73369 -54777 -195438 -127221 20039
40645 20039 86807 68490 -105387 -590272 -1244388 -1581774 -1362315 -941718 -767146 -801181
40635 -801181 -756440 -628589 -588060 -534220 -223653 231901 442042 307530 105022 -3434
40625 -3434 -109251 -155374 117628 649725 939879 719005 360971 297589 363465 129583
40615 129583 -361962 -668458 -639505 -573322 -660818 -685168 -410703 28136 314358 358281
40605 358281 357882 523073 845168 1123889 1187658 1078604 974336 920454 767081 454129
40595 454129 211335 300680 655086 973357 1117177 1195875 1274395 1235707 999073 691886
40585 691886 505743 490772 561281 618455 612521 547350 464199 392897 328238 277413 264947
40574 264947 240471 90769 -157444 -276419 -133748 77404 107684 28940 77488 215027
40564 215027 178871 -53011 -207982 -175568 -151036 -217465 -162556 101697 296011 212317 80291
40553 80291 178714 350054 275188 26696 -65538 25834 25571 -140249 -258703 -244291 -221946
40542 -221946 -156282 164657 656470 881045 666839 392081 384125 414531 154007 -197580
40532 -197580 -215241 10255 -33415 -475277 -849821 -784096 -463340 -233593 -98614 143735
40522 143735 517636 868645 1075302 1056557 722005 118046 -491692 -864889 -1002088 -1021130
40512 -1021130 -982763 -975664 -1141585 -1399074 -1385047 -976733 -650851 -919834 -1555899 -1839373
40502 -1839373 -1516841 -1006202 -626441 -193310 426432 892911 878191 583503 389566 294813
40492 294813 100230 -102447 -86692 9482 -194866 -724153 -1164648 -1219187 -1018063 -827633
40482 -827633 -744236 -761695 -898060 -1136817 -1381091 -1522658 -1463656 -1108302 -477997 206756
40472 206756 706716 968008 1017529 802985 360304 -11489 -57771 38842 -87494 -395597
40462 -395597 -475093 -167700 243895 518664 731141 954723 1052413 943924 746097 486423
40452 486423 12022 -631586 -1065833 -1050654 -797269 -594987 -436404 -254380 -193201 -317970
40442 -317970 -348798 -59044 303551 393764 362488 623613 1145624 1436694 1223931 750847
40432 750847 378055 239774 321110 526121 605860 344161 -88092 -248841 -2419 274853
40422 274853 188666 -198843 -527430 -591773 -489054 -420141 -443848 -377561 44935 802749
40412 802749 1429535 1433479 873898 294948 63474 28343 -92030 -266998 -277341 -80472
40402 -80472 157052 282667 245973 48317 -242330 -474066 -527306 -421612 -245365 -46490
40392 -46490 140381 243631 228343 164766 135910 117715 29610 -121043 -212305 -128508 113634
40381 113634 359512 460575 449514 511125 708886 832974 676960 402205 392428 719629
40371 719629 1000112 890737 514197 227307 138303 59258 -170699 -521551 -863530 -1022788
40361 -1022788 -798454 -157402 566653 882909 638253 157030 -179583 -331128 -465193
40352 -465193 -590927 -533562 -223806 186038 513077 688175 677856 443888 76522 -196861
40342 -196861 -291084 -423890 -797292 -1200963 -1181440 -610980 140256 639223 776791 664979
40332 664979 409034 133479 21706 121791 234221 155975 -71188 -270827 -323815 -116553
40322 -116553 469891 1278373 1785430 1610699 1003452 524081 352428 239594 43142 -93167
40312 -93167 -85183 -45093 -25992 22216 9360 -203854 -421423 -252694 240995 501717 291469
40301 291469 89561 343372 741705 691142 221337 -95545 27811 340609 565819 694000
40291 694000 735618 605356 364421 236716 254064 177303 -92095 -301872 -237398 -81569
40281 -81569 -143681 -392527 -539293 -513646 -553104 -759424 -837674 -477282 155086 561265
40271 561265 524000 307370 184275 68875 -162811 -256326 127650 813312 1238049 1201861
40261 1201861 1055420 1034750 885050 421443 34458 186529 655567 769063 305077 -278031
40251 -278031 -510843 -417366 -274593 -202214 -145271 -60898 9710 -42371 -322273 -753658 -1011085
40240 -1011085 -817765 -304567 110788 193953 61165 -85725 -151692 -78236 149506 364107
40230 364107 327338 60802 -161797 -228748 -330948 -551216 -590797 -163297 509745 887268
40220 887268 738628 342859 69137 -5351 9207 99544 354258 746006 1076979 1194276
40210 1194276 1166096 1162394 1215359 1200527 1026095 716864 324057 -82501 -311488 -156955
40200 -156955 282452 592786 518083 273254 204768 328107 445019 537979 714104 863509
40190 863509 749809 429297 226663 259192 322198 308649 395276 687210 992242 1112221
40180 1112221 1093392 1027386 860190 574611 316792 143382 -125895 -575854 -920042 -823181
40170 -823181 -371509 18533 74403 -146120 -447056 -668200 -726490 -664623 -638815 -755978
40160 -755978 -979755 -1254482 -1585071 -1905317 -2042993 -1956128 -1835086 -1807301 -1711208 -1357548
40150 -1357548 -858680 -481256 -305526 -250360 -299485 -446872 -520537 -336426 12225 245499
40140 245499 237002 78386 -106375 -201999 -72009 253559 461012 316087 64840 147294
40130 147294 558787 850177 761049 481891 241687 23373 -193924 -287036 -276500 -437503
40120 -437503 -883470 -1296911 -1326273 -1043327 -759990 -579289 -403329 -246284 -236377 -349307
40110 -349307 -388630 -237736 36388 308360 476309 466281 319033 238502 385710 635571
40100 635571 697086 483114 217816 153710 304655 492294 556437 478150 361923 328674
40090 328674 394670 460191 436510 327065 137407 -192528 -639872 -959768 -889660 -507792
40080 -507792 -210051 -255249 -468996 -495890 -237697 78228 187428 1091 -424953 -945694
40070 -945694 -1299222 -1199490 -628831 13805 231565 -64712 -491494 -673812 -639831 -624290
40060 -624290 -634548 -456318 -70168 201289 85108 -269801 -472217 -351867 -88556 75330
40050 75330 86012 18467 -97120 -292213 -542147 -719576 -711473 -565013 -452957 -458099 -461560
40039 -461560 -336930 -191083 -240102 -446742 -502348 -266736 -14474 -63410 -329832 -490995
40029 -490995 -458845 -391257 -300477 -18877 390112 556387 319033 17258 20451 207943
40019 207943 210051 -22803 -243294 -381217 -590055 -827855 -808499 -487176 -224157 -263939
40009 -263939 -365750 -220038 21206 -35956 -430518 -812734 -938608 -873763 -723561 -484960
39999 -484960 -216215 -59486 4354 177113 515039 814778 952702 1102183 1428974 1756096
39989 1756096 1743427 1287342 573560 -146770 -659605 -792158 -536410 -123459 188291 348990
39979 348990 424199 395251 244996 130435 223894 432485 510263 417477 330566 311595 220708
39968 220708 -22764 -333467 -645935 -963732 -1176640 -1087931 -713534 -314416 -28479 288771
39958 288771 729923 1088594 1125689 883780 560930 261651 51252 49075 241594 389680
39948 389680 371975 435273 801958 1203946 1206576 909137 856407 1200032 1424905 1135296
39938 1135296 716309 833122 1483442 1968329 1787954 1210490 838670 874481 1021239 976128
39928 976128 758910 530264 314633 68606 -98580 -11483 255396 381462 228043 56954
39918 56954 132478 277215 118268 -292849 -463314 -149973 254546 240800 -146790 -453019
39908 -453019 -497039 -558790 -847995 -1114301 -973824 -428735 160403 515847 626199 537447
39898 537447 235966 -178266 -430453 -356608 -124743 -12105 -68988 -175729 -317304 -547883
39888 -547883 -732253 -628644 -292270 -115198 -320178 -637799 -665439 -371800 -48655 104297
39878 104297 137116 170857 241193 281043 161823 -144543 -368024 -119984 551611 1027370
39868 1027370 835502 319133 210837 652441 1060860 948746 443384 -77472 -444316
39859 -444316 -640112 -651537 -568982 -545331 -501403 -178114 365099 658154 447337 69145
39849 69145 -68164 -29871 -60254 -102752 -50256 -169706 -727348 -1358723 -1393145 -778889 -157127
39838 -157127 14361 -98803 -217352 -371913 -633685 -886498 -1108281 -1474435 -1914875 -1955960
39828 -1955960 -1341919 -496579 3546 153819 318149 523285 452836 88910 -125662 114423
39818 114423 560241 759352 598337 322466 145032 8217 -269416 -689448 -995423 -968779
39808 -968779 -755219 -701194 -812946 -647707 39138 765363 793507 50807 -778066 -1086971
39798 -1086971 -936307 -733189 -668047 -660085 -611459 -470729 -174336 262382 654513 799909
39788 799909 685073 443883 180566 -57337 -187186 -99357 224977 639686 874548 696940
39778 696940 153859 -338561 -305334 307485 1077997 1591235 1822405 1946062 1961257 1724935
39768 1724935 1258640 777756 412688 94656 -238794 -479573 -470596 -209897 127029 329787
39758 329787 297230 81667 -183969 -399202 -511135 -433666 -71143 490999 917240 903448
39748 903448 519386 134207 -25828 -120700 -426525 -913916 -1228850 -1117094 -767523 -615129
39738 -615129 -807398 -1023076 -931782 -687030 -715878 -1060825 -1252980 -954162 -435889 -195937
39728 -195937 -312589 -460295 -429706 -322444 -281292 -322939 -450000 -671338 -870851 -877560
39718 -877560 -711466 -565013 -515066 -461372 -374122 -358509 -405036 -321306 -30830 270716 391029
39707 391029 386847 392496 373350 212421 -86727 -429682 -746584 -945839 -882807 -539248 -144031
39696 -144031 43419 17038 -28386 24283 101273 66213 -114181 -301250 -269841 48899 416416
39685 416416 523383 372823 225828 164666 5806 -273637 -378020 -161300 83086 84892
39675 84892 40550 228593 452616 334126 -7365 -82438 213188 486843 534131 628446
39665 628446 970795 1298725 1287606 998452 673132 372271 89382 -12906 207526 576421
39655 576421 766892 694862 550461 504154 578497 774908 1132320 1609128 2004182 2065415
39645 2065415 1706073 1132805 708750 620409 736701 867866 1011545 1156313 1031021 423296
39635 423296 -322958 -580831 -269225 52885 52112 57138 344389 521157 134859 -472892
39625 -472892 -542825 37640 640801 817241 731165 628295 441481 140031 16608 315111
39615 315111 840525 1188790 1179168 897138 521800 277336 344546 632202 807104 710617
39605 710617 562714 598067 724199 755233 757375 860507 899227 617865 168989 9769
39595 9769 242802 424001 189053 -227031 -340090 -84670 157546 105153 -142910 -386793
39585 -386793 -603110 -804429 -814320 -410185 333075 1011680 1268966 1137089 955775 976606
39575 976606 1090802 977447 522964 28258 -97590 167881 420189 332739 33461 -144482
39565 -144482 -110442 6180 193052 560405 1035305 1362411 1450620 1423216 1269811 798453
39555 798453 71472 -471696 -558437 -430972 -383364 -281842 89770 506481 597852 471100
39545 471100 527208 770376 843253 712161 736592 983194 1047510 738541 402451 309904
39535 309904 228925 -56831 -271146 -114430 166547 155158 -69443 -129269 4617 59360
39525 59360 -2826 -20444 -122598 -629302 -1422706 -1935812 -1909314 -1711891 -1701198 -1651159 -1109662
39514 -1109662 -94848 838224 1130451 680767 -106166 -636198 -616763 -308786 -178898
39505 -178898 -311559 -376257 -179933 59357 103088 45853 70115 108191 23833 -53370 112816
39494 112816 452979 623787 447368 101676 -139456 -182768 -118915 -91578 -172788 -260415
39484 -260415 -129560 282829 678175 649283 150610 -433354 -729681 -754025 -785854 -988143
39474 -988143 -1257481 -1390399 -1279789 -939095 -434803 118970 532604 638388 490440 379435
39464 379435 531196 851073 1107353 1288582 1534987 1734067 1536999 939755 529007 834704
39454 834704 1616622 2130290 2009613 1548270 1144216 842495 521339 216540 79560 185420
39444 185420 489501 812847 818249 251715 -648440 -1212564 -1023571 -391961 46472 56689
39434 56689 -107802 -209919 -286961 -390937 -392570 -207053 -17935 -65099 -286689 -374878 -205507
39423 -205507 -36196 -165414 -500066 -635115 -356715 106308 388530 373948 166632 -142554
39413 -142554 -481307 -710285 -792394 -955291 -1386931 -1833553 -1868658 -1558520 -1415640 -1580700
39403 -1580700 -1543308 -955227 -273876 -165410 -576274 -868681 -677085 -173220 354333 700422
39393 700422 645312 178380 -225568 -70865 424811 589854 303961 140971 405974 688957
39383 688957 626689 463177 462587 350622 -148616 -697615 -834367 -688318 -614277 -458272
39373 -458272 125187 856631 1075266 720069 357359 219479 -80072 -754598 -1432503 -1747766
39363 -1747766 -1749511 -1483161 -759283 307956 1057606 1026911 565678 295138 290394 229528
39353 229528 54967 -8323 75609 116166 41321 -89240 -319616 -687252 -955128 -811278
39343 -811278 -309110 188780 463780 561277 531689 370395 192131 173359 323671 544032
39333 544032 834530 1172677 1298623 988939 497468 338265 629510 1036264 1373275 1822655
39323 1822655 2457470 2989835 3180713 3140140 3052943 2981048 3115903 3772526 4796667 5364016
39313 5364016 4822513 3521306 2407585 1979539 2022835 2195946 2387435 2532729 2538826 2475804
39303 2475804 2503667 2537950 2295744 1749794 1239148 1019576 966968 850930 662245 514593
39293 514593 413347 287924 130185 -19784 -124889 -125174 4768 126615 46947 -176954
39283 -176954 -251643 -73874 94897 47886 -23896 122651 300463 134398 -292185 -452359
39273 -452359 -120187 268383 206281 -200270 -415483 -193112 187665 374815 354603 333690
39263 333690 415490 534161 606094 619761 626880 739052 1073155 1577624 1946192 1860204 1360993
39252 1360993 862212 714731 839838 878779 642158 298783 132471 216613 363438 331724
39242 331724 40311 -391286 -762408 -943946 -958257 -970881 -1203616 -1745980 -2350470 -2500606
39232 -2500606 -1887692 -848786 -124785 -75734 -315302 -268176 106260 392849 379246 292133
39222 292133 372683 539025 581506 452742 232928 -62 -138911 -67872 140625 214929
39212 214929 27082 -200274 -195208 -2049 142537 164891 158630 135337 35058 -54040 40191
39201 40191 256324 285066 -42883 -531145 -858888 -894706 -691967 -326477 130488 557555
39191 557555 820949 865737 746654 596120 539664 565483 493468 170163 -316196 -717084
39181 -717084 -894383 -881501 -712812 -385351 -2311 259825 391505 553062 754905 764716
39171 764716 481037 177699 151944 291085 251473 -26836 -259133 -240725 -71251 70220
39161 70220 136679 132253 30761 -111466 -120559 84440 353178 502952 572766 730441 959199
39150 959199 1005668 712801 301085 178038 453820 766180 681802 202452 -263598 -405420
39140 -405420 -306125 -204215 -169460 -151255 -179515 -315813 -497149 -622766 -728527 -876955
39130 -876955 -936780 -711309 -274142 65568 153957 103953 -18992 -322256 -758560 -956500
39120 -956500 -632810 -8210 449465 604601 723256 1007652 1331367 1497732 1544981 1652017
39110 1652017 1841597 1920236 1718465 1313708 963548 825428 805746 745793 704048 914868
39100 914868 1438196 1993163 2236434 2111830 1829240 1592701 1471372 1454899 1468867 1354036
39090 1354036 981843 421798 -93042 -372221 -375654 -165549 128033 319982 299531 175605
39080 175605 171771 340124 488984 431052 183414 -140721 -517731 -975670 -1432921 -1693399
39070 -1693399 -1608962 -1201173 -652608 -226833 -138842 -389991 -716384 -796310 -571793 -321850
39060 -321850 -356246 -657463 -897360 -822768 -554192 -438011 -624580 -863274 -750293 -169809
39050 -169809 528658 827887 573189 192925 276303 884310 1429282 1375673 915556 705158
39040 705158 1011840 1452661 1616455 1583935 1650131 1840071 1981868 2043545 2073323 1939987
39030 1939987 1478785 858523 492207 554217 820361 992140 957192 742212 457124 299866
39020 299866 381038 534204 531517 459339 582711 845408 872301 544250 204485 167652 379342
39009 379342 698265 1103263 1405684 1209856 517273 -29964 34248 267095 -62189 -859602
38999 -859602 -1337275 -1160949 -821777 -803842 -984751 -1052640 -999642 -925455 -754701 -440737
38989 -440737 -137379 88968 427957 961025 1421989 1592337 1649020 1799772 1829495 1392003
38979 1392003 588372 -116593 -447964 -460570 -249456 102351 356596 295135 67361 7468
38969 7468 91833 -49433 -523236 -961176 -1046241 -898102 -757208 -616763 -402744 -227811
38959 -227811 -176070 -62318 273053 590649 516874 99810 -240775 -314269 -385234 -713885
38949 -713885 -1135981 -1262561 -952578 -438275 -45159 103598 120148 164043 267392 369335
38939 369335 482634 705555 1029567 1280026 1355954 1388507 1499349 1538884 1307581 954294
38929 954294 847133 1026399 1091010 751332 251603 64515 318837 696819 811236 571251
38919 571251 252661 267145 748529 1326356 1477602 1157829 851802 885374 977068 715126
38909 715126 216129 -64151 -25870 1722 -135347 -176473 61423 317072 231472 -185943
38899 -185943 -660359 -1029950 -1288371 -1394647 -1300807 -1104733 -938925 -730832 -304426 260426
38889 260426 608545 551346 329960 265920 289507 61461 -460958 -847342 -700850 -149936
38879 -149936 348618 570332 655922 746040 764530 621861 392182 174639 -27093 -174938
38869 -174938 -154201 -6939 12317 -183209 -288738 -31797 358957 433487 146116 -152280
38859 -152280 -269103 -326146 -378408 -299757 -128262 -127083 -350850 -497260 -363015 -130276
38849 -130276 -18535 25312 69038 -51754 -438530 -862314 -1107090 -1341944 -1793331 -2231489
38839 -2231489 -2188652 -1622022 -1005724 -770196 -927218 -1227949 -1425841 -1388500 -1185736 -1065641
38829 -1065641 -1151663 -1215340 -965503 -498904 -210000 -279970 -494117 -548158 -316731 138687
38819 138687 587669 700132 363890 -81930 -178309 120094 493581 761034 994271 1164460
38809 1164460 1082224 764917 489628 359600 162623 -196822 -468287 -455506 -346340 -413866
38799 -413866 -621782 -738849 -649158 -376217 -7625 240698 115861 -327900 -689712 -705797
38789 -705797 -553126 -505231 -558753 -619921 -766792 -1025123 -1139013 -912929 -580916 -480172
38779 -480172 -541248 -490548 -396848 -559997 -926828 -1087343 -882766 -595802 -456362 -345619
38769 -345619 -122965 87141 105944 -41305 -201593 -224116 37668 589147 1092323 1102844
38759 1102844 623906 123116 -130365 -383844 -822881 -1045673 -538588 504121 1280025
38750 1280025 1296974 856771 575405 698142 987148 1085193 866389 525728 387748 564027
38740 564027 803890 778334 483028 216799 173223 243497 272188 305088 446908 619457
38730 619457 640758 473587 231605 -11612 -239671 -341925 -169652 179456 324448 -1512
38720 -1512 -627209 -1151447 -1366296 -1307822 -998605 -415962 261426 642771 513935 102108
38710 102108 -172816 -119345 139412 383826 478373 412009 278346 180371 95343 -91977
38700 -91977 -377112 -591988 -668286 -795061 -1157766 -1635326 -1930146 -1907232 -1632910 -1186538
38690 -1186538 -655219 -231550 -55049 12374 191801 383138 255012 -210278 -569951 -463316
38680 -463316 -61054 197514 129229 -101015 -256153 -214877 3445 237002 284340 136306
38670 136306 22411 125089 361404 555142 674481 740913 655551 348907 22101 -7800
38660 -7800 298850 655934 798902 716170 549431 450544 543351 822821 1038585 872969
38650 872969 338730 -148924 -216096 64130 327489 381346 353420 410002 493104 413213 125752
38639 125752 -190900 -354130 -398634 -490991 -649741 -703298 -599323 -586787 -882169 -1240038
38629 -1240038 -1147250 -501901 172583 348305 109098 -73750 -8050 80140 7332 -101451
38619 -101451 -77733 26466 69959 22318 -97407 -302971 -510874 -497201 -182615 161406
38609 161406 204899 -23083 -216535 -214900 -108908 12342 131719 126671 -154275 -552107
38599 -552107 -645392 -302447 80007 100561 -110950 -134511 141727 458428 617658 679644
38589 679644 750299 826818 872416 854665 715846 474395 305866 314574 280376 -94660 -679853
38578 -679853 -940674 -553145 231598 911645 1199927 1083881 670502 140740 -298672 -560136
38568 -560136 -672966 -605107 -292651 91183 183549 -70997 -228624 90388 648675 914019
38558 914019 801204 735266 997749 1356641 1438775 1206268 919319 798227 866356 1024126
38548 1024126 1151350 1179581 1137458 1094112 1032412 848664 523694 219144 122078 231824
38538 231824 386476 483628 561771 621540 496817 64956 -458184 -659204 -449624 -238890
38528 -238890 -397357 -706706 -620293 -5174 673604 922794 693385 244292 -155831 -285455
38518 -285455 -48107 308961 313466 -165791 -681140 -753864 -441538 -105195 160773 517151
38508 517151 943113 1195270 1175678 1025938 865068 714564 661895 796988 970732 906646
38498 906646 597497 327197 248726 197647 -6632 -311816 -561344 -662876 -568849 -289470
38488 -289470 37453 295864 606712 1118143 1567957 1421943 590145 -321793 -685023 -511265
38478 -511265 -237704 -109390 -54961 1828 14021 -50504 -139974 -163529 -27407 256925 442862
38467 442862 240458 -246964 -537804 -411821 -257305 -499026 -932858 -1008578 -609601 -129654
38457 -129654 151980 333513 504276 511530 245655 -152463 -499338 -724693 -727788 -388219
38447 -388219 112437 274730 -148757 -753221 -915019 -511263 30814 307584 294169 153384
38437 153384 -27154 -211094 -320315 -308268 -232331 -140491 37461 345701 579368 389398
38427 389398 -287783 -1011153 -1206351 -757321 -103921 270382 313388 309690 463450 720905
38417 720905 925631 980295 860474 599734 281469 -36038 -375287 -738636 -991880 -974032
38407 -974032 -710831 -386649 -100573 204150 533810 718612 590471 210579 -155384 -256680
38397 -256680 -43856 289116 437226 252628 -88853 -267562 -175169 10411 108244 144851
38387 144851 225555 336177 374035 287918 107627 -84379 -152408 9724 308325 465590
38377 465590 308355 -40079 -340245 -506717 -601486 -674091 -739875 -819856 -866388 -750208
38367 -750208 -470957 -261249 -279928 -307605 -10197 544094 928414 943018 860438 987707
38357 987707 1257810 1425231 1448605 1462557 1509771 1523355 1507645 1538346 1590085 1508048 1180324
38346 1180324 681503 244147 74333 111283 -7872 -565452 -1310343 -1618035 -1211539 -472108
38336 -472108 135215 639350 1255904 1788032 1826474 1430809 1072544 881709 512272 -93830
38326 -93830 -399210 -79274 364650 314410 2689 150534 811660 1260259 1088703 785010
38316 785010 956931 1470247 1731491 1501208 1019244 512146 -8096 -499507 -802713 -862597
38306 -862597 -801251 -711257 -562617 -359634 -205291 -139010 -71532 36830 84431 19487 -17029
38295 -17029 113869 306304 323943 110976 -162557 -337363 -384815 -294698 -35044 302060
38285 302060 473009 327623 -4839 -276875 -390706 -406465 -378749 -328979 -313523 -347134
38275 -347134 -285243 28964 472044 671181 409697 -115849 -513497 -568842 -343708 -24790
38265 -24790 223279 330635 353906 414212 553703 677778 650165 404694 -4682 -373133
38255 -373133 -413640 -21211 538822 884628 950287 944941 907153 651026 237338 71715
38245 71715 279754 378470 -36378 -587388 -596585 -77994 298990 178406 -93818 -95040 173637
38234 173637 532273 886157 1060479 815896 271201 -82872 -55902 -66129 -471657 -966508
38224 -966508 -1040314 -731658 -456763 -306614 -33723 360349 560102 501670 520802 781442
38214 781442 957701 731728 331146 286107 781931 1479537 1910008 1861327 1414356 799978
38204 799978 294712 127432 326000 623624 627426 199968 -341408 -515611 -189644 294836
38194 294836 528212 451159 312149 315599 404543 351942 28516 -392593 -545097 -288061
38184 -288061 55786 74375 -172541 -246492 9099 252222 192482 -12408 -114125 -168432
38174 -168432 -276853 -253592 71229 452058 529092 348791 192337 63249 -210489 -501721
38164 -501721 -505971 -277544 -153236 -166998 -57596 123556 -11404 -468321 -690918 -342921
38154 -342921 221666 551718 691894 838898 859353 614067 418295 651282 1109971 1258937
38144 1258937 1006694 743705 663510 554939 330809 273300 534401 753393 478944 -206688
38134 -206688 -758406 -799912 -473832 -165397 -59247 -55781 -20138 40314 65836 74321 93431
38123 93431 49900 -120967 -300092 -300547 -153623 -80457 -153458 -213370 -199732 -318764 -721348
38112 -721348 -1206714 -1440014 -1333089 -1038685 -693779 -351217 -65394 132584 278963 375473
38102 375473 354412 260922 297226 509784 621662 425998 180558 288851 685559 896451
38092 896451 697241 363346 212558 235167 296968 399524 533593 496219 104730 -493425
38082 -493425 -909142 -885386 -494605 -25679 244928 235341 96677 37167 80155 65667 -94869
38071 -94869 -286005 -362348 -329125 -263164 -169626 -29642 110066 232176 449007 831406
38061 831406 1176886 1161411 773353 404575 380238 533041 426789 -57181 -563908 -719574
38051 -719574 -545361 -312511 -145746 45043 306322 511264 515594 315642 20943 -235470
38041 -235470 -346576 -289939 -158781 -61963 -6048 39538 16451 -131171 -275681 -216847 16362
38030 16362 188312 217792 276859 442999 503086 256366 -202046 -671417 -1111162 -1512344
38020 -1512344 -1703729 -1553721 -1240311 -1062390 -1068406 -1094278 -1052414 -922191 -573143 58873
38010 58873 648994 695292 134505 -533869 -837154 -798711 -705082 -646052 -490827 -202716
38000 -202716 23612 -41352 -396652 -769523 -871538 -713631 -579059 -614523 -581046 -176992
37990 -176992 487829 958794 949886 599423 236926 86193 177151 347898 338149 65306
37980 65306 -230695 -329330 -434344 -908672 -1610384 -1891374 -1405646 -587798 -114582 -151908
37970 -151908 -370896 -485797 -480504 -418145 -310945 -175015 -31954 150014 405714 689124
37960 689124 928650 1120127 1273218 1309819 1123384 750949 423739 386826 618942 756514
37950 756514 439767 -204606 -620126 -518299 -296309 -475163 -937456 -1158536 -1057750 -1046390
37940 -1046390 -1212739 -1112148 -591597 -199059 -371220 -736039 -722940 -427187 -273398 -168009
37930 -168009 303049 1001889 1298817 1016339 644009 502143 333201 -44693 -278706 -71548
37920 -71548 211119 3567 -620148 -996777 -668511 200262 1138316 1802313 2089447 2060251
37910 2060251 1850327 1583121 1331917 1151389 1055170 935374 645576 252298 67661 294865
37900 294865 736313 1002447 952273 782209 708703 714087 642849 452144 293795 349248 608247
37889 608247 851059 885560 768843 730083 900345 1195360 1428043 1435280 1150485 712078
37879 712078 455606 570291 762200 547379 -39529 -366730 -51798 426248 324700 -350251
37869 -350251 -875158 -807424 -487393 -424885 -591257 -588028 -261916 158403 431114 543444
37859 543444 603423 676738 749223 749376 622344 444153 384501 461875 444429 156574 -194812
37848 -194812 -213026 173366 589270 657149 399441 130717 90362 271754 509977 642065
37838 642065 636397 618421 716014 865906 866395 643395 348898 154183 63366 -14885 -124650
37827 -124650 -241564 -279973 -101902 315157 699220 720714 496323 553875 1096610 1608548
37817 1608548 1515559 991790 687096 806820 956137 870944 774428 867301 932324 716310
37807 716310 366134 176833 137329 31977 -153632 -218201 -72891 145794 274145 277520
37797 277520 230495 248724 403151 625774 755948 726317 612623 471938 284917 122895
37787 122895 184090 525102 901149 1029818 914175 768828 711952 653801 427103 -48234
37777 -48234 -647242 -1050376 -1017897 -707608 -535517 -637384 -679292 -330694 287351 795407
37767 795407 1005584 988339 856722 688370 544445 406085 206290 15564 -3176 81072
37757 81072 -19679 -310667 -371645 19043 469595 544439 416301 496591 713014 721613 633135
37746 633135 869203 1346184 1477471 1093440 734341 799544 947337 670403 57916 -384196
37736 -384196 -410551 -209296 -60793 -80317 -215111 -346133 -449086 -659737 -1031992 -1290303
37726 -1290303 -1097761 -547038 -40310 332587 872177 1620171 2097216 1947631 1470901
37717 1470901 1193462 1191842 1160209 934479 637586 448816 483496 774929 1169689 1378633
37707 1378633 1308810 1187470 1204067 1236992 1114516 913613 776154 655932 507839 518394
37697 518394 851383 1324192 1624506 1708605 1707357 1591386 1259159 858816 677817 729490
37687 729490 740410 561053 343369 277586 342471 356068 164252 -209310 -537381 -597559
37677 -597559 -455437 -372564 -371381 -172818 268459 505616 200943 -291079 -370294 -52600
37667 -52600 83975 -232570 -604526 -535092 -10821 577751 835140 626223 173251 -81010
37657 -81010 101276 490981 734232 824157 951888 1050544 915839 716561 889097 1444848
37647 1444848 1831849 1635923 1039150 438785 -1325 -247557 -255253 -191283 -441476 -1085377
37637 -1085377 -1651026 -1710206 -1463617 -1395238 -1570086 -1661860 -1521985 -1307624 -1110100 -859143
37627 -859143 -612736 -570882 -709983 -716783 -424987 -69154 51440 -47980 -175409 -300367
37617 -300367 -512643 -731451 -721601 -430761 -100445 43205 39521 19076 -51790 -243602 -380425
37606 -380425 -170606 334492 662943 439077 -186464 -749288 -961434 -854798 -597296 -353313
37596 -353313 -215114 -94114 222331 749723 1179217 1254404 1098881 918981 588450 -76566
37586 -76566 -753690 -831989 -259953 276768 195247 -334657 -767687 -859773 -718150 -479542
37576 -479542 -254552 -194347 -300748 -282786 128507 784073 1245268 1260547 962725 668067
37566 668067 615657 808364 976916 813052 367043 62495 153340 346170 206937 -197775
37556 -197775 -376125 -85029 373915 577022 446470 196993 -2491 -176145 -417917 -709321
37546 -709321 -869234 -709785 -270038 170533 378237 395268 401723 431814 348304 45249
37536 45249 -434473 -927289 -1193263 -1028954 -499804 -4085 73488 -232508 -540127 -565220
37526 -565220 -347492 -69062 160929 309419 359634 305682 133284 -171074 -491507 -542584
37516 -542584 -162621 370523 559753 286435 -38906 -32512 177391 205266 -24801 -219631
37506 -219631 -155942 73809 273031 374802 377554 230984 -56503 -295063 -273391 -23741
37496 -23741 218875 328529 404603 529142 581505 431275 189574 78785 115502 125841
37486 125841 42932 -53522 -211809 -621827 -1208586 -1486962 -1097770 -338192 137149 77541
37476 77541 -191361 -335331 -417528 -624221 -866397 -881482 -599351 -207154 88347 207745
37466 207745 162724 33469 -38661 10860 35620 -166119 -535062 -757667 -670260 -491519
37456 -491519 -495719 -578248 -377793 195484 798912 1086738 1079594 984180 856056 654042 482063
37445 482063 493687 585153 450887 2590 -472757 -653658 -520520 -279538 -112840 -98371
37435 -98371 -225607 -361903 -316081 -71947 118923 9876 -318474 -523350 -372846 26212
37425 26212 363215 430355 298267 206525 269816 326900 154423 -201890 -440270 -361787 -80787
37414 -80787 164145 271515 279629 235087 161749 92042 59065 99126 262029 530338 749380
37403 749380 773559 661897 555785 395959 13924 -483995 -737619 -631293 -452278 -401479
37393 -401479 -278013 120585 597215 855235 942684 1070782 1212115 1226887 1184387 1175472
37383 1175472 989427 417170 -251873 -509499 -343554 -198168 -254991 -285575 -268713 -569561
37373 -569561 -1280078 -1883493 -1905401 -1529018 -1231209 -1115224 -960620 -699530 -470982 -342001
37363 -342001 -302589 -435416 -779552 -1086176 -1009844 -550599 -70589 149775 176556 221823
37353 221823 364917 539784 666720 703266 615836 376451 14132 -337834 -500439 -420608
37343 -420608 -252976 -181168 -189680 -129876 34223 224183 459043 815613 1138950 1091212
37333 1091212 641495 244700 304364 649671 795105 571618 230129 19019 -52769 -64795
37323 -64795 -67504 -134838 -307705 -452489 -384778 -185053 -193154 -599564 -1194497 -1611878 -1692053
37312 -1692053 -1513532 -1200336 -845793 -564197 -458038 -493685 -485608 -263867 142229 509526
37302 509526 628869 504097 314466 180040 35687 -202499 -404204 -284208 260878 946041
37292 946041 1308843 1142256 694343 422495 550751 878144 1024101 840634 550853 474109
37282 474109 646369 767799 570446 208428 156146 625827 1200921 1266653 788161 379039
37272 379039 496411 875889 1005427 873101 841360 949538 859146 507998 290011 391166
37262 391166 408015 -41259 -659945 -820670 -377014 243772 644293 802271 866326 939164
37252 939164 1084687 1287686 1374505 1194657 906325 867969 1194190 1587687 1657900 1283801
37242 1283801 671610 196584 150372 457817 667479 433323 -7930 -84968 368201 903860
37232 903860 1064518 885561 635936 372116 47102 -155261 16229 436848 689374 644502
37222 644502 639033 940931 1315751 1357055 1059825 774819 677530 605961 459917 430340 641488
37211 641488 812744 586072 103101 -64019 384047 1077659 1395503 1113252 532056 114233
37201 114233 124870 507869 941463 1064243 788470 378823 143472 110737 111369 87124 135005
37190 135005 270566 353813 315602 288609 381814 430775 158435 -407340 -850712 -824118 -495934
37179 -495934 -362863 -618329 -921328 -899793 -672913 -641118 -895969 -1158723 -1271659 -1379633
37169 -1379633 -1517691 -1371638 -698450 241463 938373 1176174 1084596 792119 325781 -184318
37159 -184318 -478940 -408042 -51083 394819 714873 717330 366491 -103767 -341770 -173639
37149 -173639 287334 736480 813758 323380 -489197 -1017204 -890682 -406972 -135861 -218122
37139 -218122 -362000 -431610 -614248 -957889 -1160079 -1002014 -688535 -545055 -592701 -611630
37129 -611630 -452548 -129283 235577 425182 265397 -115865 -341449 -226399 26309 195692
37119 195692 345695 542856 539490 89420 -558290 -844693 -556644 -10250 397286 532720
37109 532720 431341 181747 813 155782 653435 1160947 1343875 1165465 814983 517111
37099 517111 462806 702590 987158 925276 466721 40869 20293 235140 286647 187307
37089 187307 324516 820038 1311202 1467800 1392188 1332149 1289464 1167501 1084772 1222137
37079 1222137 1466988 1519907 1323048 1101833 978110 823107 556706 333359 303903 377097
37069 377097 338407 64545 -461297 -1174704 -1852281 -2163970 -1954932 -1395459 -772912 -251932
37059 -251932 103558 265388 332197 504449 790750 892547 588416 113460 -71096 182795
37049 182795 605588 884183 932541 825286 667247 538536 424946 217601 -108034 -391699
37039 -391699 -510287 -587240 -771644 -909586 -715243 -245639 77801 -35599 -462784 -910648
37029 -910648 -1181668 -1116224 -553608 426566 1359534 1721736 1423194 875815 545707 486095
37019 486095 367487 -26150 -452826 -527673 -314739 -297401 -670331 -998198 -809910 -231719
37009 -231719 286338 591584 760263 655926 112866 -537491 -716906 -417922 -211118 -329311
36999 -329311 -327133 112016 586624 589343 299880 307566 773258 1280887 1415767 1169479 812173
36988 812173 577739 463106 270255 -72177 -274007 -12046 540620 885237 923237 1034501
36978 1034501 1308973 1281163 746485 277055 430113 899811 1042225 877009 889394 1083135
36968 1083135 989596 561719 317929 488326 681004 620917 639315 1086139 1691586 1912226
36958 1912226 1651194 1270660 1029021 818763 438011 -87731 -500983 -572041 -359424 -182695
36948 -182695 -274385 -519936 -656567 -648803 -685398 -855030 -1039413 -1123312 -1110582 -1023493 -871581
36937 -871581 -721307 -612642 -418747 5362 535180 853065 826700 602693 321000 -15828
36927 -15828 -349489 -511824 -482808 -494373 -734079 -1078538 -1229744 -1023962 -561269 -143959
36917 -143959 -102659 -521884 -1085316 -1338024 -1158260 -841635 -682553 -628015 -425463 5041
36907 5041 448717 618110 467314 272563 324956 537298 543170 275914 167966 510315
36897 510315 877299 635778 -81558 -414524 161139 1259929 2193060 2704392 2885377
36888 2885377 2764244 2340673 1816645 1467807 1354344 1327307 1214262 893582 368830 -91405
36878 -91405 -89692 436194 1043212 1255146 1065550 816278 742231 823803 935830 921402 625379
36867 625379 72240 -453200 -680203 -637921 -503697 -267241 217565 866953 1300305 1245699
36857 1245699 886718 678914 837253 1098606 1055759 679618 364205 404149 614969 648880
36847 648880 526100 557458 802081 946516 779353 480239 321787 334590 390910 404709
36837 404709 335126 182965 63757 91258 159393 85121 -35110 45050 214943 82981
36827 82981 -318935 -427442 -14584 343499 70150 -567870 -897803 -764396 -490462 -222707
36817 -222707 82222 232016 6844 -297115 -158340 349067 625546 466757 301718 411666
36807 411666 537761 476772 467975 659640 713276 365904 -8409 135611 738953 1251401
36797 1251401 1351425 1184159 1015062 995115 1181895 1472916 1563681 1247860 730228 407028
36787 407028 375223 388967 272109 143704 225026 599518 1153671 1602553 1628772 1192477
36777 1192477 671982 500192 691362 930762 1072564 1249410 1467753 1445179 1024131 483056
36767 483056 199354 175046 141127 14765 -13877 187078 517471 822136 1039872 1137731
36757 1137731 1080375 927643 807739 730907 577700 330165 141685 91073 60880 -3968
36747 -3968 76400 407698 703064 572646 72295 -328196 -329342 -88959 103209 167565 173831
36736 173831 184270 266217 455563 620384 585285 481547 697491 1319023 1893471 1976574
36726 1976574 1669628 1349083 1107179 813443 543467 510834 634543 602384 389244 306733
36716 306733 451384 505410 266279 17002 98213 375823 452665 251134 61686 76166
36706 76166 182366 254232 381435 681887 1039062 1175538 946864 472732 -4467 -319481
36696 -319481 -443944 -425957 -332324 -228823 -149781 -69694 46931 155368 157462 47454 -55727
36685 -55727 -84955 -138242 -300908 -425901 -253965 246736 800660 1115642 1148507 1059603
36675 1059603 1012857 1055783 1094766 947372 521605 -351 -255122 -56602 402668 777939
36665 777939 932990 985701 1044432 1026606 779927 320510 -118131 -299173 -235479 -184509
36655 -184509 -347095 -597222 -588882 -147325 514361 995460 1051695 701429 96658 -574441
36645 -574441 -1081205 -1214593 -963652 -574176 -336398 -309075 -300308 -112140 247748 592496
36635 592496 733590 622210 371226 161103 87248 94728 100477 143719 312975 538760 613687
36624 613687 464502 247898 100569 -30202 -182632 -193431 87142 529005 875038 1025850
36614 1025850 953454 517445 -282118 -982847 -1028159 -485303 748 43960 -83626 -4657
36604 -4657 223975 342283 310884 245997 208281 292354 650453 1176533 1446340 1264783 1017736
36593 1017736 1149804 1506042 1545256 1052283 307439 -316316 -611029 -535386 -295371 -297983
36583 -297983 -677931 -975498 -644818 192338 858725 935917 615025 277297 105089 133809
36573 133809 336807 570083 681118 711017 784732 854341 812609 785973 985536 1303654
36563 1303654 1410729 1255564 1117960 1135561 1129327 959512 726677 549324 446233 485488
36553 485488 723978 952250 864578 571807 565210 1019526 1488597 1497484 1133711 823141
36543 823141 762803 807088 744273 496248 168858 19584 238384 687853 1013014 1038735
36533 1038735 872637 630081 338331 142918 276149 697059 1041078 1060331 878479 720582
36523 720582 657504 709569 904192 1096680 1018427 658956 349994 334748 500720 651156
36513 651156 762873 847428 844086 794184 841849 926683 772188 319261 -140073 -400211 -568607
36502 -568607 -704047 -634806 -372171 -291947 -571933 -806164 -570944 -94886 52788 -245021
36492 -245021 -561246 -504378 -61413 532248 967742 994617 646877 290566 262611 530801
36482 530801 815432 892339 682423 277617 8678 208599 737422 1039248 866782 619390
36472 619390 726302 1062798 1294405 1428455 1607257 1667569 1397286 1027246 982769 1263809
36462 1263809 1501553 1527516 1471762 1384572 1186564 966326 940483 1107710 1264034 1358086
36452 1358086 1536676 1844287 2143718 2324730 2364171 2221785 1895272 1521831 1227978 969362
36442 969362 706171 588263 729258 944469 978673 866712 807141 815466 789195 799204 1011120
36431 1011120 1374523 1641560 1650182 1410789 1005735 557806 174460 -182460 -571144 -747014
36421 -747014 -326699 547751 1125404 920007 276751 -245293 -594767 -903456 -930319 -456659
36411 -456659 101857 161093 -140441 -144686 362897 975697 1322328 1315023 864660 -12155
36401 -12155 -824347 -951859 -423541 132104 321025 312446 377992 595935 995975 1516545
36391 1516545 1821811 1604351 1043880 566511 271594 46899 50409 478571 991484 1037079
36381 1037079 704459 593174 840643 964244 725473 462272 431700 473229 499382 702524
36371 702524 1050768 1138702 797735 391536 284366 424449 615383 791846 885326 810138
36361 810138 699658 788349 998628 1023364 828745 657614 548524 321542 44029 15545
36351 15545 251002 443517 468159 478189 506534 420381 254090 170610 170543 237088 571966
36340 571966 1217928 1722347 1744627 1683670 2036926 2485222 2410111 1990628 1876069 2047274
36330 2047274 1990945 1769229 1850222 2059067 1833049 1403895 1550759 2235284 2667723 2670534
36320 2670534 2731257 2766953 2212607 1359457 1157340 1574877 1630865 1191359 1158582 1656236
36310 1656236 1708815 1097039 840621 1358981 1831998 1907534 2312704 3177121 3536684 3193612
36300 3193612 3259239 4097736 4597072 4300369 4303462 5106136 5612896 5337717 5495951 6670300
36290 6670300 7507114 7096939 6553654 6840737 7238423 7425792 8669086 11271792 13390443
36281 13390443 14267563 15967028 19791377 23791849 26162639 28085224 30657345 32443605
36273 32443605 33145598 35965250 42730611 50828054 59156166 72173277 92962162 119164200
36265 119164200 154068180 212997176 301675587 389493357 424089669 382229201 294941404
36258 294941404 213747718 162288811 130539698 104445951 83075808 68938384 58509750
36251 58509750 48006083 39078219 33759619 29930928 25478073 21874221 20407993 19102573
36243 19102573 16297291 13662883 12952853 12855644 11572901 9844113 9075370 8762384 7913121
36234 7913121 7041617 6822415 6531652 5545676 4760581 4966561 5343768 4990347 4455641
36225 4455641 4421062 4326029 3628542 3037711 3196033 3444745 3126805 2820457 3063448 3154326
36215 3154326 2503391 1933088 2283804 2855979 2624681 1993518 1929620 2222439 2014982 1368728
36205 1368728 955681 755915 303883 -239042 -383925 -261880 -276697 -270830 16010 162914
36195 162914 -275486 -805691 -694945 -221420 -215644 -684697 -889349 -567018 -153698 55155
36185 55155 129177 23331 -352715 -684475 -566453 -184875 -79369 -318953 -463089 -243244
36175 -243244 187677 552332 602516 194398 -415444 -634877 -268305 169938 255309 308382
36165 308382 759868 1338392 1512950 1353119 1284868 1306223 1118856 785878 589337 429320
36155 429320 14893 -495564 -666180 -481921 -290655 -150637 177321 635451 831916 632039
36145 632039 327404 173266 123459 39287 -131381 -357003 -494367 -387745 -175914 -234183
36135 -234183 -562737 -586331 58762 873092 1095535 688668 231900 56414 14730 -32220
36125 -32220 -23286 45687 86451 106456 124792 22617 -219389 -316363 -51394 335031 473139
36114 473139 380079 297348 242061 112104 25253 147670 370132 522835 689072 940278
36104 940278 1042110 841206 638061 705838 766039 488177 177207 301630 605726 454196
36094 454196 -69976 -191896 425089 1289640 1888155 2203771 2304782 2057854 1481612 892596
36084 892596 503455 275420 252798 580558 1086173 1323427 1188850 1073077 1262397 1599560
36074 1599560 1860688 2032035 2041420 1631572 742286 -270727 -973074 -1179575 -902942 -303127
36064 -303127 241954 363370 108022 -171607 -362098 -655829 -1029634 -1100602 -665367 -5454
36054 -5454 530588 916715 1236514 1398904 1296669 1026715 761913 555116 365646 124906
36044 124906 -241596 -661127 -822403 -510018 6391 231947 60630 -213243 -428726 -660670
36034 -660670 -816188 -656299 -296816 -159593 -291145 -264565 61419 255010 50528 -192651
36024 -192651 -136912 -38526 -214262 -410994 -249487 92778 235135 307092 639795 965325
36014 965325 684771 -84734 -481510 -93695 474644 544340 306549 366867 744298 897689
36004 897689 591220 180895 8933 -6674 -14992 125741 544408 962213 970525 587826
35994 587826 199185 332 -142679 -286164 -262266 -45013 113512 93783 118124 333335
35984 333335 514069 450409 315909 331552 365649 247867 203620 516984 959504 1041559
35974 1041559 716625 377239 245691 224508 266574 411212 493119 287531 -70744 -250683
35964 -250683 -249580 -293096 -319029 -127449 34211 -287092 -899000 -1072879 -628293 -177934
35954 -177934 -88173 27776 432103 650807 280440 -225812 -222557 128313 165149 -272167
35944 -272167 -734364 -847643 -606753 -155826 292405 469667 330691 138875 11371 -317001
35934 -317001 -973173 -1579777 -1816810 -1948561 -2284152 -2496808 -2111320 -1383241 -988705 -997424
35924 -997424 -875906 -472697 -272474 -541954 -851154 -688098 -99433 497890 793093 711056
35914 711056 389161 173770 363824 830631 1117076 983807 638138 399932 391829 587184
35904 587184 907369 1214647 1399596 1481082 1473130 1277812 944628 853834 1271507 1850315
35894 1850315 2012925 1771355 1686897 2003148 2313508 2189488 1681230 1053955 459191 38701
35884 38701 -54504 58974 44425 -125850 -102315 200357 344718 55868 -261120 -93115
35874 -93115 434374 832384 994701 1165114 1344860 1289748 1058836 1024007 1229861 1217076
35864 1217076 708363 120396 97538 723940 1460104 1765751 1565940 1145398 795651 620110
35854 620110 551838 457997 246466 -72447 -404196 -644587 -737453 -675576 -474254 -161998
35844 -161998 208495 554228 772292 765736 488883 -5426 -568021 -1015219 -1184587 -966210
35834 -966210 -391373 256053 556596 360449 18315 699 291528 395503 9449 -558697
35824 -558697 -786040 -557373 -215749 -130222 -383465 -780097 -1011466 -907406 -645501 -591166
35814 -591166 -831256 -1049894 -992808 -800508 -665676 -446337 26876 481633 496986 169280
35804 169280 18108 222765 400100 224695 -146175 -409355 -500659 -449270 -178970 286773
35794 286773 646048 598309 190628 -260871 -475003 -356348 -35053 145628 -100839 -608526
35784 -608526 -831834 -457470 250667 856423 1264373 1615993 1885206 1873987 1530625 1033987
35774 1033987 598442 366186 421283 713213 995322 1011039 743983 377827 54202 -210124
35764 -210124 -420200 -561798 -646846 -686202 -636587 -475939 -305190 -265324 -354594 -412571 -289536
35753 -289536 19581 383545 613534 559533 209450 -281804 -681877 -814706 -644402 -288271
35743 -288271 53060 237468 266357 208171 96331 -25522 -48037 60762 118784 -59326
35733 -59326 -333935 -363749 -95993 119328 1852 -321661 -608642 -893953 -1344374 -1857683
35723 -1857683 -2078321 -1802055 -1185500 -550661 -113439 88407 106442 -28612 -322598 -700123
35713 -700123 -929319 -812430 -463386 -217956 -202162 -168433 136422 610626 935644 925082
35703 925082 598447 57949 -535108 -964705 -1095922 -937751 -505451 201077 967268 1360947
35693 1360947 1207868 892687 901174 1189411 1306945 1045929 628352 288402 30154 -153902
35683 -153902 -160261 7391 156101 167981 141147 171280 211337 251991 394245 579650 492726
35672 492726 -13314 -564380 -652214 -317693 -131594 -429744 -841399 -766307 -172107 318817
35662 318817 140843 -595358 -1277863 -1477306 -1327837 -1258318 -1475980 -1759646 -1688779 -1037209
35652 -1037209 -5074 893253 1225335 977895 483287 31108 -345217 -684571 -877198
35643 -877198 -778315 -464160 -208336 -194124 -354843 -510341 -574323 -597433 -659955 -765940
35633 -765940 -853278 -899524 -960045 -1044191 -1030353 -846877 -680389 -766668 -955539 -796051 -216205
35622 -216205 181673 -190353 -1104264 -1747960 -1675958 -1195517 -837435 -791777 -918270 -987480
35612 -987480 -786021 -252365 326887 457911 -48972 -826009 -1306190 -1208511 -621936 166156
35602 166156 780891 907172 558506 117365 -55866 21037 107414 114077 125395 140902 35865
35591 35865 -218866 -493059 -686958 -827696 -932692 -920796 -737265 -467047 -234570 -45214
35581 -45214 187374 462905 611755 445157 574 -407492 -458301 -163246 134296 131862
35571 131862 -125391 -351157 -345830 -142296 95575 204646 93118 -200188 -514419 -710470
35561 -710470 -787219 -788579 -659922 -324576 131595 499819 673981 710649 684368 638541 650172
35550 650172 719726 586395 -54537 -1040085 -1748974 -1832077 -1649504 -1679380 -1762030 -1389300
35540 -1389300 -601532 -32450 3669 -70257 187443 572333 647069 465250 431106 630055
35530 630055 754489 637654 455136 365874 292600 142698 -10195 -54418 30066 203246
35520 203246 356492 293064 -59578 -423063 -409881 -33269 266477 165743 -194457 -454457
35510 -454457 -399087 -30168 458106 698171 426021 -128507 -376412 -31075 592589 1038809
35500 1038809 1173438 1041107 618221 -3811 -462392 -490435 -276577 -183552 -279920 -421037
35490 -421037 -587040 -799799 -872134 -620241 -219236 21736 134918 332790 448840 44481
35480 44481 -845843 -1544985 -1514258 -960847 -456361 -246063 -178353 -80898 81067 301031
35470 301031 536549 652769 529140 219409 -83265 -224014 -195638 -126726 -182063 -396512
35460 -396512 -586282 -510867 -148196 258872 423048 211671 -306219 -868720 -1131188 -965834
35450 -965834 -656854 -616425 -898461 -1180389 -1224271 -1117930 -1018012 -925465 -841241 -898873 -1139203
35439 -1139203 -1308831 -1089542 -457753 318455 949405 1259018 1160880 704787 148806 -169965
35429 -169965 -112534 140123 257500 60182 -309693 -506666 -312110 139794 491037 498279
35419 498279 216032 -93684 -160353 109546 515027 669751 370178 -161066 -524210 -598470
35409 -598470 -596643 -692817 -789420 -703300 -450490 -287305 -508797 -1156447 -1862046 -2109283
35399 -2109283 -1787282 -1340247 -1194284 -1238747 -1151122 -1003696 -1099013 -1329203 -1242531 -767729
35389 -767729 -328351 -123450 150981 641970 945165 731480 330828 267904 538051 758003
35379 758003 774072 711612 635523 565567 659557 998020 1326532 1361580 1204265 1114112 1062324
35368 1062324 902103 792976 978881 1259607 1194258 799246 533820 554941 497797 122584
35358 122584 -300223 -463554 -478455 -590052 -754295 -785742 -708079 -687219 -754395 -815419 -838958
35347 -838958 -869838 -936787 -1062477 -1265230 -1450569 -1417600 -1090300 -655921 -380617 -363224
35337 -363224 -523553 -717709 -794930 -669682 -443526 -357542 -514794 -718441 -680874 -346830
35327 -346830 59215 256861 126757 -230172 -573634 -700311 -609848 -491508 -513223 -636388
35317 -636388 -669513 -501175 -240756 -78952 -9518 205062 687789 1160873 1218705 883143
35307 883143 628234 759473 1024677 1008134 670641 266448 -62859 -314205 -397076 -214219
35297 -214219 101011 318956 427257 547855 645155 635468 683474 992044 1342371 1294539
35287 1294539 887413 667807 883727 1110145 926895 564926 524948 830195 1048194 934261
35277 934261 724653 795581 1218628 1655547 1639579 1054767 348458 73091 191657 132498
35267 132498 -370929 -870465 -868951 -527081 -317276 -247671 56716 589196 806781 364509
35257 364509 -376466 -771022 -582491 -80012 375673 650384 823395 1022719 1286242 1518769
35247 1518769 1572719 1389653 1071014 819343 791715 952096 1062789 904685 533938 226701
35237 226701 132993 108742 -36446 -262039 -393992 -393131 -372819 -411330 -492826 -595212 -698923
35226 -698923 -733877 -652562 -553506 -611771 -861586 -1121015 -1145798 -828694 -294925 142136
35216 142136 191482 -140578 -516335 -605463 -435142 -306512 -385081 -498384 -376751 -1977
35206 -1977 366693 501925 472019 526629 724284 792954 473995 -69653 -373011 -210680
35196 -210680 156986 339523 255034 116519 119227 268618 431837 451964 275139 40674
35186 40674 -23603 151238 414141 605048 700503 722510 682963 691115 918082 1330974 1635964
35175 1635964 1610371 1314451 867008 270805 -342609 -578793 -226057 345655 596279 517525
35165 517525 547573 839465 1028558 801791 350063 105393 255159 627084 879285 750549
35155 750549 303237 -68345 -82920 -4338 -327821 -1014495 -1428914 -1192412 -710850 -565424
35145 -565424 -696173 -590439 -97135 399012 593895 636079 765399 907371 843636 597536
35135 597536 419430 455079 612023 751980 873985 1054653 1276317 1373914 1161489 629720
35125 629720 36965 -245558 -68383 308135 448317 207425 -110343 -119905 191657 467790
35115 467790 379296 -85318 -667928 -1037666 -977268 -559060 -166170 -171397 -532561 -843168
35105 -843168 -830434 -642542 -575870 -695221 -834091 -815651 -556364 -102787 311323 408062
35095 408062 208733 63816 175738 285637 63145 -371732 -612161 -529732 -349238 -214114
35085 -214114 -21296 276055 506173 521315 393632 293022 336575 585350 995245 1331663
35075 1331663 1329796 1002151 625026 384910 216244 31694 -81355 8291 271644 522249
35065 522249 562254 336900 21026 -113760 -19333 64119 633 1922 214436 311753 -43759
35054 -43759 -478601 -238667 714532 1527087 1548829 1055372 618583 314030 -35534 -298089
35044 -298089 -237137 32644 295162 680170 1341281 1905093 1839480 1289189 954656 1111715
35034 1111715 1308064 1141394 792993 552636 289618 -232847 -818833 -1012063 -686467
35025 -686467 -161068 222273 395167 448292 427161 311031 99201 -150451 -362398 -505263
35015 -505263 -596708 -649863 -664430 -681480 -745111 -751735 -481631 73426 542813 558985 236862
35004 236862 20426 75551 121157 -86299 -388011 -472041 -253356 145402 576008 840653
34994 840653 690388 117793 -451309 -532400 -136454 271735 376923 353847 536356 934996
34984 934996 1221552 1110873 655280 201018 107183 441743 882070 971002 561255 -18229
34974 -18229 -309319 -199657 40416 144523 104771 22446 -77394 -132091 85873 716926
34964 716926 1467062 1776310 1413507 719537 187477 -5404 41815 206615 334178 171568
34954 171568 -359884 -876446 -837683 -201630 477917 697910 522577 337810 323863 381971
34944 381971 424106 469213 497803 452231 402559 503407 718367 765645 452591 -55238 -409766
34933 -409766 -423849 -132234 351894 836462 993763 609134 -36184 -298533 118317 758366
34923 758366 944488 602197 291025 455619 934277 1266986 1220372 868320 384860 -13759
34913 -13759 -55659 383224 1043543 1433124 1278056 737706 159891 -264102 -550798 -737935
34903 -737935 -778065 -634255 -394720 -217091 -183321 -286973 -542501 -960433 -1357277 -1367524
34893 -1367524 -828234 -59951 439565 540267 527099 656501 904933 1131017 1207293 987368
34883 987368 472406 62602 250440 907216 1278499 947290 406184 304470 499893 384393
34873 384393 -95702 -380841 -214169 982 -119311 -430745 -639608 -737678 -783110 -624310
34863 -624310 -184536 241636 326782 176960 132749 220416 140199 -221984 -590558 -695868
34853 -695868 -644757 -739786 -1032110 -1218176 -1010968 -520830 -158850 -155073 -299283 -252013
34843 -252013 8654 228974 288990 317973 387784 359808 147383 -94452 -199878 -235028
34833 -235028 -329802 -413628 -337171 -178843 -209127 -550801 -1039141 -1430684 -1605862 -1530931
34823 -1530931 -1155188 -457514 419847 1153038 1419542 1156346 640992 267945 222257 386038
34813 386038 519660 448574 103536 -469167 -1073075 -1443498 -1456306 -1220449 -931191 -684744
34803 -684744 -457394 -202453 55101 180643 31384 -304605 -443646 -90348 506637 731197
34793 731197 339475 -194888 -249419 197474 603264 558950 220550 39674 247571 680958
34783 680958 1024100 1126827 1070192 970700 823036 595717 372782 242026 104612 -190216
34773 -190216 -528414 -595885 -314554 34349 217879 326619 504180 667999 705392 702468
34763 702468 716069 534432 -8861 -632637 -877426 -703294 -472602 -380241 -283824 -135487
34753 -135487 -174180 -505648 -804141 -692760 -243468 142512 248812 212620 217958 234419
34743 234419 122376 -131595 -386029 -514485 -519507 -463973 -366390 -231038 -127736 -131169 -197825
34732 -197825 -230305 -261668 -412638 -634856 -692689 -486275 -199218 -13446 109366 209648
34722 209648 138484 -166983 -418368 -295112 99701 401664 482581 462467 346096 53278
34712 53278 -223672 -117978 399418 979440 1427006 1881052 2359930 2541677 2200671 1527179
34702 1527179 813445 145716 -388866 -553196 -325564 -125921 -337705 -802583 -1077880
34693 -1077880 -990234 -657876 -212452 162969 169155 -210987 -440413 -33533 685649 950553
34683 950553 638028 424567 767931 1289221 1409715 1134929 863738 761692 712303 685656
34673 685656 780682 971934 1086817 1006370 727234 312445 -72006 -203255 -60541 94173
34663 94173 78024 68921 289654 577452 598390 395925 341015 528615 619649 400338 132780
34652 132780 128484 269116 256599 154711 330636 887210 1443719 1550060 1145596 555748
34642 555748 166949 141920 327804 388375 122666 -299033 -501999 -351210 -125635 -166972
34632 -166972 -442446 -594247 -405019 -59945 124582 106457 92023 153489 102438 -159948
34622 -159948 -378100 -253776 95078 273284 176019 95268 202712 277864 122877 -86030
34612 -86030 -134564 -168774 -399214 -627551 -488472 -26283 405326 713513 1044751 1251635
34602 1251635 970003 314541 -97819 -20977 100797 -35980 -59234 335450 685344 445345
34592 445345 -52847 -74465 338643 458795 59315 -298352 -258748 -181896 -387521 -557079
34582 -557079 -304004 151337 326418 158801 -63889 -192117 -243429 -147704 146053 415609
34572 415609 355862 -7826 -327904 -316890 31884 502680 780615 647871 237741 -17975
34562 -17975 143057 510629 692222 536988 126312 -424678 -908942 -970971 -437903 367344
34552 367344 909836 986385 782295 511402 275700 188641 310036 453691 332962 -67874
34542 -67874 -474010 -664681 -632308 -434593 -139034 83490 60750 -145906 -315442 -387298
34532 -387298 -488212 -635842 -676300 -571969 -501397 -579714 -696615 -734413 -750609 -832132 -941890
34521 -941890 -1027388 -1133645 -1287090 -1372548 -1220985 -757861 -58079 630869 944219 674124
34511 674124 26513 -566268 -905298 -1107554 -1250357 -1231217 -1046176 -883159 -792171 -580881
34501 -580881 -251485 -220514 -766183 -1475479 -1632974 -1074189 -308223 163168 303680 305902
34491 305902 248402 134346 44852 86269 286385 623140 1053580 1457061 1658785 1586207
34481 1586207 1349311 1147088 1153540 1456751 1964392 2352233 2270030 1693538 981935 513540
34471 513540 346513 308693 318060 461815 760510 998100 907257 518000 212211 329648
34461 329648 747853 988420 789198 439971 432249 866842 1368292 1553194 1414208 1213255
34451 1213255 1140813 1163128 1134697 985261 788439 639785 485040 174502 -262063 -556169
34441 -556169 -572612 -579665 -874230 -1241300 -1169803 -630289 -210632 -312022 -627736 -719780
34431 -719780 -724672 -1016334 -1426221 -1389412 -818216 -259153 -95867 -142523 -219901 -569677
34421 -569677 -1292876 -1820246 -1515166 -611928 -3511 -124948 -528010 -617627 -356942 -74159
34411 -74159 54789 68048 -1804 -142425 -262488 -267461 -184801 -125270 -201523 -510520 -1013980
34400 -1013980 -1364633 -1100737 -216313 640936 792930 267921 -296208 -398058 -82276
34391 -82276 337820 661899 824437 776037 530648 255296 169862 334254 576037 651880
34381 651880 488227 239551 65837 -104514 -463021 -968776 -1288677 -1178648 -763621 -323943
34371 -323943 19588 243270 232267 -83685 -506421 -737929 -716305 -562689 -294003 123111
34361 123111 509536 626020 600720 836597 1397608 1827296 1735465 1274779 845229 570868
34351 570868 288470 -116377 -562641 -862211 -851692 -567959 -336220 -469503 -825930 -939499
34341 -939499 -665807 -340930 -159307 148774 700469 964550 399773 -684482 -1469667
34332 -1469667 -1678505 -1703527 -1751511 -1511996 -823478 -96139 227751 227956 211284 185465 -26216
34321 -26216 -351761 -495477 -326375 -5020 237067 285142 160486 -18797 -129703 -156258
34311 -156258 -146189 -61582 165397 412402 447090 330315 475979 1095587 1774716 1864775
34301 1864775 1212763 295600 -304330 -377289 -108309 187703 352467 492767 754247 981269
34291 981269 818007 248624 -257330 -372985 -383000 -653743 -924926 -707773 -258746 -418266
34281 -418266 -1306140 -1884311 -1276388 -10140 651690 308636 -306952 -527652 -507473 -646164
34271 -646164 -884630 -940190 -840807 -800735 -787013 -617178 -379504 -359278 -540953 -540986 -146976
34260 -146976 350114 520426 288782 -115842 -537860 -974577 -1341044 -1427873 -1182302 -858077
34250 -858077 -746194 -834345 -860387 -666283 -363934 -138222 -25552 32072 27804 -62995 -114225
34239 -114225 96167 606524 1171151 1513406 1573507 1426501 1091801 589321 102177 -129535
34229 -129535 -92360 -13989 -70893 -234414 -428175 -644559 -817036 -753528 -345387 258648
34219 258648 805429 1167314 1316458 1209948 878946 539638 407685 432400 399131 267757
34209 267757 192313 182129 -14147 -550955 -1170199 -1423347 -1168759 -721278 -502469 -617768
34199 -617768 -798143 -720444 -351250 45215 227103 229258 238732 286349 203706 -94521 -427601
34188 -427601 -558601 -529468 -652173 -1117227 -1690426 -1917583 -1654476 -1271925 -1212837 -1425843
34178 -1425843 -1442046 -1010428 -395160 68015 434098 914576 1380767 1454709 1042949 451255
34168 451255 -41247 -403160 -600069 -480307 -82882 233057 212169 64504 162577 523745
34158 523745 848403 972608 999040 992910 830632 456121 92352 20506 205314 296001
34148 296001 44408 -379422 -603459 -548444 -526790 -778418 -1115010 -1231608 -1205798 -1353996
34138 -1353996 -1643514 -1651222 -1216007 -766177 -778164 -1184084 -1549581 -1592090 -1265911 -587948
34128 -587948 264957 848865 831250 424337 119000 47270 -48601 -259132 -333316 -135851
34118 -135851 101160 150786 122690 234834 485610 739295 938021 1030333 857522 339645
34108 339645 -315352 -781401 -938421 -881050 -689069 -383839 -85387 -3723 -201106 -492151
34098 -492151 -673633 -770588 -927758 -1081127 -921583 -319221 332437 444518 -68584 -671284
34088 -671284 -895583 -864686 -895118 -861068 -391034 410572 933376 832153 409456 89602
34078 89602 -83462 -203353 -150542 161666 463174 446410 253637 264670 490130 561523
34068 561523 316734 30441 -15291 112956 200228 209586 252699 366772 445638 342085 15479
34057 15479 -353290 -441338 -125324 293357 398929 185576 43000 198097 443350 511089
34047 511089 427898 314152 96580 -300372 -658167 -684019 -443103 -258750 -218557 -107921
34037 -107921 139919 271951 107712 -211927 -539784 -971668 -1507406 -1740098 -1297790 -478598
34027 -478598 -10058 -153450 -438445 -375848 -45347 210301 319448 421195 536257 629795
34017 629795 818510 1169130 1420851 1280106 927881 853729 1189311 1587103 1797740 1948184
34007 1948184 2108484 2002933 1435926 704639 264756 176302 171607 111235 72675 110075
33997 110075 235183 553663 1100854 1579213 1589957 1157964 722814 541221 403094 72057
33987 72057 -288797 -370835 -197771 -56275 -32772 82996 400622 697768 725148 568716
33977 568716 513581 629637 708187 606982 428978 274918 44111 -332409 -632172 -573663
33967 -573663 -218026 137978 421474 818316 1334193 1672015 1657759 1463564 1246889 883858
33957 883858 277625 -363020 -813863 -1134046 -1393216 -1392483 -1028249 -670030 -706164 -887769
33947 -887769 -641645 50352 625116 782754 791118 854017 754403 366910 22253 22833 182617
33936 182617 200535 160527 270219 365978 120230 -389812 -728494 -684168 -476069 -371664
33926 -371664 -364462 -271153 36175 511062 911645 933262 504833 -86231 -494498 -679980
33916 -679980 -833608 -1023514 -1110122 -995171 -777229 -618879 -559547 -490760 -276776 91261
33906 91261 455253 657667 728699 791311 810566 640046 333355 150522 172755 190554 105048
33895 105048 123137 333772 407295 44689 -514097 -795857 -732320 -623190 -604078 -541282
33885 -541282 -365662 -134458 160915 471141 473059 -65678 -739549 -817431 -162096 625186
33875 625186 1057241 1256247 1445043 1488459 1269459 1084289 1239417 1535418 1558721 1303761
33865 1303761 1130786 1214820 1363469 1324222 1009141 463343 -158450 -607473 -709724 -510576
33855 -510576 -177603 140087 297410 197067 -27686 -95336 -6906 -141340 -683773 -1223737
33845 -1223737 -1273299 -994415 -995238 -1484585 -2042477 -2234727 -2065747 -1743588 -1344700 -869744
33835 -869744 -392964 -3863 259319 363191 330413 351586 621637 1013262 1150925 899731
33825 899731 546472 370352 274491 49410 -184084 -82553 406178 887014 962835 701586
33815 701586 533432 708439 987947 971587 654832 458830 655048 983588 1015657 715223
33805 715223 397789 268715 302714 488774 828968 1103614 1029472 723854 623701 822595
33795 822595 909037 671363 505870 749875 1010387 705472 47367 -144637 392102 970745
33785 970745 889878 289964 -175677 -154375 233892 763646 1261890 1503704 1301512 760367
33775 760367 255020 82048 205455 346890 276362 46372 -29269 292058 829422 1084469
33765 1084469 790693 227896 -129722 -126910 94921 475911 1078528 1766448 2165568 2074790
33755 2074790 1715307 1447499 1390651 1423108 1402101 1259338 1008136 774741 704414 739260
33745 739260 647101 394638 289772 537966 835187 704683 149091 -351587 -462739 -287682
33735 -287682 -20319 325234 694404 818093 507860 -32953 -379645 -268657 267836 962126
33725 962126 1401879 1294838 817891 498298 569567 675895 430893 -10086 -267556 -370856
33715 -370856 -602744 -844884 -635456 51470 585477 452503 -111312 -485231 -382803 12749
33705 12749 385134 515755 355536 86814 -6410 125238 241384 202464 179834 302823
33695 302823 368839 192425 24127 255565 822464 1271647 1378957 1335257 1301416 1152705
33685 1152705 791129 407893 245136 288351 352884 321322 161448 -131678 -443405 -506853
33675 -506853 -150812 453953 921730 1001197 729516 324625 42162 60982 334672 551877
33665 551877 393123 -123811 -653476 -908064 -912976 -816271 -601295 -185764 250362 310963
33655 310963 -107697 -540139 -414474 266338 931453 1126371 940592 685992 442607 158177
33645 158177 -7652 198603 667079 906725 619266 88409 -171608 -38523 125407 -30118
33635 -30118 -416621 -630290 -409850 120600 641026 946849 998118 767070 244209 -372895
33625 -372895 -718375 -648035 -451769 -486420 -703517 -772731 -596376 -395022 -263871 12241
33615 12241 534938 961743 878540 372689 -40391 -41915 159744 155737 -177962 -595745 -775281
33604 -775281 -610268 -257308 30782 98326 -49037 -296548 -478020 -435428 -146787 193539
33594 193539 350067 341066 416755 673352 861034 728115 410894 255594 323921 331630 94195
33583 94195 -208188 -297008 -131833 136163 376916 486933 317771 -166649 -674915 -747467
33573 -747467 -234513 488696 888207 811616 573751 515215 581613 416756 -166971 -917377
33563 -917377 -1380219 -1335342 -928406 -433892 -20662 239165 284861 118178 -111675 -199615
33553 -199615 -81837 125372 287176 371766 391325 321511 167092 56356 151328 440211
33543 440211 706543 761323 651905 574143 615623 677996 653911 574050 513402 424641 178869
33532 178869 -221642 -564721 -617345 -352264 58337 432054 684737 770350 632685 296294
33522 296294 -54226 -199923 -115067 -4938 -94236 -426186 -870922 -1239742 -1351125 -1097723
33512 -1097723 -570150 -65874 154064 114688 33507 97 -104887 -351940 -597299 -672898
33502 -672898 -605829 -513776 -386590 -144602 145127 315585 371967 506685 752640 807227
33492 807227 389627 -304286 -710951 -503574 49449 411817 387491 302570 589825 1270099
33482 1270099 1894539 1997198 1573113 1061689 832656 749650 357887 -484991 -1325824 -1596733
33472 -1596733 -1269409 -813413 -539797 -291242 99523 371811 195224 -206226 -225895 308398
33462 308398 908254 1157187 1248799 1490580 1641071 1247191 475183 29355 192679 483004
33452 483004 453588 320427 422254 487977 18371 -798805 -1196319 -906197 -554477 -736399
33442 -736399 -1169336 -1167118 -656907 -235505 -294487 -542095 -490868 -84513 346575 551746
33432 551746 580058 618699 769604 977745 1101778 1055739 898967 754013 641273 469375
33422 469375 199416 -77225 -263073 -362378 -405423 -354370 -178058 28822 100509 -22474
33412 -22474 -224332 -333398 -299021 -258628 -418289 -830092 -1301105 -1576158 -1594256 -1496530
33402 -1496530 -1407314 -1305923 -1102946 -744955 -274521 101531 94555 -297423 -582994 -284202
33392 -284202 328278 427279 -282961 -1103157 -1252115 -821974 -393563 -88377 366069 835484
33382 835484 781753 122228 -548208 -755905 -633551 -451752 -239805 -117954 -410758 -1024196
33372 -1024196 -1228602 -591288 259855 386208 -203803 -638414 -384692 208973 541601
33363 541601 406025 -44597 -530997 -755850 -622158 -393689 -339613 -268651 185404 841633
33353 841633 1033096 505926 -191799 -407116 -95301 341523 562441 430803 1120 -395661
33343 -395661 -355996 80668 411925 364797 252324 393634 595130 585706 568709 814942
33333 814942 998749 576161 -278688 -737556 -363999 437308 1094630 1451129 1498645 1073916
33323 1073916 198330 -620349 -833806 -463641 -4289 143537 -75752 -511196 -912576
33314 -912576 -995812 -677899 -239371 -66010 -246441 -559811 -777764 -793988 -542294 -51716
33304 -51716 406851 484712 162250 -191754 -275180 -210170 -306282 -587154 -745712 -554650
33294 -554650 -159134 93269 17347 -277743 -548478 -615553 -429968 -58884 339288 597867
33284 597867 684113 731331 854978 966540 875578 576516 313383 324392 634802 1130559
33274 1130559 1655958 1924585 1546946 438947 -850408 -1527743 -1355731 -842505 -549365
33265 -549365 -469547 -279398 37137 152051 -92133 -467977 -722735 -878554 -1045778 -1160782
33255 -1160782 -1114242 -1015947 -1100220 -1366887 -1483690 -1114458 -286904 593494 1071751 1000705
33245 1000705 612778 240914 -15742 -282104 -571135 -621856 -212876 455220 893025 860494
33235 860494 617369 573042 801488 991961 813107 235326 -484753 -1061529 -1391288 -1524897
33225 -1524897 -1483111 -1193113 -665093 -144360 62308 -78765 -292984 -332247 -227681 -153990
33215 -153990 -166407 -180657 -135734 -56143 11129 13093 -137189 -490013 -930111 -1199356 -1115310
33204 -1115310 -764228 -446090 -395303 -537594 -559052 -268798 146705 329361 177824 -89006
33194 -89006 -300255 -525443 -787761 -859060 -615493 -398129 -621472 -1084464 -1122353 -533594
33184 -533594 89701 175609 -100972 -254750 -279279 -476104 -721168 -554097 -11988 270213
33174 270213 5709 -260751 30614 616339 843426 591338 240532 -27525 -308467 -478447
33164 -478447 -254029 209794 365060 50205 -303690 -407425 -492064 -694607 -654860 -155793
33154 -155793 350339 417566 389583 826248 1432583 1366921 574160 7515 327281 1062102
33144 1062102 1401825 1270851 1163659 1292786 1400386 1255917 932772 622454 435545
33135 435545 364020 279446 32766 -326774 -545874 -498628 -379900 -421874 -554148 -507501
33125 -507501 -149532 414663 954558 1206997 1020647 577471 326606 503628 823131 831929
33115 831929 463089 43907 -156452 -168038 -149639 -188702 -296108 -448961 -580330 -591390
33105 -591390 -421034 -132022 52978 -101074 -521924 -755390 -455285 102478 317297 80905
33095 80905 -95419 147253 575124 893193 1225072 1698182 1981936 1737096 1236296 1025977
33085 1025977 1168043 1303302 1292297 1282734 1274130 1149480 1066790 1290996 1661291 1723052 1366484
33074 1366484 850521 272604 -393691 -777143 -350038 669171 1345094 1204926 759388
33065 759388 571861 482035 180590 -71456 109873 508962 645570 526006 481841 490584
33055 490584 238292 -259309 -622660 -654507 -492277 -260343 33068 282576 343063 308468
33045 308468 431872 777039 1195071 1566097 1785555 1617273 913135 -43934 -729814 -919753
33035 -919753 -800058 -602945 -414220 -292718 -265132 -193418 84144 473172 716410 734277
33025 734277 630696 419984 41309 -377305 -569510 -468661 -248268 -30539 197719 400300
33015 400300 488040 489955 483425 403463 194968 73614 282458 629897 667248 347370 108089
33004 108089 240967 576208 881694 1154939 1368074 1325150 977911 539231 101080 -491803
32994 -491803 -1182055 -1523478 -1272478 -802414 -578695 -534044 -352509 -85266 -13318 -89635
32984 -89635 -23698 155064 107985 -215254 -428884 -261283 108306 384938 509906 532047
32974 532047 429600 279077 376085 913701 1626694 1979316 1705174 1038069 444198 255094
32964 255094 529436 1088919 1608257 1795272 1626788 1382365 1332608 1409430 1321832 1000450
32954 1000450 714382 637924 537697 153199 -271250 -221050 314620 701382 466186 -62961
32944 -62961 -187866 274333 806815 801579 112631 -955899 -1977611 -2656854 -2894847 -2734988
32934 -2734988 -2310860 -1863654 -1679570 -1808749 -1881206 -1469178 -692560 -190715 -372106 -961361
32924 -961361 -1439207 -1616556 -1537105 -1151279 -480881 121688 327193 318171 483943 717660
32914 717660 520160 -173535 -782232 -839888 -526151 -237923 -51338 101594 85456 -211260
32904 -211260 -513622 -430793 -22366 233603 36282 -431598 -816215 -994207 -1088225 -1216176
32894 -1216176 -1325266 -1283552 -1133862 -1170592 -1583477 -2028050 -1846116 -888086 139994 421673
32884 421673 -80472 -812141 -1502948 -2331976 -3218623 -3552932 -2961647 -1958416 -1420103
32875 -1420103 -1610667 -2077306 -2332432 -2203863 -1595212 -430316 1006515 2087423 2461874
32866 2461874 2395306 2266694 2029232 1502716 938278 794795 1018883 1061996 716625 452823
32856 452823 664403 987214 781812 60390 -537255 -637475 -556839 -736295 -1124655 -1360402
32846 -1360402 -1349299 -1373603 -1644171 -1933268 -1753489 -908926 159381 681857 332939 -352220
32836 -352220 -505410 112965 856412 952931 333119 -417661 -745403 -557927 -95646 336272
32826 336272 475246 191024 -373495 -856473 -1011170 -949249 -950086 -1062476 -1035507 -691911
32816 -691911 -252230 -156231 -580809 -1253592 -1764314 -1934550 -1816515 -1483820 -1014682 -616493
32806 -616493 -514818 -637843 -595062 -109986 625198 1145334 1180243 814617 277129 -258409
32796 -258409 -691718 -980184 -1123102 -1057246 -615292 219487 1014681 1121729 402449 -427642
32786 -427642 -437597 526944 1656049 2011420 1416658 473878 -151608 -322650 -373789 -645460
32776 -645460 -1156942 -1671453 -1986789 -2162076 -2537398 -3536002 -5279149 -7193313 -8040621
32767 -8040621 -6684049 -3165851 944201 3501760 3322882 956856 -1856108 -3405261
32759 -3405261 -2976152 -1117198 840166 1798378 1750320 1593955 1964841 2425517 2090061
32750 2090061 911200 -138573 -315212 -84431 -432070 -1405351 -1896756 -1009077 803001
32741 803001 2279509 2767771 2638886 2383691 1870863 792629 -545488 -1387957 -1423970
32732 -1423970 -1106409 -1007866 -1187808 -1314875 -1110036 -480085 525652 1629254 2358839
32723 2358839 2428055 2002665 1430415 871335 405661 286288 701850 1356889 1668569 1431435
32713 1431435 1004358 809639 926844 1208059 1479581 1546208 1294496 913104 749102 830393
32703 830393 796402 428443 -37747 -301161 -415851 -584182 -748471 -653284 -193578 487206
32693 487206 1124815 1433359 1266605 829272 514198 375384 43053 -611757 -1057383 -731589
32683 -731589 132007 748798 740424 419037 188391 142430 311073 823296 1594893 2185296
32673 2185296 2258747 2025008 1964431 2169955 2179895 1530955 366961 -636649 -973334 -783921
32663 -783921 -510651 -256369 176567 684503 813417 490799 310428 708962 1245334 1186330
32653 1186330 550466 48807 139071 641859 1192848 1557035 1524303 1002256 276414 -219169
32643 -219169 -411871 -523884 -586668 -472174 -331151 -472901 -818399 -1002567 -1013612 -1150110
32633 -1150110 -1329281 -1112118 -542317 -272726 -627627 -1180894 -1519868 -1764110 -2001467
32624 -2001467 -1892277 -1296664 -723648 -672170 -998987 -1341397 -1643942 -1862152 -1730024 -1290701
32614 -1290701 -1064655 -1207598 -1173351 -767202 -751470 -1665283 -2839441 -3478878 -3880934 -4467692
32604 -4467692 -4555935 -3690343 -3397608 -5355343 -7910734 -6968230 -1271878 5266940 7952922
32595 7952922 6503124 4275165 3555559 3667624 3270047 2403249 1805471 1664215 1784983
32586 1784983 2169017 2810891 3408686 3679991 3622230 3264279 2574597 1804753 1471087 1694989
32576 1694989 1895435 1450165 446660 -481485 -890614 -851822 -659342 -470887 -246393
32567 -246393 118244 662427 1306076 1852817 2037007 1659693 814043 -37149 -389326 -168158
32557 -168158 274691 666076 1059046 1469350 1599884 1234456 684847 472108 665444 886414
32547 886414 896383 796969 649458 300958 -286666 -855566 -1165467 -1251595 -1224684 -1041340
32537 -1041340 -658694 -249857 -69437 -188463 -484580 -790866 -941312 -797791 -396276
32528 -396276 8618 196637 226345 287940 378630 325178 135300 101007 421149 869385
32518 869385 1034578 843514 633135 665987 791846 734950 537563 466726 556210 543956
32508 543956 321554 172505 405373 935023 1401858 1574342 1464961 1162374 742636 293595
32498 293595 -126797 -515758 -812795 -883145 -767683 -800379 -1216956 -1719249 -1729836 -1104407
32488 -1104407 -311869 180694 447076 870751 1570377 2268278 2647294 2647018 2406534 2050552
32478 2050552 1594229 1033264 499594 276310 567245 1227545 1816678 1999375 1852499
32469 1852499 1709094 1748500 1849590 1840553 1739433 1637983 1450437 983723 283648 -294124
32459 -294124 -488394 -451076 -485724 -610661 -637140 -582853 -660136 -834023 -754354 -257871 370473
32448 370473 795850 997617 1061407 945643 719846 701420 982129 1087543 551341 -353960
32438 -353960 -921174 -912090 -676062 -472208 -239712 -48558 -169306 -522378 -590944 -138590
32428 -138590 424402 645460 576490 436226 174370 -221119 -346812 186986 1144578 1919403
32418 1919403 2257800 2331326 2236988 1889623 1373706 959420 702451 372464 -144405 -659118
32408 -659118 -959999 -1020078 -868716 -508236 -27351 425285 827162 1207408 1357963 935306
32398 935306 -6747 -869810 -1136621 -972339 -953336 -1288664 -1569293 -1318902 -601046 40499
32388 40499 182604 -55399 -230144 -125800 53277 40243 -142059 -312727 -443912 -612731
32378 -612731 -730229 -580007 -126865 441746 996887 1553273 2030976 2195671 1969935 1609859
32368 1609859 1425761 1466431 1592140 1707501 1788138 1809038 1789510 1810281 1869028 1822365 1579764
32357 1579764 1240783 928839 621270 282209 29871 -8003 89525 147428 154543 234489
32347 234489 401636 516771 471585 287008 56282 -96065 -48643 204462 527301 822893
32337 822893 1138629 1472598 1623873 1430606 1030267 655510 294141 -173761 -613871 -762368
32327 -762368 -671232 -660954 -814078 -887644 -777012 -663679 -593236 -327937 191317 638284
32317 638284 797680 877570 1040168 1033934 686663 377223 498878 749926 558528 21897
32307 21897 -241106 -108254 -123876 -562913 -1006091 -1080905 -1007281 -1059698 -1028250 -663171 -227163
32296 -227163 -103479 -169996 -74789 112293 70777 -109302 -21116 344097 556344 498375
32286 498375 596099 1082990 1525402 1425452 944244 631962 674913 834931 1007291 1362139
32276 1362139 1874301 2144426 1923127 1524144 1404268 1506340 1405931 1070442 993802 1357978
32266 1357978 1482249 591604 -1034933 -2231187 -2311179 -1764094 -1403838 -1337872 -1170009
32257 -1170009 -823320 -591273 -531800 -375486 -55247 149766 93705 -23870 -59242 -161006
32247 -161006 -419442 -611484 -533159 -329357 -250882 -291936 -305257 -290317 -312373 -283147 -87060
32236 -87060 174307 316088 373768 518226 705083 671063 317366 -113266 -320649 -276534
32226 -276534 -205389 -312678 -561698 -681954 -435161 69080 399218 249151 -210129 -555445
32216 -555445 -615282 -572876 -605451 -641623 -536072 -312472 -121984 -44151 -10879 109245 379045
32205 379045 703607 882492 823181 684601 698165 840421 821664 467519 581 -176304
32195 -176304 52270 359074 313734 -159406 -700061 -899505 -732545 -532894 -544873 -637052
32185 -637052 -560627 -372695 -399599 -778190 -1214995 -1277246 -820984 -84441 537296 762212
32175 762212 590870 303366 211167 334167 400739 237681 43079 131425 489691 778621
32165 778621 770111 591419 474237 437159 351822 206059 118240 122555 123588 106650 232485
32154 232485 605414 1036029 1178687 904268 441774 136258 134146 314268 452781 422131
32144 422131 280202 203146 307534 525627 681384 679645 565479 402284 184344 -79347
32134 -79347 -267487 -226414 51421 380856 531682 408307 85284 -311472 -721936 -1110402
32124 -1110402 -1321728 -1096264 -352368 569352 1092305 925095 358366 -16670 115770
32115 115770 519811 705121 480418 149701 94785 252466 230064 -38857 -83921 426956
32105 426956 1081327 1176975 628047 -21846 -404900 -620552 -700685 -405992 209101 611652
32095 611652 569521 625006 1283233 2125178 2333383 1829044 1233249 860090 456088 -70618
32085 -70618 -377736 -314721 -217616 -335261 -466805 -429734 -420930 -607810 -769909 -675964 -466446
32074 -466446 -340897 -203859 38968 168039 27581 -81018 171782 550138 553254 144446
32064 144446 -284883 -550458 -777411 -929826 -760857 -284258 169128 457136 750548 1034043
32054 1034043 949232 380010 -190446 -224159 233452 750050 1105950 1368810 1539394 1499604
32044 1499604 1287781 1113255 1043059 901547 561314 171898 3024 142942 415000 549274
32034 549274 408868 75591 -278650 -595812 -937074 -1256620 -1306679 -923445 -335636 27947
32024 27947 61135 92180 374888 693142 700512 506061 580817 1056222 1455428 1308065 783033
32013 783033 443485 532759 817902 1062605 1288229 1511753 1568206 1367160 1092462 968916
32003 968916 998644 1061362 1085869 986224 656211 216894 39328 278608 600708 653572
31993 653572 587003 740342 1004580 958642 554709 175041 3333 -154611 -340346 -261535
31983 -261535 149540 474043 401489 186611 183552 296025 284597 295098 601867 1039340
31973 1039340 1189286 1023750 884993 876345 746065 398923 72895 -80476 -183993 -283063
31963 -283063 -193455 126843 396415 406708 306616 283730 247097 75542 -76571 -19702
31953 -19702 122946 125164 66197 180387 370469 239874 -333965 -953367 -1153617 -917146
31943 -917146 -616635 -564424 -723119 -805697 -591825 -150561 244458 404162 349210 142343
31933 142343 -219884 -615887 -687199 -191949 584733 1036972 864291 280587 -357639 -823159
31923 -823159 -906440 -447837 298666 661755 250246 -520678 -916616 -769029 -537160 -573065
31913 -573065 -735502 -787684 -770152 -765590 -600356 -90081 576787 1008200 1098281 1062915 1001995
31902 1001995 754518 310466 62724 353316 904269 1047197 562148 -11372 -60735 333314
31892 333314 573265 357943 -10449 -157064 -154940 -334181 -766076 -1171713 -1286849 -1136249
31882 -1136249 -943565 -880015 -900130 -762392 -259254 499242 1095535 1190662 846213 396518
31872 396518 115469 113523 392802 781206 927659 637552 161284 -119964 -228623 -460605
31862 -460605 -749459 -633451 -1521 604839 744901 727036 1063116 1569342 1558804 820628
31852 820628 -131168 -803687 -1207118 -1461620 -1408047 -908800 -228533 194293 187799 -146984
31842 -146984 -662550 -1150918 -1292423 -944443 -423959 -229268 -483871 -862321 -1033356 -940769
31832 -940769 -657055 -248514 112177 151404 -181433 -523748 -442579 64422 568749 699676
31822 699676 476290 131269 -206326 -510645 -664840 -505633 -96846 245003 327346 339302
31812 339302 554008 877060 943728 659410 366471 367608 526623 535455 396808 383585 600091
31801 600091 843404 899267 749890 457026 59153 -332361 -534187 -533719 -601192 -996735
31791 -996735 -1621565 -2092743 -2140708 -1828628 -1394419 -986980 -601778 -223159 46969 73655
31781 73655 -72754 -65902 325921 849287 939949 393645 -314682 -546449 -192813 343962
31771 343962 718586 894651 897043 700686 470258 561780 1056070 1539311 1612561 1425755
31761 1425755 1401773 1578788 1596567 1284162 867165 538618 203642 -209728 -534255 -668857
31751 -668857 -791300 -998996 -1021545 -642011 -174543 -79255 -227931 -58379 533067 978243
31741 978243 867558 497108 296225 146243 -286578 -831668 -964531 -589391 -175940 -72665
31731 -72665 -118298 -61078 29535 757 -23309 197235 649951 1097927 1376706 1474111 1408361
31720 1408361 1217399 1009083 862190 742531 657285 773249 1164639 1536808 1493755 1087562
31710 1087562 813934 979010 1330782 1454197 1288346 1037449 757090 330717 -185322
31701 -185322 -476443 -320286 131978 514383 602886 459546 296675 264579 344032 405668
31691 405668 373897 318768 356015 479159 550694 460532 238065 -702 -165730 -241689 -275900
31680 -275900 -337322 -441923 -493987 -348962 10786 373642 436837 107343 -334008 -443143
31670 -443143 -66030 441004 542372 92809 -515167 -791277 -604665 -146284 385242 883977
31660 883977 1238500 1370834 1362636 1342756 1243936 885418 342084 -3348 88749 386697
31650 386697 479790 284769 83365 116028 311716 419403 274269 -88092 -478277 -670815
31640 -670815 -546929 -196835 104883 68929 -375574 -958106 -1239684 -1020944 -562415 -290862
31630 -290862 -306568 -316888 -42237 489859 1061402 1445864 1410025 803269 -167530 -943368
31620 -943368 -1116222 -824021 -485255 -284670 -116047 114731 388774 692725 991818 1140956
31610 1140956 1049870 871117 783407 664097 265546 -330317 -756861 -853099 -760628 -509903
31600 -509903 63938 836053 1239327 911807 226536 -154273 -65000 158911 319593 591373
31590 591373 1086444 1531674 1551763 1110059 522672 108378 -73310 -164720 -275617 -356829
31580 -356829 -319277 -225081 -252262 -440957 -589165 -496147 -241984 -113107 -266617 -556527
31570 -556527 -700338 -562190 -263097 -48802 -65651 -261525 -492510 -683489 -850223 -1007576
31560 -1007576 -1119093 -1111681 -899007 -466594 -8396 149909 -61390 -251694 -17839 435429
31550 435429 436992 -315515 -1354243 -2000602 -2038240 -1643392 -952515 -49745 767990 1106127
31540 1106127 899531 481548 175689 7172 -122326 -150975 105069 656289 1178127 1232201
31530 1232201 707876 1844 -352663 -228242 49126 168007 131628 44322 -143169 -503016
31520 -503016 -910633 -1123121 -971792 -403450 464368 1216692 1349853 846251 317929 307305
31510 307305 648984 827239 748038 742264 927636 1030411 844977 461785 -3469 -514700
31500 -514700 -871671 -759331 -206058 329293 500970 420331 291683 26844 -500400 -1049602
31490 -1049602 -1200623 -869752 -386279 -85214 -23736 -91615 -213404 -366068 -485504 -460996
31480 -460996 -276818 -133987 -298225 -731273 -1004123 -776343 -290865 -139519 -533807 -1069739
31470 -1069739 -1275693 -1129859 -902644 -712789 -448352 -33548 381735 494958 116313
31461 116313 -556124 -996632 -891472 -576101 -643451 -1101978 -1298140 -819618 -93089 201724
31451 201724 9443 -180631 -92786 80679 130171 133292 225305 361854 454336 552963 735209
31440 735209 896899 798590 350566 -197837 -429245 -179465 251625 411547 191559 -125027
31430 -125027 -277531 -267157 -152326 110189 468749 669670 570516 383247 374723 472523
31420 472523 412320 155547 -100929 -247762 -336709 -389519 -390174 -433188 -624160 -840612 -837716
31409 -837716 -605296 -390360 -345200 -374665 -350133 -240301 -4701 371499 657542 475942
31399 475942 -202238 -861097 -932702 -367888 416212 1004498 1233123 1125926 834338 602065
31389 602065 573684 622032 526004 319120 275876 514078 815251 955260 1028110 1236019
31379 1236019 1473932 1406398 977735 571454 521912 667427 584132 139072 -390043 -657198
31369 -657198 -506036 28216 716783 1162490 1099566 714401 447277 454166 512271 471495
31359 471495 463344 553330 538423 308441 116915 227014 518825 711899 754064 700384 438965
31348 438965 -87936 -557513 -587858 -318302 -256171 -552361 -834624 -809139 -620229 -479528
31338 -479528 -314125 -12402 264649 302837 213664 332156 774840 1274433 1456357 1185083
31328 1185083 645260 147423 -132709 -239578 -296320 -351043 -386256 -373109 -243357 71922
31318 71922 465245 647857 477528 166068 -15354 -88779 -196531 -239648 -31169 265240
31308 265240 231861 -236776 -797476 -1140244 -1280200 -1292162 -1097920 -676154 -206850 161944
31298 161944 465100 706214 743137 552825 376616 404999 502119 428586 182375 -42321
31288 -42321 -87628 108226 510625 911772 1042320 914151 866188 1112437 1451637 1609386
31278 1609386 1633882 1688678 1655036 1288304 687433 277942 314405 647477 1001330 1258008
31268 1258008 1424939 1517600 1561828 1599559 1627447 1591095 1467415 1314559 1235928 1297686 1438989
31257 1438989 1477570 1304681 1065140 981416 982940 751641 247911 -71091 207249 879736
31247 879736 1382234 1494413 1465950 1480438 1361430 938186 423025 184001 251464 276930
31237 276930 -3312 -432850 -653651 -546222 -285516 7049 425388 985396 1409156 1451798
31227 1451798 1288927 1264927 1343270 1168570 652591 100748 -281679 -571933 -720519 -469804
31217 -469804 68845 255783 -248509 -881851 -882422 -300698 197798 313516 322910 409517 377694
31206 377694 105651 -190433 -273788 -120569 233489 734264 1126476 1080040 618302 133427
31196 133427 -125660 -318329 -686461 -1220440 -1718415 -1933289 -1636332 -840468 -17232 243422
31186 243422 -91256 -457563 -442933 -256736 -304706 -610554 -878181 -884606 -604050 -146155
31176 -146155 255974 400180 401230 584166 953665 1080391 735436 310960 282876 529078
31166 529078 585471 384451 272841 369623 384757 146851 -98381 -81170 103749 192515
31156 192515 116714 -18114 -152074 -267964 -279438 -135397 1047 -117781 -474517 -734182
31146 -734182 -649097 -401732 -372281 -596756 -676327 -325140 187692 368337 173783 65323
31136 65323 352188 769411 870164 625875 407319 484306 779276 1070100 1203782 1093409
31126 1093409 730991 305609 143905 384276 790020 1013019 978593 862947 741138 484841
31116 484841 74755 -217183 -156292 90814 180520 108816 193043 518699 747541 613813
31106 613813 298025 93243 -17142 -170835 -274148 -191867 -83067 -128860 -72135 475222
31096 475222 1299781 1685205 1339329 743244 412879 283293 91208 -63467 60522 334325
31086 334325 386901 136202 -125147 -125510 116136 346840 261865 -235920 -814887 -933247
31076 -933247 -455803 134919 323426 122421 -175381 -512204 -960387 -1326684 -1330647 -1092019
31066 -1092019 -982198 -1004748 -791650 -287643 36335 -142121 -503031 -553748 -300620 -114950
31056 -114950 -113714 -45983 234915 506918 480625 175965 -107843 -93567 280353 869596
31046 869596 1404903 1593621 1281699 595049 -126853 -604679 -811223 -863331 -800132 -573524
31036 -573524 -215025 129782 345651 417259 369439 279928 326106 600147 844145 636141
31026 636141 -23553 -554709 -439558 155368 634688 704915 572200 495257 455767 315021
31016 315021 58960 -207563 -373252 -366961 -195263 22806 128056 51358 -153340 -361847
31006 -361847 -425340 -248734 95228 398162 520774 471130 248734 -194297 -724918 -987722
30996 -987722 -803971 -437686 -228242 -126470 114179 427194 475308 162487 -234563 -457298
30986 -457298 -486469 -358409 -69979 277584 517573 659093 833953 979906 888740 629309
30976 629309 570426 839243 1084244 974597 643722 405191 299088 210477 215357 448234
30966 448234 730346 690860 282827 -94091 -60473 334240 731491 845908 659721 353406
$$ [...]
##END NTUPLES=NMR SPECTRUM
##END=
