##TITLE=31P_DE-80H_X3
 64 sc D2O
 26.2.2025
##JCAMPDX= 6.0         $$ Bruker NMR JCAMP-DX V2.0
##DATA TYPE= NMR SPECTRUM
##DATA CLASS= NTUPLES
##ORIGIN= UXNMR, Bruker Analytische Messtechnik GmbH
##OWNER= root
$$ XWIN-NMR		Version 3.5
$$ Thu Jul 10 10:06:23 2025 Russian Standard Time (UT+4h)  Yarkov@DPX200
##.OBSERVE FREQUENCY= 81.013821
##.OBSERVE NUCLEUS= ^31P
##.ACQUISITION MODE= SIMULTANEOUS
##.ACQUISITION SCHEME= undefined
##.AVERAGES= 64
##.DIGITISER RES= 17
##SPECTROMETER/DATA SYSTEM= spect
##.PULSE SEQUENCE= zgpg30
##.SOLVENT NAME= DMSO
##.SHIFT REFERENCE= (INTERNAL, DMSO, 0, 198.062)
##AUDIT TRAIL= $$ (NUMBER, WHEN, WHO, WHERE, WHAT)
$$ ##TITLE= Audit trail, XWIN-NMR		Version 3.5
$$ ##JCAMPDX= 5.01
$$ ##ORIGIN= Bruker BioSpin GmbH
$$ ##OWNER= Yarkov
$$ C:/Bruker/XWIN-NMR/data/yarkov2/nmr/P31/2/pdata/1/auditp.txt
$$ ##AUDIT TRAIL=  $$ (NUMBER, WHEN, WHO, WHERE, WHAT)
(   1,<2025-07-10 10:05:30.00 +0400>,<Yarkov>,<DPX200>,
      <created by zg, POWCHK disabled, PULCHK disabled
       configuration hash MD5:
       00 E9 B6 7A A2 85 ED C7 34 08 36 98 17 FE 4E 26
       data hash MD5: 32K
       99 48 35 C0 AA 1D 80 6A 68 9B 90 2D 8E 2D 93 22>)
(   2,<2025-07-10 10:05:51.76 +0400>,<Yarkov>,<DPX200>,
      <Start of raw data processing
       efp BC_mod = 2 LB = 1.5 FT_mod = 6 PKNL = 1 PHC0 = 1676.443 PHC1 = 49.15953 SI = 64K 
       data hash MD5: 64K
       B4 15 4C 3E 08 8F 9F 3F B8 9E 3D 55 0E 1B C4 CE>)
$$ ##END=
$$ 
$$ hash MD5
$$ F8 92 33 82 99 6C 34 AF C6 D2 E6 01 74 32 73 6D
##$RELAX= 
##$RELAX= 
##$RELAX= 
##$RELAX= 
##$RELAX= 
##$RELAX= 
##$RELAX= 
##$RELAX= 
$$ Bruker specific parameters
$$ --------------------------
##$DU= <C:/Bruker/XWIN-NMR>
##$EXPNO= 2
##$NAME= <P31>
##$PROCNO= 1
##$TYPE= <nmr>
##$USER= <yarkov2>
##$AMP= (0..31)
100 100 100 100 100 100 100 100 100 100 100 100 100 100 100 100 100 100 
100 100 100 100 100 100 100 100 100 100 100 100 100 100 
##$AQSEQ= 0
##$AQ_mod= 1
##$AUNM= <au_zg>
##$AUTOPOS= <>
##$BF1= 81.014009
##$BF2= 200.13
##$BF3= 200.13
##$BF4= 200.13
##$BF5= 200.13
##$BF6= 200.13
##$BF7= 200.13
##$BF8= 200.13
##$BYTORDA= 1
##$CFDGTYP= 0
##$CFRGTYP= 5
##$CHEMSTR= <none>
##$CNST= (0..31)
1 1 145 1 1 1 1 1 1 1 1 1 1 1 1 1 1 1 1 1 1 1 1 1 1 1 1 1 1 1 1 1 
##$CPDPRG= <waltz16>
##$CPDPRG1= <>
##$CPDPRG2= <waltz16>
##$CPDPRG3= <>
##$CPDPRG4= <mlev>
##$CPDPRG5= <mlev>
##$CPDPRG6= <mlev>
##$CPDPRG7= <mlev>
##$CPDPRG8= <mlev>
##$CPDPRGB= <>
##$CPDPRGT= <>
##$D= (0..31)
0 1 0 0 0 0 0 0 0 0.06 0 0.03 2e-05 3e-06 0 0 0.0002 0 0 0 0 0 0 0 0 0 
0 0 0 0 0 0 
##$DATE= 1752127529
##$DBL= (0..7)
120 120 120 11 120 120 24 19 
##$DBP= (0..7)
150 150 150 150 150 150 150 150 
##$DBP07= 0
##$DBPNAM0= <>
##$DBPNAM1= <>
##$DBPNAM2= <>
##$DBPNAM3= <>
##$DBPNAM4= <>
##$DBPNAM5= <>
##$DBPNAM6= <>
##$DBPNAM7= <>
##$DBPOAL= (0..7)
0.5 0.5 0.5 0.5 0.5 0.5 0.5 0.5 
##$DBPOFFS= (0..7)
0 0 0 0 0 0 0 0 
##$DE= 6
##$DECBNUC= <off>
##$DECIM= 4
##$DECNUC= <off>
##$DECSTAT= 4
##$DIGMOD= 1
##$DIGTYP= 9
##$DL= (0..7)
0 0 52 120 120 21 21 25 
$$ [...]
##$SUBNAM2= <"">
##$SUBNAM3= <"">
##$SUBNAM4= <"">
##$SUBNAM5= <"">
##$SUBNAM6= <"">
##$SUBNAM7= <"">
##$SUBNAM8= <"">
##$SUBNAM9= <"">
##$SW= 400.765351723535
##$SWIBOX= (0..15)
0 1 3 0 0 0 0 0 0 0 0 0 0 0 0 0 
##$SW_h= 32467.5324675325
##$TD= 32768
##$TD0= 1
##$TE= 0
##$TE2= 300
##$TE3= 300
##$TEG= 300
##$TL= (0..7)
0 120 53 12 22 120 120 120 
##$TP= (0..7)
150 150 150 150 150 150 150 150 
##$TP07= 0
##$TPNAME0= <>
##$TPNAME1= <>
##$TPNAME2= <>
##$TPNAME3= <>
##$TPNAME4= <>
##$TPNAME5= <>
##$TPNAME6= <>
##$TPNAME7= <>
##$TPOAL= (0..7)
0.5 0.5 0.5 0.5 0.5 0.5 0.5 0.5 
##$TPOFFS= (0..7)
0 0 0 0 0 0 0 0 
##$TUNHIN= 0
##$TUNHOUT= 0
##$TUNXOUT= 0
##$USERA1= <user>
##$USERA2= <user>
##$USERA3= <user>
##$USERA4= <user>
##$USERA5= <user>
##$V9= 5
##$VALIST= <valist>
##$VCLIST= <CCCCCCCCCCCCCCC>
##$VD= 0
##$VDLIST= <DDDDDDDDDDDDDDD>
##$VPLIST= <PPPPPPPPPPPPPPP>
##$VTLIST= <TTTTTTTTTTTTTTT>
##$WBST= 1024
##$WBSW= 4
##$XGAIN= (0..3)
0 0 0 0 
##$XL= 0
##$YL= 0
##$YMAX_a= 2181
##$YMIN_a= -93
##$ZGOPTNS= <>
##$ZL1= 120
##$ZL2= 120
##$ZL3= 120
##$ZL4= 120
##$ABSF1= 0
##$ABSF2= 0
##$ABSG= 0
##$ABSL= 0
##$ALPHA= 0
##$AQORDER= 0
##$ASSFAC= 0
##$ASSFACI= 0
##$ASSFACX= 0
##$ASSWID= 0
##$AUNMP= <proc_1d>
##$AZFE= 0.1
##$AZFW= 0.5
##$BCFW= 0
##$BC_mod= 2
##$BYTORDP= 0
##$COROFFS= 0
##$CY= -3
##$DATMOD= 1
##$DC= 0
##$DFILT= <>
##$DTYPP= 0
##$F1P= 0
##$F2P= 0
##$FCOR= 1
##$FTSIZE= 65536
##$FT_mod= 6
##$GAMMA= 0
##$GB= 0
##$INTBC= 1
##$INTSCL= 9.790993e-09
##$ISEN= 30
##$LB= 1.5
##$LEV0= 0
##$LPBIN= 0
##$MAXI= 10000
##$MC2= 0
##$MEAN= 0
##$ME_mod= 0
##$MI= 50
##$NCOEF= 0
##$NC_proc= -14
##$NLEV= 6
##$NOISF1= 182.463
##$NOISF2= 159.3651
##$NSP= 0
##$NTH_PI= 0
##$NZP= 0
##$OFFSET= 198.0616
##$PC= 4
##$PHC0= 1676.443
##$PHC1= 49.15953
##$PH_mod= 1
##$PKNL= yes
##$PPARMOD= 0
##$PSCAL= 0
##$PSIGN= 0
##$REVERSE= no
##$SF= 81.0140089999434
##$SI= 65536
##$SIGF1= 159.3651
##$SIGF2= -187.1042
##$SINO= 113.3802
##$SIOLD= 16384
##$SREGLST= <1H.CDCl3>
##$SSB= 0
##$STSI= 65536
##$STSR= 0
##$SW_p= 32467.5324675325
##$SYMM= 0
##$S_DEV= 0
##$TDeff= 32768
##$TDoff= 0
##$TI= <>
##$TILT= no
##$TM1= 0
##$TM2= 0
##$TOPLEV= 0
##$USERP1= <user>
##$USERP2= <user>
##$USERP3= <user>
##$USERP4= <user>
##$USERP5= <user>
##$WDW= 1
##$XDIM= 65536
##$YMAX_p= 293497318
##$YMIN_p= -235512831
$$ End of Bruker specific parameters
$$ ---------------------------------
##NTUPLES= NMR SPECTRUM
##VAR_NAME=  FREQUENCY,     SPECTRUM/REAL,   SPECTRUM/IMAG
##SYMBOL=    X,             R,               I
##VAR_TYPE=  INDEPENDENT,   DEPENDENT,       DEPENDENT
##VAR_FORM=  AFFN,          ASDF,            ASDF
##VAR_DIM=   65536,         65536,           65536
##UNITS=     HZ,            ARBITRARY UNITS, ARBITRARY UNITS
##FACTOR=    0.49542278885378, 1,            1
##FIRST=     16045.7642231865, 0,            0
##LAST=      -16421.768244346, 0,            0
##MIN=       -16421.768244346, -235512831,   0
##MAX=       16045.7642231865, 293497318,    0
$$ Real data points
##PAGE= N=1
##DATA TABLE= (X++(R..R)), XYDATA
$$ [...]
7376A0187885j792029J501030K823612M073260Q129180J3130211J3779812P213976
$$ 10187885 8395856 9896886 12720498 16793758 24922938 38053149 51832961 59046937
7368E9046937l671158j2210010j3271936p722138j699949n64929l819303o805751
$$ 59046937 55375779 43165769 29893833 22171695 20471746 19906817 16087514 9281763
7360I281763o400625l428584l12294J485089J795080J449845J925045L923031
$$ 9281763 2881138 -547446 -859740 625349 2420429 3870274 5795319 9718350
7352I718350O164471O587408M631277J544969j096696k394099k363210j981542
$$ 9718350 15882821 22470229 27101506 28646475 27549779 25155680 22792470 20810928
7344B0810928k177373k303346j069430N11806n45589m611578p639956n923738
$$ 20810928 18633555 16330209 15260779 15772585 15226996 10615418 2975462 -2948276
7336b948276n68755M570050P040356O209120K832774N16654L489090R448123R284541
$$ -2948276 -3517031 1053019 8093375 14302495 17135269 17651923 21141013 30589136 39873677
7327C9873677q47643j1613865j1642735l156138J912882p05871l771568j941456
$$ 39873677 39026034 27412169 15769434 12613296 14526178 13820307 10048739 8107283
7319H107283J135627J414529P25168N82195j863529o788063q057514k336010M389604
$$ 8107283 9242910 10657439 11382607 11964802 10101273 3313210 -4744304 -7080314 -2690710
7310b690710N144461J285149k055901m058977n475942l538604K831981P482205
$$ -2690710 2453751 3738900 1682999 -2375978 -7851920 -11390524 -8558543 -1076338
7302a076338M935690L2071R42407N705721N517347k35343k831175J313258N351432
$$ -1076338 3859352 3891423 4833830 10539551 16056898 15821555 12990380 14303638 19655070
7293A9655070L915460J100121K125642M538648L148728j639507n527133o317600
$$ 19655070 23570530 24670651 26796293 31334941 34483669 32844162 27317029 20999429
7285B0999429l969264J417371P313407Q097579J627647o002801p042934j821073
$$ 20999429 17030165 18447536 25760943 33858522 35486169 29483368 22440434 20619361
7277B0619361K394443J047127l458102o604371o667571m221671j85347M130593
$$ 20619361 23013804 24060931 20602829 13998458 7330887 3109216 2923869 7054462
7269G054462O849204O623401L387624j771959o533555p830250m359504J118654
$$ 7054462 13903666 20527067 23914691 22142732 15609177 7778927 3419423 4538077
7261D538077L587933Q19349l969269n106903n5236Q017958J3004023J1203100
$$ 4538077 8126010 8945359 4976090 -130813 -186049 7831909 20835932 32039032
7253C2039032M245270k960955o832214p517846p203820o940402n767446k866698
$$ 32039032 36284302 33323347 26491133 18973287 11769467 4829065 -938381 -3805079
7245c805079L19038J379652N59794J279328N333790R068463P326379O12441n351820
$$ -3805079 -3486041 -2106389 -1546595 -267267 5066523 14134986 21461365 22073806 16721986
7236A6721986p293418p067298n728674q11557P166168J1292150P026000r151j694577
$$ 16721986 9428568 2361270 -3367404 -4178961 2987207 14279357 21305357 21296206 19601629
7227A9601629O38227j58344l948120l439632K621053O341077L235716j192641
$$ 19601629 20239856 20081512 16133392 12693760 15314813 21655890 24891606 23698965
7219B3698965j407194o8719j081934j971552J57882J398445k446324o895385m808937
$$ 23698965 22291771 22223052 21141118 19169566 19327448 20725893 18279569 11384184 6575247
7210F575247J615240L517790j090190m729894j962233L774304O673003N962480
$$ 6575247 8190487 11708277 10618087 5888193 3925960 7700264 14373267 20335747
7202B0335747M151174K255483k14230k912706m492033l836283j063703J818297
$$ 20335747 24486921 26742404 26528174 23615468 19123435 15287152 14223449 16041746
7194A6041746K212921L27313m86116J251547K424863O14415j191611J78976J335290
$$ 16041746 18254667 18581980 18095864 19347411 21772274 22386689 21195078 21374054 22709344
7185B2709344k679823q687084q599943k171760K006438J6209j551309K651473
$$ 22709344 20029521 11342437 2742494 570734 2577172 2593381 1042072 3693545
7177C693545P120790M276009k859707m728389P73714O070878N261850J077124
$$ 3693545 10814335 15090344 12230637 7502248 8275962 14346840 19608690 20685814
7169B0685814p99751P55195K825003L159706J752202o27035l196540m795044m270021
$$ 20685814 19886063 20641258 23466261 26625967 28378169 27751134 24554594 19759550 15489529
7160A5489529j836615M33891L92217j573368k633351j086696J299807K030709
$$ 15489529 13652914 14086805 14479022 12905654 10272303 9185607 10485414 12516123
7152A2516123J651751K313226L585753L020831N12740j618888k952398n137890
$$ 12516123 14167874 16481100 20066853 23087684 23600424 21981536 19029138 13891248
7144A3891248p223593n768368j103747J929376K023891M205361J0339586J2956826
$$ 13891248 6667655 899287 -204460 1724916 3748807 7954168 18293754 31250580
7136C1250580N487660n708949q234257q84404M939836J783529m421521m607905
$$ 31250580 36738240 31029291 22795034 21910630 26850466 28633995 24212474 19604569
7128A9604569P59208M228208K113597k415329m780506l528407n38717P64502j349210
$$ 19604569 20363777 24591985 26705582 24290253 19509747 15981340 15442623 16207125 14857915
7119A4857915l985698k266056L467409O500420K757884k621626k405192J773516
$$ 14857915 10872217 8606161 12073570 18573990 21331874 18710248 16305056 18078572
7111A8078572J891917l791785p696161m433028J301348K709562J547389M340047
$$ 18078572 19970489 16178704 8482543 4049515 5350863 8060425 9607814 13947861
7103A3947861J0633311J2489332O201105k113243n218225l808844l048432m085259
$$ 13947861 24581172 37070504 43271609 41158366 35940141 32131297 29082865 24997606
7095B4997606l891663j300565J713921L807946M898027L643763j124274o455113
$$ 24997606 21105943 19805378 21519299 25327245 30225272 33869035 32744761 26289648
7087B6289648p402104l814645o32724n11901p85580R18367L076585M309153N684394
$$ 26289648 18887544 15072899 14440175 13928274 13142694 14061061 17137646 21446799 27131193
7078B7131193O143858J439473p961650j3508422r160442q07971J881014p72117
$$ 27131193 33275051 34714524 26752874 13244452 4084010 3276039 5157053 4384936
7070D384936j053120K464700L590382O64293k277M567879P974846M064509m010028
$$ 4384936 3331816 5796516 9386898 10051191 10048914 14616793 22591639 26656148 22646120
7061B2646120q855989p763033k673254L698534P757993N971416J23300k959207
$$ 22646120 13790131 6027098 3353844 7052378 14810371 20781787 20905087 17945880
7053A7945880q63914N95633k280779l266474M004529J3635470J4189268N220742
$$ 17945880 17081966 17677599 15396820 12130346 16134875 29770345 43959613 49180355
7045D9180355k523557k896800q60792j800123l417600k144170m14866k254405
$$ 49180355 46656798 43759998 42899206 41099083 37681483 35537313 35122447 32868042
7037C2868042o223907p847486o271197m177918k762656n15178L395459O871713
$$ 32868042 26644135 18796649 12525452 8347534 5584878 5069700 8465159 15336872
7029A5336872O381582O16044o612961q271517j517136P484129R641763L593629
$$ 15336872 21718454 22334498 15721537 7450020 5932884 13417013 23058776 26652405
7021B6652405l692395o663150o188381m207123p9956M752120M936813r01386n481380
$$ 26652405 22960010 16296860 10108479 5901356 5821400 10573520 15510333 14608947 9127567
7012I127567k050511N500509Q061364L922438j003432l619038o354136r396977
$$ 9127567 7077056 12577565 20638929 24561367 23557935 19938897 13584761 4187784
7004D187784q246702j560670M897374N684855K477395J78059K12104J118610K365409
$$ 4187784 -4058918 -5619588 -722214 4962641 7440036 7618095 7830199 8948809 11314218
6995A1314218L741763L468945O40222k280082k694836j777544j696419q85455
$$ 11314218 15055981 18524926 19165148 16885066 14190230 12412686 10716267 9830812
6987I830812L368663Q457989P828144J02734p526353p733129k065266J666311
$$ 9830812 13199475 21657464 29485608 29588342 22061989 14328860 12263594 13929905
6979A3929905m34313m181125l546353J742311O509307O613248K906243j228291
$$ 13929905 13495592 9314467 5768114 7510425 14019732 20632980 23539223 22310932
6971B2310932l942802n049626l906215k31313L131124J865916l572449o315651
$$ 22310932 18368130 13318504 9412289 9180976 12312100 14178016 10605567 4289916
6963D289916r82635Q336854J1929780O186572k406510o014507m324049k118680
$$ 4289916 3307281 11644135 23573915 29760487 27353977 21339470 17015421 14896741
6955A4896741j174551J018554N147341P127807L205803m249403q519460n958309
$$ 14896741 13722190 14740744 19888085 27015892 30221695 25972292 17452832 11494523
6947A1494523k12346J717512k515419p337189n207067L943229J1051178P623127
$$ 11494523 11282177 12999689 10484270 3147081 -2059986 1883243 12934421 20557548
6939B0557548l806511j1650899q218289J847845P642718M551620j792449l419459
$$ 20557548 16751037 5100138 -3118151 -1270306 6372412 10924032 9131583 5712124
6931E712124Q30751N018905L470653k949561p842466o012511J030758O558969
$$ 5712124 6542875 11561780 15032433 12082872 4240406 -1772105 -741347 5817622
6923E817622N698544M06590l189955j730422K371356M719246M073860K642201
$$ 5817622 11516166 11922756 8732801 7002379 9373735 14092981 18166841 20809042
6915B0809042K153967J469381j139943m414748m785611j385173J365726j298543
$$ 20809042 22963009 24432390 23292447 18877699 14092088 12706915 14072641 12774098
6907A2774098p181885q014420M62870J1735017J5096694Q141138p80625k934368
$$ 12774098 5592213 -2422207 -1959337 9775680 24872374 33013512 32232887 29298519
6899B9298519J289719M801327L052023j814587m914355m107156j286756J66961
$$ 29298519 30588238 35389565 38441588 36627001 31712646 27605490 26318734 26485695
6891B6485695j550676n543592r307185j0397808p275241j45692P590691J0220452
$$ 26485695 24935019 19391427 10084242 -313566 -7588807 -7734499 -143808 10076644
6883A0076644N187340k253555l359879L629657J0508676R059335J280739l867220
$$ 10076644 15263984 13010429 9650550 13280207 23788883 32848218 34128957 30261737
6875C0261737k192268J652249J814938j220286k561270J99659M297027N199426
$$ 30261737 28069469 29721718 31536656 30316370 27755100 27954759 32251786 37451212
6867C7451212J346292m380145p501453o330662l183954j015773p7463R97128K235397
$$ 37451212 38797504 34417359 26915906 20585244 17401290 16385517 16308054 17305182 19540579
6858A9540579K508630J723972M89690j702054n247293p807971o154670j042312
$$ 19540579 22049209 23773181 24262871 22560817 17313524 9505553 3350883 2308571
6850B308571K827123K580697J46952j355064j135813N03416L486669N995457M457181
$$ 2308571 5135694 7716391 7863343 6508279 5372466 5875882 9362551 15358008 19815189
6841A9815189j503323o542616n384537L93145M439239L354213n66283l375521
$$ 19815189 18311866 11769250 6384713 6777858 11217097 14571310 14005027 10629506
6833A0629506l363883j394576J99510m82196k257846j399972L056301O656678
$$ 10629506 7265623 5871047 6070557 5588361 3330515 1930543 4986844 11643522
6825A1643522N453016K350218K817839N869219N470334Q07744j991761m06632
$$ 11643522 17096538 19446756 22264595 28133814 33604148 34411892 32420131 32013499
6817C2013499m81099o669411j2924296j0718657j993064L700408L212728K671464
$$ 32013499 31532400 24862989 11938693 1220036 -773028 2927380 6140108 8811572
6809H811572N717831P130485J898334n700755p657675l192875J492152K468698
$$ 8811572 14529403 21659888 23558222 17857467 10199792 7006917 8499069 10967767
6801A0967767J475252N52324j090813l399197l324194P38808N368028O204428
$$ 10967767 12443019 12995343 11904530 8505333 5181139 5919947 11287975 17492403
6793A7492403L821799K264462K709894K081233j749882o429009p996166n191764
$$ 17492403 21314202 23578664 26288558 28369791 26619909 20190900 12194734 7002970
6785G002970K94335N900678Q979978P416110J920741l156768l823813j129504
$$ 7002970 7297305 13197983 22177961 29594071 31514812 28358044 24534231 23404727
6777B3404727L91741r77031k074325j26332K614059J951096k055946n056217m434281
$$ 23404727 23796468 22819437 20745112 20618780 23232839 25183935 23127989 18071772 13637491
6768A3637491k387305j934422k436384j315697J341396K846317K329826K132429
$$ 13637491 11250186 9315764 6879380 5563683 6905079 9751396 12081222 14213651
6760A4213651L803326N245735L759678J41495k621800l589076m120086m546219
$$ 14213651 18016977 23262712 27022390 27163885 24542085 20953009 16832923 12286704
6752A2286704l697755j922646j328899k033370j353417J550523L341551J438868
$$ 12286704 8588949 6666303 5337404 3304034 1950617 3501140 6842691 8281559
6744H281559j409801r43041K213349M021209L732072M494666P175027Q138301
$$ 8281559 6871758 5928717 8142066 12163275 15895347 20390013 27565040 35703341
6736C5703341M582223j531301o417462q157788o137084n86987N085348N336502
$$ 35703341 40285564 38754263 32336801 24179013 18041929 17454942 22540290 27876792
6728B7876792o96470o390402n601442j069826l18010m776641q312556o463419
$$ 27876792 27180322 20789920 15188478 14118652 13800642 9024001 711445 -5751974
6720e751974j836980J033921J585061J575270J230571J66294j91599J791574N195893
$$ -5751974 -7588954 -6555033 -4969972 -3394702 -2164131 -1997837 -2189436 -397862 4798031
6711D798031P783351Q844211Q576824N888814k70824p646654j1537177r740925
$$ 4798031 12581382 21425593 30002417 35891231 35620407 27973753 16436576 6695651
6703F695651m929033j330541l72734m34699J61432J240116J761514J668453J929330
$$ 6695651 1766618 436077 63343 -371356 -209924 1030192 2791706 4460159 6389489
6694F389489K836404L210093K006866O4312q61558l79965N23217J267274J598147
$$ 6389489 9225893 12435986 14442852 14507164 13645606 13265641 13788858 15056132 16654279
6685A6654279J58719l978861p914890o609159J42782N700988M526707n29501k534531
$$ 16654279 16812998 12834137 4919247 -1689912 -1547130 4153858 8680565 8151064 5616533
6676E616533R9907K923398K841676J214322k04193j364348j295676J641246N384300
$$ 5616533 5716440 8639838 11481514 12695836 12491643 11127295 9831619 11472865 16857165
6667A6857165M824175q53705n700102m592664M25979M133821M730368L458852
$$ 16857165 21681340 20827635 15127533 10534869 10960848 15094669 19825037 23283889
6659B3283889J430801K58004K041210M941708K988517m967392j0605076o729271
$$ 23283889 24714690 24972694 27013904 31955612 34944129 29976737 19371661 12642390
6651A2642390J489448L672085m29532k114011J128906K297939k010716n692141
$$ 12642390 14131838 17803923 17374391 15260380 16389286 18687225 16676509 10984368
6643A0984368l992152q45680l45976M92447M179540N821006J442823l319952j596820
$$ 10984368 6992216 6146536 5800560 6293007 10472547 16293553 17736376 14416424 12819604
6634A2819604K807549J443345m395498n520268L65318N672246N097159J743216
$$ 12819604 15627153 17070498 12675000 7154732 7520050 13192296 18289455 20032671
6626B0032671m30034k051484l752780l295655l43927J784073J870848K788934
$$ 20032671 19602637 17551153 13798373 10502718 10158791 11942864 13813712 16602646
6618A6602646N105662M356007j843059q798096j0611008p301372k926352r1979
$$ 16602646 21708308 26064315 24221256 15423160 4812152 -2489220 -5415572 -5507551
6610e507551Q23145K89277N3479J951876M584534M659807K651218K288513L219612
$$ -5507551 -4684406 -4395129 -4341650 -2389774 2194760 6854567 9505785 11794298 15013910
6601A5013910N85308n482528p198383p07203O347059N143668j871293n768347
$$ 15013910 15599218 10116690 2918307 2211104 8558163 13701831 11830538 6062191
6593F062191l775915K24345L966475P615964R076090O369496K741034K036080
$$ 6062191 2286276 2510621 6477096 14093060 23169150 29538646 32279680 34315760
6585C4315760J377687l582824q781441o754566Q3489K118205j481217j340272
$$ 34315760 35693447 32110623 23329182 16574616 16658105 18776310 17295093 15954821
6577A5954821N323797Q785964K850161m441951l652001J802117L056386Q4332
$$ 15954821 21278618 30064582 32914743 28472792 24820791 26622908 29679294 29763626
6569B9763626j074194o468r65311l595335l985381k936291m463630p309889o251970
$$ 29763626 28689432 28682964 27717653 24122318 20136937 17200646 12737016 5427127 -824843
6560h24843j261350K585609M043879O400655Q873912N982536k324241p826558
$$ -824843 -2086193 499416 4543295 10943950 19817862 25800398 23476157 15649599
6552A5649599m822038K607284P489717Q171527O074163J283081m869398p805954
$$ 15649599 10827561 13434845 20924562 29096089 35170252 36453333 31583935 23777981
6544B3777981n521762k516581k977130l909925p12079L903775L479051j551141
$$ 23777981 18256219 15739638 12762508 8852583 8140504 12044279 15523330 13972189
6536A3972189m095966j294353J690388K75589l155074m182073k794988j394688
$$ 13972189 9876223 8581870 10272258 10547847 7392773 3210700 415712 -978976
6528i78976M0595K755226N270629M648615J217428j071646N37940M328185O204994
$$ -978976 -938381 1816845 7087474 11736089 12953517 11881871 12419811 16747996 22952990
6519B2952990M042849m33862l556671l226022n98140J558137J581504l07772k751823
$$ 22952990 26995839 26561977 23005306 19779284 19181144 20739281 22320785 22013013 19261190
6510A9261190l565441p04201M734655P504528L562761l717820o618752l108581
$$ 19261190 15695749 14991548 19726203 27230731 30793492 27075672 20456920 17348339
6502A7348339N94897o16645l535345k339066K594538O350911O864091N289029
$$ 17348339 17943236 17326591 13791246 11452180 14046718 20397629 27261720 32550749
6494C2550749J502005m535298q515555n928670j13496J197573k120940k280316
$$ 32550749 34052754 29517456 21001901 15073231 14959735 16157308 14036368 11756052
6486A1756052K804988M915198p18730o117667k843872L646840K047112o898274
$$ 11756052 14561040 19476238 18757508 12639841 9795969 13442809 15489921 8591647
6478H591647j1642104p283571o46120K663509N286263R104531R277457K870325
$$ 8591647 -3050457 -10334028 -10980148 -8316639 -3030376 6074155 15351612 18221937
6470A8221937m308200n876934l946648l610639l591094K75821N956277P566663
$$ 18221937 13913737 8036803 4090155 479516 -3111578 -2835757 3120520 10687183
6462A0687183N064068M081409O399554P477455M332218j66551k482550k745416
$$ 10687183 15751251 19832660 26232214 33709669 38041887 37875336 35392786 32647370
6454C2647370j984641L11616L392472L935187M93687l626804m711925l500984
$$ 32647370 30662729 30974345 34366817 38302004 38795691 35168887 30456962 26955978
6446B6955978l006826l492577k684139J9244K340765K102977l49385k789976l247436
$$ 26955978 23949152 20456575 17772436 17791680 20132445 22235422 21886037 19096061 15848625
6437A5848625j718218j66846k28298j020382p10599m5678j494585m062916k717528
$$ 15848625 14130407 13963561 13735263 12714881 12004282 11958604 10464019 6401103 3683575
6428C683575M144545R883295P019628j956959o648607k259484M167897L508194
$$ 3683575 7828120 17711415 24731043 22774084 16125477 13865993 18033890 21542084
6420B1542084l735165r478209r125929n643830l091353r86601K987592P823643
$$ 21542084 17806919 8328710 -797219 -6441049 -9532402 -10519003 -7531411 292232
6412B92232R702385O821442J626344j828870j611715R98019L184427L059971J034541
$$ 292232 9994617 16816059 18442403 16613533 15001818 15999837 19184264 22244235 23278776
6403B3278776q26458r40194K5092l44267l358448o711702n932975K64676O788222
$$ 23278776 22452318 21512124 21537216 21192949 17834501 11122799 5189824 5454500 12242722
6394A2242722O840110L30117n255247m122992O59988K340996j3148k072494k568444
$$ 12242722 19082832 19412949 14157702 10034710 10694698 13035694 13022546 10950052 8381608
6385H381608m520101p668653o764665l53926N050012M138498P80344J166752L714235
$$ 8381608 3861507 -3807146 -10571811 -10925737 -5875725 -1737227 -956883 209869 3924104
6376C924104K958219J9526O26902M208308M148016m20486k187946K320641O816984
$$ 3924104 6882323 6901849 7528751 11737059 15885075 15464589 13276643 15597284 22414268
6367B2414268N702782K756130L218619L595433k549648j2258983j5259322p929690
$$ 22414268 28117050 30873180 34091799 37687232 35137584 22878601 7619279 -310411
6359c10411J858002N058720J382683k858595l020928l1901K059490Q37317j882118
$$ -310411 1547591 6606311 7988994 5130399 2109471 2077570 4137060 4974377 3092259
6350C092259k350506J62162K482231K392766J671111K344743K883224J230637
$$ 3092259 741753 903915 3386146 5778912 7450023 9794766 12677990 13908627
6342A3908627r02916o24264J112055J095768q61343k260899k369642k197322j122750
$$ 13908627 13005711 12381447 13493502 14589270 13727927 11467028 9097386 6900064 5777314
6333E777314J887121M416389K917766j208621k852144q05357J031452P70270J179511
$$ 5777314 7664435 12080824 14998590 13789969 10937825 10132468 11163920 11934190 13113701
6324A3113701L378573L588811m46840m408895k970810K625343O476837N378186
$$ 13113701 16492274 20081085 19634245 15225350 12254540 14879883 21356720 26734906
6316B6734906R63385l550126n536419l563383Q90255L416219J329062k477160
$$ 26734906 27698291 24148165 18611746 15048363 15938618 19354837 20683899 18206739
6308A8206739k966909N21272L867582L776909J106698j391198k159437j143209
$$ 18206739 15239830 15761102 19628684 23405593 24512291 23121093 20961656 19818447
6300A9818447R48223K716496K712131J033764l56855J83723J682931J345215j861137
$$ 19818447 20766670 23483166 26195297 27229061 26872206 27055929 28738860 30084075 28222938
6291B8222938n104944m559278n05125K282736N40471k762697k061050L237649
$$ 28222938 23117994 18558716 18053591 20336327 20876798 18114101 16053051 19290700
6283A9290700P616679O283110Q39173k998310k061023J066297J449463j955972
$$ 19290700 26907379 33190489 34029662 31031352 28970329 30036626 31486089 29530117
6275B9530117m486344j759479L400016L780241j797153o001169l749178L43345
$$ 29530117 25043773 23284294 26684310 30464551 28667398 22666229 18917051 19260396
6267A9260396N94949M83004N573856J0434549M417274r825025j6244791p444032
$$ 19260396 19855345 20338349 25912205 36346754 40764028 30939003 14694212 7250180
6259G250180M635224O323814M94658j487977J654701J295761o053516j3701266
$$ 7250180 11885404 18209218 18703876 17215899 18870600 20166361 14112845 411579
6251D11579j4107120o500524M003792J0022830O974918o88219j943645O520514
$$ 411579 -13695541 -20196065 -16192273 -6169443 805475 117256 -1826389 4694125
6243D694125J3219720O734543o907249j1812475m382769L775480M669548L028046
$$ 4694125 17913845 24648388 17741139 5928664 1545895 5321375 9990923 13018969
6235A3018969L846807L154177k431765o821148l602970K617497K876403k233919
$$ 13018969 16865776 20019953 17588188 10767040 7164070 9781567 12657970 10424051
6227A0424051l907645J306437P004194O513909J160171k746274j594314K467467
$$ 10424051 6516406 7822843 14827037 21340946 22501117 19754843 18160529 20627996
6219B0627996M302369Q07896n821198r768267p173180K67748P371721J0068441
$$ 20627996 24930365 25738261 19917063 10148796 2975616 3243364 10615085 20683526
6211B0683526P857668L321043l03139k286442m951357r464479j2234464q766146
$$ 20683526 28541194 31862237 31559098 29272656 24321299 14856820 2622356 -6143790
6203f143790o16465N621490O634044N210346L932135J459637k496485l938952
$$ -6143790 -6760255 -1138765 5495279 10705625 14637760 16097397 13600912 9661960
6195I661960m67796L817922M010166J612942J042751J846152L52027k706697k833493
$$ 9661960 9194164 13012086 17022252 18635194 19677945 21524097 21876124 19169427 16335934
6186A6335934N5436N94184l257609o122259k955214L519327P017564O249387M805137
$$ 16335934 16391370 16985554 13727945 7605686 4650472 8169799 15187363 21436750 26241887
6177B6241887M233145K279528j647589l961806k145918Q47233P51947j635633
$$ 26241887 30475032 32754560 31106971 27145165 24999247 25846480 26598427 24962794
6169B4962794k266232q27566r41617l054024k797413J190998L427352n8937m401045
$$ 24962794 22696562 21868996 20927379 17873355 15075942 16266940 19694292 19635355 15234310
6160A5234310l051713J509385J860060j901711k769919M35191Q73588l521189
$$ 15234310 12182597 13691982 15552042 13650331 10880412 11315603 12189191 8668002
6152H668002n013097J100856P373533N245647j443370k470687L597060Q849977
$$ 8668002 3654905 4755761 12129294 17374941 15931571 13460884 17057944 25907921
6144B5907921Q155927L712407j202869n337435o637882l436997J090065J919599
$$ 25907921 34063848 37776255 36573386 31235951 24598069 21161072 22251137 24170736
6136B4170736l1089O43719M224679M726541L0858l807693j605116L421313M998021
$$ 24170736 24139647 24783366 29008045 33734586 33765444 29957751 28352635 31773948 36771969
6127C6771969J886809l254302q605094j2157290r813091l45974R541762J0744846
$$ 36771969 38658778 35404476 26799382 14642092 4829001 4483027 14024789 24769635
6119B4769635K372990p375321j1191110r516355o521893l363942J456550P117797
$$ 24769635 27142625 19767304 8576194 -940161 -7462054 -10825996 -9369446 -2251649
6111b251649R844090P899429M355324K871778K554067J7974m282887n963820l798209
$$ -2251649 7592441 15491870 19847194 22718972 25273039 25291013 21008126 15044306 11246097
6102A1246097k256936m179997n420508j621112L317142K305473l239550m737915
$$ 11246097 8989161 4809164 -611344 -2232456 1084686 3390159 150609 -4587306
6094d587306J35054L825352J584856l92607M733821J2342749J2271751L514447
$$ -4587306 -4452252 -626900 957956 565349 5299170 17641919 29913670 33428117
6086C3428117m770029n889459k303097N76464R21468o78094l524222n523462l731362
$$ 33428117 28658088 22768629 20465532 21041996 21963464 21285370 17761148 12237686 8506324
6077H506324J154062M002067J470806l616947o489145o417770n654091m578612
$$ 8506324 9660386 13662453 15133259 11516312 5027167 -1390603 -7044694 -11623306
6069a1623306j523410L367072P292202P952387N484025J477181k066557l365924
$$ -11623306 -13146716 -9779644 -2487442 5464945 10948970 12426151 10359594 6993670
6061F993670k570619k169989l282629k614430L147310J0335466J0842299L204455
$$ 6993670 4423051 2253062 -1029567 -3643997 -496687 9838779 20681078 23885533
6053B3885533m128387m022034k43771m10954l270526q47232P615613J2288021
$$ 23885533 19757146 15735112 15491341 15080387 11809861 10962629 18578242 30866263
6045C0866263N885673o358489j3770528j2469746o355873J6655M377903N028986
$$ 30866263 36751936 30393447 16622919 4153173 -2202700 -2186045 2191858 7220844
6037G220844J575827k979791m632244k838162k68478R76181O67775o35978j581278
$$ 7220844 8796671 5816880 1184636 -1653526 -1922004 -945823 -278048 -914026 -2495304
6028b495304m32337K253845L393827K147490K008756M965589P071598M401961
$$ -2495304 -2927641 -673796 2720031 4867521 6876277 11841866 18913464 23315425
6020B3315425P0756n77641R84382o99096m970377n846716k567892r42392l127865
$$ 23315425 23386181 22808540 23792922 23093826 18123449 12276733 9708841 8766449 5638584
6011E638584m459680k554002j097689j388088J226352P735955J0762643N959082
$$ 5638584 1178904 -1375098 -2472787 -3860875 -2634523 5101432 15864075 21823157
6003B1823157N92969K764151Q249918P293069M8868m585093l034107k37077K01115
$$ 21823157 22416126 25180277 33430195 40723264 40772132 36187039 33152932 32915855 33116970
5994C3116970k39784j167177m291630p314879n443463p05617r54906o644019p601926
$$ 33116970 32877186 31710009 27418379 20103500 14660037 13954420 12999514 6355495 -1246431
5985a246431J855896J2617965J2759890L920751k537275k003942l55823k294375
$$ -1246431 609465 13227430 25987320 29908071 27370796 25366854 25011031 22716656
5977B2716656m642334l234670K14617J698402J010455M98349N44004R7478J46081
$$ 22716656 18074322 14839652 15054269 16752671 17763126 18261475 18805479 18902957 19049038
5968A9049038K738954O686810P771009M307568l33774k468583k776607l617440
$$ 19049038 21787992 28474802 36245811 40553379 40219605 37751022 34974415 31356975
5960C1356975m028193j690532J130304q07997o958716r506743m005838L460848
$$ 31356975 27328782 25638250 26768554 25960557 19001841 9495098 5489260 8950108
5952H950108M679450P50867j297854l45331j420205m876737m506689J270143M929396
$$ 8950108 13629558 14380425 13082571 12737240 11317035 6440298 1933609 3203752 8133148
5943H133148J342083l365480j031070N647294P120823R95191n742489p495457
$$ 8133148 9475231 6109751 5078681 10725975 17846798 18841989 13099500 5604043
5935E604043n718573l405831p68256J791424K229746R31494J395744M234316N056477
$$ 5604043 -114530 -3520361 -4288617 -2497193 -267447 664047 2059791 6294107 11350584
5926A1350584J376090k814677l084387r11453N42382K729395P486751R834555
$$ 11350584 12726674 9911997 6827610 5916157 6458539 9187934 16674685 26509240
5918B6509240L348310p974905j2120662n301289K531803K323491j833929j320935
$$ 26509240 29857550 21882645 9761983 4460694 6992497 9315988 7482059 6161124
5910F161124K901801L547867J64489r60979J293035J137543k918622m715695j326283
$$ 6161124 9062925 12610792 12775281 11814302 13107337 14244880 11326258 6610563 5284280
5901E284280J547481l24253k281542L91845L427756J187081k526996o21400M193514
$$ 5284280 6831761 6507508 4225966 4617811 8045567 9232648 6705652 6084252 10277766
5892A0277766K856004m909019r419323n955531r41430l20620p91665K579483P425138
$$ 10277766 13133770 8224751 -1194572 -7150103 -8091533 -8412153 -9203818 -6624335 800803
5883H00803Q688521O657789M330004J097725m517161q891025o820970J28264M698148
$$ 800803 9489324 16147113 20477117 21574842 17057681 8166656 1345686 1473950 6172098
5874F172098L299529n47409k351869j684410q5744K085499M710950O280186N262290
$$ 6172098 9471627 8924218 6572349 4887939 4802195 6887694 11598644 17878830 23141120
5865B3141120K113142j291964l712334n300268o445204o415286m015319j11682
$$ 23141120 25254262 23962298 20249964 14949696 8504492 2089206 -1926113 -2037795
5857b037795J862476n9477k800423j831627J948656L071947N3780j769843J529910
$$ -2037795 -175319 -234796 -3035219 -4866846 -2918190 153757 207537 -1562306 -32396
5848c2396O002483N507843L18348m358539n590308l906060O8628N042343P205000
$$ -32396 5970087 11477930 11796278 7437739 1847431 -2058629 -1990001 3052342 10257342
5839A0257342M363437L75386N0215J391952p50419m850436m395633O82135L063070
$$ 10257342 14620779 14996165 15046380 16438332 15687913 10837477 6441844 7123979 10187049
5830A0187049M39342j58461N358482R907013N781784l107975p252702n154436
$$ 10187049 10626391 10467930 15826412 25733425 31515209 28407234 21154532 16000096
5822A6000096k746741k337945r36411J502056J020299k022989j548387M453003
$$ 16000096 13253355 10915410 9978999 11481055 12501354 10478365 8929978 13382981
5814A3382981R285695O715328k13082m005370k696477k30298O24061N61713j55580
$$ 13382981 22668676 29384004 29170922 25165552 22469075 22238777 22862838 23424551 23268971
5805B3268971k846254o738603q044447m652880O62761L636185L381935K007358
$$ 23268971 20422717 13684114 5639667 986787 1649548 5285733 8667668 10675026
5797A0675026R12139j1034l31338P39827J933652P72791k120269k714802M82076
$$ 10675026 11587165 11576131 11244793 11984620 13918272 14691063 12570794 9855992 10338068
5788A0338068L446466K761501J424121L573019O039297K323752n538421p699492
$$ 10338068 13784534 16546035 17970156 21543175 27582472 29906224 24367803 16668311
5780A6668311j474625L211561j250080p835490n824206K237893N376477K374853
$$ 16668311 15193686 18405247 17155167 9319677 3495471 5733364 11109841 13484694
5772A3484694K359454P221955P044555k518056j0669819p436915N27043O30774
$$ 13484694 15844148 23066103 30110658 27592602 16922783 9485868 10012911 10643685
5764A0643685n938716p330012m60287N438106M915636L730462O620160Q308251
$$ 10643685 4704969 -2625043 -3085330 2352776 7268412 10998874 17619034 25927285
5756B5927285L183770l992397n135190j569770j121367m853617n453058M99871
$$ 25927285 29111055 25118658 19983468 18413698 17292331 12438714 6985656 7485527
5748G485527O350111M847224j452068l990887R0446M816072L796528k060608o817304
$$ 7485527 13835638 18682862 17230794 13239907 13330353 18146425 21942953 19882345 13065041
5739A3065041p013099m352516j779798J67788K167237L606214L412968K291088
$$ 13065041 6051942 1699426 -80372 87416 2254653 5860867 9273835 11564923
5731A1564923J859202J956983R97309j100971k676435l263048m188845n428069
$$ 11564923 13424125 15381108 16378417 15277446 12601011 9337963 5149118 -278951
5723b78951m547842m84707L803193M620636K054430p74989j792448j301913j84396
$$ -278951 -4826793 -5311500 -1508307 3112329 5166759 4391770 2599322 1297409 1113013
5714A113013J158807K412810L358978L872518L106060k7307m398733o480881m484570
$$ 1113013 2271820 4684630 8043608 11916126 15022186 14994879 10596146 4115265 -369305
5705c69305r95058P31469J335744L373432O274344O785901L816087m24957l726280
$$ -369305 -1364363 -632894 702850 4076282 10350626 17136527 20952614 20527657 16801377
5696A6801377n292468m484953j468078J425996K326464K835724M474470L761828
$$ 16801377 11508909 7023956 5555878 6981874 9308338 12144062 16618532 20380360
5688B0380360l224076j2014460j2914042m343011M603587P568910Q651110J2048254
$$ 20380360 17156284 5141824 -7772218 -12115229 -7511642 57268 8708378 20756632
5680B0756632J2566969M463460o657871j0441854o439071k520065j285533J532873
$$ 20756632 33323601 37787061 31129190 20687336 14248265 11728200 10442667 11975540
5672A1975540N956420N929620K01701m745573n284026n074400n889637l570878
$$ 11975540 17931960 23861580 24063281 19317708 14033682 8959282 3069645 -501233
5664e01233K262638M043688j560513n986956j653727N045611L673483l252939
$$ -501233 1761405 5805093 4244580 -1742376 -3396103 1649508 5322991 2070052
5656B070052m823092L09772L143079O61986J47014M963618Q014695M335255R8353
$$ 2070052 -2753040 -2443268 699811 1361797 1508811 6472429 14487124 18822379 18920732
5647A8920732K152025O363732M389521l122652q009181o220248j005928L524610
$$ 18920732 21072757 27436489 31826010 28703358 20694177 14473929 13468001 16992611
5639A6992611N739913M721043J009117j622053m14981J149073k048398p429526
$$ 16992611 22732524 27453567 28462684 26840631 26425650 27574723 25526325 18096799
5631A8096799o593200K058530Q964645N349334n017538j0672251o656166Q09058
$$ 18096799 11503599 13562129 22526774 27876108 22858570 12186319 5530153 6339211
5623F339211L346128L4978l395539k563358Q18002K131277n0861k669224k577351
$$ 6339211 9685339 9720317 6324778 3761420 4579422 6710699 6659838 3990614 1413263
5614A413263j72852K163434L231426K914315P62531k691594m411392j854755K853599
$$ 1413263 1240411 3403845 6635271 9549586 10312117 7620523 3209131 1354376 4207975
5605D207975M941710L250801J182456J049950J309088O40495P05609K286035K276133
$$ 4207975 9149685 12400486 13582942 14632892 15941980 16582475 17288084 19574119 21850252
5596B1850252j724474o233438n594683J44670N098106N197035K386072O66061
$$ 21850252 20125778 13892340 8297657 8442327 13540433 18737468 21123540 21789601
5588B1789601J227276K682072L452894K386884r68996n092880p006494n510439
$$ 21789601 23016877 25698949 29151843 31538727 30569731 25476851 18470357 12959918
5580A2959918k577336l00606J744013M178369M804758J314341l650852m320976
$$ 12959918 10382582 10081976 11825989 16004358 20809116 22123457 18472605 14151629
5572A4151629J56123L511279R94079l326300k586447J847759K049936l427489
$$ 14151629 14307752 17819031 18813110 15486810 12900363 14748122 16798058 13370569
5564A3370569n765788R32964R150453P568413k691709r754630p711372k908491
$$ 13370569 7604781 8537745 17688198 25256611 22564902 12810272 5098900 2190409
5556B190409k165747l242758j177462K773869M289282L291473K176990L08571
$$ 2190409 24662 -3218096 -4395558 -1621689 2667593 5959066 8136056 8444627
5548H444627l626622o385954l695506K389511N684984M611387K804391J568751
$$ 8444627 4818005 -1567949 -5263455 -2873944 2811040 7422427 10226818 11795569
5540A1795569j633117o357277p469680k767491K948625M369819K160047L34114
$$ 11795569 10162452 3805175 -3664505 -6431996 -3483371 886448 3046495 3380609
5532C380609Q84187L481602O910952Q333802M826274j644163m597772j577745
$$ 3380609 4264796 7746398 14657350 22991152 27817426 26173263 21575491 19997746
5524A9997746J601323q17011n634389n462693L8503L733407J288056l630971n264992
$$ 19997746 21599069 20782058 15147669 9684976 9723479 13456886 14744942 11113971 5848979
5515E848979k514222J553906L647351K405664q33454k506849l70820K901029K312060
$$ 5848979 3334757 4888663 8536014 10941678 10108224 7601375 7230555 10131584 12443644
5506A2443644k541765o128994m019279J548934N338251N888923N428782M549235
$$ 12443644 9901879 3772885 -246394 1302540 6640791 12529714 17958496 22507731
5498B2507731J297176l727850n471013o98632O072683P103243J705406k387120
$$ 22507731 23804907 20077057 14606044 13907412 19980095 27083338 28788744 26401624
5490B6401624L60224N437758M874062j241018n225881k982047J159222K013164
$$ 26401624 26761848 32199606 37073668 35832650 30606769 27624722 28783944 30797108
5482C0797108N59320M25585J562224J351224o14736k678527m376275o175134p166827
$$ 30797108 31356428 31782013 33344237 34695461 34080725 31402198 27025923 20850789 13683962
5473A3683962o047387l513761j196036P25298K561607L247427K013844N19939
$$ 13683962 7636575 4122814 2926778 3652076 6213683 9461110 11474954 11994893
5465A1994893O46078J588928J821504K109970L329897L223999m89968n124808
$$ 11994893 12640971 14229899 16051403 18161373 21491270 24715269 24225301 19100493
5457A9100493n822680k743333n34840n43805J109865O205737J0118172P821803
$$ 19100493 13277813 10534480 9999640 9455835 10565700 16771437 26889609 34711412
5449C4711412R20576m523450n383720l960420l827964n314013n570387k523191
$$ 34711412 35631988 31108538 25724818 21764398 17936434 12622421 7052034 4528843
5441D528843K120590M960644N547058O140746O255807J954638o425746j0771132
$$ 4528843 6649433 11610077 17157135 23297881 29553688 31508326 25082580 14311448
5433A4311448n200613M024490N984785L06050l645076j918679l62551k301811
$$ 14311448 9110835 13135325 19120110 19426160 15781084 13862405 13499854 11198043
5425A1198043k470282K096022M840126N63656m403427j807581M590038M674055
$$ 11198043 8727761 10823783 15663909 16227565 11824138 10016557 14606595 19280650
5417A9280650j909055n724513k628076J247359Q94394l77726J364907L257685
$$ 19280650 17371595 11647082 9019006 10266365 11160759 10783033 12147940 15405625
5409A5405625J003778l234708l694823O96795N337092O212132L856097J445710
$$ 15405625 16409403 13174695 9479872 10176667 15513759 21725891 25581988 27027698
5401B7027698J334101L411608N235049L769707j660193p820261r890505o173266
$$ 27027698 28361799 31773407 37008456 40778163 39117970 31297709 21407204 15233938
5393A5233938m01422J545067k093261o730288o763116k353983J441066K055632
$$ 15233938 14832516 16377583 14284322 7554034 790918 -1563065 -121999 1933633
5385A933633K392164N072654P376475N109974p63043m979331m406501n50620L447620
$$ 1933633 4325797 9398451 16774926 21884900 21121857 16142526 11736025 11185405 14633025
5376A4633025N239850L394648j554167o106869o710766l995018j757809j741069
$$ 14633025 19872875 23267523 21713356 15606487 8895721 4900703 3142894 1401825
5368A401825j993405o58048J323727K159201J698715R36786N39498P10650J408407
$$ 1401825 -591580 -1249628 74099 2233300 3932015 4868801 5408299 6118949 7527356
5359G527356K129829K284193J939966J516934R98535K28455m90636q87777j163800
$$ 7527356 9657185 11941378 13881344 15398278 16396813 16625268 16134632 15246855 14083055
5350A4083055j346821j316446j895571l864138n040494j465824O246867J0969865
$$ 14083055 12736234 11419788 9524217 5660079 619585 -846239 5400628 16370493
5342A6370493P161416j476436o661804n920639l481793k314591j203116L19679
$$ 16370493 23531909 22055473 15393669 9473030 5991237 3676646 2473530 2793209
5334B793209L26874p47167O12150M457779N215709l74063p148547p552230j276529
$$ 2793209 3120083 2372916 2985066 7442845 12658554 12284491 5135944 -2416286 -3692815
5325c692815M993731N894796K171384j637865j437908L423575Q769799Q363784
$$ -3692815 1300916 7195712 9367096 7729231 6291323 9714898 18484697 26848481
5317B6848481Q90306o859703p087531p64531L579001J450143j657611J153548
$$ 26848481 27738787 20879084 13791553 13027022 16606023 18056166 16398555 17552103
5309A7552103P182080P205202r00569p861832n487630J569795K570058l439501
$$ 17552103 24734183 31939385 31038816 23176984 17689354 19259149 21829207 18389706
5301A8389706o545355j515362M135284K104219l914498m784124m91856Q49706
$$ 18389706 11844351 10328989 14464273 16568492 12653994 7869870 7378014 8227720
5293H227720l279653o386851m092932j60205J295085K080674M255762M582441
$$ 8227720 4948067 -1438784 -5531716 -5691921 -4396836 -2316162 1939600 6522041
5285F522041K31036m552653l733104J169592L157261K21916k100598M59402M411332
$$ 6522041 6753077 2200424 -1532680 -363088 2794173 3016089 915491 1374893 5786225
5276E786225L575158k073909o183334m485925l56668K36685k437164k101663L868948
$$ 5786225 9361383 7287474 1104140 -3381785 -3738453 -3501768 -5938932 -8040595 -4171647
5267d171647R682150R265176N167781L942861N181038K166652o627144j3797841
$$ -4171647 5510503 14775679 19943460 23886321 29067359 31234011 24606867 10809026
5259A0809026j2887900o251036k61191K465528K932492K082184P83349M36754
$$ 10809026 -2078874 -8329910 -8591101 -6125573 -3193081 -1110897 -327548 109206
5251A09206P98198L921j379328j81081L301307L782804q94004m622330r47592
$$ 109206 907404 911325 -468003 -649084 2652223 6435027 5541023 918693 -28899
5242b8899P088174J0464704N936007p01689k668073N03134M139449M286022J646203
$$ -28899 7059275 17523979 23459986 22758297 20090224 20593358 24732807 29018829 30665032
5233C0665032K78074K062186L427856J92391n190344n852238m81834M344659L541288
$$ 30665032 30943106 33005292 36433148 36625539 31435195 25582957 25101123 29445782 32987070
5224C2987070l24677k689699l010069k013713R02776L590855R39643o271220q915515
$$ 32987070 32662393 29972694 26962625 24948912 25851688 29442543 30382186 24110966 15195451
5215A5195451k123771O008352N589624j160346n364514n059334l795119r57976
$$ 15195451 13071680 19080032 24669656 23509310 18144796 13085462 9290343 8332367
5207H332367N287167R239161M246178l975685l461589N012745Q300626J469095
$$ 8332367 13619534 22858695 27104873 23129188 19667599 24680344 32980970 34450065
5199C4450065n541221n145751k629156l816322m702445j295652P94272l881208
$$ 34450065 28908844 23763093 21133937 17317615 12615170 11319518 12113790 8232582
5191H232582r345033o635102K175831P739000P040314M579543L048365J067934
$$ 8232582 -1112451 -7747553 -5571722 2167278 9207592 13787135 16835500 17903434
5183A7903434j478957k829637k980468k629671m03263L874817N824352K032696
$$ 17903434 16424477 13594840 10614372 7984701 7581438 11456255 17280607 19313303
5175A9313303l574932m832851k538430k205237m447801m610718j415594R21309
$$ 19313303 15738371 10905520 8367090 6161853 1714052 -2896666 -4312260 -3390951
5167c390951m1362j519216o83322J556102L278845L964920L192639Q33206o37262
$$ -3390951 -3432313 -4951529 -5634851 -4078749 -799904 3165016 6357655 7190861 6553599
5158F553599J933527O973396Q649000M388915j572046m181733l934047m489865
$$ 6553599 8487126 15460522 24109522 28498437 26926391 22744658 18810611 14320746
5150A4320746o112228m943711J062692P832230Q553637J598667o267673o632125
$$ 14320746 8208518 3264807 4327499 12159729 20713366 22312033 16044360 9412235
5142I412235N04460O032540K517811o859745j2530708r531932j263586N903515
$$ 9412235 9916695 15949235 18467046 11607301 -923407 -10455339 -11718925 -5815410
5134e815410P995092M503115j584671m680591j487388M201382N148943J74000
$$ -5815410 2179682 6682797 5098126 417535 -1069853 3131529 8280472 8454472
5126H454472l736400q10182N503410P263236K602768k491704k621130O27183K089063
$$ 8454472 4718072 3907890 9411300 16674536 19277304 16785600 14164470 14791653 16880716
5117A6880716J25391k121679j471115J679900M399080L967616m22774o526021
$$ 16880716 17006107 14884428 13413313 15093213 19492293 23459909 23037135 16511114
5109A6511114r331986n480905J302724K598064m114956j0488716p274452L128500
$$ 16511114 7179128 1698223 3000947 5599011 1484055 -9004661 -16279113 -13150613
5101a3150613R638291O876482K71104l482044m162277m021140k555579O44036
$$ -13150613 -3512322 3364160 3635264 153220 -4009057 -8030197 -10585776 -9941740
5093i941740K725977J732370K60616R22711J653474k54126k815209k724130j150804
$$ -9941740 -7215763 -5483393 -5222777 -4300066 -2646592 -2900718 -5715927 -8440057 -9590861
5084i590861j182598j793889M59152N236763Q659977Q541304N262072o05714o790946
$$ -9590861 -10773459 -12567348 -12108196 -6871433 1788544 10329848 15591920 14986206 8195260
5075H195260p608182J20197J0245178J2606839N478414k911040n759827m676140
$$ 8195260 587078 707275 10952453 23559292 29037706 26126666 20366839 15690699
5067A5690699l864258l299820r46855K423699M278209L931592K592052J428856
$$ 15690699 11826441 8526621 7579766 10003465 14281674 18213266 20805318 22234174
5059B2234174J147746J815314K002327j73174m265182p341062p124469l860847
$$ 22234174 23381920 25197234 27199561 27026387 22761205 15420143 8295674 4434827
5051D434827P80046M722609N744252L156360o99584k694688k347356j081948O89845
$$ 4434827 5214873 9937482 15681734 18838094 18138510 15443822 13096466 12014518 12704363
5042A2704363K768394K746386j456597o917306p857600l061574K561934M403673
$$ 12704363 15472757 18219143 16762546 9845240 1987640 -1073934 1488000 5891673
5034E891673K620227j35237j548615K78132N321063R206740O629042j230733o758650
$$ 5891673 8511900 8376663 6828048 7106180 12427243 21633983 28263025 27032292 20273642
5025B0273642n234493k85296J954150K99168k288705l434391k415780P24904M385100
$$ 20273642 15039149 14753853 16708003 17007171 14718466 11284075 8868295 9593199 13978299
5016A3978299N762169L973137Q19389k520346o418022r319601p610112j322429
$$ 13978299 19740468 23713605 24532994 22012648 15594626 6275025 -1335087 -2657516
5008b657516M131336M938285L591097L202698J692755l152475o665986k412500
$$ -2657516 1473820 6412105 10003202 13205900 14898655 11746180 5080194 2667694
5000B667694P110772J2020387P973878J340605m19363J928656K788675M6603m161521
$$ 2667694 9778466 21798853 29772731 31113336 30693973 32622629 35411304 35457907 31296386
4991C1296386q106924j1167942j1104355n541580L117552Q375590P102360L062492
$$ 31296386 23189462 12021520 917165 -4624415 -1506863 6868727 13971087 17033579
4983A7033579O46134j455908o108405r872700n781587N588497J4210976J2519792
$$ 17033579 17679713 16223805 10115400 242700 -5538887 49610 14260586 26780378
4975B6780378L994057l619743q251018j1308605j0416044k487496P616096R932204
$$ 26780378 30774435 27154692 18903674 7595069 -2820975 -5308471 2307625 12239829
4967A2239829K272869o293936p047864j405946L360456L566912J126474o34614
$$ 12239829 14512698 8218762 1170898 -235048 3125408 6692320 7818794 7184180
4959G184180j24484J796301K484228L29059k609992k845947l76813J353526N08243
$$ 7184180 7059696 8855997 11340225 11669284 9059292 6213345 5836532 7190058 7698301
4950G698301j161167j700962j323722r87678j253624k538314m044822l315354
$$ 7698301 6537134 4836172 3512450 2524772 1271148 -1267166 -5311988 -8627342
4942h627342K58349L057285K013888k53523M24212K905439L609903L635137N921367
$$ -8627342 -8368993 -5311708 -3297820 -3551343 -3127131 -221692 3388211 7023348 12944715
4933A2944715P581290L694104k498862k964123J487898J420466n746568j1073253
$$ 12944715 20526005 24220109 21721247 18757124 20245022 21665488 15918920 4845667
4925D845667q073771j437667K057631K118722O62758j861975k373539K995969
$$ 4845667 -3228104 -4665771 -2608140 -489418 173340 -1688635 -4062174 -1066205
4917a066205R730967Q434314P87430q23196N906457P894019o27900o632912p02720
$$ -1066205 8664762 17099076 17886506 17063310 22969767 30863786 30235886 23602974 22900254
4908B2900254N285759j869227j3019144j1194040Q43319O966920L914147J525156
$$ 22900254 28186013 26316786 13297642 2103602 2946921 9913841 13827988 15353144
4900A5353144K104214p99748n779982m339439K712289O182415M640711M113621
$$ 15353144 17457358 16657610 10877628 6538189 9250478 15432893 20073604 24187225
4892B4187225L851283j507064p957432o995786j946661k314311n180210r87914
$$ 24187225 28038508 26531444 18574012 11578226 9631565 7317254 2137044 1149130
4884A149130N921667L765673l113148p39951P418996O444197L13261M987521J2863322
$$ 1149130 7070797 10836470 7723322 6983371 14402367 20846564 21159825 26147346 39010668
4875C9010668L439826o849835K5016285Q9602308J08363054L4915012o7962971
$$ 39010668 42450494 35600659 60616944 150219252 258582306 293497318 225534347
4868B25534347j02438557n9092954j1976447p619780j9865604j5256399l514905
$$ 225534347 123095790 64002836 52026389 44406609 24541005 9284606 5769701
4861E769701l824205p227483J30314Q263992M213451j932596L701333J1865374
$$ 5769701 1945496 -5281987 -5151673 3112319 7325770 5393174 9094507 20959881
4853B0959881N919466r077603j4801651p828048j32018J866900J820892J775546
$$ 20959881 26879347 17801744 3000093 -4827955 -4959973 -3093073 -1272181 503365
4845E03365O89263J256151N944701R429281N579920j609743m056091k679495m292676
$$ 503365 1192628 2448779 8393480 17822761 23402681 21792938 17736847 15057352 10764676
4836A0764676q623176q789999l111406K814223N125766N042522L911977J835140
$$ 10764676 2141500 -6648499 -9759905 -6945682 -1819916 3222606 7134583 8969723
4828H969723O70245K387929M963692M837992K319478J53999j387996l512544n122628
$$ 8969723 9639968 12027897 16991589 21829581 24149059 24303058 22915062 19402518 14279890
4819A4279890m506917k692384j143068J117185M178151M751061J632784n02141
$$ 14279890 9772973 7080589 5937521 7054706 11232857 15983918 17616702 17114561
4811A7114561J668086L442799n14354o103685n358404O26227L379912M65386k191996
$$ 17114561 18782647 22225446 21711092 15607407 10249003 10875230 14255142 14720528 12528532
4802A2528532j744649k596988o562560p612069j270530P171961R334540M469917
$$ 12528532 10783883 8186895 1624335 -5987734 -7258264 -86303 9248237 13718154
4794A3718154j396558l967265l531037j315401K138516N065230M740824Q74445
$$ 13718154 12321596 8354331 4823294 3507893 5646409 10711639 15452463 16326908
4786A6326908l263158m300221k377354k73401M60643Q36194J461164M49103l269477
$$ 16326908 13063750 8763529 6386175 6112774 6573417 7409611 8870775 9319878 6050401
4777F050401n991164k713688N020790R233437N512765j151872l559035j554188
$$ 6050401 59237 -2654451 2366339 11599776 17112541 15960669 12401634 10847446
4769A0847446o1392j014439k244913k492974k447291j789069J26743J443334K53303
$$ 10847446 10786054 9771615 7526702 5033728 2586437 797368 924111 2367445 2620748
4760B620748r64766J571954N896907N942815P11086l819783l241001J06730K200349
$$ 2620748 1655982 3227936 9124843 15067658 15778744 11958961 8717960 8824690 11025039
4751A1025039K432350J515793n91978k033689N43987N635176O132813o99556p419523
$$ 11025039 13457389 14973182 14381204 12347515 12891502 18526678 24659491 23959935 16540412
4742A6540412o090140M67959L763641K621902K974742O123342O217003Q01282
$$ 16540412 10450272 10918231 14681872 17303774 20278516 26401858 32618861 33420143
4734C3420143m376787m489388k683903l547665n259071l697878K9129K055925
$$ 33420143 29043356 24553968 21870065 18322400 13063329 9365451 9394580 11450505
4726A1450505K368491K844845J621927l477348p790867m314750M639864Q765299
$$ 11450505 13818996 16663841 18285768 14808420 7017553 2702803 7342667 16107966
4718A6107966M473304k25939R76409L163846m847m655370l454843J354160J737399
$$ 16107966 20581270 20355331 21331740 24495586 24490739 19835369 16380526 17734686 19472085
4709A9472085j974133j281030N933823J0969202P055587j584587p026561p325353
$$ 19472085 17497952 16216922 22150745 33119947 40175534 38590947 31564386 24239033
4701B4239033n037107j902959O44085L82452k097365k685445k11616P64410k522557
$$ 24239033 19201926 17298967 17943052 18325504 16228139 13542694 13331078 14095488 11572931
4692A1572931n493378l173511J632144L136266K155843L924310Q020265P772172
$$ 11572931 6079553 2906042 4538186 7674452 9830295 13754605 21774870 29547042
4684B9547042L99778q088205j0057783m572298L018646P155868O410474L334542
$$ 29547042 29946820 21858615 11800832 7228534 10247180 17403048 23813522 27148064
4676B7148064R48033n93965k984567n876413o978529o496835p164300q193140
$$ 27148064 28096097 27502132 24517565 18641152 11662623 5165788 -1998512 -10191652
4668a0191652m625098L833250R175381N860687m1556K85380M725699M221864k320999
$$ -10191652 -14816750 -10983500 -1808119 4052568 4011012 4296392 9022091 13243955 10922956
4659A0922956p014209o163076m377926m324247k211582L335853O709485M240375
$$ 10922956 3908747 -2254329 -6632255 -10956502 -13168084 -9832231 -3122746 1117629
4651A117629N98734J280735M470145N357095L747447K421331J683127J03446k037106
$$ 1117629 1716363 2997098 7467243 12824338 16571785 18993116 20676243 20779689 18742583
4642A8742583l453154l557521j535053K863386O287864M327224j263357l577408
$$ 18742583 15289429 11731908 10196855 13060241 19348105 23675329 22411972 18834564
4634A8834564r10410O97400j662919k366840K072005N079784M35226o280867n899719
$$ 18834564 17924154 18621554 16958635 14591795 16663800 21743584 22178810 15897943 9998224
4625I998224n0545K817505J919750L471905P444192O726518K24636m242867k768109
$$ 9998224 9947679 12765184 14684934 18156839 25601031 32327549 32552185 28309318 25541209
4616B5541209j154388l895413o323884l446115O70391n63814n004232m460867
$$ 25541209 24386821 20491408 14167524 10721409 11391800 10827986 5823754 1362887
4608A362887L061237J0022801Q879070J080707n007339l752951J599948L199861
$$ 1362887 4424124 14446925 23325995 24406702 19399363 15646412 17246360 20446221
4600B0446221j448666o417352n798146j803697m55486j923752r83646L957722
$$ 20446221 18997555 12580203 6782057 4978360 4522874 2599122 1615476 5573198
4592E573198Q548455R434077P537896L822770j858502o395106m739802J763109
$$ 5573198 14121653 23555730 31093626 34916396 33057894 26662788 21922986 23686095
4584B3686095M757349M9014o377559p295891l556078j18471J744002K990204K315589
$$ 23686095 28443444 28492458 22114899 14819008 11262930 11144459 12888461 15878665 18194254
4575A8194254r44913l075000j014759J831657M94571l526906m823262k336553
$$ 18194254 17249341 14174341 13159582 14991239 15485810 11958904 7135642 4799089
4567D799089O23586K526714M005598L980537J399961o62006J267589M525871L766837
$$ 4799089 5422675 7949389 11954987 15935524 17335485 16673479 17941068 22466939 26233776
4558B6233776k42223k113472j332121k545330n986848n818532k11574M489194
$$ 26233776 25991553 23878081 22545960 20000630 14013782 8195250 7983676 12472870
4550A2472870L141541j083888k880230k369858k082948j395721R74623K801021
$$ 12472870 15614411 14530523 11650293 9280435 7197487 5801766 6776389 9577410
4542I577410J804988L61736J721668L751755J680725l892028o699991l066861
$$ 9577410 11382398 11744134 13465802 17217557 18898282 15006254 8306263 5239402
4534E239402L169436N276644J215949m463748n642105j089005M304868N107072
$$ 5239402 8408838 13685482 14901431 10437683 4795578 3706573 8011441 13118513
4526A3118513J317405k542738l162234q80967K549431N297809N103937J425406
$$ 13118513 14435918 11893180 8730946 7849979 10399410 15697219 20801156 22226562
4518B2226562k288415k470630r56450j672243k858494K62635N130134L520718
$$ 22226562 19938147 17467517 16511067 14838824 11980330 12242965 17373099 20893817
4510B0893817m021077n959091K458149R633401M697805m932553m878362L883212
$$ 20893817 16872740 10913649 13371798 23005199 27703004 22770451 17892089 21775301
4502B1775301P828884K699157k127275j153343l26369l697607n343117o70692
$$ 21775301 29604185 32303342 30176067 29022724 28696355 24998748 19655631 18984939
4494A8984939M384734K664706l243880o315169n569766m767264n112720n082984
$$ 18984939 23369673 26034379 22790499 16475330 10905564 6138300 1025580 -4057404
4486d057404m159661k340137O48218K516835m52639o198504o751074L28380O784736
$$ -4057404 -8217065 -10557202 -9908984 -7392149 -7844788 -14043292 -20794366 -20465986 -13681250
4477a3681250N558151J272955J623041M535836L273104l45080J248105P451958
$$ -13681250 -8123099 -6850144 -5227103 -691267 2581837 2236757 3484862 10936820
4469A0936820R520967M722972N1706O971N09296j617415k156973K332663P185452
$$ 10936820 20457787 25180759 25232465 25239436 25748732 24131317 21974344 24307007 31492459
4460C1492459O586874K472540K89210O899k182629n902877o893556m322287j895697
$$ 31492459 38079333 40551873 40841083 40847982 38665353 32762476 25868920 21546633 19650936
4451A9650936j375650k61871K468017K749334l179645j1993604j5458771r514346
$$ 19650936 18275286 18013415 20481432 23230766 20051121 8057517 -7401254 -16915600
4443a6915600J149036Q433216R037809N853187K606601l686k592237m422564m173358
$$ -16915600 -15766564 -7333348 1704461 7557648 10164249 10160563 7568326 3145762 -1027596
4434a027596j670549K488392P215316R593876N993117k915491j0506388j0795265
$$ -1027596 -2698145 -209753 7005563 16599439 22592556 19677065 9170677 -1624588
4426a624588n221101J15250K234400K752533L189031L210735L085119L822735
$$ -1624588 -6845689 -6730439 -4496039 -1743506 1445525 4656260 7741379 11564114
4418A1564114M814850M592971L441284K046279j109590o842621j1151107r140642
$$ 11564114 16378964 20971935 24413219 26459498 25349908 18507287 7356180 -1784462
4410a784462k279203L600973O606880Q873509R341766M540780k804713m926200
$$ -1784462 -4063665 -462692 6144188 15017697 24359463 28900243 26095530 21169330
4402B1169330j259191m77977o261493j0284338n584885J756603K684389k56936
$$ 21169330 19910139 19432162 13170669 2886331 -2698554 -941951 1742438 1485502
4394A485502J444508O946752P483530J130940m365154l730904j18411K153618
$$ 1485502 2930010 9876762 17360292 18491232 14126078 10395174 10276763 12430381
4386A2430381K869726K361934j60488k725055j361763L140863M947170J628428
$$ 12430381 15300107 17662041 17501553 14776498 13414735 16555598 21502768 23131196
4378B3131196k582142l932494l814348l728376j414387M063322Q077491O049327
$$ 23131196 20549054 16616560 12802212 9073836 7659449 11722771 19800262 25849589
4370B5849589M47081k174480L24020L533550K343812l224799q027907p194442
$$ 25849589 26296670 24122190 24446210 27979760 30323572 27098773 19070866 11876424
4362A1876424j968279R55471k197895o392941m024235M188742R567830O688366
$$ 11876424 9908145 10863616 8665721 2272780 -1751455 2437287 12005117 18693483
4354A8693483j039418p595109j0536775r589187m881536Q88367L556858L173212
$$ 18693483 17654065 10058956 -477819 -10067006 -14948542 -14060175 -10503317 -7330105
4346g330105L708277N348795L482103j847723l121168K789488P191856J597152
$$ -7330105 -3621828 1726967 5209070 3361347 240179 3029667 10221523 11818675
4338A1818675q364244j0070224j771959N941601N631350J312386J61484K951579
$$ 11818675 3454431 -6615793 -8387752 -2446151 3185199 4497585 4659069 7610648
4330G610648N166328L280667j758734m959678j840648N069294P139288J001695
$$ 7610648 12776976 16057643 14298909 9339231 7498583 12567877 19707165 20708860
4322B0708860n008435k130599M997793M821676k938173o448519k0623P673285
$$ 20708860 15700425 13569826 18567619 23389295 20451122 14002603 13981980 21655265
4314B1655265P207566O35010m912601p492253q176452n720234k10433L385563
$$ 21655265 28862831 29497841 24585240 17092987 8916535 3196301 2985868 6371431
4306F371431J753192j299338j592010j544965l997400m641728J098529P919355
$$ 6371431 8124623 6825285 5233275 3688310 -309090 -4950818 -3852289 4067066
4298D067066O803797r19194n104664j750362K557755J859740j774867l846593
$$ 4067066 10870863 9951669 4847005 3096643 5654398 7514138 5739271 1892678
4290A892678l362026j062563K304328M271681K758177P49400K712937N931868
$$ 1892678 -1469348 -2531911 -227583 4044098 6802275 7551675 10264612 16196480
4282A6196480L283240l893098n137880K952851R486088M978500m139643n896346
$$ 16196480 19479720 15586622 10448742 13401593 22887681 27866181 23726538 17830192
4274A7830192j174279n42277o117076q686580l269614L552868N021134L637923
$$ 17830192 16655913 16113636 9996560 1309980 -1959634 1593234 6614368 10252291
4266A0252291M178971M594131N98294n187052n891837o94023L636167J896825
$$ 10252291 14431262 19025393 19623687 14436635 8544798 7850775 11486942 13383767
4258A3383767l393621o282267m451751j47623L573617N008961L311341j277250
$$ 13383767 9990146 3707879 -743872 -891495 2682122 7691083 11002424 9725174
4250I725174o019214o725880k069303M164926P083291O308456N258211N185571
$$ 9725174 3705960 -3019920 -5089223 -924297 6158994 12467450 17725661 22911232
4242B2911232L409202j279608m885073k862808L348503P495735N453965j267542
$$ 22911232 26320434 25040826 20155753 17292945 20641448 28137183 33591148 32323606
4234C2323606q090238j1211257r660379n670918k481719m36004L093543Q239990
$$ 32323606 24233368 13022111 3361732 -2309186 -4790905 -5226909 -2133366 6106624
4226F106624J0129305N573674l03813K38189N998943P267151p50844j0629898
$$ 6106624 16235929 21809603 21505790 21743979 27742922 35010073 34259229 23629331
4218B3629331j2091202m643977K941541L376771k490161q449288r217145m223284
$$ 23629331 11538129 6894152 9835693 13212464 10722303 2273015 -6944130 -11167414
4210a1167414K623813O486326N703851K502827o5167r20854r43367j624369l765125
$$ -11167414 -8543601 -2057275 3646576 6149403 6084236 5163382 4220015 2595646 -1169479
4201a169479o190589o085352k220691K678688M721210L342141Q53516j366493
$$ -1169479 -7360068 -13445420 -15666111 -12987423 -8266213 -4924072 -4070556 -5437049
4193e437049l159663l011288Q36449O597672R856627Q532388L948868k154790
$$ -5437049 -8596712 -11608000 -10771551 -4173879 5682748 14215136 18164004 16009214
4185A6009214p672592q508594k624436M527239M881034j329455n881516m431328
$$ 16009214 8336622 -171972 -2796408 1730831 6611865 5282410 -599106 -5030434
4177e030434p89238J859230N377419R426781Q865223L203531R9437L359039N544563
$$ -5030434 -5819672 -3960442 1416977 10843758 19708981 22912512 23011949 26370988 31915551
4168C1915551k47893q711163j0636288o310122j881470J575667N821345P521125
$$ 31915551 31667658 22956495 12320207 6010085 4128615 5704282 11525627 19046752
4160A9046752K794764m087070o119913m151069l107183k100261J939841N400910
$$ 19046752 21841516 17754446 11634533 7483464 4376281 2276020 4215861 9616771
4152I616771L319314r29691j823456j861226m210279l258587L284281L509629
$$ 9616771 12936085 12006394 10182938 8321712 4111433 852846 4137127 7646756
4144G646756p053153m166409L4077282P9239817P3960977J0412650m9820133n3520767
$$ 7646756 593603 -3572806 30504476 109744293 183705270 194117920 144297787 90777020
4136I0777020k0494993l614802j3253863j8651713o727862K688145k553872q475741
$$ 90777020 70282027 66667225 53413362 34761649 28033787 30721932 28168060 19692319
4128A9692319l593035L138738K527171N43118L604872O722361N424081M061972
$$ 19692319 16099284 19238022 21765193 22308311 25913183 32635544 38059625 42121597
4120D2121597M396584L00883q709855j2382189n854851J626408J507772k355261
$$ 42121597 46518181 46819064 38109209 25727020 19872169 21498577 23006349 20651088
4112B0651088l692942l615250l207098J637866R854605J1215865J680645p807617
$$ 20651088 16958146 13342896 10135798 11773664 21628269 32844134 34524779 26717162
4104B6717162o964066n33592K134736J547391J850878K04884n825581q893727
$$ 26717162 19753096 19219504 21354240 22901631 24752509 24957393 19131812 10238085
4096A0238085k487805O045875N570434j713517n433494l697299j935835k57607
$$ 10238085 7750280 13796155 19366589 17653072 12219578 8522279 6586444 6328837
4088F328837M510414Q075777L950138l068191k540723M094676N551977o28590
$$ 6328837 10839251 18915028 22865166 19796975 17256252 21350928 26902905 26274315
4080B6274315n740898o294889p603066r299924l275615R265933J4029034M430268
$$ 26274315 20533417 14238528 6635462 -2664462 -5940077 3325856 17354890 21785158
4072B1785158p023228p024252L72060L777389K424076K399978K751555j637039
$$ 21785158 14761930 7737678 8109738 11887127 14311203 16711181 19462736 17825697
4064A7825697p544988o434385J058030M673159j16680n295246k041750O871626
$$ 17825697 10280709 3846324 4904354 9577513 9460833 4165587 2123837 8995463
4056H995463J0569038L444913q008425j2109851n134424M244227N867010J179199
$$ 8995463 19564501 23009414 15000989 2891138 -2243286 2000941 7867951 9047150
4048I047150k50895L637967M193911k720714q165752l801772M230624N015434
$$ 9047150 8796255 12434222 16628133 13907419 5741667 1939895 6170519 11185953
4040A1185953L55508O02358O217861O805033q57818o691300l284531K962962K979239
$$ 11185953 11541461 12143819 18361680 25166713 24308895 17617595 14333064 17296026 20275265
4031B0275265j395272k730500o74895o81408l415255l680809P60213N792877O877038
$$ 20275265 18879993 16149493 15474598 14793190 11377935 7697126 8457339 14250216 21127254
4022B1127254L772935r53797m374124m133387m91640K581957J672699j046160
$$ 21127254 24900189 23946392 19572268 15438881 14947241 17529198 19201897 18155737
4014A8155737q25182J872378J444658l875509q212241o101434j32967L482982
$$ 18155737 17330555 19202933 20647591 16772082 8559841 2458407 2325440 5808422
4006E808422L741038M171413N295525L792296n60757k963092q06997J952500R31149
$$ 5808422 9549460 13720873 19016398 22808694 22247937 19284845 18477848 20430348 21361497
3997B1361497j977887k156808K92574J519639O99733M86906J030427q35842n134501
$$ 21361497 19383610 17226802 17519376 19039015 19738748 20225654 21256081 20420239 15285738
3988A5285738o697881k393201L609542N243523K364823l43474j78468J417420
$$ 15285738 8587857 6194656 9804198 15047721 17412544 17069070 16890602 18308022
3980A8308022K149474J093663j481728l823991l291809K07531K818818J628982
$$ 18308022 20457496 21551159 20069431 16245440 12953631 13161162 15979980 17608962
3972A7608962q07914m34231J594313Q82832k519938l990839k151097r94491k629666
$$ 17608962 16801048 16366817 17961130 18843962 16324024 12333185 10182088 9187597 6557931
3963F557931l515953o97764L262071N147374O290574Q440973Q447879K806884
$$ 6557931 3041978 2344214 5606285 10753659 17044233 25485206 33933085 36739969
3955C6739969m909004p289048l094744J402544J258061j888188m072359l818787
$$ 36739969 31830965 24541917 21447173 22849717 24107778 22219590 18147231 14328444
3947A4328444j271271L112200O685196N130023j947665q350551p702641j523105
$$ 14328444 13057173 16169373 22854569 27984592 26036927 17686376 9983735 8460630
3939H460630K294963p32573o041553n686563J566935Q144740O614719j009058
$$ 8460630 10755593 10023020 3981467 -1705096 -138161 8006579 14621298 13612240
3931A3612240n613221k336914M035704O375302L898970L21542l005867o812868
$$ 13612240 7999019 5662105 9697809 16073111 19972081 20293623 17287756 10474888
3923A0474888q886291n752269O40349L992353K474261Q09072K096672L630284
$$ 10474888 1588597 -4163672 -3523323 469030 2943291 3752363 5849035 9479319
3915I479319L324793L942948O855505P472700K414973l516147l893783o21629
$$ 9479319 12804112 16747060 23602565 31075265 33490238 29974091 26080308 25458679
3907B5458679n33732m535580p256959o210195m170853k701826j91737L047038
$$ 25458679 24924947 20389367 13132408 6922213 2751360 49534 -142203 2904835
3899B904835M145052L175663L173197L542809O9991o476016q636729k734524M929574
$$ 2904835 7049887 10225550 13398747 16941556 17011547 10535531 1898802 -835722 4093852
3890D093852O626649K805092j316428l715705m784178l162932J150276K987332
$$ 4093852 10720501 13525593 12209165 8493460 3709282 546350 1696626 4683958
3882D683958j434607o326002k732684P177052J0649824J562330j0200139j1251234
$$ 4683958 3249351 -3076651 -5809335 1367717 12017541 13579871 3379732 -7871502
3874g871502j580155O873890O134007P24815k17182N184271J0298219Q869208
$$ -7871502 -9451657 -2577767 3556240 4281055 4063873 9248144 19546363 28415571
3866B8415571K224351l162443l714261k283430l265161o074441n623683P65365
$$ 28415571 30639922 27477479 23763218 21479788 18214627 12140186 6516503 7281868
3858G281868Q830658J1044464M490015n756127j1327503q319439j30289O860216
$$ 7281868 16112526 27156990 31647005 25890878 14563375 6243936 6113647 12973863
3850A2973863R254184Q035391N693717L663586J992033j50254l459685o795688
$$ 12973863 22228047 30263438 35957155 39620741 41612774 41462520 38002835 31207147
3842C1207147p323934m124175n51570l84399k524594k886496r47184j19235j367979
$$ 31207147 23883213 19759038 19207468 18823069 16298475 13411979 12464795 12345560 10977581
3833A0977581j402313J301634L550661K845262J103755J84446j471368m108559
$$ 10977581 9575268 10876902 14427563 17272825 18376580 18561026 17089658 12981099
3825A2981099l627702J716036O113520L879540j250163j431677L315711O026142
$$ 12981099 9353397 11069433 17182953 21062493 19812330 18380653 21696364 27722506
3817B7722506M091768J526516K45368k394065n993251n414330K22443M188594
$$ 27722506 31814274 33340790 33586158 31192093 25198842 19784512 20006955 24195549
3809B4195549J961587j887647j448826J315938P91330l004024n566023n805380
$$ 24195549 26157136 24269489 22820663 24136601 24927931 21923907 16357884 10552504
3801A0552504o602293q301796p165959j096322O787421J1263094R649690L442871
$$ 10552504 3950211 -4351585 -11517544 -12613866 -5826445 5436649 15086339 18529210
3793A8529210k697273m052588j28081M343178M453777P82069j805443n35096K300338
$$ 18529210 15831937 11779349 11651268 15994446 20448223 21230292 19424849 18889753 21190091
3784B1190091K993271J065104q21372n85311R97956J926797J795201J664920J381267
$$ 21190091 24183362 25248466 24427094 23841783 24839739 26766536 28561737 30226657 31607924
3775C1607924q18834m978830p961691p433351n271534m121588k600683J898180
$$ 31607924 30789090 25810260 17848569 10415218 5143684 1022096 -1578587 319593
3767C19593O972204P113546K078213j959982r86215J994497K597515R29376o83211
$$ 319593 7291797 14405343 16483556 14523574 13537359 15531856 18129371 19058747 18375536
3758A8375536j595940j592857M46974L553087L840229r2618m085236l885408p20426
$$ 18375536 16779596 15186739 15633713 19186800 23027029 22934411 18849175 14963767 14243341
3749A4243341J560980J784749R02940m94737r86229J712574O148455O538332P97907
$$ 14243341 15804321 17589070 18492010 17997273 17011044 18723618 24872073 31410405 32208312
3740C2208312n152420n844595m252190n160943n388063P92730R412008R993261
$$ 32208312 27055892 21211297 16959107 11798164 6410101 7202831 16614839 26608100
3732B6608100J001654p224817o940147k175026k75399j442523j319805J130361
$$ 26608100 27609754 20384937 13444790 11269764 10994365 9551842 8232037 9362398
3724I362398L256326L271819J367811j771640m795851n525426k966251J341627
$$ 9362398 12618724 15890543 17258354 15486714 10690863 5165437 2199186 3540813
3716C540813M529564M034941q06037o491687o534967J068454Q983589Q250643
$$ 3540813 8070377 12105318 11299281 4807594 -1727373 -658919 8324670 16575313
3708A6575313K8268o194442n631593k382167p8750L172000P615846Q092846K781337
$$ 16575313 16603581 10409139 4777546 2395379 2316629 5488629 13104475 21197321 23978658
3699B3978658j426248R98922M558213J005744o871091q605164j459175O128098
$$ 23978658 22552410 23551332 28109545 29115289 22244198 13639034 12179859 18307957
3691A8307957O912774L059330Q2419r40021j780653k401441j918988j614336l246830
$$ 18307957 25220731 28280061 28362480 27422459 25641806 23240365 21321377 19707041 16460211
3682A6460211n395129m532281J01139M877450O002781M072125K770607L365721
$$ 16460211 11065082 6532801 6633940 11511390 17514171 21586296 24356903 27722624
3674B7722624K893391q73413n022766n048546j408355J283348J176200J004255
$$ 27722624 30616015 29742602 24719836 19671290 18262935 19546283 20722483 21726738
3666B1726738K588434M125573M202107L827441K664426j720109q137457j0521505
$$ 21726738 24315172 28440745 32642852 36470293 39134719 37414610 29277153 18755648
3658A8755648o215689o76836N42014l80472Q85486K452144O27142j455558J500130
$$ 18755648 12539959 11863123 12405137 12024665 12910151 15362295 15989437 14533879 16034009
3649A6034009O049081L700593m647617q205123k478325L687757J703081m546852
$$ 16034009 22083090 25783683 21136066 12930943 10452618 14140375 15843456 11296604
3641A1296604o337897l313104j380249j686584m0718M010956N156607N85837n197179
$$ 11296604 4958707 1645603 265354 -1421230 -1461948 2549008 7705615 8291452 3094273
3632C094273o044760j291620M706864P791405O880201L260786p20481k393607
$$ 3094273 -2950487 -4242107 464757 8256162 15136363 18397149 17676668 15283061
3624A5283061j46998M493542O869688L480227l064356n823286k191590J750418
$$ 15283061 15136063 19629605 26499293 29979520 26915164 21091878 18900288 20650706
3616B0650706r46965p954825j0479224n646727J10768J437450J317588M199412
$$ 20650706 19703741 11748916 1269692 -4377035 -4266267 -2828817 -1511229 2688183
3608B688183P440793N496150n89566m175200k454025O11172R07757r04415k011925
$$ 2688183 10128976 15625126 15035560 10860360 8406335 9017507 9925264 9020849 7008924
3599G008924j433759j39204N41610p2735j061921k91149K576119M564570L245625
$$ 7008924 5575165 5435961 5977571 5904836 4842915 4551766 7127885 11692455 14938080
3590A4938080P64056R07798L371992M694297L975476L241022K529891k29513l944469
$$ 14938080 15702136 16609934 19981926 24676223 28651699 31892721 34422612 34193099 30248630
3581C0248630m558667k198810k356834o798300q765764k202833Q217105J2172428
$$ 30248630 25689963 23491153 21134319 14336019 5570255 3367422 11584527 23756955
3573B3756955O770512j040646m249543k649636K20097J972852J646846j172748
$$ 23756955 30527467 29486821 25237278 22587642 22807739 24780591 26427437 25254689
3565B5254689n251316p672933o471011k339753K545822O110744O920666M886885
$$ 25254689 20003373 12330440 5859429 3519676 6065498 12176242 19096908 23983793
3557B3983793J676756o89157j360398j41594K787829N083502K792992m149845
$$ 23983793 25660549 24971392 23610994 23469400 26257229 31340731 34133723 29983878
3549B9983878r423604p657710k232273l11925j802986m99553M009807M409821
$$ 29983878 20560274 12902564 10670291 10358366 8555380 8055827 12065634 16475455
3541A6475455j838608o867434m394250L82832j86885l813594l470072k6145L23563
$$ 16475455 14636847 7769413 3375163 3757995 3571110 -242484 -3712556 -3738701 -3415138
3532c415138j556484J199052Q260058J0741566N252420m76825P4464K940108J986754
$$ -3415138 -4971622 -3772570 4487488 15229054 20481474 20004649 20079113 23019221 25005975
3523B5005975j020833j223143L67018j32654j858089j802225j570054l884539
$$ 25005975 23985142 22761999 23129017 22996363 21138274 19336049 17765995 13881456
3515A3881456m921073J193175J0839952J2884348M056471n711454o914571k396615
$$ 13881456 8960383 10153558 20993510 33877858 37934329 32222875 25308304 22911689
3507B2911689m89123k188702k474232r93771k850253q527700j0869931n278355
$$ 22911689 22422566 20233864 17759632 16765861 13915608 5387908 -5482023 -10760378
3499a0760378K837805N413149K643322J077101K981812L932001J174766j726681
$$ -10760378 -7922573 -2509424 133898 1210999 4192811 8124812 9299578 7572897
3491G572897r43676J812278K927928K534284K575545K279963J8361k600687l217615
$$ 7572897 6629221 8441499 11369427 13903711 16479256 18759219 18777580 16176893 12959278
3482A2959278l416033n695336p318238l549003L305690N181145p669m826949l374538
$$ 12959278 9543245 3847909 -3470329 -7019332 -3713642 1467503 1459834 -3367115 -6741653
3473f741653O31116J107057p08951M06444M426997O273189L462336j454234n057965
$$ -6741653 -6110537 -5003480 -5712431 -5305987 -878990 5394199 8856535 7402301 2344336
3464B344336n720805l266317N29102K360270J342725P07012K500682L268636p61507
$$ 2344336 -3376469 -6642786 -6113684 -3753414 -2410689 -1703677 797005 4065641 3304134
3455C304134o517498p267047j842802M248839O475786N513218L982026L125667
$$ 3304134 -3213364 -10480411 -12323213 -8074374 -1598588 3914630 7896656 11022323
3447A1022323K947238K384110l20261m647662o751101m697447k292539l077667
$$ 11022323 13969561 16353671 16033410 11385748 4634647 -62800 -2355339 -5433006
3439e433006l384023K085139R748206J0382444K887554l523393k548997J720733
$$ -5433006 -8817029 -6731890 3016316 13398760 16286314 12762921 10213924 11934657
3431A1934657L267951K399470J582619P0613k319248k108210J667363L457610
$$ 11934657 15202608 17602078 19184697 19255310 16936062 14827852 16495215 19952825
3423A9952825p67735o195817o182202k317629l86190Q6550L731564Q599568O953206
$$ 19952825 19185090 12989273 6807071 4489442 4103252 4189802 7921366 16520934 23474140
3414B3474140j958566q281911m367406M827948Q639108M087510k200637l425343
$$ 23474140 21515574 13233663 8866257 13694205 22333313 26420823 24220186 20794843
3406B0794843K25853L581394K706388j586915n065453m318725j25941L285693
$$ 20794843 21020696 24602090 27308478 25721563 20656110 16337385 16211444 19497137
3398A9497137K572660j166795l446714j340282K641372K590809l745650j0749266
$$ 19497137 22069797 20903002 17456288 16116006 18757378 21348187 17602537 6853271
3390F853271j0146826r69983Q212495Q715326J434752n206315n563777j837767
$$ 6853271 -3293555 -4263538 3948957 12664283 14099035 8892720 3328943 1491176
3382A491176R93623J746499K578664M150552M442092K496729M99507L97248M68030
$$ 1491176 2484799 4231298 6809962 10960514 15402606 17899335 18398842 18796090 19264120
3373A9264120j839658m721449l699446J101719L965407J844019j206783j339950
$$ 19264120 17424462 12703013 9003567 10105286 14070693 15914712 14707929 13367979
3365A3367979j544977n206370p596055k227565O654926P899920J31238n684696
$$ 13367979 11823002 6616632 -979423 -3206988 3447938 11347858 11479096 5794400
3357E794400l181860J53046l633218r377645p011120K798184J0362769J0875090
$$ 5794400 2612540 2765586 -867632 -10245277 -17256397 -14458213 -4095444 6779646
3349F779646Q044998N716458L786236K005619R88652q07875n353064j0014705
$$ 6779646 14824644 20541102 24327338 26332957 27321609 26513734 21160670 11145965
3341A1145965r437305k905454M538719Q388162P991408M112340k037129p076907
$$ 11145965 1708660 -1196794 3341925 11730087 19721495 23833835 21796706 14719799
3333A4719799p208597k591717K992152O522906O840235K993132l981156q659468
$$ 14719799 7511202 4919485 7911637 14434543 21274778 24267910 20286754 11627286
3325A1627286n846931K258246Q041045P635502L656378q96518n963057j0688133
$$ 11627286 5780355 8038601 16079646 23715148 27371526 26475008 20511951 9823818
3317I823818j1595796o887920O09880O351622P729355M829328K77897k070964
$$ 9823818 -1771978 -8659898 -8050018 -1698396 6030959 10860287 11138184 9067220
3309I067220j085791J01807o63044m43473L225835N925722K164206m740063o566759
$$ 9067220 7981429 8083236 7420192 6976719 10202554 16128276 18292482 13552419 6985660
3300F985660k799697n63953k142754k161646J527429M192573M155342O188502
$$ 6985660 4185963 3622010 1479256 -682390 845039 5037612 9192954 15381456
3292A5381456J0743210R910310K76838r343023j0397154o719936n999972o544026
$$ 15381456 26124666 36034976 36311814 26968791 16571637 9851701 3851729 -2692297
3284b692297k224607M889053P087622L053851j646542l670393l530941q57271
$$ -2692297 -4916904 -27851 7059771 10113622 8467080 4796687 1265746 408475
3276D08475L959580O044853K179064j904826J056238P653040Q467988K927741
$$ 408475 4368055 10412908 12591972 10687146 11743384 19396424 27864412 30792153
3268C0792153r83176q82259k336845o194057n560362J233928N779467K785868
$$ 30792153 29808977 28926718 26589873 20395816 14835454 16069382 21848849 24634717
3260B4634717j653151j019677J295166k07453k741957j034075K365697J346988
$$ 24634717 22981566 21961889 23257055 23049602 20307645 19273570 21639267 22986255
3252B2986255l214654n557544m668965l633969j780249L665433R054706O860060
$$ 22986255 19771601 14214057 9545092 5911123 4130874 7796307 16851013 23711073
3244B3711073j849369o233420o26269O631624M759689m269302q883777l917411
$$ 23711073 21861704 15628284 15002015 21633639 26393328 22124026 13240249 9322838
3236I322838L505009M785751P36717j620738L73503K381959N47352k825136l142315
$$ 9322838 12827847 17613598 18350315 16729577 17103080 19485039 20032391 17207255 14064940
3227A4064940k50182J962240J525421M20985M09501J78024j825072m198929m355023
$$ 14064940 13814758 15776998 17302419 17723404 18132905 18310929 16485857 12286928 7931905
3218G931905k012155R74111L146014L901460K365369j799099o385395p585602
$$ 7931905 5919750 6893861 10039875 13941335 16306704 14507605 8122210 536608
3210E36608m014469J238474L703266K355687K76696K74752J204620K13586k058245
$$ 536608 -3477861 -2239387 1463879 3819566 4096262 4371014 5575634 5789220 3730975
3201C730975j399116L740557Q759544Q345415L464961n52376j692494k709098
$$ 3730975 2331859 6072416 14831960 23177375 26642336 26089960 24397466 21688368
3193B1688368m956372n587548k642813J080911J922123K33915j282741j690169
$$ 21688368 16731996 11144448 8501635 9582546 11504669 11738584 10455843 8765674
3185H765674j484320k40841K343483M447855M063009K005457M84206m24075k324375
$$ 8765674 7281354 7040513 9383996 13831851 17894860 19900317 20384523 19960448 17636073
3176A7636073n173549o833877n732775k215387K194752N357080N347854K448367
$$ 17636073 12462524 5628647 -104128 -2319515 -124763 5232317 10580171 13028538
3168A3028538p40970k588614m095341n702815n254494j963515O61575Q0049R7819
$$ 13028538 12287568 9698954 5603613 -99202 -5353696 -7317211 -6655636 -6575587 -6477768
3159f477768N231906J1526069J0164662M69313q005361q273976l991832j689417
$$ -6477768 -1245862 10280207 20444869 20914182 12908821 4634845 643013 -1046404
3151a046404j530524m12309J284973J720893K259383M366620N160377J878975
$$ -1046404 -2576928 -2989237 -1704264 16629 2276012 6642632 11803009 13681984
3143A3681984k095138j893360N72774j84514l461766l329850J102542M182730
$$ 13681984 11586846 9693486 10266260 10081746 6619980 3290130 4392672 8575402
3135H575402L270199K071830K537819J187531l093882m838411m03612N398460
$$ 8575402 11845601 13917431 16455250 17642781 14548899 9710488 9306876 14705336
3127A4705336O490629M282041L446556L445661Q49524l263312n218342n820056
$$ 14705336 21195965 25478006 28924562 32370223 33219747 29956435 24738093 18918037
3119A8918037q412247j1075083q062858O11664P642434P952475M356020K028136
$$ 18918037 10505790 -569293 -8632151 -8020487 -378053 7574422 11930442 13958578
3111A3958578K001527K143237Q70692j951557n106940o150995l962425j016855
$$ 13958578 15960105 18103342 18974034 17022477 11915537 5764542 1802117 785262
3103G85262j65535j85824J439671K808237L61439l533305k860942J827564L439850
$$ 785262 619727 433903 1873574 4681811 5043250 1509945 -1350997 476567 3916417
3094C916417L02755o78932L491400N436831j38393n795283k239747O167678P551961
$$ 3916417 4219172 3540240 7031640 12468471 12330078 6534795 4295048 10462726 18014687
3085A8014687J027307k423164K278338O648322K379789n967359p984458j868751
$$ 18014687 19041994 16618830 18897168 25545490 27925279 21957920 13973462 12104711
3077A2104711M569909N324992K951716L125402O210014P113454K840611k913403
$$ 12104711 16674620 21999612 24951328 28076730 34286744 41400198 44240809 41327406
3069D1327406m713153k762442j538905k126255j344715Q91840K6404m473345n833795
$$ 41327406 36614253 33851811 32312906 30186651 28841936 29733776 29760180 25286835 19453040
3060A9453040n04040M467153J731297m158935l894711J117625J127223n369124
$$ 19453040 18949000 23416153 25147450 20988515 17093804 18211429 19338652 13969528
3052A3969528q540283k415080O689009J0318691Q264914M766492J303023k230391
$$ 13969528 5429245 3014165 9703174 20021865 28286779 33053271 34356294 32125903
3044C2125903m390543m327912l265999j555400J518021L808622J741136l072649
$$ 32125903 27735360 23407448 20141449 18586049 20104070 23912692 25653828 22581179
3036B2581179n084199m066821n434734r217545p959838K03577O009801L012799
$$ 22581179 17496980 13430159 7995425 -1222120 -9181958 -8978381 -2968580 44219
3028D4219j915379j15998M943361M900693P33557j073422j061561l688015n789803
$$ 44219 -1871160 -1987158 2956203 7856896 8590453 7517031 6455470 2767455 -3022348
3019c022348j001457O437555N688232k799004o657409q79471N236022M350147
$$ -3022348 -4023805 2413750 8101982 5302978 -1354431 -2233902 3002120 7352267
3011G352267J741525L410512M912376P45158m182552k562780K227692J558092
$$ 7352267 9093792 12504304 17416680 18161838 13979286 11416506 13644198 15202290
3003A5202290l880429n336233l04640M074561K577151j265593j993186L14028
$$ 15202290 11321861 5985628 5680988 9755549 12332700 11067107 9073921 9387949
2995I387949K059233J337776j146203l385891l014804L26750L032904J148567
$$ 9387949 11447182 12784958 11638755 8252864 5238060 5564810 8597714 9746281
2987I746281l518363m672258j47929M667137M263166L28180j572441N5901K022132
$$ 9746281 6227918 1555660 1407731 6074868 10338034 10666214 9093773 9149674 11171806
2978A1171806K407615K798697M278344M941175K963913l64513k508446k928146
$$ 11171806 13579421 16378118 20656462 25597637 28561550 28197037 25688591 22760445
2970B2760445k725405k315372j311270K6168R74726J518952J780586Q85555j705327
$$ 22760445 20035040 17719668 16408398 16434566 17409292 18928244 20708830 21594385 19889058
2961A9889058m138091l723414p14063J716597J691648M54097p19093k590405n241367
$$ 19889058 15750967 12027553 11313490 13030087 14721735 15175832 14456739 11866334 6624967
2952F624967n897794k273417L392712O508948N653518L334402J661963Q0174k187046
$$ 6624967 727173 -1546244 1846468 8355416 14008934 17343336 19005299 19085473 16898427
2943A6898427l986410l839583k179016o40704P9751M82669P14726K7025j634677
$$ 16898427 12912017 9072434 6893418 6252714 6332465 6815134 7529860 7556885 5922208
2934E922208k309158K05606M873961P328803M729733m08432l177048k180543j46069
$$ 5922208 3613050 3818656 8692617 16021420 20751153 20342721 17165673 14985130 14839061
2925A4839061N47856o5239j451799k958238k418576J452094N140653L863903l77976
$$ 14839061 15386917 15321678 13869879 10911641 8493065 9945159 15085812 18949715 18571739
2916A8571739o24515L432905L576733k985509o495505O24915R355270N702525
$$ 18571739 17947224 21380129 24956862 21971353 15475848 16100763 25456033 31158558
2908C1158558p488098j3399840n527831L974618L387601l016820m728950p91640
$$ 31158558 23670460 10270620 4742789 8717407 12105008 9088188 4359238 3567598
2900C567598K450159L037431L994068N429701L993699n23356l961378l351510
$$ 3567598 6017757 9055188 13049256 18478957 22472656 21949300 17987922 14636412
2892A4636412J60541L690415N034599L528786R57999M55230K438286L483323J402907
$$ 14636412 14796953 18487368 23521967 27050753 28008752 28463982 30902268 34385591 35788498
2883C5788498j102647q39434M59971q53960l750624l634453L47761L517155K031907
$$ 35788498 34685851 33846417 34306388 33452428 29701804 26067351 26415112 29932267 31964174
2874C1964174k274782m748497l370864r7517J808488O79731k508234n052652m568110
$$ 31964174 29689392 24940895 21570031 21472514 23281002 23960733 21452499 16399847 11831737
2865A1831737o88944M579352P929027P069272K952986j062401l233189n139478
$$ 11831737 11142793 15722145 23651172 30720444 33673430 32611029 29377840 24238362
2857B4238362p834886q701706n381539o06087J453794J723796L168184K904529
$$ 24238362 16403476 7701770 2320231 1714144 3167938 4891734 8059918 10964447
2849A0964447m129415j3164191j1589173K713118J4626462J0743371k560127q926463
$$ 10964447 6835032 -6329159 -17918332 -15205214 -578752 10164619 7604492 -1321971
2841a321971m037848K548517M011343L296193L789064L488298R68781q87806k74426
$$ -1321971 -5359819 -2811302 1200041 4496234 8285298 11773596 12742377 11854571 11580145
2832A1580145L99062o80557j767330j300120O0805K357633O178807Q435421M206728
$$ 11580145 11979207 11298650 9531320 8231200 8292005 10649638 16828445 25263866 29470594
2823B9470594n058756j1039409r253963m820111l818969m201374n23879O035814
$$ 29470594 24411838 13372429 4118466 -701645 -4520614 -8721988 -9245867 -3210053
2815c210053Q560713M171042k085266l620593M57448N174804N156102j40832o167286
$$ -3210053 5350660 9521702 7436436 3815843 4273291 9448095 14604197 14463365 8296079
2806H296079q269885o211132k659585J120562M985267O582783L160844k815536
$$ 8296079 26194 -6184938 -8844523 -7723961 -2738694 3844089 7004933 4189397
2798D189397m926741j465247J908768O68568k149947j577494J483310K714693
$$ 4189397 -737344 -2202591 -293823 374745 -1775202 -3352696 -1869386 845307
2790H45307J543509Q29917J373784J658929J918598L613166N186771L008636k763002
$$ 845307 2388816 3218733 4592517 6251446 8170044 11783210 16969981 19978617 17215615
2781A7215615p166610o548176k660981O62337K256652L195908L598559K436672
$$ 17215615 10049005 3500829 839848 1502185 3758837 6954745 10553304 12989976
2773A2989976K69915j6712L422334Q008097Q688713M022659j641980l925072m268325
$$ 12989976 13259891 13243179 16665513 24673610 33362323 37384982 35743002 31817930 27549605
2764B7549605o487102q984914o088891J980151O781224K953943l340547k765546
$$ 27549605 21062503 12077589 5988698 7968849 14750073 17704016 14363469 11597923
2756A1597923L884409P256687K901998l529293n221768k469133J39547K62439
$$ 11597923 15482332 22739019 25641017 22111724 16889956 14420823 14560370 14822809
2748A4822809j450034m094382o799821p827540o061110k906011j002553j242415
$$ 14822809 13372775 9278393 2478572 -5348968 -11410078 -14316089 -15318642 -16561057
2740a6561057j987794r61769K525070O652956Q131578N132360j63212k782838
$$ -16561057 -18548851 -19510620 -16985550 -10332594 -2201016 2931344 2768132 -14706
2732a4706J94764O140202R114566O036454L5556l255582k447647j549760l560428
$$ -14706 180058 6320260 15434826 21471280 21506836 18251254 15803607 14253847 10693419
2723A0693419n542638l192219J436044J732788l516044p305040m019592K746164
$$ 10693419 5150781 1958562 3394606 5127394 1611350 -5693690 -9713282 -6967118
2715f967118N733397L607467L90712j726058l527018m413183k657472L16275J176352
$$ -6967118 -1233721 2373746 2764458 1038400 -2488618 -6901801 -9559273 -9242998 -8066646
2706h066646N02779K422188P635827J1448995R999516M385638k399001q327345
$$ -8066646 -7563867 -5141679 2494148 13943143 23942659 28328297 25929296 17601951
2698A7601951j0983096q154103j930893K057375J811238J233307K979222L944610
$$ 17601951 6618855 -1535248 -3466141 -1408766 402472 1635779 4615001 8559611
2690H559611J401607j190027M44512L855467L467188n96237l142516k113372m21361
$$ 8559611 9961218 8771191 9215703 13071170 16538358 15942121 12799605 10686233 10264872
2681A0264872l9676N4983l39533l165635o721698n109597L616278J2445698J2588139
$$ 10264872 10225196 10280179 9940646 6775011 53313 -5056284 -1440006 11005692 23593831
2672B3593831M095293m020299m065143K215859O374958L025431m236228p302245
$$ 23593831 27689124 23668825 19603682 21819541 28194499 31219930 26983702 19681457
2664A9681457l286839K424648L599656O01030k167602l271593m159917l921515
$$ 19681457 16394618 18819266 22418922 23019952 20852350 17580757 13420840 9499325
2656I499325p1005N322068O360376J864245k305635j873395K44931O7214j223749
$$ 9499325 9428320 14750388 21110764 22975009 20669374 18795979 19040910 19108124 17884375
2647A7884375j513815k859928o435105p002097r7438Q180658P335879k147189
$$ 17884375 16370560 13510632 7075527 73430 -24008 8156650 15492529 13345340
2639A3345340q277205l799303N080773R039772P277219M431408K115422p15372
$$ 13345340 5068135 1268832 6349605 15389377 22666596 27098004 29213426 28498054
2631B8498054l108149l540236l432893m464935m709870k011600J063299O08107
$$ 28498054 25389905 21849669 18416776 13951841 9241971 7230371 8293670 8901777
2623H901777j951117j690526K166837N313418M721241J486328k345303n258258
$$ 8901777 6950660 5260134 7426971 12740389 17461630 18947958 16602655 11344397
2615A1344397m837564J15005N597635N650247O73891k549138p23149J514510k01278
$$ 11344397 6506833 6621838 12219473 17869720 18543611 15994473 15271324 16785834 16584556
2606A6584556k721306j003621L008010K958943k204993o704049o175311k805316
$$ 16584556 13863250 12859629 15867639 18826582 16621589 9917540 3742229 936913
2598I36913r61225j202183q18191J496622L780449L560307J234118k00914J056398
$$ 936913 -24312 -1226495 -2044686 -548064 3232385 6792692 8026810 7825896 8882294
2589H882294L052776K633243J11606o91158K414767O869441Q532161O260750J969313
$$ 8882294 11935070 14568313 14679919 13988761 16403528 23272969 31805130 38065880 40035193
2580D0035193k340634n875533q286425r137108p885018m098688J191105M436123
$$ 40035193 37694559 31819026 23532601 14395493 6510475 2411787 3602892 8039015
2572H039015K405221k858263m687341L73392P510946R081469L623073l215940
$$ 8039015 10444236 7585973 2898632 3272024 10782970 19864439 23487512 20271572
2564B0271572n570777k431815L260520P530860P472884L138088k154683n099527
$$ 20271572 14700795 12268980 15529500 23060360 30533244 33671332 31516649 26417122
2556B6417122n955727p111758q465083o706742l8025Q112641J1587626P716972
$$ 26417122 20461395 13349637 4884554 -1822188 -1860213 6252428 17840054 25557026
2548B5557026M63287l459400k084541l46627k685951n348282j091012Q175646
$$ 25557026 26020313 22560913 20476372 20129745 17443794 12095512 11004500 19180146
2540A9180146J0428449n15732j3923879j4265294j427199R258698O798428l475582
$$ 19180146 29608595 29092863 15168984 903690 -523509 8735189 15533617 12058035
2532A2058035r369696o266967J379121P510224Q769770M637658k158287o581092
$$ 12058035 2688339 -3578628 -2199507 5310717 14080487 18718145 16559858 9978766
2524I978766n732225j822884P62086O5624k786435n376731m968492o9517O792841
$$ 9978766 4246541 2423657 3185743 3251367 464932 -4911799 -9880291 -9949808 -3156967
2515c156967R773532N730599j553755n411763l810734p40252l88256k015792j510122
$$ -3156967 6616565 12347164 10793409 5381646 1570912 830660 442404 -1573388 -3083510
2506c083510K846856P583388P976932M143915R59358J302667K406292J061761
$$ -3083510 -236654 7346734 15323666 19467581 20426939 21729606 24135898 25197659
2498B5197659r06190l67943P99025j176502m291122l161494J234345K083299j603170
$$ 25197659 24291469 23923526 24722551 23546049 19254927 16093433 17327778 19411077 17807907
2489A7807907k393834K846332O133936N65215p794982q585949k747596P2646k845596
$$ 17807907 15414073 18260405 24394341 24959556 17164574 8578625 5831029 5903675 3058079
2480C058079m304428j93549L830864J881326k848483k918568K955007Q308494
$$ 3058079 -1246349 -1439898 2390966 4272292 1423809 -1494759 1460248 9768742
2472I768742O427782k423869j0614394j0198589j699616N700654N191606R81612
$$ 9768742 16196524 13772655 3158261 -7040328 -8739944 -3039290 2152316 3133928
2464C133928J421875N941607N906435j643258q992614q958920m113429p73195
$$ 3133928 4555803 10497410 16403845 14760587 5767973 -3190947 -7304376 -8077571
2456h077571L56633K378026N383491O898570O232870L685214j652866q466900
$$ -8077571 -7720938 -5342912 40579 6939149 13172019 16857233 15204367 6737467
2448F737467j0850650n476308J339963R19454m666815m954089K729393Q230474
$$ 6737467 -4113183 -9589491 -8249528 -7330074 -11996889 -16950978 -14221585 -5991111
2440e991111L416930n636104p426665n90428O479066Q316359P107315N871033
$$ -5991111 -2574181 -8210285 -15636950 -16227378 -9748312 -1431953 5675362 11546395
2432A1546395M252895J938921J96675j360489m198447n915957k041861N076307
$$ 11546395 15799290 17738211 17934886 16574397 12375950 6459993 4418132 9494439
2424I494439O172035j770683q841934n339578L683621N563678j445848o683635
$$ 9494439 15666474 13895791 5053857 -285721 3397900 8961578 7515730 832095
2416H32095l782496J285068J630871j6739K492059Q329596J1484720R115702L108402
$$ 832095 -2950401 -1665333 -34462 -51201 2440858 10770454 22255174 31370876 34479278
2407C4479278l677759q366682q109981l438391P55577J190433M36571J680984
$$ 34479278 30801519 22434837 14324856 10886465 11642042 12832475 13269046 14950030
2399A4950030K844274O81148k556120k487090m09874j256886m695748m895408
$$ 14950030 17794304 18475452 15919332 13432242 13022368 11765482 7069734 2174326
2391B174326J70530N012905M067867j345928n375715m152101J121238N590964
$$ 2174326 2344856 7357761 11425628 10079700 4703985 551884 1673122 7264086
2383G264086N257004J724061R85238N177825Q367926M588348k881348o063172
$$ 7264086 12521090 14245151 15230389 20408214 28776140 33364488 30483140 24419968
2375B4419968l940749k483031l877489l671895L20257L925180L899602K618290
$$ 24419968 20479219 17996188 14118699 10446804 10767061 14692241 18591843 21210133
2367B1210133K454570J556282j346669l479061l078483k810039m262107m027647
$$ 21210133 23664703 25220985 23874316 20395255 17316772 14506733 10244626 6216979
2359F216979K03907M120221K628174j964802k899358J663302O613631O389686
$$ 6216979 6420886 10541107 13169281 11204479 8305121 9968423 16582054 22971740
$$ [...]
##END NTUPLES=NMR SPECTRUM
##END=
