##TITLE=31P_DE-80H_X3
 64 sc D2O
 26.2.2025
##JCAMPDX= 6.0         $$ Bruker NMR JCAMP-DX V2.0
##DATA TYPE= NMR SPECTRUM
##DATA CLASS= NTUPLES
##ORIGIN= UXNMR, Bruker Analytische Messtechnik GmbH
##OWNER= root
$$ XWIN-NMR		Version 3.5
$$ Fri Jul  4 10:29:42 2025 Russian Standard Time (UT+4h)  Yarkov@DPX200
##.OBSERVE FREQUENCY= 81.013821
##.OBSERVE NUCLEUS= ^31P
##.ACQUISITION MODE= SIMULTANEOUS
##.ACQUISITION SCHEME= undefined
##.AVERAGES= 64
##.DIGITISER RES= 17
##SPECTROMETER/DATA SYSTEM= spect
##.PULSE SEQUENCE= zgpg30
##.SOLVENT NAME= DMSO
##.SHIFT REFERENCE= (INTERNAL, DMSO, 0, 198.062)
##AUDIT TRAIL= $$ (NUMBER, WHEN, WHO, WHERE, WHAT)
$$ ##TITLE= Audit trail, XWIN-NMR		Version 3.5
$$ ##JCAMPDX= 5.01
$$ ##ORIGIN= Bruker BioSpin GmbH
$$ ##OWNER= Yarkov
$$ C:/Bruker/XWIN-NMR/data/yarkov2/nmr/P31/2/pdata/1/auditp.txt
$$ ##AUDIT TRAIL=  $$ (NUMBER, WHEN, WHO, WHERE, WHAT)
(   1,<2025-07-04 10:27:47.07 +0400>,<Yarkov>,<DPX200>,
      <created by zg, POWCHK disabled, PULCHK disabled
       configuration hash MD5:
       00 E9 B6 7A A2 85 ED C7 34 08 36 98 17 FE 4E 26
       data hash MD5: 32K
       51 1B E6 6E 32 B4 90 71 61 EC 68 3A BB 3B 8A B9>)
(   2,<2025-07-04 10:29:02.79 +0400>,<Yarkov>,<DPX200>,
      <Start of raw data processing
       efp BC_mod = 2 LB = 1.5 FT_mod = 6 PKNL = 1 PHC0 = 1676.443 PHC1 = 49.15953 SI = 64K 
       data hash MD5: 64K
       5C 5C 67 36 29 12 6B 55 6D 5D 74 4A 16 80 8B A8>)
$$ ##END=
$$ 
$$ hash MD5
$$ 49 1A C7 74 14 1E 8A E6 F8 0B 15 41 32 D8 CD 37
##$RELAX= 
##$RELAX= 
##$RELAX= 
##$RELAX= 
##$RELAX= 
##$RELAX= 
##$RELAX= 
##$RELAX= 
$$ Bruker specific parameters
$$ --------------------------
##$DU= <C:/Bruker/XWIN-NMR>
##$EXPNO= 2
##$NAME= <P31>
##$PROCNO= 1
##$TYPE= <nmr>
##$USER= <yarkov2>
##$AMP= (0..31)
100 100 100 100 100 100 100 100 100 100 100 100 100 100 100 100 100 100 
100 100 100 100 100 100 100 100 100 100 100 100 100 100 
##$AQSEQ= 0
##$AQ_mod= 1
##$AUNM= <au_zg>
##$AUTOPOS= <>
##$BF1= 81.014009
##$BF2= 200.13
##$BF3= 200.13
##$BF4= 200.13
##$BF5= 200.13
##$BF6= 200.13
##$BF7= 200.13
##$BF8= 200.13
##$BYTORDA= 1
##$CFDGTYP= 0
##$CFRGTYP= 5
##$CHEMSTR= <none>
##$CNST= (0..31)
1 1 145 1 1 1 1 1 1 1 1 1 1 1 1 1 1 1 1 1 1 1 1 1 1 1 1 1 1 1 1 1 
##$CPDPRG= <waltz16>
##$CPDPRG1= <>
##$CPDPRG2= <waltz16>
##$CPDPRG3= <>
##$CPDPRG4= <mlev>
##$CPDPRG5= <mlev>
##$CPDPRG6= <mlev>
##$CPDPRG7= <mlev>
##$CPDPRG8= <mlev>
##$CPDPRGB= <>
##$CPDPRGT= <>
##$D= (0..31)
0 1 0 0 0 0 0 0 0 0.06 0 0.03 2e-05 3e-06 0 0 0.0002 0 0 0 0 0 0 0 0 0 
0 0 0 0 0 0 
##$DATE= 1751610466
##$DBL= (0..7)
120 120 120 11 120 120 24 19 
##$DBP= (0..7)
150 150 150 150 150 150 150 150 
##$DBP07= 0
##$DBPNAM0= <>
##$DBPNAM1= <>
##$DBPNAM2= <>
##$DBPNAM3= <>
##$DBPNAM4= <>
##$DBPNAM5= <>
##$DBPNAM6= <>
##$DBPNAM7= <>
##$DBPOAL= (0..7)
0.5 0.5 0.5 0.5 0.5 0.5 0.5 0.5 
##$DBPOFFS= (0..7)
0 0 0 0 0 0 0 0 
##$DE= 6
##$DECBNUC= <off>
##$DECIM= 4
##$DECNUC= <off>
##$DECSTAT= 4
##$DIGMOD= 1
##$DIGTYP= 9
##$DL= (0..7)
0 0 52 120 120 21 21 25 
$$ [...]
##$SUBNAM2= <"">
##$SUBNAM3= <"">
##$SUBNAM4= <"">
##$SUBNAM5= <"">
##$SUBNAM6= <"">
##$SUBNAM7= <"">
##$SUBNAM8= <"">
##$SUBNAM9= <"">
##$SW= 400.765351723535
##$SWIBOX= (0..15)
0 1 3 0 0 0 0 0 0 0 0 0 0 0 0 0 
##$SW_h= 32467.5324675325
##$TD= 32768
##$TD0= 1
##$TE= 0
##$TE2= 300
##$TE3= 300
##$TEG= 300
##$TL= (0..7)
0 120 53 12 22 120 120 120 
##$TP= (0..7)
150 150 150 150 150 150 150 150 
##$TP07= 0
##$TPNAME0= <>
##$TPNAME1= <>
##$TPNAME2= <>
##$TPNAME3= <>
##$TPNAME4= <>
##$TPNAME5= <>
##$TPNAME6= <>
##$TPNAME7= <>
##$TPOAL= (0..7)
0.5 0.5 0.5 0.5 0.5 0.5 0.5 0.5 
##$TPOFFS= (0..7)
0 0 0 0 0 0 0 0 
##$TUNHIN= 0
##$TUNHOUT= 0
##$TUNXOUT= 0
##$USERA1= <user>
##$USERA2= <user>
##$USERA3= <user>
##$USERA4= <user>
##$USERA5= <user>
##$V9= 5
##$VALIST= <valist>
##$VCLIST= <CCCCCCCCCCCCCCC>
##$VD= 0
##$VDLIST= <DDDDDDDDDDDDDDD>
##$VPLIST= <PPPPPPPPPPPPPPP>
##$VTLIST= <TTTTTTTTTTTTTTT>
##$WBST= 1024
##$WBSW= 4
##$XGAIN= (0..3)
0 0 0 0 
##$XL= 0
##$YL= 0
##$YMAX_a= 655
##$YMIN_a= -587
##$ZGOPTNS= <>
##$ZL1= 120
##$ZL2= 120
##$ZL3= 120
##$ZL4= 120
##$ABSF1= 0
##$ABSF2= 0
##$ABSG= 0
##$ABSL= 0
##$ALPHA= 0
##$AQORDER= 0
##$ASSFAC= 0
##$ASSFACI= 0
##$ASSFACX= 0
##$ASSWID= 0
##$AUNMP= <proc_1d>
##$AZFE= 0.1
##$AZFW= 0.5
##$BCFW= 0
##$BC_mod= 2
##$BYTORDP= 0
##$COROFFS= 0
##$CY= -3
##$DATMOD= 1
##$DC= 0
##$DFILT= <>
##$DTYPP= 0
##$F1P= 0
##$F2P= 0
##$FCOR= 1
##$FTSIZE= 65536
##$FT_mod= 6
##$GAMMA= 0
##$GB= 0
##$INTBC= 1
##$INTSCL= 9.790993e-09
##$ISEN= 30
##$LB= 1.5
##$LEV0= 0
##$LPBIN= 0
##$MAXI= 10000
##$MC2= 0
##$MEAN= 0
##$ME_mod= 0
##$MI= 50
##$NCOEF= 0
##$NC_proc= -10
##$NLEV= 6
##$NOISF1= 182.463
##$NOISF2= 159.3651
##$NSP= 0
##$NTH_PI= 0
##$NZP= 0
##$OFFSET= 198.0616
##$PC= 4
##$PHC0= 1676.443
##$PHC1= 49.15953
##$PH_mod= 1
##$PKNL= yes
##$PPARMOD= 0
##$PSCAL= 0
##$PSIGN= 0
##$REVERSE= no
##$SF= 81.0140089999434
##$SI= 65536
##$SIGF1= 159.3651
##$SIGF2= -187.1042
##$SINO= 113.3802
##$SIOLD= 16384
##$SREGLST= <1H.CDCl3>
##$SSB= 0
##$STSI= 65536
##$STSR= 0
##$SW_p= 32467.5324675325
##$SYMM= 0
##$S_DEV= 0
##$TDeff= 32768
##$TDoff= 0
##$TI= <>
##$TILT= no
##$TM1= 0
##$TM2= 0
##$TOPLEV= 0
##$USERP1= <user>
##$USERP2= <user>
##$USERP3= <user>
##$USERP4= <user>
##$USERP5= <user>
##$WDW= 1
##$XDIM= 65536
##$YMAX_p= 376440779
##$YMIN_p= -7031232
$$ End of Bruker specific parameters
$$ ---------------------------------
##NTUPLES= NMR SPECTRUM
##VAR_NAME=  FREQUENCY,     SPECTRUM/REAL,   SPECTRUM/IMAG
##SYMBOL=    X,             R,               I
##VAR_TYPE=  INDEPENDENT,   DEPENDENT,       DEPENDENT
##VAR_FORM=  AFFN,          ASDF,            ASDF
##VAR_DIM=   65536,         65536,           65536
##UNITS=     HZ,            ARBITRARY UNITS, ARBITRARY UNITS
##FACTOR=    0.49542278885378, 1,            1
##FIRST=     16045.7642231865, 0,            0
##LAST=      -16421.768244346, 0,            0
##MIN=       -16421.768244346, -7031232,     0
##MAX=       16045.7642231865, 376440779,    0
$$ Real data points
##PAGE= N=1
##DATA TABLE= (X++(R..R)), XYDATA
$$ [...]
42501 -109242 132431 329078 395697 415631 408147 332986 252012 211192 69976 -248854 -486844
42490 -486844 -399062 -229249 -391747 -793360 -984229 -923946 -1013718 -1322616 -1401341 -1050408
42480 -1050408 -694581 -693347 -774093 -528842 -89387 100383 -85271 -429162 -768975 -1058870
42470 -1058870 -1176312 -1006990 -666310 -387804 -239944 -140752 -81946 -158779 -416513 -782782
42460 -782782 -1104738 -1215262 -1088383 -957928 -1087899 -1372847 -1413891 -1090850 -776206 -810472
42450 -810472 -1040730 -1109235 -949861 -717915 -435209 -33014 371864 551143 458958 218986
42440 218986 -97199 -451701 -704743 -752326 -715164 -738757 -703426 -429636 -95733 -94402 -453826
42429 -453826 -739101 -618384 -243101 42492 108816 24073 -126766 -221648 -82683 319946
42419 319946 757870 1008094 1126955 1294710 1488702 1527597 1397463 1288029 1251882 1052500
42409 1052500 506717 -154636 -461364 -208229 368114 896939 1178458 1158327 830272 330187
42399 330187 -22319 -1914 246659 396995 363089 314414 282127 35656 -528094 -1106142
42389 -1106142 -1305972 -1117593 -874940 -815584 -872100 -893239 -890344 -978225 -1155419 -1252601 -1132130
42378 -1132130 -889761 -763042 -811502 -814283 -608503 -411392 -570087 -1013946 -1235252 -912222
42368 -912222 -321106 21052 -54487 -299907 -424483 -355550 -223501 -245238 -545784 -970544
42358 -970544 -1174131 -1020739 -767400 -691063 -679144 -422384 79107 471803 497933 248001
42348 248001 -55396 -291402 -389815 -263352 61710 360647 389228 114610 -280955 -560373
42338 -560373 -552778 -221167 265214 558089 378558 -177793 -648119 -626120 -186300 207000
42328 207000 226174 -20877 -276345 -513389 -824168 -1075716 -999497 -615940 -258563 -106964
42318 -106964 23389 329967 737912 1081486 1279950 1190489 626442 -236882 -803558 -740708
42308 -740708 -451666 -481297 -692535 -524280 73188 528319 503683 319869 341992 395487
42298 395487 100106 -500514 -969528 -1015133 -760959 -535792 -554164 -776451 -987963 -1027325
42288 -1027325 -948614 -902968 -893346 -776075 -502111 -204367 -11183 93871 182482 257830
42278 257830 251739 73920 -303869 -713370 -819313 -462011 77086 355335 283960 141666
42268 141666 108197 81032 3378 56747 368311 770329 1043249 1213997 1405135 1520359
42258 1520359 1312767 737813 69727 -346936 -363393 -49687 436893 931199 1236576 1147064
42248 1147064 632040 -17738 -409020 -474368 -503792 -675806 -815116 -775520 -741138 -839706
42238 -839706 -774037 -305704 138765 -43204 -632127 -765442 -193076 333927 160481 -433187
42228 -433187 -838248 -961708 -987057 -812600 -342955 8944 -232817 -831141 -1100429 -866823
42218 -866823 -616558 -698467 -894532 -862775 -576495 -202065 126759 310537 335751 387253
42208 387253 649402 963673 969046 636349 379138 545756 1047714 1575506 1941239 2096101
42198 2096101 2015595 1708877 1238706 685039 190317 -5278 222242 638384 848388 762556
42188 762556 642481 659552 661404 448000 37156 -437045 -850760 -1003191 -665182 80821
42178 80821 735542 853739 535954 271554 364912 692975 985335 1146151 1244982 1318344
42168 1318344 1297155 1124589 858562 587587 291802 -78978 -380102 -322240 131631 600991
42158 600991 721841 607931 637745 903807 1179205 1347911 1483981 1492699 1103865 379769
42148 379769 -141141 -55278 410493 730419 650580 203653 -538002 -1356943 -1758843 -1411155
42138 -1411155 -671080 -258629 -359834 -436832 -41196 550554 737293 354140 -250210 -720898
42128 -720898 -963896 -973705 -726786 -332595 -64077 -105689 -394282 -782317 -1195949 -1519318
42118 -1519318 -1516397 -1102772 -589796 -376655 -411845 -246929 317315 932902 1194141 1150690
42108 1150690 1102853 1107961 1001556 790353 688916 769924 858899 819708 713374 614113 468860
42097 468860 221529 -69391 -300329 -404709 -362094 -250892 -263640 -501309 -777259 -823727
42087 -823727 -671634 -587414 -639364 -624824 -485192 -457651 -650220 -770722 -538142 -154927
42077 -154927 -84994 -473147 -1027019 -1391260 -1411092 -1092574 -552734 -24322 282221 367351
42067 367351 380835 384494 320445 225136 307759 708602 1244690 1506666 1250934 674024 246762
42056 246762 244984 477986 517712 138931 -532164 -1212646 -1656058 -1708458 -1377660 -880499
42046 -880499 -468222 -178831 105661 386111 533394 541283 543957 542084 373169 28187 -271608
42035 -271608 -410345 -506782 -598422 -532421 -349975 -411637 -847750 -1208045 -1024887 -464028
42025 -464028 -12183 257030 636358 1150172 1472063 1444137 1216259 862026 310679 -294103
42015 -294103 -630912 -705345 -879968 -1254378 -1454456 -1246778 -930881 -828477 -777488 -518252
42005 -518252 -266960 -435650 -948462 -1299813 -1256843 -1108777 -1181886 -1428665 -1574549 -1435600
41995 -1435600 -1034730 -596490 -440296 -670267 -966861 -921599 -590841 -441280 -697873 -1070463
41985 -1070463 -1255233 -1350734 -1515641 -1536769 -1147986 -592218 -388060 -567804 -616013 -249610
41975 -249610 189608 308593 216472 218728 313872 367742 504179 864168 1154455 943945
41965 943945 358207 -19807 20040 70110 -187359 -493324 -456814 -102271 292271 596026
41955 596026 803593 874236 833246 793062 683393 272258 -320554 -520923 -66420 486229
41945 486229 475362 53697 -141935 -3272 6968 -261412 -398593 -180253 29411 -144317
41935 -144317 -549718 -807510 -821074 -762895 -798957 -985104 -1211129 -1160271 -607448 144345
41925 144345 444611 64340 -504714 -680608 -444959 -195557 -213630 -478320 -795496 -930419
41915 -930419 -789908 -583664 -588344 -682650 -436024 205912 691190 561652 70311 -192086
41905 -192086 -31782 288585 510458 586376 576573 604868 788375 1014071 974253 616088
41895 616088 295568 238610 158556 -239667 -672290 -661413 -307838 -163553 -418668 -714059
41885 -714059 -742928 -550054 -200175 345231 876000 914183 301349 -500031 -917793 -851311
41875 -851311 -572827 -303460 -116897 -83495 -255432 -553633 -810051 -893647 -753862 -439102
41865 -439102 -121776 6794 -73033 -206048 -262862 -235894 -141657 23875 214089 356121
41855 356121 450488 497267 357456 -74207 -534781 -523980 75862 730079 812874 319083
41845 319083 -174830 -192167 178485 484343 420807 80433 -245881 -425622 -575395 -800850
41835 -800850 -965416 -833845 -396235 80425 320749 269375 76341 -50216 -10608 75317
41825 75317 -16534 -289837 -429750 -194473 204630 340453 116643 -168093 -244170 -85518
41815 -85518 245191 616028 676994 95368 -911107 -1616080 -1566008 -1057327 -651928 -506404
41805 -506404 -436928 -391322 -503384 -782068 -1043160 -1125619 -988330 -659783 -268241 -38325
41795 -38325 -73010 -210809 -263523 -292757 -452997 -662284 -679253 -468029 -241633 -139138
41785 -139138 -87047 -10093 47218 85575 224986 468861 547274 203978 -393958 -734586
41775 -734586 -535783 -116264 -40743 -444966 -920263 -1108875 -1145815 -1299800 -1412495 -1094393
41765 -1094393 -421607 15211 -110249 -414542 -364642 30230 378806 518217 615635 781498
41755 781498 903551 836305 530545 25695 -500169 -773567 -730034 -659919 -812404 -989680
41745 -989680 -843564 -465248 -285540 -395484 -385578 13832 489737 557925 173749 -289402
41735 -289402 -513545 -487219 -377751 -321668 -317289 -252190 -76615 53157 -68299 -370393
41725 -370393 -505812 -261795 168108 431383 424439 338534 376898 533958 618623 443202
41715 443202 46892 -242192 -80992 476800 946148 899028 427457 15029 -9150 229227
41705 229227 391826 346452 254340 271428 285735 63200 -373509 -680327 -606135 -349433
41695 -349433 -329750 -648344 -962977 -930878 -627811 -450649 -674482 -1152727 -1433851 -1205039
41685 -1205039 -662401 -349462 -519688 -775096 -542079 166293 736023 711861 278598 -120109
41675 -120109 -363656 -639432 -1021457 -1315288 -1282625 -859349 -183633 464958 793507 705386
41665 705386 405136 216206 267451 380591 262199 -190267 -739385 -979067 -717323 -177172
41655 -177172 247641 392289 370507 290049 114145 -181256 -510005 -797913 -1036984 -1159745
41645 -1159745 -1034412 -665638 -242862 79203 283807 338209 178489 -57233 -59839 205659
41635 205659 348169 89166 -279216 -282449 68253 348328 351204 270343 280507 317772 339044
41624 339044 455972 661735 679431 267902 -450460 -1075244 -1247633 -873002 -195506 314041
41614 314041 335742 33479 -152227 -63597 60660 80988 227905 657909 1027789 875059
41604 875059 296881 -121806 -54048 226198 310313 148524 -77755 -302135 -526312 -586420
41594 -586420 -288177 226305 519906 362247 -3971 -217765 -260869 -396637 -743054 -1092382
41584 -1092382 -1145381 -800442 -230168 222437 279406 8494 -180027 257 295956 216730
41574 216730 -247530 -547946 -346184 -25651 -155375 -691474 -1084992 -1065481 -911231 -917757
41564 -917757 -975465 -836033 -534112 -324180 -328417 -440617 -533730 -609495 -711839 -762158 -551967
41553 -551967 31317 750318 1102127 797068 113621 -376330 -422746 -265808 -182124 -101222
41543 -101222 183092 595704 813865 695507 475613 464819 673254 840982 787354 597665
41533 597665 433755 283311 20755 -331241 -557343 -499061 -223401 105174 385885 531605
41523 531605 405906 -18994 -501356 -693949 -484804 -85388 214162 305519 290818 309730
41513 309730 345243 226612 -107954 -415557 -406146 -189311 -193970 -558079 -900325 -870709 -614988
41502 -614988 -435585 -310377 -116401 -51236 -354083 -788035 -915489 -777681 -753853 -814776
41492 -814776 -555601 -32033 113704 -405658 -1059021 -1292344 -1233911 -1208868 -1071660 -566245
41482 -566245 12342 111165 -296427 -711548 -775185 -506833 -5035 637194 1159127 1278073
41472 1278073 1032858 706717 465522 340004 434054 788710 1122534 1097309 824355 747765
41462 747765 1027359 1383497 1554603 1547778 1403381 1074651 625847 237941 -55539 -338895
41452 -338895 -474490 -151295 600050 1266795 1408704 1113744 771872 646815 795026 1119576
41442 1119576 1316680 1031772 307708 -317985 -399854 -117048 4928 -230921 -548171 -647986
41432 -647986 -535245 -366060 -186675 48721 285359 339699 131879 -109553 -14145 501713
41422 501713 1089131 1340286 1182635 791457 306133 -131188 -229587 191840 836516 1173571
41412 1173571 1074225 884924 849056 837259 748072 776052 1066107 1413231 1547861 1480003
41402 1480003 1337214 1080448 620656 59249 -393895 -626533 -626130 -439890 -235164 -193384
41392 -193384 -237513 -99445 244473 500937 541816 592360 750178 738915 443878 261197
41382 261197 472756 647630 229573 -532346 -865962 -575536 -237223 -300106 -603095 -896416
41372 -896416 -1256105 -1716075 -1949542 -1672915 -1102983 -714683 -699335 -866148 -938363 -768868
41362 -768868 -367478 129158 540440 746272 698100 406688 19569 -218450 -271108 -437960
41352 -437960 -908340 -1324692 -1159913 -459329 214728 563592 797036 1028916 971227 478913
41342 478913 -62699 -239715 -155014 -136457 -219071 -298509 -519689 -1045563 -1587472 -1634050
41332 -1634050 -1132508 -557501 -270527 -143151 105289 471164 701215 609701 261450 -96151
41322 -96151 -265722 -300255 -403476 -581579 -555691 -169910 275963 338295 -16071 -405116
41312 -405116 -517382 -356949 -52710 290276 522983 503011 305104 194424 315303 550718
41302 550718 711660 693558 445018 20511 -283982 -120158 443154 868304 760479 354158
41292 354158 173197 355758 592838 665927 721987 934440 1152152 1083114 715593 360152
41282 360152 269199 350656 317717 50235 -270948 -378523 -208006 45995 125588 -67012
41272 -67012 -412986 -688515 -716732 -449232 42041 615032 1108869 1396897 1436021 1264182
41262 1264182 934194 479243 -15755 -352372 -339243 -15476 319069 358967 53567 -401345
41252 -401345 -757293 -847218 -616773 -160222 264874 375047 102401 -316654 -555082 -522460
41242 -522460 -442297 -546562 -709623 -508746 256757 1193169 1628093 1304084 603705 53334
41232 53334 -214224 -401697 -634810 -818720 -842814 -723464 -516773 -232356 111056 424870
41222 424870 589958 529148 257308 -91416 -319049 -320425 -170192 -4310 130110 229958
41212 229958 225300 61981 -150827 -259854 -332123 -586149 -996965 -1198529 -942497 -481364
41202 -481364 -271947 -395822 -519579 -391165 -103387 168695 393128 496164 228803 -497810
41192 -497810 -1297101 -1650664 -1518362 -1291459 -1150129 -852761 -281461 204139 251796 66621
41182 66621 102079 373431 482081 251887 -66298 -239378 -305292 -287829 -28684 508562
41172 508562 1038781 1249687 1099123 701303 164281 -317451 -483529 -326933 -160902 -173696
41162 -173696 -174957 -4254 124536 25585 -3355 404142 987265 1110741 689134 337784
41152 337784 501364 907490 1093952 1068630 1125990 1284004 1279423 1026291 755393 664031
41142 664031 652602 522666 326591 356268 732546 1126804 1078003 585537 152029 132526
41132 132526 295430 241714 8798 -86451 -29080 -88150 -266802 -237843 91574 378657
41122 378657 368554 243996 243358 265519 124453 -61860 -32141 229304 509230 648234 617369
41111 617369 448401 262422 225625 318444 322089 205113 304074 860725 1551822 1791220
41101 1791220 1426258 863532 539571 495891 451850 105076 -600505 -1333473 -1577340 -1169550
41091 -1169550 -556709 -298005 -408340 -462474 -279413 -155926 -365875 -740890 -904490 -726491
41081 -726491 -395515 -163230 -137207 -258134 -408042 -566375 -831836 -1209583 -1449709 -1275424
41071 -1275424 -760035 -289917 -134433 -239907 -470666 -805220 -1169605 -1297747 -987362
41062 -987362 -413532 3880 27388 -234784 -552482 -782590 -818759 -519940 127674 819177
41052 819177 1110073 899528 607792 692744 1048562 1121244 653363 42872 -195111 -81815
41042 -81815 -21936 -157369 -229143 -74033 87224 -14926 -319547 -558833 -605622 -534895
41032 -534895 -433685 -296392 -73003 265502 674733 1010764 1136622 1101688 1103535 1193684
41022 1193684 1159721 852818 514578 524774 824089 872522 343710 -345334 -471892 89094
41012 89094 699646 761544 394113 117707 106526 97615 -49542 -100367 154223 563385 868930
41001 868930 1065291 1283264 1459081 1357496 884841 216301 -368041 -675577 -685348 -536151
40991 -536151 -388221 -256280 -64430 142158 240674 325319 671726 1254006 1591062 1327013
40981 1327013 712984 218642 -72567 -292423 -265121 278750 1026215 1220521 628594 -108926
40971 -108926 -319656 -97513 12869 -200708 -503911 -699213 -857619 -1067327 -1195598 -1012685
40961 -1012685 -515656 -65273 -88622 -569772 -974265 -853784 -385136 -51981 56291 231686
40951 231686 511066 569427 347931 273633 602150 979519 992965 795266 781965 917526
40941 917526 824412 399178 -67243 -323409 -368688 -267705 -71304 69648 -14647 -272153
40931 -272153 -466446 -481685 -431197 -455449 -558004 -656916 -690951 -664119 -638574 -656009 -653160
40920 -653160 -542814 -375316 -265542 -161739 79250 353793 360891 108795 34370 411507
40910 411507 963173 1315322 1502665 1693230 1734797 1409593 907398 593437 478612 354930
40900 354930 269385 370580 450320 207035 -130986 -65402 307857 364044 -24962 -228047
40890 -228047 128771 534467 382688 -142863 -454388 -427329 -364467 -370841 -285232 -90367
40880 -90367 70980 226737 532410 920566 1124025 1053083 884917 782437 752754 767232
40870 767232 810528 829331 813880 875204 1043117 1062038 643274 -96439 -698623 -889870
40860 -889870 -820204 -735768 -643399 -402928 17953 495677 841815 862854 466779 -160727
40850 -160727 -580917 -467478 54088 546106 748589 812969 993764 1236455 1239487 896113
40840 896113 467370 229487 127115 -57138 -316242 -423285 -267772 35141 354923 643176
40830 643176 824748 844497 860778 1121341 1560320 1799341 1687871 1552821 1696182 1913254
40820 1913254 1807846 1379282 938220 567000 74744 -512327 -823101 -645325 -250825
40811 -250825 -20287 27225 87313 116899 -134596 -615324 -807152 -305509 568324 1026575
40801 1026575 725623 146834 -91370 -43278 -227310 -751316 -1117019 -990708 -723915 -812048
40791 -812048 -1142483 -1180461 -771446 -355597 -353672 -657624 -851753 -725646 -405889 -86267
40781 -86267 194656 472023 659549 591017 314531 191377 493718 962130 1029244 515914
40771 515914 -158933 -524052 -514996 -291148 42258 321968 304247 70640 129148 713568
40761 713568 1259119 1046100 160994 -687858 -1140762 -1384495 -1471470 -1135919 -419523 133860
40751 133860 160248 -119968 -383385 -588694 -631393 -165258 804706 1581118 1524413 860291
40741 860291 285693 40952 -113016 -198452 87862 775295 1423782 1657632 1537706 1290712
40731 1290712 974271 544960 33948 -462693 -822821 -896894 -637575 -239571 39101 203329
40721 203329 465687 852269 1091669 959220 534900 44984 -380061 -713990 -957179 -1136369
40711 -1136369 -1272447 -1304292 -1156131 -898057 -705915 -638964 -585875 -437388 -175640 188423
40701 188423 588409 827001 742084 463517 281871 248322 174059 64201 205128 665377
40691 665377 1042967 969468 611715 381529 357393 329252 259840 304201 408687 282785
40681 282785 -135301 -477483 -356109 195918 794589 1080977 965970 638089 407660 452389
40671 452389 663979 799670 765162 653985 550446 435540 266051 3810 -392365 -823899
40661 -823899 -952590 -504635 297500 871285 923812 722198 628313 653055 644841 634343 706069
40650 706069 716644 463921 51989 -204064 -202572 -117133 -37405 185151 656228 1191127
40640 1191127 1444729 1211263 603195 33831 -47579 400550 846865 676687 -117862 -922639
40630 -922639 -1206981 -1036175 -818933 -781259 -846648 -863461 -747770 -477567 -119706 153352
40620 153352 190993 12615 -224284 -374390 -387012 -299042 -197715 -136330 -45336 206688
40610 206688 619572 1003706 1167490 1088705 853170 527988 188045 -24482 -13691 110778
40600 110778 113491 -83032 -261714 -126050 342672 789474 806480 350222 -235669 -627769
40590 -627769 -819987 -934877 -918881 -649207 -246356 6373 60448 148362 380190 562586
40580 562586 526455 389138 345877 413505 539235 763705 1085314 1317482 1271030 973609
40570 973609 574695 161755 -210571 -465337 -605241 -712906 -753409 -588164 -281646 -101677
40560 -101677 -65305 150847 599318 771872 325022 -264720 -296965 161908 469905 408033
40550 408033 329672 378725 265910 -70572 -232170 -3390 321313 481907 600759 728853
40540 728853 576455 61865 -319211 -94319 538247 1025769 1121228 892823 416891 -128233
40530 -128233 -350922 -80687 281335 251252 -79086 -256564 -140594 61309 258997 517075
40520 517075 728201 696121 493085 340601 212772 -39779 -279811 -266741 -165517 -335448
40510 -335448 -636055 -549321 -78164 121620 -259506 -673076 -582321 -298887 -422795 -853938
40500 -853938 -1005820 -806660 -813047 -1286689 -1748719 -1684592 -1264567 -1024293 -1075137 -1015847
40490 -1015847 -581075 -30576 232859 192687 127854 107805 -94728 -509056 -697670 -253835
40480 -253835 589824 1166934 1155596 857041 685027 693680 717718 685067 586867 346797 -41303
40469 -41303 -362400 -380471 -128796 161652 350315 433797 377423 125231 -200219 -303733
40459 -303733 -26860 442727 759330 765988 574691 330754 15091 -447391 -956791 -1267137
40449 -1267137 -1275592 -1136906 -1004167 -809803 -465784 -142683 -93915 -251831 -271263 8915
40439 8915 406404 724541 941143 987648 684487 98869 -337274 -356836 -275337 -545589
40429 -545589 -1061239 -1288686 -1028081 -651987 -544573 -649052 -688406 -555720 -327643 -96035
40419 -96035 50861 22211 -159748 -334135 -376873 -295500 -103955 226792 611096 841380
40409 841380 877426 941782 1130503 1132818 642140 -81406 -439944 -292921 -141949 -402338
40399 -402338 -838419 -949022 -637529 -202971 137081 367079 427561 237364 -17521 29118
40389 29118 429189 785039 752311 457133 265124 338280 587840 879908 1087638 1082823
40379 1082823 878496 672189 576693 446424 169884 -26441 150713 581824 835740 728843
40369 728843 498123 410808 483375 626074 782442 834188 622637 204235 -98780 -35375
40359 -35375 299575 583371 534666 71565 -596917 -1018813 -880786 -411296 -177741 -418099
40349 -418099 -828106 -1089700 -1294243 -1659677 -2108263 -2375791 -2347915 -2063946 -1566673 -982622
40339 -982622 -596849 -600614 -853070 -1062466 -1075820 -848619 -346247 290453 678988 584188
40329 584188 242175 35578 -6398 -97362 -240192 -241297 -93143 21682 85440 266206
40319 266206 573515 799704 834042 774584 727070 743779 915714 1223713 1346589 981182
40309 981182 351711 12165 100951 198343 4378 -287677 -461255 -671878 -1084511 -1464634
40299 -1464634 -1458423 -1039415 -403733 336529 1073966 1559321 1661719 1607608 1666528 1766357
40289 1766357 1715201 1610604 1648872 1659372 1267911 521966 -47190 -69732 283212 669593
40279 669593 1010652 1362647 1590535 1451006 964342 506004 450293 775488 1094395 1100726
40269 1100726 911168 853966 975178 980809 717047 431443 372929 373928 117117 -338648 -628686
40258 -628686 -610841 -500352 -482316 -493877 -438955 -354733 -291439 -237592 -210168 -217152 -120248
40247 -120248 220464 640959 786520 582093 299246 88943 -203702 -617864 -850593 -718195
40237 -718195 -524566 -630077 -900115 -960528 -805939 -715057 -671659 -365150 198031 557016
40227 557016 441230 178775 231789 608607 980447 1139538 1058486 691913 80412 -413835
40217 -413835 -339181 295348 956102 1180706 1038502 869505 756207 483949 -35894 -537911
40207 -537911 -675390 -402038 9952 285747 403915 532097 751562 895860 711904 187145
40197 187145 -364414 -626114 -635971 -686967 -883473 -987842 -794081 -469262 -339289 -450450
40187 -450450 -566436 -544587 -469621 -413892 -325052 -214399 -204128 -277664 -229336 -16001 87645
40176 87645 -103165 -352436 -353182 -198369 -159310 -169350 29657 304791 210651 -274501 -589116
40165 -589116 -363446 86671 311098 355042 461750 497305 168561 -375407 -665884 -579035
40155 -579035 -423858 -371538 -243592 56409 316568 380156 399601 542102 703126 683728
40145 683728 433054 -17959 -618845 -1145413 -1251535 -900259 -537236 -595004 -975522 -1241521
40135 -1241521 -1176655 -924771 -689317 -538673 -457291 -391752 -266602 -67397 161771 464931
40125 464931 936319 1423193 1523234 1104917 590300 423188 479962 377697 157260 164505
40115 164505 353128 283644 -107382 -284390 127141 806523 1224371 1268895 1086000 673738
40105 673738 56744 -390993 -274603 253632 655078 711657 715216 934007 1245277 1411483
40095 1411483 1427465 1400961 1275254 891179 264194 -367803 -773873 -896589 -780603 -459377
40085 -459377 -9057 356581 424583 278265 295153 692025 1172999 1242073 828606 368331
40075 368331 245028 389466 486461 328942 -128360 -794170 -1348994 -1381623 -861956 -302006
40065 -302006 -205521 -502821 -758479 -762794 -615845 -361923 80813 630145 1006198 1054035
40055 1054035 875206 619717 365393 189500 101691 -94061 -580044 -1136567 -1293429 -957347
40045 -957347 -558975 -421842 -319048 81116 598981 731962 344080 -170990 -417867 -422586
40035 -422586 -456620 -619430 -711959 -481872 47558 504874 484667 -34270 -659195 -1006313
40025 -1006313 -1038863 -922288 -716844 -397909 -75702 49872 -31679 -98324 13059 215451
40015 215451 331328 307860 178578 -75874 -474750 -870712 -994270 -745043 -362370 -197516
40005 -197516 -326838 -499583 -498217 -417458 -467962 -600464 -522305 -95671 455483 787084
39995 787084 736262 342996 -221338 -623276 -480925 235768 1011186 1255743 962916 655280
39985 655280 655298 690317 363824 -214228 -526924 -307580 133765 273637 -80450 -654465
39975 -654465 -1017283 -982252 -768773 -787233 -1195836 -1670501 -1729291 -1320483 -937706 -1031061
39965 -1031061 -1432840 -1573164 -1212093 -696376 -425112 -320837 -34620 485697 908195
39956 908195 975057 801496 651013 603662 564680 472949 358425 251721 162560 132963 213673
39945 213673 378075 525704 584289 565139 518550 488384 525065 684614 957136 1209714
39935 1209714 1263209 1061942 741739 494239 385872 360987 401657 586463 945214 1323549
39925 1323549 1467774 1240250 735223 212175 -91433 -160796 -235912 -545365 -981133 -1180801
39915 -1180801 -1005089 -756573 -768167 -936921 -904141 -593183 -274020 -114280 18747 231926
39905 231926 372782 291929 134499 166916 422519 689616 782576 677620 420878 43385
39895 43385 -403870 -794665 -957463 -805060 -452874 -124435 134612 524682 1117757 1561300
39885 1561300 1453491 952866 639705 719781 764481 400539 -138803 -428424 -480161 -592163
39875 -592163 -809262 -935837 -948626 -1008147 -1125420 -1162766 -1117705 -1079168 -952319 -575149
39865 -575149 -80874 228103 377763 696773 1221434 1535472 1368483 987587 766591 686723
39855 686723 554497 456705 632550 1002965 1165078 876213 329361 -85365 -160669 -9063
39845 -9063 79117 -78693 -350167 -404927 -87068 403429 756434 868520 821758 670430
39835 670430 418969 172666 153120 521845 1226608 1990456 2427955 2289715 1720983 1222263
39825 1222263 1212309 1621479 1992968 1955971 1513175 918160 428210 199352 266259 503332
39815 503332 652042 491756 14379 -589709 -1109722 -1451278 -1620180 -1649135 -1581760 -1463379
39805 -1463379 -1259192 -825451 -111924 578279 713374 82982 -838602 -1239215 -708731
39796 -708731 414187 1384254 1663474 1270089 660636 284264 199702 143232 -53246 -274158
39786 -274158 -396020 -505712 -661751 -669488 -380325 -37203 29158 -70686 46147 399579
39776 399579 610236 502530 302393 179813 56267 -26636 156930 518001 580347 185123
39766 185123 -188289 -133907 94067 101038 24504 186034 427319 363001 45516 -194315
39756 -194315 -370276 -703402 -1005835 -857120 -377221 -193003 -556664 -1062753 -1340207 -1456879
39746 -1456879 -1472461 -1158303 -461425 187673 355238 102882 -214004 -361090 -266956 32022
39736 32022 298949 247452 -40099 -146683 70019 243081 70812 -203776 -121483 453814
39726 453814 1298379 2037102 2252944 1761580 957553 499171 479302 378934 35441 17638
39716 17638 629286 1190449 958007 262131 -21864 231604 431338 335997 223924 115338
39706 115338 -278185 -772789 -738838 -110845 386928 295565 18491 50997 258105 306033
39696 306033 237210 176389 -39838 -476044 -765084 -625892 -334265 -217202 -65284 414292
39686 414292 899278 841674 357498 89586 259962 463058 404819 255403 158910 -54773
39676 -54773 -441060 -674080 -516413 -247253 -306174 -695914 -1023376 -1037857 -886001 -850245
39666 -850245 -1014883 -1234257 -1335067 -1277531 -1117793 -877209 -548473 -229455 -90638 -116756
39656 -116756 -41486 291411 635834 644259 381095 261550 475562 737819 686590 319575
39646 319575 -64660 -193350 3037 389922 706123 761579 642572 614305 762792 879094
39636 879094 791238 647782 696520 881499 883256 568798 199979 85144 147882 11189
39626 11189 -506185 -1142888 -1505226 -1473421 -1170119 -675788 -34004 512481 631011 357203
39616 357203 153726 319765 590619 573143 350864 309618 496963 554288 284694 -68854
39606 -68854 -190778 -56279 164110 326877 351208 239116 145924 250604 495458 638111
39596 638111 602042 557883 596641 559678 300790 -87331 -416053 -581776 -511287 -134240
39586 -134240 462999 1024589 1367660 1481470 1349133 919874 342483 -61268 -207881 -368108
39576 -368108 -704744 -988168 -1001047 -933262 -1057317 -1233803 -1094518 -584339 1696 419884
39566 419884 618552 574962 302706 -21193 -193737 -202488 -106361 153941 553699 757282
39556 757282 470664 -54932 -252177 52179 511075 808403 934075 893723 592300 146042
39546 146042 -67290 141246 550419 888209 1118171 1240797 1142418 838254 573085 464817
39536 464817 314234 -11998 -287309 -289067 -212131 -391012 -776086 -1017513 -964016 -758661
39526 -758661 -503298 -152484 249244 513610 568425 567115 661607 815659 910758 922581 928252
39515 928252 1006045 1162165 1317657 1373851 1326856 1276098 1265676 1178012 875141 409269 -2113
39504 -2113 -203036 -227542 -196963 -140446 51262 469927 978242 1233863 1034389 595507
39494 595507 334568 385913 501938 445643 275025 176806 218840 352401 465434 353855
39484 353855 -120146 -713041 -904225 -515461 6543 159030 5425 -60185 38824 21924
39474 21924 -253963 -642094 -1009072 -1326070 -1450928 -1182213 -611739 -120693 67815 62777
39464 62777 -42954 -379677 -987102 -1546937 -1663757 -1296815 -760651 -396950 -344477 -496859
39454 -496859 -564978 -301461 202570 526859 340084 -247676 -813790 -1023585 -856165 -552278
39444 -552278 -421001 -590664 -853291 -836996 -415159 136674 467480 542679 612046 854700
39434 854700 1161251 1247340 925108 290412 -324614 -626414 -616203 -541280 -606961 -807095
39424 -807095 -1011866 -1102016 -1013233 -783427 -587211 -595731 -759371 -836886 -658294 -245224
39414 -245224 300599 834315 1098232 886779 378368 51668 124976 307850 274099 124697
39404 124697 129755 235926 171146 -81065 -260202 -241202 -145141 -34161 188504 512032
39394 512032 738339 782875 826882 1046340 1377988 1670774 1884389 1996622 1883987 1483484
39384 1483484 971896 597526 376456 118522 -247401 -516281 -433307 -14177 424526 568182
39374 568182 413948 229124 198304 223897 163111 119546 269056 452076 255907 -399352
39364 -399352 -1039249 -1189766 -933903 -682915 -584840 -470208 -276176 -170022 -243572 -400434
39354 -400434 -601983 -924560 -1274398 -1352044 -1083927 -836574 -970827 -1374183 -1673497 -1735566
39344 -1735566 -1668508 -1457176 -948510 -191744 511571 944970 1126882 1106691 878099 542338
39334 542338 275810 45914 -358290 -889424 -1140258 -881167 -425383 -198996 -184324 -100409
39324 -100409 66039 97542 12363 93939 451734 901086 1315665 1772545 2287876 2735216
39314 2735216 3128699 3676304 4413545 5073685 5475881 5739835 5908994 5674645 4797589
39305 4797589 3587256 2601986 1997058 1518378 1055502 799795 815960 828923 597596 250020
39295 250020 71628 128435 260453 328869 321863 294473 329293 501273 774715 975780 957693
39284 957693 761179 536762 351680 167830 -14506 -108287 -73344 -22681 -124230 -400285
39274 -400285 -661861 -668743 -370147 14928 186682 62208 -132603 -110151 147893 372944
39264 372944 351447 207863 251556 569228 895210 929446 679023 399653 275799 275607 288305
39253 288305 273597 246923 207054 124618 -32731 -261054 -454606 -407897 8070 645209
39243 645209 1150005 1295719 1187658 1088901 1092902 1035882 722317 180389 -340164 -615171
39233 -615171 -642372 -551968 -384553 -88545 272480 508054 583201 710415 993265 1170206
39223 1170206 966616 557340 359288 437023 465803 278227 77030 40037 76806 96677
39213 96677 169246 262719 174863 -67206 -83841 308808 734032 745954 411818 76117 -179638
39202 -179638 -442843 -573993 -383836 -80300 -67350 -345069 -533449 -452722 -260844 -64950
39192 -64950 130718 108621 -380662 -1029379 -1125690 -505414 160517 297402 139282 143046
39182 143046 177517 -161853 -750534 -1055342 -927435 -714420 -601786 -368941 113866 620348
39172 620348 982445 1378860 1958194 2467414 2549234 2227420 1815540 1461662 1074499 662986
39162 662986 451673 570340 833933 960837 885342 731737 581489 423178 285564 246871
39152 246871 286539 266355 111759 -98544 -273790 -414761 -490358 -344204 111137 659815
39142 659815 911008 691267 217262 -143526 -230830 -211004 -366923 -741697 -1004707 -798005
39132 -798005 -254553 23801 -337119 -973134 -1201824 -853078 -410433 -358760 -671812 -979399
39122 -979399 -978828 -599261 2409 478580 508860 129782 -266285 -362637 -239168 -183747 -315378
39111 -315378 -509549 -601781 -537082 -345789 -54363 359006 904818 1468706 1840684 1933262
39101 1933262 1869837 1744338 1441796 901577 405553 282564 399431 319517 -31145 -267875
39091 -267875 -208194 -201236 -580687 -1147170 -1480681 -1501109 -1425116 -1371093 -1295613 -1174745 -994305
39080 -994305 -683160 -272353 13726 31876 -57270 -47288 -8415 -117368 -306869 -344014 -170328
39069 -170328 57295 186817 158809 -5261 -131757 26747 445483 744291 674636 475771
39059 475771 463662 498305 254073 -135800 -160025 371201 1102127 1616264 1788802 1645086
39049 1645086 1244642 791983 550154 537297 534504 426626 296415 187036 55490 -33328
39039 -33328 27730 112951 -19215 -303182 -413442 -294760 -263949 -470103 -650819 -616536
39029 -616536 -599955 -847518 -1165700 -1196540 -948267 -749105 -785740 -924089 -908486 -579091
39019 -579091 -1933 488425 530195 163887 -142090 -48745 244901 323523 105706 -138730
39009 -138730 -170638 47523 448289 895846 1189201 1214120 1042180 764574 360027 -124259
38999 -124259 -441731 -437685 -343066 -509882 -931802 -1290252 -1413874 -1402947 -1316501 -1050332
38989 -1050332 -602699 -207861 -91217 -266425 -640761 -1114808 -1476408 -1414815 -839813 -76959
38979 -76959 436376 597242 639537 752830 878279 884745 767143 593586 389517 184314
38969 184314 69155 57342 -44914 -417239 -857379 -874222 -292265 413768 601854 191082
38959 191082 -306121 -426690 -193678 91555 237119 240622 170110 100548 73182 41340 -58649
38948 -58649 -160092 -123056 33839 130220 112005 152883 363155 580205 597610 451975 315100
38937 315100 226576 116357 -5679 -84248 -186897 -432379 -749224 -883411 -697340 -345170
38927 -345170 -96612 -58914 -123330 -148244 -134422 -179724 -273440 -241086 5722 249288 192840
38916 192840 -89181 -152197 268778 891795 1207136 1026087 569632 135499 -142417 -261805
38906 -261805 -249066 -110315 168862 542989 821405 795586 518458 310245 374545 546823
38896 546823 563429 441398 396040 473585 497451 376606 263874 330821 495956 468211 56749
38885 56749 -584749 -1055118 -1090704 -821226 -558174 -382425 -119398 274428 541264 461360
38875 461360 181367 36102 147510 346958 427723 352205 237832 204051 226548 179142
38865 179142 77342 149229 478513 729990 561919 208179 196166 500627 538492 129985
38855 129985 -155708 89272 462697 465138 308029 412419 556982 253569 -316551 -514290
38845 -514290 -271801 -179850 -555647 -1090025 -1468456 -1714677 -1828463 -1681884 -1407724 -1335662
38835 -1335662 -1406693 -1202479 -707205 -461554 -735900 -1105971 -1133879 -956267 -865666 -776194
38825 -776194 -490462 -131292 52890 23180 -173225 -528114 -834306 -727544 -273578 -112985
38815 -112985 -658949 -1509801 -2017857 -2065075 -1876994 -1471499 -807924 -168711 156809 337787
38805 337787 632355 797656 460624 -107118 -252594 65818 203252 -178470 -638790 -646075
38795 -646075 -227766 277287 680337 913469 898688 715592 651845 867299 1194421 1409561
38785 1409561 1485273 1446450 1226870 855293 583031 621564 879543 1111744 1200786 1147476
38775 1147476 916376 485781 5023 -268592 -239581 -123756 -268548 -770982 -1281554 -1313605
38765 -1313605 -824206 -338815 -347275 -732887 -1033281 -1104276 -1142481 -1100710 -583602 463694
38755 463694 1353686 1318545 421250 -514039 -832692 -640459 -444581 -455644 -417295 -61703
38745 -61703 446558 655684 407274 109691 283353 906401 1414591 1369311 929562 580360
38735 580360 570721 767339 940099 987087 884372 591304 105548 -446903 -865754 -1028182
38725 -1028182 -941651 -650489 -181529 357039 726431 769470 645799 668990 885671 1021001
38715 1021001 905357 711653 621476 498986 146060 -291887 -476087 -353720 -211451 -278459
38705 -278459 -514945 -777807 -973358 -1048582 -1020423 -995440 -1003283 -897605 -617719 -413643
38695 -413643 -527624 -767740 -745896 -461079 -248187 -186888 -26101 256636 319600 40194
38685 40194 -235350 -263370 -288531 -544818 -756913 -540897 -37086 263268 166088 -89183
38675 -89183 -207984 -57480 357737 841630 1045800 835766 503582 372742 355608 185461
38665 185461 -94439 -229181 -208656 -248410 -391879 -496189 -553415 -655448 -687333 -452017
38655 -452017 -88233 45163 -74669 -110432 54329 158849 96128 117914 290046 195022
38645 195022 -487922 -1442205 -2095578 -2268006 -2101768 -1622688 -813995 13283 373945 156896
38635 156896 -276464 -547856 -584908 -530307 -570355 -820716 -1162995 -1254741 -931416 -510205
38625 -510205 -421340 -630846 -757399 -674035 -576193 -486634 -215478 79895 -137380 -953195
38615 -953195 -1630372 -1509345 -913564 -643027 -833677 -920095 -614910 -282169 -260404 -396882
38605 -396882 -470926 -594766 -885415 -1110597 -1016753 -757743 -660383 -750181 -830741 -881434 -1036262
38594 -1036262 -1250539 -1311826 -1160538 -930729 -695362 -429166 -198897 -107903 -41567 239040
38584 239040 690314 956821 859292 656544 668820 861905 999730 1036127 1114152 1254184
38574 1254184 1278550 1079819 816921 762406 981148 1198900 1033347 398561 -360096 -816887
38564 -816887 -913271 -935340 -1084780 -1264963 -1318907 -1259179 -1150271 -953523 -661262 -452760
38554 -452760 -511975 -737938 -810095 -541043 -45851 420902 665674 587698 163484 -483161
38544 -483161 -1034720 -1140417 -734373 -178721 36353 -206206 -562879 -721422 -803034 -1072230
38534 -1072230 -1406587 -1403830 -999133 -606542 -550691 -696438 -799113 -891422 -1077952 -1217566
38524 -1217566 -1110382 -820325 -538135 -282981 -8634 152511 50906 -193268 -349803
38515 -349803 -405112 -440979 -341829 6028 339131 283584 -28002 -66981 301290 590541
38505 590541 405698 -31920 -286744 -273412 -150026 55156 396712 781097 1057087 1206077
38495 1206077 1244303 1109549 857050 770610 1002008 1246723 1076897 509917 -32805 -265566
38485 -265566 -260924 -194096 -180469 -369766 -872853 -1494643 -1808853 -1648357 -1327993 -1234576
38475 -1234576 -1358619 -1394561 -1177814 -835319 -565232 -443751 -438535 -459809 -374551 -104665
38465 -104665 229242 370738 225337 15689 16417 180872 199480 -47508 -281228 -180775
38455 -180775 200986 546935 690365 705841 656249 522125 400786 492158 776889 947914
38445 947914 807793 518372 284485 17930 -420457 -811676 -751313 -204996 403147 706142
38435 706142 770882 886720 1158148 1408368 1392366 1047764 584140 306578 284221 266626
38425 266626 46185 -196862 -104217 375650 942962 1340268 1517179 1420151 970191 355655
38415 355655 14606 120029 331093 270121 19610 -104860 -77123 -149789 -434819 -786434
38405 -786434 -1037811 -1090583 -833279 -262369 336222 623444 650505 783454 1137895 1390798
38395 1390798 1265480 907410 588348 293049 -124795 -528255 -551887 -72570 589606 985492
38385 985492 925589 547621 133107 -95630 -99147 -32581 -117046 -433602 -801618 -882592 -494721
38374 -494721 124701 470325 303950 -45858 -99450 138060 245504 93957 105419 620790
38364 620790 1349592 1762795 1786139 1722803 1658898 1405794 993378 736766 702689 547114
38354 547114 114284 -158420 227936 1090766 1689061 1536527 849376 205337 -39524 24885
38344 24885 64802 -135726 -471236 -664652 -611218 -488193 -498041 -632506 -771484 -883692
38334 -883692 -995428 -1053231 -969847 -762413 -516679 -246517 91591 460097 723653 786647
38324 786647 699219 631468 746261 1036631 1284025 1276125 1071523 901257 791720 513628
38314 513628 9162 -382479 -339237 -4551 228900 234459 175613 138121 60932 -19058 16738
38303 16738 95745 3096 -248039 -379677 -261670 -101453 -119794 -268255 -382324 -406839
38293 -406839 -343142 -148066 186024 572392 919845 1155678 1154201 844450 411798 148463
38283 148463 53809 -142189 -482057 -629867 -368323 65133 337774 420676 408708 265128
38273 265128 38331 10935 248289 286500 -242882 -881485 -811041 4062 716164 706036
38263 706036 256995 -44965 -78804 -77375 -155589 -288735 -475618 -610150 -441449 15932
38253 15932 267910 -73347 -638615 -656619 77256 977518 1446371 1499048 1489672 1551787 1549948
38242 1549948 1377639 1041495 550869 -32835 -465490 -474354 -115477 187169 88146 -270150
38232 -270150 -427058 -164411 245387 413399 334009 357643 694626 1132997 1335464 1270147
38222 1270147 1173055 1142627 993521 587961 135689 -19270 139357 244651 18665 -337859
38212 -337859 -370786 50346 529257 569800 113996 -422295 -594314 -324139 104030 317436
38202 317436 102911 -488034 -1166704 -1572831 -1525451 -1162979 -813271 -704145 -803578 -921589
38192 -921589 -909436 -726456 -365580 178713 813989 1286029 1330493 934263 388239 26254
38182 26254 -58987 -3728 61555 137609 259774 391494 473593 516696 574111 640260 620616
38171 620616 398376 -75671 -714626 -1289968 -1559382 -1474211 -1228469 -1031970 -875314 -621047
38161 -621047 -287129 -62161 2685 110376 368294 490035 127185 -537847 -855525 -496901
38151 -496901 75603 153863 -353296 -870780 -902649 -534095 -154585 36635 97513 114395
38141 114395 114863 127200 155083 128552 12386 -78587 -20972 78041 -44246 -438544 -794451
38130 -794451 -769882 -395175 -28167 73260 10273 30033 155869 157022 -118777 -516140
38120 -516140 -756498 -762655 -672294 -570591 -376295 -34253 323588 506702 472260 319806
38110 319806 152263 25291 -34193 -53026 -99282 -155882 -74758 227950 588275 746606
38100 746606 660860 533452 536851 647093 742869 717857 490391 89538 -216861 -91739
38090 -91739 436345 885999 874828 634050 702452 1138844 1360742 902668 76707 -385860
38080 -385860 -220844 162379 361630 509391 923640 1513027 1883077 1918436 1853329 1734030
38070 1734030 1252422 337559 -463840 -588346 -219693 -13260 -166579 -264800 -86541 -17908
38060 -17908 -399349 -889764 -888307 -343974 266496 628431 845718 1061365 1240000 1394919
38050 1394919 1669674 2040130 2196314 1885386 1200073 433426 -157616 -379486 -176674
38041 -176674 161447 144282 -331441 -764456 -689382 -315026 -178139 -336464 -347719 4572
38031 4572 439296 704427 921039 1209255 1363415 1187397 861405 651751 470377 82494
38021 82494 -365606 -406417 124598 794939 1002672 568304 -139561 -582730 -545734 -283417
38011 -283417 -142906 -88443 192711 698779 970602 727977 310361 166684 209230 100587
38001 100587 -73988 20413 254878 131644 -369312 -655977 -399513 23732 206396 290185
37991 290185 539376 805256 816279 623804 361842 -80748 -722160 -1168576 -1130159 -963599
37981 -963599 -1146871 -1449031 -1255366 -593359 -148097 -218348 -313161 34478 626938 1045019
37971 1045019 1249614 1398153 1429277 1219105 928975 838431 934841 941491 700250 333193
37961 333193 68564 42906 225431 440366 520246 494100 541897 730165 913409 937349
37951 937349 801404 573658 301405 72478 7730 107314 242551 371757 611638 1011923
37941 1011923 1417098 1653981 1709334 1613270 1297760 718030 16855 -556165 -817946 -679173
37931 -679173 -139662 607648 1166349 1194799 686678 -37869 -564171 -612937 -209185 275832
37921 275832 385629 29715 -387983 -406482 -25028 315499 226322 -249666 -728691 -865687
37911 -865687 -627844 -249924 13223 42768 -192489 -680367 -1255424 -1566963 -1349322 -712589
37901 -712589 -32960 416146 602744 586769 427059 209875 -13337 -297342 -649109 -868695
37891 -868695 -761199 -453979 -256649 -243996 -237994 -155209 -64056 69681 334726 563933
37881 563933 464188 115579 -64428 43656 85764 -147421 -353617 -203494 185631 517333
37871 517333 718758 824748 792103 688770 745520 968061 1035460 824865 637853 627983
37861 627983 483391 79881 -42412 586331 1538831 2011050 1871603 1567106 1258545 780313
37851 780313 310603 316074 794780 1212756 1243303 1002719 568147 -91683 -665493 -674884
37841 -674884 -255617 -116155 -517765 -924969 -904032 -711555 -653609 -501637 -17304 475753
37831 475753 584076 499930 624217 855401 793324 409268 -11542 -410177 -913755 -1374212
37821 -1374212 -1469123 -1245971 -1107022 -1209257 -1264920 -1007541 -540965 -163053 -104079 -456051
37811 -456051 -1073985 -1510107 -1345285 -685973 -94904 59749 -43421 -66822 9133 -10734
37801 -10734 -141217 -176137 4106 284590 503094 653265 840116 1098929 1322177 1357805
37791 1357805 1150804 790570 439388 211563 94048 -24436 -219062 -412201 -431589 -214146
37781 -214146 92046 278627 298867 285644 366640 507788 536087 311274 -90949 -385923
37771 -385923 -363650 -154993 -60734 -99760 33043 441648 732522 499197 -94649 -535910
37761 -535910 -635953 -622210 -618942 -453697 -67724 232625 115309 -393187 -982248 -1339231
37751 -1339231 -1283471 -822577 -188609 317739 579141 645276 513174 159161 -215063 -265616
37741 -265616 67045 448266 556808 392085 117778 -147073 -290453 -220295 -45024 -21842
37731 -21842 -211717 -399772 -446799 -466672 -544599 -556833 -427186 -299857 -273996 -207551 22108
37720 22108 292058 471970 667392 997220 1316088 1392640 1218351 934035 594832 216685
37710 216685 -65768 -98257 86797 278830 248019 -108868 -617657 -836577 -481151 146077
37700 146077 479527 468347 584548 949023 1017948 454494 -229788 -391717 -179117 -150922
37690 -150922 -302916 -157622 318946 582584 336746 -92331 -342148 -489667 -740770 -1013292
37680 -1013292 -1058547 -779294 -279635 232283 508902 399179 3420 -403858 -615719 -593967
37670 -593967 -431553 -342107 -549110 -1001195 -1331421 -1295681 -1084252 -961277 -804961 -354169
37660 -354169 248032 586471 603921 679789 1030104 1386738 1378943 972218 438745 81431
37650 81431 19312 85181 -35048 -403904 -677469 -556446 -248106 -194963 -470697 -773877
37640 -773877 -915299 -944006 -860032 -597723 -289211 -188098 -326421 -553448 -845394 -1216054
37630 -1216054 -1416114 -1175717 -706463 -474224 -473535 -257722 259592 623746 626261 688303
37620 688303 1160051 1733515 1918658 1709514 1399368 1060288 609459 169556 -22229 35429
37610 35429 111072 19338 -237056 -468341 -386705 59532 400200 70571 -756257 -1232072
37600 -1232072 -979180 -670244 -1038517 -1762177 -1945101 -1425968 -897701 -781321 -690848 -198152
37590 -198152 463108 815831 867091 985456 1241390 1301838 982389 536366 240719 -37134
37580 -37134 -574643 -1207775 -1363702 -779014 89933 567745 468451 81505 -342531 -748982
37570 -748982 -1024048 -977467 -628047 -207995 161674 521899 780705 704467 305986 -61458
37560 -61458 -133400 -3979 137551 251830 285582 57703 -458559 -931773 -967412 -504669
37550 -504669 189550 782011 1049416 971291 750701 617315 590779 593091 709650 1025410
37540 1025410 1253026 973486 334359 36655 414190 951265 995630 569415 140037 -77126
37530 -77126 -199017 -315018 -446568 -690374 -1029283 -1132094 -704383 25406 476419 342659
37520 342659 -173493 -683467 -943569 -925482 -774258 -688838 -720903 -732766 -611350 -408671
37510 -408671 -224387 -117162 -168362 -401390 -593733 -472029 -171242 -127094 -373411 -390724
37500 -390724 80252 519017 320888 -341194 -812425 -847156 -710774 -573295 -324071 51611
37490 51611 364169 530069 656230 779196 782873 596653 282541 -43174 -218541 -72657
37480 -72657 356541 752041 850992 732986 629343 628803 740565 1006152 1304236 1275555 743196
37469 743196 50731 -274276 -53946 507941 1079444 1296857 940328 293028 2275 285462
37459 285462 632940 619010 539799 770610 978088 657990 106521 61628 544748 846347
37449 846347 620830 240689 18452 -184703 -422517 -414957 -86480 200076 208820 170703
37439 170703 327026 555600 686586 819220 1087119 1396778 1574351 1528702 1200041 648264
37429 648264 226336 291443 678530 861017 719837 710064 1115449 1595632 1719415 1543862
37419 1543862 1354374 1162357 834148 517298 553606 979493 1354993 1161443 313914 -733618
37409 -733618 -1408360 -1553067 -1461406 -1389466 -1284316 -1120827 -1158397 -1528083 -1846201 -1683512
37399 -1683512 -1221439 -948883 -859615 -527673 69849 431691 335447 191955 392634 776007
37389 776007 997707 1059941 1200668 1497070 1790712 1870546 1655121 1319266 1188165 1329123
37379 1329123 1398114 1153963 898702 1004760 1235567 1085961 640232 439482 546267 457174
37369 457174 35161 -191143 99711 479583 428727 32470 -313397 -485221 -604743 -744289
37359 -744289 -903654 -1029140 -937173 -518908 -72129 -42917 -370512 -513542 -212829 214488
37349 214488 435736 494534 526403 545695 647982 978626 1378469 1498058 1349405 1280062
37339 1280062 1345691 1241009 930165 767424 871628 965216 967200 1136359 1469210 1590569
37329 1590569 1436092 1402863 1602674 1618210 1255364 890667 799827 791717 788957 1081595 1655115
37318 1655115 1939377 1634231 1187719 1077597 1202303 1324963 1491837 1642174 1443801
37309 1443801 914894 587637 669691 686484 343185 51709 158803 340609 251761 108645
37299 108645 125042 34364 -290665 -387386 64454 645947 860812 822814 805422 714075 483096
37288 483096 376473 435169 270703 -170508 -362796 -150726 -135275 -621938 -1024523 -853434
37278 -853434 -440110 -136573 275741 795771 843128 377684 324212 1082240 1670748 1256532
37268 1256532 491572 338773 582435 587376 575353 979818 1381912 1250139 979938 1126442
37258 1126442 1381037 1323510 1343783 1810948 2236328 2247914 2373529 2856415 2878711 2073175
37248 2073175 1508433 1931496 2419458 2150279 2013381 2881848 3827706 3839645 3774847 4642618
37238 4642618 5482426 5086890 4337853 4566885 5091125 4752211 4343308 4977493 5691752
37229 5691752 5391053 5395507 7065270 8806289 8786967 8623804 10620906 13462655 14861695
37220 14861695 16208076 19719656 23368508 24374729 25418828 30786628 38724736 45430345
37212 45430345 54159510 70792975 93160920 118217641 158421382 230687182 320554603
37205 320554603 376440779 357975012 281416073 200776227 150331224 122920641 99750937
37198 99750937 78200232 64149292 55550521 46344477 37341671 32651905 30756985 27316074
37190 27316074 22783690 20351483 19484822 17485933 14928493 14204139 14671436 13929885 12217428
37181 12217428 11382983 11049472 9654619 7911437 7596118 8069769 7388462 5852322 5275495
37172 5275495 5609442 5307083 4337329 4015171 4375356 4293463 3767439 3735243 4053276 3815363
37162 3815363 3251131 3292992 3693315 3466340 2756909 2487523 2614319 2417499 2020167 2015998
37152 2015998 2148892 1905216 1773172 2380349 3101860 3082874 2843368 3231745 3642574 3061018
37142 3061018 2069289 1913713 2295028 2054948 1415382 1470551 1970441 1747859 1007414 1043222
37132 1043222 1852988 2139701 1649372 1443423 1753087 1588711 756275 365425 910419
37123 910419 1516623 1518404 1296926 1211577 1100494 1092261 1547629 2038915 1774319 1105948
37113 1105948 1142551 1845390 2140727 1978404 2440467 3540374 3844193 2833582 1822519
37104 1822519 1813139 2150574 2111083 2176268 2785504 3330586 3397541 3649771 4521430 5378525
37094 5378525 5918309 6970304 8886448 10750686 12546458 16379768 23406054 30596243
37086 30596243 32991582 29084731 22134088 16170501 12464492 10139460 8401376 7111568
37078 7111568 6148550 5281635 4478873 3862297 3486069 3317313 3227392 2955935 2349845 1662448
37068 1662448 1339595 1472082 1694560 1659670 1426288 1340377 1623902 2077103 2196831 1711223
37058 1711223 964649 552159 600716 720308 654646 566696 607590 666214 721562 995838
37048 995838 1511055 1896197 1912403 1806075 1850824 1883395 1623189 1173445 875754 866619
37038 866619 1043165 1284111 1478885 1507387 1378689 1246609 1183224 1114957 1035654 1052750
37028 1052750 1182790 1349423 1579414 1907831 2139769 2082570 1953681 2090811 2299307 2054727
37018 2054727 1384780 921557 953139 1065866 925334 757457 770892 739913 526200 429262
37008 429262 606840 682385 371692 15741 29465 254469 325902 289541 374544 483333
36998 483333 379062 133878 -5988 10040 98204 226937 316444 255725 200034 465013
36988 465013 956231 1184418 1040271 978424 1179448 1200648 835048 604412 869736 1122363
36978 1122363 800078 215382 -22895 26934 -5546 12169 356526 687558 509896 89388
36968 89388 64986 392555 512388 356633 325470 411411 238604 -84096 -30507 392143
36958 392143 592874 379396 192319 232583 143764 -221342 -443495 -230565 148028 403840
36948 403840 667327 1115440 1633722 2075457 2421427 2520458 2153127 1539488 1298330 1673546
36938 1673546 2231144 2526354 2641273 2862036 3269805 3892361 4837846 5997228 6975750
36929 6975750 7611072 8291226 9538609 11497519 13902924 16198448 17589837 17439893 15864174
36920 15864174 13623868 11291035 8904964 6557481 4741262 3767678 3304089 2907207
36912 2907207 2636701 2698975 2830679 2579129 2006323 1601951 1583012 1725712 1836285 1956683
36902 1956683 2114579 2300114 2741944 3754636 5105173 5890486 5389252 3903568 2480878
36893 2480878 1853831 1886692 2023059 1945501 1647618 1156787 548578 145957 299136 863280
36883 863280 1224697 1034239 641304 561743 763898 809370 545081 290114 363112 714237
36873 714237 1038389 1049828 671982 130303 -210886 -261423 -317721 -577010 -755244 -486365
36863 -486365 101544 594748 925074 1344116 1835716 2019107 1670876 964545 185596 -421398
36853 -421398 -558125 -73467 701992 1234048 1424580 1562276 1666868 1429473 877008 501989
36843 501989 527408 586973 396272 215443 307967 424968 251338 -20735 -16234 209857
36833 209857 321347 255758 220564 267778 230869 22115 -255255 -414498 -256107 289243
36823 289243 924310 1125986 740406 220752 56017 200602 315724 325828 418792 669039
36813 669039 968844 1223144 1370602 1325081 1094439 831188 627400 458238 448451 874854
36803 874854 1678702 2313380 2401505 2254852 2379718 2727136 2843761 2562989 2120626 1727558
36793 1727558 1429364 1274257 1250236 1178346 1012413 1054974 1464255 1761867 1370589 519120
36783 519120 17198 148637 392324 310291 86319 -14020 -116243 -323151 -318990 159658
36773 159658 771012 940821 623401 297129 282890 418818 421935 290745 250259 436378
36763 436378 723798 849038 696828 438316 316462 331836 292580 175169 213278 525613
36753 525613 861742 904073 683526 479030 391780 277213 101707 91732 388765 749569
36743 749569 810280 566391 351079 336681 322303 125909 -71255 -10915 192748 215243
36733 215243 61066 82846 427895 810443 941496 860551 689736 400744 72810 64370
36723 64370 557404 1118464 1109220 477949 -190107 -401063 -235089 -67965 -68771 -80751 129598
36712 129598 583768 1033593 1233049 1262703 1412304 1686023 1691747 1203118 560313 226438
36702 226438 177292 91216 -38957 74815 455391 762638 791375 692931 640675 613704 589320
36691 589320 637274 725637 699335 531162 356143 223231 75425 -14544 89508 246457
36681 246457 123062 -279305 -533713 -362222 34342 373919 657026 907882 907008 520705
36671 520705 65826 3337 392003 910292 1294019 1496617 1529875 1415982 1247597 1088146
36661 1088146 874826 597536 460474 628658 896172 883133 551728 260156 262576 417510
36651 417510 511539 638349 1022117 1570519 1881011 1745054 1419292 1241087 1155519 897858
36641 897858 564207 617674 1211047 1849672 1969016 1575079 1033463 511048 31193 -153536
36631 -153536 208471 828239 1105277 933371 775314 883436 1017376 1090547 1473909 2307563
36621 2307563 3030650 3051685 2518965 1998927 1718977 1566993 1531606 1641786 1688686 1504109
36611 1504109 1359846 1625128 2172545 2597465 2893398 3397941 4163115 4936242 5744337
36602 5744337 6900495 8306364 9266289 9197187 8152588 6550746 4825615 3466973 2884277
36593 2884277 2932450 2948460 2533024 1968209 1642525 1484517 1306746 1309903 1759098 2401856
36583 2401856 2704126 2553344 2295909 2151969 2015684 1822534 1719636 1823483 2128248
36574 2128248 2670412 3440898 4092505 4112851 3427656 2524403 1842167 1357378 941260 754026
36564 754026 949968 1256487 1267630 1049376 1051152 1420517 1778707 1764292 1484976 1280477
36554 1280477 1280150 1369021 1409185 1322199 1100753 909314 1036009 1546825 2081838 2191866
36544 2191866 1818609 1274269 834403 564709 481774 614648 883437 1141886 1375164 1650666
36534 1650666 1865184 1808136 1537686 1394051 1488052 1460787 994975 349366 80800 340804
36524 340804 734650 843551 637986 373082 299477 519778 945344 1309996 1325786 896814
36514 896814 182751 -493788 -786274 -535926 11763 336625 184636 -124670 -141537 93806
36504 93806 189705 94598 235934 863569 1630547 2060719 2154469 2230366 2342596 2203872
36494 2203872 1664007 971459 477791 271759 209311 177670 191717 262008 296028 200705
36484 200705 36958 -30236 39526 94784 42602 48086 291791 584689 504047 -3158 -417619
36473 -417619 -253105 319155 716498 707718 605882 687828 768125 533844 53820 -325404
36463 -325404 -470211 -538363 -581778 -405142 39532 393677 293974 -112451 -351523 -268796
36453 -268796 -174756 -295072 -393142 -118815 492365 1089873 1430406 1505108 1353673 1013639
36443 1013639 647857 499657 645279 891415 955431 718179 357077 273698 756124 1594528
36433 1594528 2169422 2088068 1610164 1268871 1240533 1344344 1483971 1701686 1875896 1805026
36423 1805026 1616839 1653398 1852594 1707740 1055760 469033 521419 993243 1207212 940388
36413 940388 583195 488295 554755 481346 144038 -338375 -735762 -882868 -845266 -868902
36403 -868902 -1051583 -1160209 -923229 -397769 130650 508646 775098 954223 1008575 940468
36393 940468 749064 366947 -159382 -532040 -497256 -197560 39586 180731 428637 739154
36383 739154 802896 581852 471007 741309 1139356 1275968 1160127 1072601 1096028 1092816
36373 1092816 1072592 1247901 1655970 1981512 1929356 1646162 1562765 1814819 2016725 1739573
36363 1739573 1090086 608644 619272 904659 1064870 959064 683340 351774 94900 98000
36353 98000 419143 866941 1205800 1356971 1309127 1081127 922003 1202908 1831005 2131770
36343 2131770 1719123 1145466 1166680 1653298 1874866 1667373 1574253 1882479 2290880 2603836
36333 2603836 2980284 3319850 3169748 2531489 2052951 2081099 2203093 2089451 2064866 2359995
36323 2359995 2514187 2148277 1709339 1746329 1982825 1868082 1585415 1673320 1977934 1859451
36313 1859451 1281711 898924 1117220 1739685 2462167 3090154 3355251 3132406 2768084
36304 2768084 2660434 2678096 2528211 2408152 2622903 2862419 2658381 2302495 2425060 2865872
36294 2865872 2940653 2712442 2958163 3874351 4853409 5614675 6550251 7895668 9617860
36285 9617860 12145600 15932387 20045772 22474253 22306227 20588698 18799931 17668689
36277 17668689 17683048 19268809 22022742 25198283 29282883 35541609 44140821 55379743
36269 55379743 72851221 100630203 134134572 157626042 156571358 132312814 100537692
36262 100537692 75451994 59418375 47809753 38069539 30792310 25786407 21594285
36255 21594285 17938032 15611088 14348806 12976872 11306822 10084494 9384269 8622168
36247 8622168 7835264 7474687 7196911 6263185 4954319 4258931 4256967 4069212 3388704 2859815
36237 2859815 2842249 2891411 2656983 2369506 2239227 2171079 2224553 2606911 3072804 3044073
36227 3044073 2488066 2043704 2124763 2454815 2598488 2442778 2090288 1750652 1740268 2138210
36217 2138210 2532561 2583856 2626534 3080094 3491105 2998670 1703857 697655 608627 946849
36207 946849 1097215 1159410 1445722 1819760 1977483 1926263 1835043 1766997 1782906 1945238
36197 1945238 2069118 1858450 1394914 1077668 1022896 998033 975684 1170681 1449402 1347460
36187 1347460 834283 411117 256479 -23890 -516778 -613553 53533 927677 1293348 1195937
36177 1195937 1096781 1113588 1145284 1303609 1634276 1760202 1372868 800973 568791 649208
36167 649208 657218 525343 458121 432508 292894 212595 551504 1307842 2105115 2637739
36157 2637739 2803161 2569721 2087188 1743044 1715292 1667484 1310592 1038114 1463641 2458987
36147 2458987 3224077 3295576 2959594 2634317 2370073 2094472 1889335 1786613 1592065 1142204
36137 1142204 585713 278447 466933 1061398 1623014 1671005 1160986 556795 282775 282047
36127 282047 300432 339315 502941 633227 515407 298976 296361 483039 616359 714192
36117 714192 932350 1081065 831468 373245 256109 511652 565163 191876 -82900 142047
36107 142047 449933 246306 -335660 -679026 -553704 -257201 -61767 25475 39573 -8966
36097 -8966 -13408 97461 162826 39799 -18825 383541 1139226 1624998 1458635 934842 539915
36086 539915 364714 287123 458277 1144401 2134631 2775882 2758306 2506288 2532762 2696025
36076 2696025 2464866 1747997 1022359 661512 562879 515710 522377 581712 535540 389597
36066 389597 468853 948767 1495287 1703026 1663704 1727102 1880586 1791994 1383095 947574
36056 947574 715957 676886 830742 1232286 1705167 1863241 1562275 1093551 823113 836313
36046 836313 1000837 1169271 1241087 1201294 1163383 1242029 1382502 1458465 1482289 1523557 1493336
36035 1493336 1265451 964460 851525 947980 1058883 1135659 1277269 1380910 1195088 805420
36025 805420 667857 978137 1340816 1289365 882369 559889 593020 869751 1091072 1034994
36015 1034994 735457 480492 520413 766952 939867 968838 999625 1036917 920776 688937
36005 688937 583822 594535 377981 -179105 -663353 -628099 -109132 548322 1094290 1399217
35995 1399217 1370058 1103802 896012 862917 774108 469112 185432 224685 528754 844932
35985 844932 1083746 1245676 1227361 1014219 873331 1023936 1252125 1163406 721923 272307
35975 272307 114309 274348 577966 744390 570645 244289 286365 925443 1713066 2040844
35965 2040844 1852539 1536607 1312049 1106276 912554 858376 948855 1073066 1228149 1444670
35955 1444670 1570173 1450884 1254181 1266726 1431933 1448754 1287361 1217490 1319107 1357627
35945 1357627 1209722 1059121 1078622 1220818 1390700 1526259 1465377 1081419 634399 609366
35935 609366 1036700 1318171 970352 272515 -96647 120025 573527 834217 836544 802889
35925 802889 916460 1145259 1328191 1365347 1276282 1093041 834607 662442 878378 1551831
35915 1551831 2255096 2431038 1997888 1364458 895741 640085 561746 694130 956443 1110426
35905 1110426 1074646 1099574 1492826 2307116 3373634 4460638 5290949 5581932 5243742
35896 5243742 4483256 3626860 2883579 2296004 1834920 1513931 1450742 1752331 2259862 2540552
35886 2540552 2313381 1775962 1305913 978269 659693 428398 481260 666496 576113 180036
35876 180036 -74260 65297 308562 339951 257950 231770 125967 -161176 -313726 -7151
35866 -7151 490546 586380 169808 -248481 -224927 119723 359678 261816 -74964 -397766
35856 -397766 -509883 -398466 -228955 -178550 -248252 -245261 55338 696509 1412306 1751768
35846 1751768 1469103 801685 233584 -755 -17958 47569 190995 321640 232972 -66654
35836 -66654 -273511 -216051 -116323 -243680 -552048 -852444 -1084626 -1193007 -1011977 -565404
35826 -565404 -223400 -220139 -246891 76008 511863 468418 -129373 -709327 -834753 -692349
35816 -692349 -691191 -930313 -1206785 -1274246 -969785 -336074 261219 371056 -51847 -573179
35806 -573179 -787415 -708062 -574008 -505660 -503209 -591703 -782586 -1002071 -1187552 -1346508
35796 -1346508 -1421313 -1242567 -756924 -178279 242866 505781 762315 1021779 1138326 1055427
35786 1055427 875404 671954 410864 125577 16674 233722 627968 879489 874806 814778
35776 814778 896110 1032662 1019658 857084 705334 561980 234229 -297584 -711058 -682758
35766 -682758 -254115 277956 697738 945685 999069 897017 818448 918159 1089929 1067945
35756 1067945 775384 424122 246832 251941 272055 169458 -24240 -130992 -17854 213132
35746 213132 329834 312540 415154 749185 1003936 830530 372872 114626 256859 562473
35736 562473 806296 1023974 1219992 1164661 701425 62263 -328030 -263623 139212 612062
35726 612062 875476 747220 294574 -164159 -338180 -224659 -26792 114371 201363 248863
35716 248863 220973 148206 209460 562072 1050800 1217291 787063 119228 -99665 276774
35706 276774 576771 151871 -747275 -1314889 -1250954 -993769 -917070 -848415 -558785 -214954
35696 -214954 -670 312275 963683 1624299 1704319 1157526 543214 286705 270445 218612
35686 218612 105037 10973 -115973 -313260 -405932 -230443 23964 -34537 -472124 -868758
35676 -868758 -823247 -497014 -454798 -952691 -1568093 -1658233 -1076597 -273241 254707 407425
35666 407425 372827 311253 279074 306486 375680 384119 262545 89832 -14145 -63290 -158608
35655 -158608 -292490 -317208 -130574 177821 397871 400468 267417 217203 382304 683778
35645 683778 960117 1143309 1198104 984072 415979 -241030 -523640 -329945 -72587 -113342
35635 -113342 -299156 -291987 -118279 -54249 -115287 -42934 240691 527795 693853 831824
35625 831824 958687 920739 695685 466591 253817 -187288 -875904 -1338194 -1173594 -662597
35615 -662597 -406844 -487227 -429538 -15674 339581 216929 -168141 -275843 10371 300368
35605 300368 305770 188659 208161 287076 156556 -164118 -265932 202695 1093834 1850531
35595 1850531 2011044 1576174 914555 398603 164254 136861 162397 86519 -184741 -581796
35585 -581796 -836124 -660863 -43371 670429 1040433 886916 375040 -201669 -650094 -908852
35575 -908852 -971258 -873833 -733283 -688240 -746212 -730814 -453691 49066 499886 631031
35565 631031 435433 152193 31151 128905 285729 251160 -115372 -664968 -987917 -747712
35555 -747712 -48514 609475 811762 623785 464596 651747 1122114 1527382 1525333 1041577
35545 1041577 352188 -109967 -109860 232953 657008 1025521 1297346 1371471 1176781 889768
35535 889768 835161 1093232 1359943 1289842 874413 404238 149469 161086 316551 467608
35525 467608 556586 626004 707969 733893 621616 421108 261354 165133 60694 -9899 125880
35514 125880 503792 901779 1096898 1102768 1027198 846608 519203 230114 289103 769833
35504 769833 1415917 1928427 2215271 2351404 2447340 2594023 2781508 2797300 2359132 1492648
35494 1492648 681710 456335 828786 1291789 1414446 1285647 1265836 1445676 1563304 1421638
35484 1421638 1141188 915708 734214 518104 367869 422030 543938 428417 42249 -305155
35474 -305155 -416946 -479313 -705253 -923415 -799280 -381717 -127820 -314980 -651284 -625321
35464 -625321 -126673 457393 724053 633200 343966 -112557 -762261 -1370871 -1514332 -1076674
35454 -1076674 -441730 -23621 187171 397068 542735 392787 21765 -191568 -70977
35445 -70977 158434 222559 55846 -337758 -937724 -1491176 -1572307 -1077466 -435973 -132127
35435 -132127 -205223 -377169 -448922 -375878 -164008 73942 109652 -146412 -497293 -699497
35425 -699497 -684725 -437052 86490 726975 1092502 1009620 764118 640188 502089 151051
35415 151051 -205197 -277542 -263328 -587038 -1193461 -1595871 -1574721 -1346410 -1059639 -638405
35405 -638405 -195501 -104212 -474502 -929102 -1072797 -895390 -608588 -385384 -339141 -436708
35395 -436708 -355855 222566 1091324 1653881 1691176 1593826 1686710 1768392 1582409 1342759
35385 1342759 1423960 1789479 2071885 2054174 1804446 1484770 1250020 1194841 1226490 1134580
35375 1134580 887010 644801 428829 113716 -145210 53458 637627 858191 227229
35366 227229 -725669 -1117851 -812989 -330189 47048 417100 676218 513414 50011 -138702
35356 -138702 197820 691522 994446 1209907 1466954 1540256 1222126 723148 363911 127260
35346 127260 -162822 -430937 -456130 -257360 -60865 53371 200323 404224 501596 369585
35336 369585 100967 -77018 31258 468787 1038713 1352194 1121641 478216 -79968 -125700
35326 -125700 326381 897508 1241196 1311183 1265299 1206801 1098672 895611 652587 470989
35316 470989 408422 468673 602583 687074 602430 393972 268842 360978 581824 765756
35306 765756 853054 847164 726486 532211 427966 512665 658955 685934 598141 493772 348819
35295 348819 101998 -132335 -176687 -76399 -42757 -129664 -189673 -143156 -71195 -40287 -44289
35284 -44289 -106532 -214793 -183592 141916 538544 565183 128085 -402617 -704823 -815167
35274 -815167 -828860 -647787 -235048 181014 410437 570477 797982 913899 665331 144199
35264 144199 -313461 -521989 -492583 -238354 166349 442864 353391 48402 -124788 -119221
35254 -119221 -175119 -320146 -252038 169358 627348 732793 489297 192168 28137 -34844
35244 -34844 -73200 -120858 -219419 -400445 -605218 -707502 -630737 -420163 -229194 -239162 -504237
35233 -504237 -826807 -881596 -557774 -114082 111178 91996 77207 176482 173068 -142202 -582796
35222 -582796 -707329 -341354 218143 583196 706568 811647 1015825 1214391 1294548 1263564
35212 1263564 1146520 943734 741589 683419 741035 683513 392428 55998 -94094 -99341
35202 -99341 -152974 -279997 -351378 -350924 -400174 -514191 -524627 -292995 116908 497215 648160
35191 648160 513798 254921 100595 20396 -291018 -895819 -1276996 -898966 -22768 493817
35181 493817 266926 -199042 -318744 -171776 -144231 -250770 -256556 -193843 -277469 -470222
35171 -470222 -596750 -773690 -1227022 -1714558 -1656130 -936035 -118427 278832 309340 246487
35161 246487 150761 27282 -847 6800 -303221 -1021847 -1625988 -1600629 -1149096 -820830
35151 -820830 -651925 -224956 520087 1121196 1282898 1199677 1076188 820040 401560 67814
35141 67814 -61977 -237955 -634480 -990736 -1001345 -787636 -659181 -637897 -545261 -370021
35131 -370021 -226343 -112114 -20866 -122016 -489649 -814826 -773384 -554222 -597781 -885615
35121 -885615 -953419 -613232 -189911 44961 212089 431682 521806 345389 120587 107601
35111 107601 251905 396604 586412 861506 980936 714294 277689 118370 302492 430857
35101 430857 187864 -271113 -524825 -304437 304076 915299 1101669 751864 189907 -161642
35091 -161642 -186991 -32856 211066 539807 797408 726280 333684 -37668 -131518 -78751
35081 -78751 -135841 -282436 -250965 130927 762940 1358358 1589442 1250437 456639 -347853
35071 -347853 -739198 -681973 -451923 -245818 -37914 201889 395136 556210 881501 1438180
35061 1438180 1908211 1891316 1410664 877707 571719 420653 327707 385389 594091 660799
35051 660799 369452 -31373 -130920 66259 204902 159150 159195 298612 312898 15079 -367489
35040 -367489 -503088 -349936 -35898 397171 866420 1095993 927932 648716 671064 967597
35030 967597 1141900 1009610 768757 599585 453032 300325 247863 276337 172145 -126112
35020 -126112 -408212 -607531 -1017761 -1792031 -2483083 -2490531 -1848546 -1153669 -735837 -340650
35010 -340650 264281 803145 893785 646429 510314 653499 816879 742392 460474 142420
35000 142420 -75346 -75200 191090 546580 682219 495293 158756 -194432 -595174 -938333
34990 -938333 -892679 -384017 100772 72786 -260697 -288278 83495 279374 -94524 -696354
34980 -696354 -948413 -744253 -405489 -192803 -123570 -98631 18896 316306 656100 755126
34970 755126 585415 461311 527079 440209 -110432 -801369 -1007408 -624847 -142207 68620
34960 68620 100282 111921 25601 -202599 -347534 -188387 186609 530004 720508 752942
34950 752942 623496 401512 278216 360781 494401 427871 95614 -357404 -736820 -879287
34940 -879287 -678751 -186602 357733 727483 929663 1132813 1389016 1524255 1330689 815162
34930 815162 219893 -203299 -424530 -615431 -893754 -1144940 -1143835 -806904 -273655 199992
34920 199992 372751 155262 -247297 -416130 -129216 333463 468669 129099 -337459 -518994
34910 -518994 -337610 -24036 114670 -109690 -604328 -997921 -994864 -743374 -635048 -730075
34900 -730075 -669205 -233165 319672 626959 647190 512898 239068 -141290 -361437 -168420
34890 -168420 312882 733045 953194 1083400 1182260 1196648 1154383 1146920 1126967 961247 684995
34879 684995 484703 430669 439897 490096 634134 801780 843299 798942 859058 998325 934582
34868 934582 571611 215859 175410 359813 472915 414597 270938 65896 -209988 -403392
34858 -403392 -290946 131586 634150 1004567 1148194 995306 552781 64584 -124757 40030
34848 40030 256894 279688 212669 263974 388424 384414 246024 187052 314582 460004 385161
34837 385161 47307 -381604 -690106 -802606 -823000 -889457 -963860 -853828 -513093 -187907
34827 -187907 -115625 -204623 -227678 -212179 -330716 -476990 -362151 -82874 -134309 -651160
34817 -651160 -1062739 -841367 -250904 65678 -17924 -104030 15966 171239 282441 489706
34807 489706 738506 720299 386002 118301 203652 467236 614008 619695 594314 554473 534204
34796 534204 645139 821857 785446 484126 288199 479948 811174 875577 693570 577356
34786 577356 581742 464687 124180 -252091 -454686 -425321 -210157 35016 64130 -200456
34776 -200456 -491948 -501210 -275128 -93044 -55821 -62483 -90983 -184124 -208992 36692 473186
34765 473186 796431 900845 943998 973200 836362 561645 479119 754918 1053759 923541
34755 923541 397317 -8117 134456 733392 1321278 1529652 1377774 1121470 914725 738848
34745 738848 623994 704348 949006 1062453 844983 476573 239689 150223 102727 151046
34735 151046 297427 209474 -389690 -1150697 -1416926 -1103580 -755756 -685497 -595756 -220478
34725 -220478 199989 368569 405775 529131 615090 437547 65123 -300204 -616438 -834948
34715 -834948 -748180 -368104 -158619 -444039 -825971 -697664 -171038 82851 -133756 -285531
34705 -285531 5576 373423 284441 -226014 -726318 -985202 -1040605 -899119 -563636 -260995
34695 -260995 -252471 -394463 -225525 397600 1029207 1187814 983808 955604 1381767 2006486
34685 2006486 2417244 2435284 2099114 1540958 1012350 785622 824831 749108 360168 27780
34675 27780 246558 934712 1525787 1696479 1621968 1515221 1347317 1132582 1063385 1135923
34665 1135923 994795 433389 -225133 -545041 -555546 -602025 -799430 -974599 -1054957 -1175658
34655 -1175658 -1391617 -1533105 -1393200 -923271 -260748 332643 634883 678285 698349 762096
34645 762096 612262 51480 -682931 -1148026 -1175153 -914613 -548176 -208210 -52355 -123179
34635 -123179 -204935 -92970 68940 7678 -204309 -244732 -92320 -93285 -393722 -672719 -630392
34624 -630392 -458099 -562663 -970301 -1254384 -1037020 -401809 227022 533993 568859 547706
34614 547706 501850 290225 -48626 -211760 -38609 220342 258777 150663 156015 237897
34604 237897 110373 -281387 -642567 -693977 -404486 111073 659010 965738 906717 738540
34594 738540 822260 1115542 1218940 911793 345482 -252897 -702313 -720676 -119543 758392
34584 758392 1238047 1112586 856145 886951 1051564 1051663 920628 760113 437493 -39434
34574 -39434 -214096 251256 945812 1164047 843717 548656 594561 711329 614677 429056
34564 429056 374423 394158 309511 118799 -32336 -27352 191737 630193 1164124 1563348
34554 1563348 1689933 1616998 1497196 1365848 1120576 683826 170759 -150734 -153282 -65424
34544 -65424 -205590 -476152 -398072 195047 780527 752105 191518 -321816 -521982 -636499
34534 -636499 -788994 -716253 -248056 313474 549860 419356 164023 -78948 -324175 -521871
34524 -521871 -540725 -333644 38434 497765 922688 1100387 897952 483517 216971 275573
34514 275573 493920 609626 563665 494578 514110 582757 590223 484551 306855 145108 74273
34503 74273 110563 206840 317413 463806 675377 853927 803120 467938 47408 -248486
34493 -248486 -465393 -767168 -1108177 -1264071 -1166293 -964453 -755374 -541240 -499142 -911148
34483 -911148 -1629112 -1965523 -1452723 -471787 229598 447384 538373 674223 597466 170831
34473 170831 -298323 -473990 -406767 -336558 -332598 -330670 -342485 -436317 -617376 -839760 -1024199
34462 -1024199 -1007940 -648359 -54846 456006 705604 760256 652578 300086 -153464 -256965
34452 -256965 182848 697931 694815 261466 51898 411417 1010818 1400374 1540866 1612380
34442 1612380 1613635 1434155 1159262 1017810 1064850 1135293 1123212 1131335 1296291 1591985 1856433
34431 1856433 1912402 1627087 991580 239753 -234473 -240302 -11712 96549 79819 228337
34421 228337 608262 890048 812198 541387 364395 266590 102585 -23918 65656 195771
34411 195771 31857 -310473 -330305 88534 460659 467901 466181 855903 1342349 1329212 821565
34400 821565 397714 355931 402345 233175 -33785 -153830 -119318 -57786 -45330 -158617
34390 -158617 -431556 -616097 -300560 507465 1201946 1285859 1041497 1138421 1708529 2211808
34380 2211808 2198062 1793480 1331923 885226 400341 26957 -31964 104490 86801 -178263
34370 -178263 -383593 -240296 160198 511732 653237 619190 471693 280631 195997 321086
34360 321086 520762 558527 442908 420759 566055 615743 360846 -5863 -139405 9895
34350 9895 221798 355181 416061 373901 218527 165093 454948 901058 991181 599183 271217
34339 271217 564187 1352808 2071373 2429141 2544504 2518439 2298496 1980259 1859587 2046559
34329 2046559 2291667 2333114 2195126 2002869 1725943 1308654 884630 616922 418816 89596
34319 89596 -289833 -349617 96519 741323 1062772 825924 230658 -338168 -584017 -393059
34309 -393059 147027 747990 1067728 996451 769520 687990 757734 756684 654047 718468 1066471
34298 1066471 1327332 1049361 347469 -181875 -202655 35199 201484 361126 708063 1100742
34288 1100742 1201097 953322 620842 406054 300713 272185 328871 400723 393143 360957
34278 360957 403809 414038 201982 -127869 -239093 -54162 142495 187424 266738 479094
34268 479094 528195 164533 -320064 -406826 -36252 343866 354804 35183 -343517 -551440
34258 -551440 -499546 -280276 -114119 -106480 -109440 33660 227037 305041 334127 461383 584846
34247 584846 515126 396448 573544 1014939 1253743 997558 451470 -77600 -540444 -941166
34237 -941166 -1123235 -1011722 -801066 -651990 -450060 -134054 -4707 -329801 -796666 -786285
34227 -786285 -203026 327098 199935 -465823 -1008094 -953529 -427352 111702 403849 567684
34217 567684 779623 957318 930180 792446 768309 736178 292337 -556210 -1163950 -1016234
34207 -1016234 -403508 50255 251481 542232 922425 956169 487809 -63316 -263538 -113274
34197 -113274 195677 563128 835749 767868 388241 96047 118889 144597 -217321 -842490
34187 -842490 -1273800 -1309259 -1088909 -756225 -386324 -149642 -173343 -253974 -43628 448607
34177 448607 839312 896215 787755 735733 713790 625547 524556 478499 419447 320800 348963
34166 348963 620658 940904 1023686 896771 839420 944303 999005 846200 618400 498562
34156 498562 444933 322301 164470 97515 76131 -71182 -325879 -430938 -240667 68836
34146 68836 270463 405582 637015 892701 921149 702203 526841 550679 500885 51217
34136 51217 -639301 -1037329 -895821 -570845 -577011 -987259 -1419275 -1522545 -1301617 -970800
34126 -970800 -678656 -478620 -445492 -623660 -838093 -735523 -169801 506147 704885 218994
34116 218994 -531824 -940034 -815784 -466634 -256250 -241141 -241630 -103999 192355 566713
34106 566713 843789 792853 320447 -353944 -832011 -895194 -655650 -339259 -54712 148231
34096 148231 152549 -97256 -405546 -490226 -355995 -290971 -430611 -555322 -455858 -267175
34086 -267175 -205351 -169147 47961 243503 -51664 -817361 -1348782 -1095468 -406509 -78903
34076 -78903 -331475 -646995 -614175 -480289 -665753 -1038832 -1008881 -278220 751558 1378863
34066 1378863 1285789 777288 407145 414563 533668 366160 -91065 -395496 -186312 355786
34056 355786 719902 674970 469415 402403 437623 408896 419497 729623 1270825 1603840
34046 1603840 1497947 1279143 1352199 1575957 1472368 988486 631402 740919 1020482 1041492
34036 1041492 889088 921809 1086197 945527 379693 -195026 -423336 -428619 -431807 -331492
34026 -331492 -3003 265146 84534 -392406 -599578 -350792 -78203 -140545 -290907 -114050
34016 -114050 291980 445240 175569 -162947 -184567 99972 396554 437582 118942 -439747
34006 -439747 -860946 -747428 -121369 528150 800793 834340 998241 1303364 1434162 1303417
33996 1303417 1196463 1285520 1357392 1214829 1044582 1106296 1284880 1293421 1169971 1181987
33986 1181987 1297874 1182765 780981 488775 576101 788531 753990 483253 196976 -70526
33976 -70526 -366894 -550067 -503019 -454826 -669512 -925180 -773945 -296645 -88313 -393823
33966 -393823 -756032 -737541 -539831 -581623 -820148 -884479 -655427 -332649 -62747 164945
33956 164945 342931 444511 509700 505693 254416 -237518 -563805 -382187 53369 221191
33946 221191 89974 100332 415857 671957 561535 248314 55150 97528 353287 738509
33936 738509 976199 763255 245954 -38709 102513 230876 -23407 -383505 -419555 -256664
33926 -256664 -310399 -563486 -640131 -490877 -471136 -709476 -867890 -666572 -285603 -62080
33916 -62080 -40262 -10345 159265 391812 540936 557060 510405 460092 336682 54803 -267102
33905 -267102 -394662 -346337 -425168 -739131 -965505 -825048 -516126 -361101 -284721 -68728
33895 -68728 74153 -292680 -1094498 -1717672 -1768696 -1438299 -1069518 -805856 -749921 -1016827
33885 -1016827 -1469725 -1787670 -1928393 -2111968 -2205600 -1633811 -221978 1281016 1931952
33876 1931952 1604449 945620 549457 499768 557053 481757 259415 183195 545666 1117587
33866 1117587 1238602 661357 -26244 -153893 166766 347651 225712 139018 249319 351311
33856 351311 368472 527515 904053 1185928 1062704 581363 -16856 -590493 -1114228 -1568650
33846 -1568650 -1893119 -1949154 -1568434 -787744 44230 593430 876159 1042717 989733 551029
33836 551029 -37280 -329420 -334400 -497681 -909133 -1030054 -462528 426189 973079 992914
33826 992914 749488 439662 105202 -126349 -129606 -34813 -28184 53472 543124 1321391 1760095
33815 1760095 1463543 785941 370849 352039 294452 -122069 -655320 -849139 -627989 -328723
33805 -328723 -210310 -187981 -124671 -148348 -468369 -1000399 -1420304 -1553443 -1471774 -1216685
33795 -1216685 -727466 -148907 89856 -241877 -781197 -947023 -662098 -430663 -657132
33786 -657132 -1132736 -1344169 -1127105 -784141 -576672 -346423 192180 899632 1210519 777182
33776 777182 -48764 -549441 -406338 19001 170489 -80258 -368438 -320074 -4995 139425
33766 139425 -164235 -659183 -823244 -490811 -20893 216871 297038 496048 787091 869760
33756 869760 632959 294135 64073 -72252 -192330 -276914 -286585 -225807 -86290 111638
33746 111638 215085 82141 -151492 -186921 6065 126431 2094 -149407 -67048 182864
33736 182864 368730 434702 478659 539089 601276 700040 839877 923190 923694 1002067 1245307
33725 1245307 1403363 1147659 573183 192100 346249 791636 985731 703926 230666
33716 230666 -72468 -229880 -500257 -814622 -699410 32505 793611 828789 202718 -274704
33706 -274704 -131572 229049 217060 -174596 -544295 -642125 -445285 -262 462558 531301
33696 531301 104804 -331965 -287701 83468 288595 244676 259320 393211 352194 31657
33686 31657 -261094 -204887 227381 872313 1490576 1820114 1856826 2027432 2676185 3406274
33676 3406274 3412195 2536520 1509886 994817 880128 762989 646066 750041 963719 947719
33666 947719 658712 403327 416667 652717 949656 1176777 1237790 1109364 884994 687916
33656 687916 570758 540724 580837 589961 430482 104796 -244513 -548718 -838629 -1002332
33646 -1002332 -782426 -181142 358901 408956 51209 -270666 -268642 356 316709 455290
33636 455290 268576 -169174 -556881 -664628 -560218 -414628 -230928 45995 291977 308825
33626 308825 77675 -287747 -710454 -1042681 -953996 -276791 597103 1028403 864822 539783
33616 539783 396861 277938 -68303 -496694 -655428 -492381 -307586 -339229 -466411 -337025
33606 -337025 258534 1101153 1625875 1412085 647327 -8507 -88513 247590 491016 362867
33596 362867 25009 -175256 -51085 277963 501018 419553 177594 110389 323142 540467
33586 540467 466048 182488 55982 292515 712365 956580 834872 472184 159107 53060
33576 53060 37065 -63541 -162395 17117 512544 985657 1167657 1245174 1558373 2040514
33566 2040514 2260327 2002901 1522557 1169515 1018659 954924 889933 751874 443329 -20347
33556 -20347 -431139 -567789 -381551 38601 533753 846572 738484 285891 -113488 -190221
33546 -190221 -88776 -42641 6204 198756 376370 273841 -6625 -93206 115804 373752
33536 373752 531224 659075 695587 425206 -49351 -260176 -47816 106414 -258569 -905702
33526 -905702 -1240849 -1086691 -744990 -481540 -342958 -357867 -519861 -614084 -405338 21787
33516 21787 403329 717326 1136772 1591754 1726833 1341965 610341 -145930 -634306 -593949
33506 -593949 27686 858540 1369670 1407364 1202565 908331 512457 193199 270008 671142
33496 671142 910057 783766 652365 788407 917166 753818 562061 703679 963857 880385
33486 880385 551816 534157 973506 1392552 1431290 1320800 1420471 1653767 1673552 1357407
33476 1357407 867275 340705 -208587 -682132 -817653 -468094 111234 431518 287750
33467 287750 -35747 -198757 -275950 -535920 -874221 -887022 -563779 -450389 -886954 -1466368
33457 -1466368 -1582635 -1209050 -745377 -353074 86402 510046 688066 683823 831586 1194024
33447 1194024 1450719 1418784 1301425 1286959 1256657 1070126 832606 670442 500283 246643
33437 246643 72230 143040 317525 322061 157273 111182 392082 909037 1405577 1692477
33427 1692477 1770108 1837824 2180639 2930630 3879449 4570984 4652927 4177071 3534362 3048417
33417 3048417 2660319 2114286 1436463 1020256 1113335 1408842 1383186 952563 537983 487915
33407 487915 682392 774229 632289 444605 488999 864184 1370637 1635245 1439164 944290
33397 944290 535004 440859 560011 607253 379924 -50510 -350683 -231019 195786 502624
33387 502624 464083 281076 189475 134141 36064 61027 296837 459514 331939 219443
33377 219443 457517 701189 343548 -468597 -931337 -707106 -248147 96595 537325 1145142
33367 1145142 1429901 1053531 394796 -40485 -262685 -413779 -280197 250181 703852
33358 703852 629399 336545 373237 559790 279208 -427105 -826363 -595203 -263484 -374891
33348 -374891 -754403 -875758 -578525 -157524 42437 -59428 -257827 -297077 -193333 -218679
33338 -218679 -446676 -539635 -240840 165702 256754 124626 177015 422380 466366 183741
33328 183741 -101816 -135418 19351 268202 564230 660103 266799 -436454 -893385 -878596
33318 -878596 -688720 -545332 -294426 146301 519849 624940 572253 475060 312432 255326
33308 255326 623261 1284038 1613023 1348825 983342 961342 1028623 818611 565297 657353
33298 657353 893618 807173 429262 124223 -66410 -286147 -324450 65614 461191 152270
33288 152270 -769368 -1437041 -1415175 -1172454 -1176453 -1214290 -940039 -515902 -298556 -300910 -322900
33277 -322900 -270399 -49125 487698 1173652 1492543 1271071 1043888 1302997 1720868 1641502
33267 1641502 1090867 685419 632811 471098 -90738 -646145 -685107 -312007 -20206 14275
33257 14275 53466 294046 574848 667364 635617 715181 895891 852985 416913 -49223 -7868
33246 -7868 528362 932741 750473 272438 101466 380792 761935 968501 1005377 868030
33236 868030 455242 -157298 -690921 -1011114 -1214414 -1296215 -1074020 -585250 -208689 -154327
33226 -154327 -143620 108408 373443 250338 -168046 -388889 -192545 187423 515229 774474
33216 774474 926492 882103 825588 1151062 1866442 2411037 2332206 1860180 1519646 1420159
33206 1420159 1283703 1001519 768139 723376 824831 1073594 1520762 1996132 2157793 1936303
33196 1936303 1676022 1724840 2141237 2923786 4181911 5760091 6915809 6814727 5401234
33187 5401234 3512204 2063782 1321023 988473 739541 486707 312501 350401 662350
33178 662350 1069834 1186665 828088 353889 350082 900338 1413382 1332714 816858 467751
33168 467751 511553 580734 324364 -100849 -308908 -198792 53068 358752 786454 1288622
33158 1288622 1620238 1600535 1303825 944258 706871 717726 991399 1293902 1210450 540998
33148 540998 -405368 -1064283 -1180638 -1005105 -902714 -907583 -794667 -516598 -346760 -487978
33138 -487978 -707395 -588748 -109490 296328 329009 216808 325131 592446 671233 522323
33128 522323 482350 691942 824429 564613 76629 -244071 -277062 -171131 -5122 214962
33118 214962 313789 94880 -220995 -90845 615539 1264509 1140187 328141 -385711 -446645
33108 -446645 -67382 190339 76649 -239263 -496604 -564591 -446403 -263008 -200837 -329876
33098 -329876 -500738 -541453 -503272 -566484 -754414 -921751 -1001995 -1061619 -1097169 -996889 -760265
33087 -760265 -551805 -463885 -424435 -408008 -500269 -648996 -624112 -394807 -267263 -415591
33077 -415591 -558934 -413328 -183233 -179722 -177036 295247 1091784 1480172 1130228 539481
33067 539481 276192 280551 196047 -23031 -182209 -204044 -69144 324235 883397 1150373
33057 1150373 809995 195743 -111084 -52108 -45292 -261919 -414405 -288818 -59477 41278
33047 41278 24188 -8536 -13369 120622 547471 1141355 1462492 1263072 830697 608983
33037 608983 636507 606712 387334 213589 339456 680611 890826 733250 325676 11032
33027 11032 -15275 100803 119791 83081 257382 683353 1002832 890266 515051 376477
33017 376477 724422 1308049 1687275 1645339 1271748 771968 282955 -161162 -543958 -788288
33007 -788288 -811707 -674143 -587844 -686547 -814748 -658933 -122078 508921 831779 736979
32997 736979 485691 367191 339004 93617 -507570 -1177698 -1484275 -1323000 -968747 -677708
32987 -677708 -429717 -116930 218618 484868 725525 1014691 1256599 1280632 1072024 724690
32977 724690 247903 -339117 -780122 -762223 -354372 42071 251878 500736 899486 1126167
32967 1126167 886527 384844 22142 -103362 -46725 337812 1117758 1853930 2010871 1701455
32957 1701455 1456370 1322392 862199 93807 -323826 -61391 453438 881823 1463085
32948 1463085 2200570 2401405 1765078 1184017 1506380 2146283 2147819 2171319 3815987 6854989
32938 6854989 8769555 7759621 4996168 2946595 2408875 2329319 1909105 1538991 1700987
32929 1700987 2079496 2111477 1741050 1276009 901603 622690 462325 513427 848908 1392500
32919 1392500 1845636 1892519 1583359 1297279 1176714 906305 311435 -175062 -69353 399920
32909 399920 588982 354537 155943 296518 571371 713881 739376 739767 710690 701989 834247
32898 834247 1060668 1167998 1091462 1009640 1089609 1338817 1694604 2041232 2178798 2012462
32888 2012462 1721986 1518914 1349220 1104630 958235 1113119 1354574 1290719 944993 643025
32878 643025 399755 -29248 -509289 -555168 -80344 504492 1093809 2109728 3593109
32869 3593109 4695730 4598262 3542069 2464445 1898634 1688607 1555964 1450927 1394048
32860 1394048 1338457 1222750 991336 618851 210420 -70439 -256853 -540497 -877273 -911626
32850 -911626 -460791 187302 628377 728972 515463 20556 -535618 -755468 -545319 -290912
32840 -290912 -271751 -231413 121909 526023 548444 330377 418872 923908 1314857 1103122
32830 1103122 378877 -387989 -809795 -793063 -505879 -200759 28962 292341 638644 882759
32820 882759 819932 490524 104123 -169380 -227388 -24636 345593 738842 1216594 1966476
32810 1966476 2844352 3305192 3018162 2315544 1813770 1782819 2040774 2241289 2147594 1886798
32800 1886798 1973020 2679579 3370657 3079063 1921962 1190336 1633730 2427007 2452092 1873038
32790 1873038 1595659 1741804 1665078 1143499 546049 -22599 -786718 -1578698 -1961381 -2058953
32780 -2058953 -2386717 -2833691 -2725210 -2008082 -1458974 -1481694 -1541889 -1088895 -237444 833062
32770 833062 2404650 4640496 6988070 8584234 8946636 8165863 6903534 6200093 6532810
32761 6532810 6909022 5722607 2819502 -93278 -1472018 -1548035 -1463634 -1685976 -1974743
32752 -1974743 -2175381 -2200600 -1747946 -849190 -295133 -732924 -1648874 -1967182 -1396235 -521501
32742 -521501 147113 507782 472625 -24318 -698294 -1169732 -1448657 -1693377 -1724850 -1322386
32732 -1322386 -734589 -297124 166086 874113 1322945 839724 -250005 -904877 -794262
32723 -794262 -549633 -541857 -383832 91160 311894 -70117 -478488 -291893 155856 126658
32713 126658 -371078 -669230 -475434 -188552 -208868 -461454 -706589 -922843 -1175729 -1333261
32703 -1333261 -1162221 -687644 -279173 -261996 -502822 -550923 -206314 265731 569887 752826
32693 752826 931851 936245 574924 70866 -182328 -186459 -242555 -375464 -331000 -131416 -112384
32682 -112384 -308630 -306126 99604 544999 646879 516040 435615 382532 225027 122795
32672 122795 322242 697629 888816 867197 1020571 1584580 2215392 2290214 1598479 659994
32662 659994 308573 915890 2026095 2782078 2679023 1882339 944551 356370 264936 402502
32652 402502 309170 -175635 -653724 -590943 27581 694411 1020303 1096956 1163911 1220182
32642 1220182 1157331 1072520 1195360 1547252 1857905 1862468 1591281 1298906 1138323 1015776
32632 1015776 822017 657980 641138 614303 375577 154876 424371 1148201 1699373 1715560
32622 1715560 1528855 1461441 1273377 778836 459241 815707 1527923 1947929 2080622 2355501
32612 2355501 2764758 3025269 3294727 3875640 4505856 4850245 5309255 6239280 6860213
32603 6860213 6463903 6294544 8038418 10236155 8816754 2521578 -4419806 -7031232
32595 -7031232 -5411765 -3542806 -3500528 -3700756 -2613127 -1244106 -1031399 -1495799 -1372658
32586 -1372658 -671873 -270294 -365560 -541806 -781381 -1341173 -1966509 -2125230 -1845261 -1623761
32576 -1623761 -1642295 -1644244 -1469255 -1218612 -998059 -911762 -1171042 -1787032 -2275623 -2110690
32566 -2110690 -1433826 -916765 -912317 -1113489 -1119938 -986839 -1018295 -1242956 -1354763 -1135967
32556 -1135967 -743409 -507565 -561372 -775816 -977284 -1041933 -804531 -157273 651108 1099810
32546 1099810 999195 767215 830707 992667 767335 154123 -382569 -617034 -760770 -954704
32536 -954704 -1045743 -970472 -937296 -1072378 -1217257 -1199500 -1014670 -696710 -345010 -280454
32526 -280454 -728805 -1298617 -1297596 -713499 -325357 -596509 -1032589 -1013591 -708177 -621202
32516 -621202 -673422 -405968 126615 353559 66939 -268005 -200633 122648 225278 -112546
32506 -112546 -662120 -992997 -862691 -449254 -156531 -128755 -118561 53855 174925 26440
32496 26440 -143377 81992 642508 1048433 1038872 832643 708474 676579 642312 609663 604364
32485 604364 579784 477699 269210 -39544 -306731 -267840 120860 459181 331783 -108526
32475 -108526 -348304 -274390 -289629 -607855 -938353 -1097115 -1421257 -2116685 -2551775 -1845542
32465 -1845542 -127403 1367148 1650136 1020149 487500 498148 635888 439237 29905
32456 29905 -179016 -27662 368948 874935 1303080 1314005 738114 -42273 -424174 -347149
32446 -347149 -331038 -633133 -824506 -508590 -47133 -65740 -465862 -523117 31292 580638
32436 580638 457648 -203781 -707268 -603161 -13707 625563 880435 525126 -275869 -1016171
32426 -1016171 -1270245 -1065804 -728212 -437537 -115569 290815 630604 721272 568598 333309
32416 333309 154746 72633 60006 52463 -20877 -137500 -99569 342575 1186559 2026940 2322396
32405 2322396 1872832 1002494 258424 -32021 74281 288815 339845 158241 -77551 -105688
32395 -105688 143270 456481 562089 391235 80826 -192578 -297722 -161349 158903 439775
32385 439775 464545 258292 81548 176489 548743 964406 1121985 887604 423197 32254
32375 32254 -151453 -214928 -171768 168840 859966 1533155 1764356 1659458 1742982 2223241
32365 2223241 2705439 2813936 2834596 3417732 4681464 5882917 6125371 5312372 4253159
32356 4253159 3777074 3861290 3789684 3120050 2224913 1761571 1859377 2078433 2008918 1605847
32346 1605847 1008555 368682 -102585 -206523 7626 251545 300813 139677 -189127 -659427
32336 -659427 -1147256 -1450869 -1490620 -1341597 -1088264 -853553 -915287 -1468041 -2237474 -2669256
32326 -2669256 -2579602 -2275713 -1947843 -1381426 -498651 235945 316849 -176950 -800839 -1332067
32316 -1332067 -1771397 -1997645 -1871440 -1571686 -1415921 -1396647 -1253437 -945431 -679951 -500153
32306 -500153 -224308 178901 506024 667076 803836 990690 1099836 1034625 843043 552443
32296 552443 153950 -204747 -289213 -108942 76953 135326 174276 244725 234732 137661 116678
32285 116678 206667 258343 267006 408827 634585 623007 320668 110587 179875 139124 -364763
32274 -364763 -1033857 -1362314 -1380324 -1449687 -1571200 -1481780 -1285362 -1323591 -1410876 -876687
32264 -876687 418001 1672349 2083547 1774883 1429286 1329323 1189070 766160 218314
32255 218314 -148131 -187762 75039 535494 1012872 1270444 1142593 695175 265836 242960
32245 242960 669757 1126704 1196804 1002477 1003085 1253079 1260009 767565 273052 360905 788400
32234 788400 778547 174891 -267690 61871 754210 934641 415997 -161869 -270335 -102233
32224 -102233 -99235 -242954 -150302 282374 694937 750742 515963 245120 44286 -66441
32214 -66441 26602 366215 703575 760576 673158 835295 1268069 1513827 1308897 1010225
32204 1010225 1076087 1386962 1440174 1074453 621717 369775 233174 25920 -239679 -457941
32194 -457941 -604457 -644786 -430004 133575 870797 1418151 1500275 1093580 410940 -191570
32184 -191570 -381816 -80578 444165 790554 788494 641197 667706 909297 1061093 851505
32174 851505 411750 117712 87606 59453 -157029 -360758 -295639 -99097 -109838 -339659
32164 -339659 -483211 -432857 -420093 -567527 -644913 -440192 -92694 156143 319034 528130
32154 528130 719819 734760 646629 716603 1010162 1264181 1189644 789870 342805 133186
32144 133186 207212 357876 377134 315587 387940 607774 696217 460033 99833 -11979
32134 -11979 258945 760661 1268409 1561289 1437134 916188 360893 135822 178201 138278
32124 138278 -105280 -352856 -483642 -607691 -749290 -718320 -459371 -237271 -256865 -339369
32114 -339369 -235521 -65360 -136556 -440206 -658109 -648329 -611012 -720965 -872426 -896520
32104 -896520 -800282 -641065 -347842 150859 738996 1218509 1504401 1558498 1263287 617633
32094 617633 -7740 -140963 184846 391541 96413 -353440 -342117 197302 752545 947666
32084 947666 928180 972898 1056411 985950 748441 490689 269866 28637 -237159 -456118
32074 -456118 -602742 -707009 -755156 -689831 -504869 -264241 -48493 57027 -24024 -263572
32064 -263572 -483158 -498868 -302944 -44218 132426 163736 47456 -151965 -302571 -307181
32054 -307181 -211150 -153290 -225791 -426151 -700603 -955623 -1049040 -868943 -479126 -164571
32044 -164571 -241289 -699882 -1041955 -688310 289417 1052249 915040 241572 -9108 415378
32034 415378 765233 434736 -188495 -385205 -115526 137961 162366 70044 -167992 -602533
32024 -602533 -863284 -496342 274707 752518 771963 867813 1318707 1685003 1569021 1238175
32014 1238175 1102360 1056076 794770 422426 261090 281258 168774 -162106 -497130 -696987
32004 -696987 -832887 -961522 -985932 -758055 -242249 358282 641578 378732 -120562 -288431
31994 -288431 -15701 239281 166183 22832 125347 330660 353498 250868 223201 232500
31984 232500 200691 307575 676968 1014615 990508 754574 625418 500981 95498 -428344
31974 -428344 -642812 -564799 -594536 -787863 -790036 -525294 -351508 -419972 -461580 -382490 -505595
31963 -505595 -956520 -1320458 -1247593 -978918 -905314 -954223 -808415 -474373 -239699 -228722
31953 -228722 -340950 -509109 -709771 -803252 -649477 -354080 -174290 -187673 -219394 -89493
$$ [...]
##END NTUPLES=NMR SPECTRUM
##END=
