##TITLE=31P_DE-80H_X3
 64 sc D2O
 26.2.2025
##JCAMPDX= 6.0         $$ Bruker NMR JCAMP-DX V2.0
##DATA TYPE= NMR SPECTRUM
##DATA CLASS= NTUPLES
##ORIGIN= UXNMR, Bruker Analytische Messtechnik GmbH
##OWNER= root
$$ XWIN-NMR		Version 3.5
$$ Thu Jul  3 11:49:55 2025 Russian Standard Time (UT+4h)  Yarkov@DPX200
##.OBSERVE FREQUENCY= 81.013821
##.OBSERVE NUCLEUS= ^31P
##.ACQUISITION MODE= SIMULTANEOUS
##.ACQUISITION SCHEME= undefined
##.AVERAGES= 64
##.DIGITISER RES= 17
##SPECTROMETER/DATA SYSTEM= spect
##.PULSE SEQUENCE= zgpg30
##.SOLVENT NAME= DMSO
##.SHIFT REFERENCE= (INTERNAL, DMSO, 0, 198.062)
##AUDIT TRAIL= $$ (NUMBER, WHEN, WHO, WHERE, WHAT)
$$ ##TITLE= Audit trail, XWIN-NMR		Version 3.5
$$ ##JCAMPDX= 5.01
$$ ##ORIGIN= Bruker BioSpin GmbH
$$ ##OWNER= Yarkov
$$ C:/Bruker/XWIN-NMR/data/yarkov2/nmr/P31/2/pdata/1/auditp.txt
$$ ##AUDIT TRAIL=  $$ (NUMBER, WHEN, WHO, WHERE, WHAT)
(   1,<2025-07-03 11:48:30.07 +0400>,<Yarkov>,<DPX200>,
      <created by zg, POWCHK disabled, PULCHK disabled
       configuration hash MD5:
       00 E9 B6 7A A2 85 ED C7 34 08 36 98 17 FE 4E 26
       data hash MD5: 32K
       14 DC 5E 7A F2 32 94 81 02 CD B3 9E 86 66 34 13>)
(   2,<2025-07-03 11:48:43.67 +0400>,<Yarkov>,<DPX200>,
      <Start of raw data processing
       efp BC_mod = 2 LB = 1.5 FT_mod = 6 PKNL = 1 PHC0 = 1677.094 PHC1 = 46.35953 SI = 64K 
       data hash MD5: 64K
       DD 08 5E E8 23 AB 6F B3 2D AB C1 06 32 B5 EB EB>)
(   3,<2025-07-03 11:49:14.03 +0400>,<Yarkov>,<DPX200>,
      <pk PHC0 = -0.6508042 PHC1 = 2.8 
       data hash MD5: 64K
       77 13 52 7C 18 B7 3A 56 21 DF AE 9E CE F1 A4 51>)
$$ ##END=
$$ 
$$ hash MD5
$$ 3D E7 BE 65 EB 90 67 B0 8A F4 AE DD 3C B4 07 E3
##$RELAX= 
##$RELAX= 
##$RELAX= 
##$RELAX= 
##$RELAX= 
##$RELAX= 
##$RELAX= 
##$RELAX= 
$$ Bruker specific parameters
$$ --------------------------
##$DU= <C:/Bruker/XWIN-NMR>
##$EXPNO= 2
##$NAME= <P31>
##$PROCNO= 1
##$TYPE= <nmr>
##$USER= <yarkov2>
##$AMP= (0..31)
100 100 100 100 100 100 100 100 100 100 100 100 100 100 100 100 100 100 
100 100 100 100 100 100 100 100 100 100 100 100 100 100 
##$AQSEQ= 0
##$AQ_mod= 1
##$AUNM= <au_zg>
##$AUTOPOS= <>
##$BF1= 81.014009
##$BF2= 200.13
##$BF3= 200.13
##$BF4= 200.13
##$BF5= 200.13
##$BF6= 200.13
##$BF7= 200.13
##$BF8= 200.13
##$BYTORDA= 1
##$CFDGTYP= 0
##$CFRGTYP= 5
##$CHEMSTR= <none>
##$CNST= (0..31)
1 1 145 1 1 1 1 1 1 1 1 1 1 1 1 1 1 1 1 1 1 1 1 1 1 1 1 1 1 1 1 1 
##$CPDPRG= <waltz16>
##$CPDPRG1= <>
##$CPDPRG2= <waltz16>
##$CPDPRG3= <>
##$CPDPRG4= <mlev>
##$CPDPRG5= <mlev>
##$CPDPRG6= <mlev>
##$CPDPRG7= <mlev>
##$CPDPRG8= <mlev>
##$CPDPRGB= <>
##$CPDPRGT= <>
##$D= (0..31)
0 1 0 0 0 0 0 0 0 0.06 0 0.03 2e-05 3e-06 0 0 0.0002 0 0 0 0 0 0 0 0 0 
0 0 0 0 0 0 
##$DATE= 1751528909
##$DBL= (0..7)
120 120 120 11 120 120 24 19 
##$DBP= (0..7)
150 150 150 150 150 150 150 150 
##$DBP07= 0
##$DBPNAM0= <>
##$DBPNAM1= <>
##$DBPNAM2= <>
##$DBPNAM3= <>
##$DBPNAM4= <>
##$DBPNAM5= <>
##$DBPNAM6= <>
##$DBPNAM7= <>
##$DBPOAL= (0..7)
$$ [...]
##$SUBNAM2= <"">
##$SUBNAM3= <"">
##$SUBNAM4= <"">
##$SUBNAM5= <"">
##$SUBNAM6= <"">
##$SUBNAM7= <"">
##$SUBNAM8= <"">
##$SUBNAM9= <"">
##$SW= 400.765351723535
##$SWIBOX= (0..15)
0 1 3 0 0 0 0 0 0 0 0 0 0 0 0 0 
##$SW_h= 32467.5324675325
##$TD= 32768
##$TD0= 1
##$TE= 0
##$TE2= 300
##$TE3= 300
##$TEG= 300
##$TL= (0..7)
0 120 53 12 22 120 120 120 
##$TP= (0..7)
150 150 150 150 150 150 150 150 
##$TP07= 0
##$TPNAME0= <>
##$TPNAME1= <>
##$TPNAME2= <>
##$TPNAME3= <>
##$TPNAME4= <>
##$TPNAME5= <>
##$TPNAME6= <>
##$TPNAME7= <>
##$TPOAL= (0..7)
0.5 0.5 0.5 0.5 0.5 0.5 0.5 0.5 
##$TPOFFS= (0..7)
0 0 0 0 0 0 0 0 
##$TUNHIN= 0
##$TUNHOUT= 0
##$TUNXOUT= 0
##$USERA1= <user>
##$USERA2= <user>
##$USERA3= <user>
##$USERA4= <user>
##$USERA5= <user>
##$V9= 5
##$VALIST= <valist>
##$VCLIST= <CCCCCCCCCCCCCCC>
##$VD= 0
##$VDLIST= <DDDDDDDDDDDDDDD>
##$VPLIST= <PPPPPPPPPPPPPPP>
##$VTLIST= <TTTTTTTTTTTTTTT>
##$WBST= 1024
##$WBSW= 4
##$XGAIN= (0..3)
0 0 0 0 
##$XL= 0
##$YL= 0
##$YMAX_a= 1917
##$YMIN_a= -460
##$ZGOPTNS= <>
##$ZL1= 120
##$ZL2= 120
##$ZL3= 120
##$ZL4= 120
##$ABSF1= 0
##$ABSF2= 0
##$ABSG= 0
##$ABSL= 0
##$ALPHA= 0
##$AQORDER= 0
##$ASSFAC= 0
##$ASSFACI= 0
##$ASSFACX= 0
##$ASSWID= 0
##$AUNMP= <proc_1d>
##$AZFE= 0.1
##$AZFW= 0.5
##$BCFW= 0
##$BC_mod= 2
##$BYTORDP= 0
##$COROFFS= 0
##$CY= -3
##$DATMOD= 1
##$DC= 0
##$DFILT= <>
##$DTYPP= 0
##$F1P= 0
##$F2P= 0
##$FCOR= 1
##$FTSIZE= 65536
##$FT_mod= 6
##$GAMMA= 0
##$GB= 0
##$INTBC= 1
##$INTSCL= 9.790993e-09
##$ISEN= 30
##$LB= 1.5
##$LEV0= 0
##$LPBIN= 0
##$MAXI= 10000
##$MC2= 0
##$MEAN= 0
##$ME_mod= 0
##$MI= 50
##$NCOEF= 0
##$NC_proc= -11
##$NLEV= 6
##$NOISF1= 182.463
##$NOISF2= 159.3651
##$NSP= 0
##$NTH_PI= 0
##$NZP= 0
##$OFFSET= 198.0616
##$PC= 4
##$PHC0= 1676.443
##$PHC1= 49.15953
##$PH_mod= 1
##$PKNL= yes
##$PPARMOD= 0
##$PSCAL= 0
##$PSIGN= 0
##$REVERSE= no
##$SF= 81.0140089999434
##$SI= 65536
##$SIGF1= 159.3651
##$SIGF2= -187.1042
##$SINO= 113.3802
##$SIOLD= 16384
##$SREGLST= <1H.CDCl3>
##$SSB= 0
##$STSI= 65536
##$STSR= 0
##$SW_p= 32467.5324675325
##$SYMM= 0
##$S_DEV= 0
##$TDeff= 32768
##$TDoff= 0
##$TI= <>
##$TILT= no
##$TM1= 0
##$TM2= 0
##$TOPLEV= 0
##$USERP1= <user>
##$USERP2= <user>
##$USERP3= <user>
##$USERP4= <user>
##$USERP5= <user>
##$WDW= 1
##$XDIM= 65536
##$YMAX_p= 374073609
##$YMIN_p= -52245524
$$ End of Bruker specific parameters
$$ ---------------------------------
##NTUPLES= NMR SPECTRUM
##VAR_NAME=  FREQUENCY,     SPECTRUM/REAL,   SPECTRUM/IMAG
##SYMBOL=    X,             R,               I
##VAR_TYPE=  INDEPENDENT,   DEPENDENT,       DEPENDENT
##VAR_FORM=  AFFN,          ASDF,            ASDF
##VAR_DIM=   65536,         65536,           65536
##UNITS=     HZ,            ARBITRARY UNITS, ARBITRARY UNITS
##FACTOR=    0.49542278885378, 1,            1
##FIRST=     16045.7642231865, 0,            0
##LAST=      -16421.768244346, 0,            0
##MIN=       -16421.768244346, -52245524,    0
##MAX=       16045.7642231865, 374073609,    0
$$ Real data points
##PAGE= N=1
##DATA TABLE= (X++(R..R)), XYDATA
$$ [...]
39072A248311N68013J57684n77664p58141l98534j38024j18804l3239N1281j35423
$$ 1248311 1816324 1974008 1396344 638203 239669 101645 -17159 -50398 883 -134540
39062a34540k62965K34526R95235R42657j08294r89992p63507K9036K81279j39729
$$ -134540 -397505 -162979 832256 1774913 1666619 676627 -86880 -57844 223435 83706
39052H3706m87648l42975M5265M03931O62845N99421M691o94849o94623M3304
$$ 83706 -403942 -746917 -701652 -297721 365124 964545 969236 274387 -420236 -376932
39042c76932N36909P7762p60275r32144l27053K71134L80090K76296K94787L41830
$$ -376932 159977 237739 -522536 -1454680 -1781733 -1510599 -1130509 -854213 -559426 -217596
39032b17596K66895J92444K33378K77044K66572L72349O55780Q41100O47706J42223
$$ -217596 49299 241743 475121 752165 1018737 1391086 2046866 2887966 3535672 3677895
39022C677895m00150p71736q46261n68863q9053L01551M65955M46902J97680l45603
$$ 3677895 3277745 2506009 1659748 1090885 1001832 1303383 1769338 2216240 2413920 2068317
39012B068317q68973q39792k68716J53057j1945l00290l5348O75682J089106P72316
$$ 2068317 1199344 359552 90836 243893 231948 -68342 -103690 571992 1661098 2433414
39002B433414P208o29060p77247m98808j91526j89653l53622k94365l6722j9674
$$ 2433414 2440622 1811562 1034315 535507 343981 154328 -199294 -493659 -530381 -550055
38992e50055l11845l95126j0432L75707L49795J97973K68579K90430l5437l25860
$$ -550055 -861900 -1257026 -1267458 -891751 -541956 -343983 -75404 215026 179589 -146271
38982a46271j59636N0022l10390r09124q61904l5454Q91063J430698J488155Q43530
$$ -146271 -305907 -255885 -566275 -1475399 -2337303 -2372757 -1481694 -50996 1437159 2280689
38972B280689n14836j686178j606776n37605K42997K56213J90152L66063J82821
$$ 2280689 1765853 79675 -1527101 -2064706 -1821709 -1565496 -1375344 -1009281 -826460
38963h26460m93793p04988R5939R83226Q70374N0284m30618k32831K87677R11837
$$ -826460 -1320253 -2025241 -1929302 -946076 -75702 -25418 -456036 -688867 -401190 510647
38953E10647J472606J451195N91783m35919q49406r05294j356388k031001j956166
$$ 510647 1983253 3434448 4026231 3590312 2740906 1835612 479224 -1551777 -3507943
38944c507943q70596L24364P94694O68976M44034J85655k49612o43080n52785
$$ -3507943 -4378539 -4054175 -3259481 -2590505 -2146471 -1960816 -2210428 -2853508 -3406293
38935c406293R3970Q40503J146071R00649M91966L52058M55165L92725l3448n16926
$$ -3406293 -3312323 -2471820 -1325749 -425100 66866 418924 874089 1266814 1233366 716440
38925G16440o58449m38828j13884J34356K39976J73425O0542J74716N34024O77836
$$ 716440 57991 -380837 -494721 -360365 -120389 53036 113578 288294 822318 1500154
38915A500154J69795p34034j202233o84631M40358J126147O66045m55744r26962
$$ 1500154 1669949 935915 -266318 -950949 -510591 615556 1281601 825857 -101105
38906a01105j41213Q57004N70536q63084j623641n68155J163110J569403K99595
$$ -101105 -242318 614686 1185222 322138 -1301503 -1869658 -706548 862855 1162450
38897A162450j055868r91047L14249J475058J466049N01572m36991p67868q51265
$$ 1162450 106582 -884465 -570216 904842 2370891 2872463 2435472 1667604 816339
38888H16339j231426j629764j279347j91518P06365Q83275Q07850Q89459P60073
$$ 816339 -415087 -2044851 -3324198 -3515716 -2809351 -1926076 -1118226 -228767 531306
38879E31306K21130m7620L76157O56383l9053r69446q56349K981K02042l87964
$$ 531306 752436 704816 1080973 1737356 1698303 728857 -127492 -124511 77531 -310433
38869c10433l98111O28176J278673M49251r01337j187504l87725L12743L88574
$$ -310433 -708544 -80368 1198305 1647556 746219 -441285 -829010 -516267 -127693
38860a27693L19985M03767L33718J1121j01997K74318O79711M42286m53723j280926
$$ -127693 192292 596059 929777 940898 838901 1113219 1792930 2235216 1781493 500567
38850E00567j339425o95243l0632K30556L63712P00765R22877N51052p4812r3426
$$ 500567 -838858 -1534101 -1564733 -1334177 -970465 -269700 653177 1204229 1129417 1035991
38840A035991N33042P98251J07223p94536q79446k33206K52728J65626j39546
$$ 1035991 1569033 2367284 2474507 1679971 800525 567319 820047 985673 846127
38831H46127k93050k87092j82269m07R4071m9014k48997k27995r1093j40979k82161
$$ 846127 553077 265985 83716 83309 177380 128366 -120631 -348626 -439719 -580698 -862859
38820h62859j31695K49066L21468k8116j32957M69352J139374Q76223k04999q74660
$$ -862859 -994554 -745488 -424020 -452136 -585093 -115741 1023633 1899856 1694857 820197
38810H20197m34646L31203L35012k40498l48640J85386L54425l90398j162822
$$ 820197 385551 716754 1051766 811268 462628 648014 1002439 612041 -550781
38801e50781r11704P8548P59369Q33087P54275O11701J25655l66886j19132O59355
$$ -550781 -1462485 -1383937 -624568 208519 962794 1574495 1700150 1333264 1214132 1873487
38791A873487P78452j83121j124275r90616k08806J38920j69811n66850o82000
$$ 1873487 2651939 2468818 1344543 353927 145121 284041 114230 -452620 -1134620
38782a134620n01052k1868N35569O34683K05163j3234L74483N84056o6769p07268
$$ -1134620 -1635672 -1657540 -1121971 -487288 -282125 -295359 79124 663180 596411 -110857
38772a10857o8773J297777J513360J24309j168427r49177J19228O30210L92321
$$ -110857 -179630 1118147 2631507 2755816 1587389 638212 757440 1387650 1779971
38763A779971J43323J75669K48848L33409N29792N77565K04188l02959n14187
$$ 1779971 1923294 2098963 2347811 2681220 3211012 3788577 3992765 3689806 3175619
38754C175619n52032p40183q75723n56502M083K30402J16526J71394M80507N50260
$$ 3175619 2623587 1883404 1007681 451179 455262 685664 802190 973584 1454091 2004351
38744B004351J61519k77024l77266k22532k9189J31526J33342j79953n93141o10183
$$ 2004351 2165870 1888846 1511580 1289048 1259859 1391385 1524727 1344774 751633 141450
38734A41450j40074L32590M35719L31578K69282J83872j1572j76602k64592m71328
$$ 141450 1376 333966 769685 1101263 1370545 1554417 1542845 1366243 1101651 630323
38724F30323p72604p57380k79718J48897M2733l53482m81128k32842J59815O22490
$$ 630323 -142281 -899661 -1179379 -1030482 -987749 -1341231 -1822359 -2055201 -1895386 -1272896
38714a272896J066906J085099M91571r8502J1621M76804L42563m46387q97228
$$ -1272896 -205990 879109 1370680 1272178 1283799 1760603 2103166 1656779 759551
38705G59551n05097k1671k63490r22851j155987p83897k49452K29280P59667J198624
$$ 759551 254454 232783 -30707 -953558 -2109545 -2893442 -3142894 -2913614 -2153947 -955323
38695i55323J139650N57685J1677J1119L95003N17248L0938o22086o79128n8066
$$ -955323 184327 742012 753689 764808 1159811 1677059 1707997 1085911 406783 348717
38685C48717M43061K50191p7892L13047J098080J085111M1642q52564p31649j68842
$$ 348717 791778 1041969 964077 1277124 2375204 3460315 3501957 2649393 1917744 1748902
38675A748902K4808P6970M04773M11398n97159j856907j906216p14851K72253
$$ 1748902 1773710 1850680 2255453 2666851 2069692 212785 -1693431 -2408282 -2136029
38666b136029K64608L8606M47181J153984J347440Q50815J9756p84207j194082
$$ -2136029 -1871421 -1832815 -1385634 -231650 1115790 1966605 1986361 1202154 8072
38657H072r29143k65800J49099K40396O03156J338433J555924N99085q34838j442114
$$ 8072 -921071 -1186871 -1037772 -797376 -194220 1144213 2700137 3299222 2464384 1022270
38647A022270q10707L32149J035933Q61137L3747p22182p75733k96731n6357l63759
$$ 1022270 211563 543712 1579645 2440782 2474529 1752347 976614 679883 623526 259767
38637B59767p13423o98333n99794o91344o60506k52486J72653L31269O02365J215760
$$ 259767 -453656 -1151989 -1751783 -2443127 -3103633 -3356119 -3183466 -2852197 -2249832 -1034072
38627a034072J522368R55575J39739J6476L26433J19569n17363n38979K55714
$$ -1034072 488296 1443871 1583610 1600086 1926519 2046088 1528725 989746 1245460
38618A245460P74736K77056o34368j092448j087274r71032o45852R3393R29816
$$ 1245460 2020196 2297252 1662884 570436 -516838 -1487870 -2133722 -2040329 -1110513
38609a110513J325977J141402N97143j3279l25367r3315L31622K40234l77098
$$ -1110513 215464 1356866 1954009 1940730 1615363 1522048 1853670 2093904 1716806
38600A716806o16330O612O33712K27693p93191j036195j29723P45639N57926k06279
$$ 1716806 1100476 1107088 1740800 1968493 1175302 139107 9384 755023 1312949 1106670
38590A106670m37635p0948k5612o39880j052256m84832N17131P99499K35249j72425
$$ 1106670 669035 598087 572475 -67405 -1119661 -1604493 -1087362 -287863 -52614 -225039
38580b25039J55725N79370L67904j44632k01450J40864K49963M0180o1260r6594
$$ -225039 -69314 510056 877960 733328 531878 672742 922705 962885 901625 805031
38570H05031n23870j141563j106525l13237K30576r3802n26573j37420P10686
$$ 805031 281161 -860402 -1966927 -2280164 -2049588 -2143390 -2669963 -2807383 -2096697
38561b096697R72752N06418J16694K54694N59676O67076O78083O90875N10258
$$ -2096697 -1123945 -617527 -500833 -246139 313537 980613 1658696 2349571 2859829
38552B859829M9519m47767p87632j049452j267002j248081r15667n32510l51744
$$ 2859829 2909348 2461581 1673949 624497 -642505 -1890586 -2806253 -3338763 -3690507
38543c690507k44628R4375O66266J069247Q90395J56643o00954p87874l17057
$$ -3690507 -3935135 -3840760 -3174494 -2105247 -1214852 -1058209 -1659163 -2447037 -2764094
38534b764094L28946O66477O87018O33655N30869K56661m2150k7471K84480M36745
$$ -2764094 -2435148 -1768671 -1081653 -447998 82871 339532 297382 269911 554391 991136
38524I91136J62919j96384j56697K33900M78179L09558j0970j26430n0478j5084
$$ 991136 1154055 957671 800974 1034874 1513053 1822611 1811641 1685211 1634733 1619649
38514A619649j0681K07211O03058O80907J04525o88732r10294m47464q496r6913
$$ 1619649 1608968 1816179 2419237 3100144 3204669 2515937 1605643 1158179 1149683 1052770
38504A052770l46498k52014r7037m84750j145620j032431K07173J540148J751845
$$ 1052770 706272 454258 357221 -127529 -1273149 -2305580 -2098407 -558259 1193586
38495A193586Q73751o6679l66479j58252J68257L97818L53156m9866m68642m08555
$$ 1193586 2067337 2000658 1634179 1475927 1644184 2042002 2395158 2345292 1876650 1468095
38485A468095l1482j06078q20355j271262p16266K15187L87534j31670k66987
$$ 1468095 1436613 1330535 510180 -761082 -1477348 -1262161 -874627 -1006297 -1273284
38476a273284K61026N25448N4682l24780J8806K99584l63756j261043j066619
$$ -1273284 -1012258 -486810 -432128 -756908 -738102 -438518 -802274 -2063317 -3129936
38467c129936J1898N69124L24511M74982J444130J917243R41059l76484m70220
$$ -3129936 -3118038 -2548914 -2224403 -1749421 -305291 1611952 2553011 2176527 1706307
38458A706307L16887L62728p18230j588240j193444p3162O08723M74264J7879
$$ 1706307 2023194 2385922 1667692 79452 -1113992 -1187154 -578431 -104167 -86288
38449h6288j30282K69995Q81769R86403K35571p62586j036291m25685L17592N76887
$$ -86288 -216570 53425 935194 1921597 2157168 1394582 358291 -67394 250198 827085
38439H27085M10685J4186o05493j152794r80930r835Q43178P35149J4064l28804
$$ 827085 1237770 1251956 646463 -506331 -1487261 -1497096 -653918 81231 95295 -233509
38429b33509l1746K66648J00197k56450l85729l27244l19375l19881j18754K30883
$$ -233509 -265255 1393 101590 -154860 -540589 -867833 -1187208 -1507089 -1625843 -1394960
38419a394960L85859J37529k79303l81124N5559P10340J006133O98780J15872
$$ -1394960 -1009101 -871572 -1150875 -1531999 -1476440 -766100 240033 938813 1054685
38410A054685k10726n9927L53876O38888N40885J26615k62045l45433k44976l16225
$$ 1054685 843959 784032 1137908 1776796 2317681 2444296 2182251 1836818 1591842 1275617
38400A275617n90785o63927l20287L2502r3325m97217n25086j8364M57248M32663
$$ 1275617 684832 20905 -299382 -266880 -360205 -857422 -1382508 -1400872 -943624 -510961
38390e10961J41428P4629K76854L97946K33200r5897l83716n03057m01157j49809
$$ -510961 -369533 -294904 -18050 379896 613096 517199 133483 -369574 -770731 -920540
38380i20540O2473J56323K70217M67754N15484K37625o7602L3036M12098M84833
$$ -920540 -858067 -701744 -431527 36227 551711 789336 721734 754770 1166868 1651701
38370A651701P0303l29452l03078j18450k00566m14134l42195l3895O7388j38905
$$ 1651701 1722004 1392552 1089474 971024 770458 356324 14129 -19766 47622 -91283
38360i1283k76367j38820L0776N9400J58143M21591M25755k05418j041187j180186
$$ -91283 -367650 -506470 -475694 -416294 -258151 163440 589195 383777 -657410 -1837596
38350a837596l78437N94240Q89062N22469J31841P8301J96884K97532L92863L45036
$$ -1837596 -2216033 -1621793 -732731 -210262 -78421 -120 196764 494296 887159 1232195
38340A232195j64093r82120j291912o22488K95931M16457r3433j44304M30844
$$ 1232195 1068102 85982 -1205930 -1828418 -1532487 -1116030 -1209463 -1353767 -922923
38331i22923N01511m10085j011931j18864J264751J185330l63629j375121p08417
$$ -922923 -421412 -831497 -1843428 -1962292 -697541 487789 124160 -1250961 -1959378
38322a959378N17673Q61782M59564J70044K6865l28477n04716P1057Q74376P98279
$$ -1959378 -1441705 -579923 -120359 49685 76550 -251927 -756643 -685586 188790 987069
38312I87069j67434q40205n01555K54777N18481J56488l48582n71181l82146P0717
$$ 987069 819635 -20570 -522125 -267348 251133 407621 59039 -512142 -894288 -823571
38302h23571M22663M29231K94161L59944N47503N13823K73544J54111J80982P0699
$$ -823571 -400908 28323 322484 682428 1229931 1743754 2017298 2171409 2352391 2423090
38292B423090j65586k16622j14356k34515n46899n57430j87700J9689j40148j55187
$$ 2423090 2257504 2040882 1926526 1692011 1145112 587682 399982 419671 279523 124336
38282A24336J85422K15541m72455j038254m87759P05885J136807M41334l26937
$$ 124336 309758 525299 52844 -985410 -1473169 -767284 369523 810857 483920
38273D83920l61607j05573k39880n54257m18329J89433P21835P97356M33324j55876
$$ 483920 122313 16740 -223140 -777397 -1195726 -1006293 -284458 512898 946222 790346
38263G90346n94600n13090r6560q2462o96850j040226k94072Q20402Q39198k53935
$$ 790346 195746 -317344 -413904 -496366 -1193216 -2233442 -2527514 -1707112 -867914 -1121849
38253a121849q43321j4202J131557J196491M48679K4641M4028j31157l08612K82500
$$ -1121849 -1965170 -1979372 -847815 348676 797355 821996 866024 734867 426255 708755
38243G08755J269648J275551N1842j020406j061502q56849j133878j150014j88744
$$ 708755 1978403 3253954 3305796 2285390 1223888 367039 -766839 -1916853 -2105597
38234b105597P79375M72755n10737n60288L74011Q06092J72923m49239k93373
$$ -2105597 -1326222 -853467 -1364204 -1924492 -1550481 -744389 -571466 -1020705 -1314078
38225a314078L2254p3758j51174K88881P98312Q09492M98148J34224n32351j461176
$$ -1314078 -1281824 -1355582 -1506756 -1217875 -419563 389929 888077 1022301 489950 -971226
38215i71226j742478p80606N58038R56315L98947m396L24466Q39592Q43639L03820
$$ -971226 -2713704 -3494310 -2936272 -1979957 -1581010 -1585406 -1260940 -421348 422291 726111
38205G26111l26913n66260k11088L87761M95412j43943q13423o49753K49592J030724
$$ 726111 399198 -167062 -378150 9611 505023 361080 -452343 -1102096 -852504 178220
38195A78220J168645Q09478K50263k83927m59954j00406L65101L14116j68004
$$ 178220 1346865 2156343 2406606 2122679 1662725 1562319 1927420 2241536 2073532
38186B073532l93869j40185M2821k25738n66415n64449n02910p86354j008144
$$ 2073532 1679663 1539478 1582299 1356561 790146 225697 -277213 -1063567 -2071711
38177b071711l53630J060543J961513J406532M1314o81284l34843J20070j05513
$$ -2071711 -2425341 -1364798 596715 2003247 2044561 1363277 1028434 1148504 1042991
38168A042991n05388k42022M08485M75497j20945m34861k6202L60046J1292o89267
$$ 1042991 537603 295581 704066 1179563 1058618 623757 597555 957601 968893 279626
38158B79626r38060o08318j39368J44709J19934k34136n71506l56984K70123M58858
$$ 279626 -658434 -1266752 -1406120 -1261411 -1141477 -1375613 -1947119 -2304103 -2033980 -1575122
38148a575122l5824k87977L49709J066732Q34287P9788q7158K39030N0676o78148
$$ -1575122 -1610946 -1898923 -1549214 -482482 351805 431593 344435 583465 634141 -44007
38138d4007q69167j57560N44096N50646K59771J89562K82624N02047J007388J358611
$$ -44007 -913174 -1070734 -526638 24008 283779 473341 755965 1258012 2265400 3624011
38128C624011P10071o82374j321283n39084M02113J73908o64348o91671J65693
$$ 3624011 4334082 3651708 2330425 1791341 2193454 2367362 1703014 1011343 1177036
38119A177036P13955L52432l57145q15727j000743r51720n79698j11043M9199
$$ 1177036 1890991 2243423 1886278 1070551 69808 -881912 -1461610 -1572653 -1523454
38110a523454L6352M19614J199495J558017R19356k19531q80302p42137l59133
$$ -1523454 -1487102 -1067488 132007 1690024 2609380 2389849 1509547 767410 408277
38101D08277l56097o82443p52073k31933N05136Q64069P91492O95701O66138L08944
$$ 408277 52180 -630263 -1382336 -1614269 -1109133 -245064 546428 1242129 1908267 2217211
38091B217211m70940j070988r51723l91156o6623k00131n03642o56585m44305
$$ 2217211 1746271 675283 -276440 -667596 -734219 -934350 -1437992 -2094577 -2538882
38082b538882K37314J067166J324326P32367k5392j58318J86071L18680J03965
$$ -2538882 -2301568 -1234402 89924 822291 796899 638581 824652 1143332 1247297
38073A247297p9835j95795m78587o37676j06835Q34160J159360N61348j14317
$$ 1247297 1167462 971667 493080 -144596 -251431 582729 1742089 2303437 2189120
38064B189120k46956k77551o01447n99202K95716J266446J006666l47196j292192
$$ 2189120 1942164 1664613 1063166 463964 759680 2026126 3032792 2685596 1393404
38055A393404r68674j09797J87219k42148q67129j222359j026927k17246O73374
$$ 1393404 424730 314933 502152 260004 -607125 -1829484 -2856411 -3073657 -2400283
38046b400283P84771J02014k69191L42727J002190N10720n87315o45882N50272
$$ -2400283 -1615512 -1513498 -1782689 -1439962 -437772 72948 -514367 -1160249 -609977
38037f09977J346537O83493l74848l86197L24006L87267m90760j361855j554572
$$ -609977 736560 1420053 1045205 659008 983014 1370281 879521 -482334 -2036906
38028b036906j184987m12766O28979J263583Q26351j29758l19120M11242Q34246
$$ -2036906 -3221893 -3634659 -3005680 -1742097 -915746 -1045504 -1364624 -953382 -119136
38019a19136K39480n92576p72532n18156l55452j73201J38662Q4222m85860o88587
$$ -119136 120344 -472232 -1244764 -1762920 -2118372 -2291573 -2152911 -2068689 -2554549 -3243136
38009c243136R5786J010671R41959K81479J98705O78038P16615J93091O287L27799
$$ -3243136 -3147350 -2136679 -1194720 -913241 -714536 -36498 680117 873208 879495 1207294
37999A207294K30850o06334j203051q44701j73964j9622j33428R4337M58535L74594
$$ 1207294 1438144 831810 -371241 -1215942 -1389906 -1409528 -1542956 -1448619 -990084 -615490
37989f15490m2770j80661J09545M37133N12226L07558j44458o10689o38451k07788
$$ -615490 -658260 -838921 -729376 -292243 219983 527541 383083 -227606 -866057 -1073845
37979a073845l2565n74201j120082o74741M34812Q27796M3429p31631l42493P30921
$$ -1073845 -1106410 -1680611 -2800693 -3475434 -3040622 -2212826 -2169397 -2901028 -3243521 -2512600
37969b512600J140017N22872k18791l01802Q9549M30959O05832O56876L28686
$$ -2512600 -1372583 -849711 -1068502 -1370304 -1280755 -849796 -243964 412912 741598
37960G41598n56923j478645j556318n98211N83356J054544O99922J44296m4508
$$ 741598 184675 -1293970 -2850288 -3448499 -2865143 -1810599 -1110677 -966381 -1010889
37951a010889J17002K15252K0030j82151N0941N91040O91287j9306p95340o11410
$$ -1010889 -893887 -678635 -658605 -840756 -789815 -198775 492512 473206 -322134 -933544
37941i33544L88704J003367O03390j43357m43111m28677n13967m76662K6852N95441
$$ -933544 -544840 458527 1061917 918560 475449 46772 -467195 -943857 -917005 -321564
37931c21564O23225L34863L72252O01174L06350m98266r42039o09000q5569N0419
$$ -321564 301661 636524 1008776 1609950 1916300 1418034 475995 -133005 -218574 -168155
37921a68155j4221O3487J08418j83675o63644r33753p94493k41884O00081J327084
$$ -168155 -182376 -118889 -10471 -194146 -857790 -1791543 -2586036 -2827920 -2227839 -900755
37911i00755J445007R67010M74847L89484N31032N42787L25870j11433p49681
$$ -900755 544252 1511262 1986109 2375593 2906625 3449412 3775282 3663849 2914168
37902B914168j258947j096902k55624N00467N27686J01066p0816J49482K48943
$$ 2914168 1655221 558319 302695 803162 1330848 1431914 1361098 1510580 1759523
37893A759523j28874o79002p95511k83267L55588M18206j50766o08100l42913
$$ 1759523 1630649 951647 156136 -127131 228457 646663 495897 -112203 -455116
37884d55116K98448N32908K33106j00204k68291m87755o08083j51216O45152P71780
$$ -455116 -156668 376240 609346 509142 240851 -246904 -854987 -1006203 -361051 410729
37874D10729q0528q18411l83586P36956J193040N48205l75074p12894m49898j13493
$$ 410729 330201 -488210 -871796 -134840 1058200 1606405 1231331 518437 68539 -44954
37864d4954o4559j93972j50073J40807K65502r7508n41012m25612N1813O9078
$$ -44954 -109513 -303485 -453558 -312751 -47249 -144757 -685769 -1111381 -1059568 -990490
37854i90490m38523n63303M8156M90104R4961l45690J39593R62848P79705l37345
$$ -990490 -1429013 -1992316 -1944160 -1454056 -1359095 -1704785 -1565192 -602344 177361 -159984
37844a59984q55906j1849J033778P29525q34327j972900j331915N38748J708364
$$ -159984 -1015890 -1027739 6039 735564 -98763 -2071663 -3403578 -2864830 -1156466
37835a156466J048090m03389p87434Q4337O00254j23852q71390k47940J143029
$$ -1156466 -108376 -511765 -1299199 -1214862 -614608 -738460 -1609850 -1857790 -714761
37826g14761J626348Q13664k22186o43228m79007Q1652P75675Q62161j08623j213928
$$ -714761 911587 1725251 1503065 859837 380830 462482 1238157 2100318 1991695 777767
37816G77767j081059J05410P59933J85036n47184l37437M50904P69385K97994
$$ 777767 -303292 -197882 562051 747087 199903 -137534 313370 1082755 1380749
37807A380749m32394p42065l15617M88924P67341O6589q48324r42651m01950j93759
$$ 1380749 948355 206290 -109327 379597 1146938 1213527 365203 -577448 -979398 -1173157
37797a173157l51549N92Q67303J097885K88158m30401j60786M39130M03263o2986
$$ -1173157 -1524706 -1524114 -656811 441074 729232 298831 138045 577175 980438 917452
37787I17452k40719j15922k6011J34493M69738N34738P7376l28158k09763p4722
$$ 917452 676733 560811 534800 669293 1139031 1673769 1751145 1422987 1213224 1138502
37777A138502m71259q54118m21372M59883P72566M24390J98092L46591L33299
$$ 1138502 667243 -186875 -608247 -148364 624202 1048592 1246684 1593275 1926574
37768A926574n0282l11951j60193K8795j17556m18257m86629k44540M7784O4262
$$ 1926574 1876292 1564341 1404148 1432943 1315387 897130 410501 165961 213745 278007
37758B78007k48728m85728j91463M05305N49512J26861J4675P22724J360784Q10984
$$ 278007 29279 -456449 -647912 -242607 306905 433766 448441 1171165 2531949 3342933
37748C342933n56458j342696j049404n15504m47565n19023j81698M24274P60899
$$ 3342933 2786475 1443779 394375 -121129 -568694 -1087717 -1269415 -845141 -84242
37739h4242N98123J34482k57960k61759J15535M36239K77349k27094n67231n10776
$$ -84242 513881 648363 390403 128644 244179 680418 957767 730673 163442 -347334
37729c47334k70528j17375j47675l27200m58997k63124J96967L92529J5059m64273
$$ -347334 -617862 -735237 -882912 -1210112 -1669109 -1932233 -1735266 -1342737 -1327678 -1791951
37719a791951l84838J65306N11723L38221m8257k91119l22663j90782R258Q5131
$$ -1791951 -2176789 -2011483 -1499760 -1161539 -1209796 -1500915 -1823578 -2014360 -2005102 -1919971
37709a919971m774K5496L84109Q26682J031625J048886R78043O02675j24122o57978
$$ -1919971 -1924745 -1899249 -1515140 -688458 343167 1392053 2370096 2972771 2848649 2190671
37699B190671n89296l84424o33617r62754o40989L6308J04258m14288m15403N12955
$$ 2190671 1601375 1216951 583334 -379420 -1020409 -984101 -879843 -1294131 -1709534 -1196579
37689a196579J342973J078451P5223o36418o52523k97885L5207J62159P2962m2628
$$ -1196579 146394 1224845 1300068 663650 11127 -286758 -251551 -89392 -16430 -59058
37679e9058N725R2144J5301J479L98606Q87721P22454j24833p96397p37487l26163
$$ -59058 -53333 38811 54112 55591 454197 1341918 2064372 1939539 1143142 405655 79492
37668G9492o5705R3505K72391K45904k1425o4720L40194O68233L93235k23993
$$ 79492 13787 107292 379683 625587 604162 539442 879636 1547869 1941104 1717111
37658A717111n93374o22659n98475o02440n21146l65601j95213K6174K19001J52353
$$ 1717111 1123737 501078 -97397 -699837 -1220983 -1586584 -1781797 -1755623 -1536622 -1384269
37648a384269j22453j79259J53125M44842K50824l05645p97118r69832p19458
$$ -1384269 -1506722 -1685981 -1532856 -1088014 -837190 -1142835 -1939953 -2909785 -3629243
37639c629243j4409Q62154J371486J294229R26123N68589K56050P4954J72074
$$ -3629243 -3643652 -2781498 -1410012 -115783 810340 1378929 1634979 1709933 1882007
37630A882007L02952L2768m37647m15218P5608J32127n69758j129472q41025k91261
$$ 1882007 2184959 2217727 1780080 1364862 1440470 1572597 1002839 -126633 -967658 -1258919
37620a258919k26695k32750M11232J280147J389012P68110L03142L04141L15447
$$ -1258919 -1485614 -1718364 -1307132 -26985 1362027 2130137 2433279 2737420 3052867
37611C052867J26778p2644l72050r40727j307142r02556k13199k45511q54500
$$ 3052867 3179645 3107001 2734951 1794224 487082 -415474 -628673 -874184 -1728684
37602a728684q47030P0111P43151M33045M24M55715J299625J303451L52426m96516
$$ -1728684 -2575714 -2505603 -1762452 -1329407 -1328983 -873268 426357 1729808 2082234 1585718
37592A585718n57219k42361k31837n74968q04527n51966J33671Q56449J109373
$$ 1585718 1028499 786138 554301 -20667 -825194 -1377160 -1243489 -387040 722333
37583G22333N79085n65769j622408j762675p74810N71978J198027Q68311L60435
$$ 722333 1301418 735649 -886759 -2649434 -3424244 -2852266 -1654239 -785928 -425493
37574d25493L25683M49558J32330m48340n89434j45530L01442K98202j3012k47518
$$ -425493 -99810 349748 482078 33738 -555696 -701226 -399784 -101582 -114594 -362112
37564c62112j08343N20972J265744J214010q9972j657715j893124n58993Q92410
$$ -362112 -470455 50517 1316261 2530271 2440299 782584 -1110540 -1669533 -777123
37555g77123J202501P01006L91645M42780L24864m3139j40678K35794N55321K22871
$$ -777123 425378 1126384 1518029 1960809 2285673 2242534 2101856 2337650 2892971 3115842
37545C115842o48445j282919r92939Q8165J012285R17239k9478p99623o92329
$$ 3115842 2467397 1184478 191539 279704 1291989 2209228 2179750 1380127 687798
37536F87798q5662J65590j71102n11922k96322K68848M78583P8595l32047j05227
$$ 687798 602136 767726 596624 84702 -211620 57228 535811 614406 282359 177132
37526A77132M42090L86231l57532p18244p8061N79758O3332j030569j003688L62848
$$ 177132 619222 1005453 647921 -70323 -148384 431374 494706 -535863 -1539551 -1176703
37516a176703J342501P73153l03277l57610L37144L57081n17164r76012k26600
$$ -1176703 165798 938951 635674 278064 615208 972289 455125 -520887 -747487
37507g47487Q19943Q69227k2578o81648m24050K15011L61934r3094n38978m97772
$$ -747487 72456 941683 919105 237457 -186593 28418 390352 297258 -241720 -739492
37497g39492l8788N64610J105457J256094O31540o02716j590736j697093j216828
$$ -739492 -778280 -213670 891787 2147881 2779421 2176705 585969 -1111124 -2327952
37488b327952p22084j59351P09372J396715J207938M81022K19967M84072L22472
$$ -2327952 -3050036 -3209387 -2500015 -1103300 104638 585660 805627 1289699 1612171
37479A612171m69848q13614j15271O35739L99081l01986l61010J06695J57815
$$ 1612171 1142323 328709 213438 849177 1248258 946272 585262 691957 849772
37470H49772k77904l57260J92029O97314O84990M20182J86340j15354m67997n80883
$$ 849772 571868 214608 406637 1103951 1788941 2209123 2395463 2280109 1812112 1231229
37460A231229m26622l07358k50821K1168L95319L42319j79599m94156k28393Q7074
$$ 1231229 804607 497249 246428 267596 662915 1005234 825635 331479 103086 190160
37450A90160q7029l75738r7362N80978Q17214L15755k95235m13474k16495j70924
$$ 190160 103131 -272607 -369969 211009 1028223 1343978 1048743 635269 418774 247850
37440B47850k29260k5661K99014R7019p52630j334527p44552O02375J353481R13515
$$ 247850 18590 -7071 291943 388962 -363668 -1698195 -2442747 -1840372 -486891 426624
37430D26624J05724p0997L01882M93013K69369l0560k55245n57788q36056p12479
$$ 426624 532348 461351 763233 1256246 1525615 1495055 1239810 682022 -154034 -866513
37420h66513j69162L05420L40658N6042k89818o18294q45317p42474k21116M55214
$$ -866513 -1035675 -730255 -389597 -333555 -623373 -1241667 -2086984 -2829458 -3050574 -2595360
37410b595360R13885R93753P63314M02186J26729O2581J35432K07181K78269L83859
$$ -2595360 -1681475 -687722 75592 477778 604507 667088 802520 1009701 1287970 1671829
37400A671829L82960J20932k47346l93801k57223n3568J05243K40507J94338k33087
$$ 1671829 2054789 2175721 1928375 1534574 1277351 1223783 1329026 1569533 1763871 1530784
37390A530784p54053p25661n1251N19875L39311k83462n74568l12065J28045M73674
$$ 1530784 776731 51070 -181 519694 859005 575543 975 -311090 -183045 290629
37380B90629P25791P56747L76481j50796k66844J7226k962o61404j281056j114497
$$ 290629 1016420 1773167 2149648 1998852 1732008 1749234 1746272 1084868 -196188 -1310685
37370a310685n02140l93471r07965j156785n69089L56752R16238J136716J359875
$$ -1310685 -1812825 -2206296 -3114261 -4271046 -4840135 -4483383 -3567145 -2430429 -1070554
37361a070554J432540J006154L49899J06448K66694R5261p31809j491371j274671
$$ -1070554 361986 1368140 1718039 1824487 2091181 2186442 1454633 -36738 -1311409
37352a311409j48745R04561J067340M37587k42896m13524j91210q8815l29869
$$ -1311409 -1460154 -555593 511747 949334 706438 292914 101704 12889 -316980
37343c16980o00259n19609j34855K15789L22626J88996p5271k12152M8119N02394
$$ -316980 -917239 -1436848 -1571703 -1355914 -1033288 -844292 -919563 -1131715 -1083596 -581202
37333e81202M72203k73175r48108p08737J12299M67841J08250k10491P180M10528
$$ -581202 -108999 -382174 -1330282 -2039019 -1926720 -1458879 -1350629 -1561120 -1553940 -1143412
37323a143412O03052O65519O45449L44277p2387l2416M89815O98896R2372p79669
$$ -1143412 -540360 125159 770608 1114885 1042498 1010082 1499897 2198793 2291165 1511496
37313A511496j070371n64585M45664J500309J853812Q74013r07772j941853j477871
$$ 1511496 441125 -123460 322204 1822513 3676325 4550338 3642566 1700713 222842
37304B22842n01255k22649m49049k85907K90240N93528M58394K75076J08168k68471
$$ 222842 -278413 -501062 -950111 -1236018 -945778 -352250 106144 381220 489388 220917
37294B20917o48651n57280l1248M52287O83097P56167O30832K53775j06777j98592
$$ 220917 -427734 -985014 -1016262 -563975 119122 875289 1506121 1759896 1653119 1454527
37284A454527j80907j89626P9755P70937J291870J025056K56309k52007k76694
$$ 1454527 1273620 1083994 1163749 1934686 3226556 4251612 4507921 4255914 3979220
37275C979220j39453p6800j47797l56707m24611K690N43771L04304o21883r48359
$$ 3979220 3839767 3762967 3615170 3258463 2833852 2836542 3380313 3684617 3062734 2114375
37265B114375j75162M70403K9794n86419k73855L16374R9926l90608j32637K95619
$$ 2114375 1939213 2409616 2439410 1852991 1579136 1895510 1995436 1604828 1472191 1767810
37255A767810j66809p87722j90647R48438Q51930j98130l09825O06867O60526
$$ 1767810 1601001 813279 622632 1571070 2423000 2224870 1915045 2521912 3182438
37246C182438o16975j438763q42799j6628J33676K70842O91579N08974l02503
$$ 3182438 2565463 1126700 283901 267273 400949 671791 1363370 1872344 1569841
37237A569841l57959O23965J015067R0058n97583Q7279R56425P14812P4027J29195
$$ 1569841 1211882 1835847 2850914 2940972 2343389 2430668 3387093 4101905 4175932 4305127
37227D305127M28881J92357j28429J08389N47705P72791R75695R84216L70297
$$ 4305127 4734008 4926365 4797936 4906325 5454030 6226821 7202516 8186732 8557029
37218H557029l7806R96511K464833K236784J175009K344130N512264P428717Q980314
$$ 8557029 8519223 9515734 11980567 14217351 15392360 17736490 23248754 30677471 39657785
37209C9657785J5368009K5141672K6115571R906171j3797813k6387877k2078138
$$ 39657785 55025794 80167466 106283037 116189208 102391395 76003518 53925380
37202E3925380j2002693p190851o846846n640450l619895l546145m346429l185226
$$ 53925380 41922687 34731836 27884990 22244540 18624645 15078500 10732071 7546845
37194G546845q19405j8966p51202q86927r3529L23291J81316K12410K10812k83388
$$ 7546845 6727440 6708474 5957272 5070345 4976816 5300107 5481423 5693833 5904645 5621257
37184E621257o10268k79807k72358j180567j641376o29688L58639l16971j451912
$$ 5621257 5010989 4731182 4458824 3278257 1636881 1007193 1365832 1048861 -403051
37175d03051r07916P63047J274890L03324m05002r0135L34484M01002O05077Q19774
$$ -403051 -1310967 -547920 726970 1030294 625292 535157 869641 1270643 1875720 2695494
37165B695494K27840r89052j579449j028797q1541N66665Q70051Q05216L00339
$$ 2695494 2923334 1934282 354833 -673964 -755505 -188840 681211 1486427 1786766
37156A786766k94624o10663q44482j108325q26592J89625Q47051K47214o78133
$$ 1786766 1492142 881479 36997 -1071328 -1897920 -1708295 -861244 -614030 -1292163
37147a292163m87064M73048P33634J59702p0875L07155K95482m13823q39911l92621
$$ -1292163 -1779227 -1306179 -572545 -412843 -483718 -176563 118919 -294904 -1134815 -1527436
37137a527436K72741M54341K85213J22314P9265L36831R34052J193467M11260
$$ -1527436 -1254695 -800354 -515141 -392827 -313562 23269 957321 2150788 2562048
37128B562048q18792j087307j26280Q03559P04250k4818n46835o96903o81304
$$ 2562048 1743256 655949 529669 1333228 2037478 2012660 1465825 768922 87618
37119H7618m46371J21713P82491J064546O50889l02442j050985q21514J67121
$$ 87618 -358753 -237040 545451 1609997 2260886 1958444 907459 85945 253066
37110B53066P42265K96192l83972m11809j14270j75220l13399L4881M67366L78326
$$ 253066 995331 1291523 907551 495742 381472 206252 -107147 -72266 395100 773426
37100G73426L00567R93842J760871J342403J07475l87013K53773J163583K178015
$$ 773426 1073993 2067835 3828706 5171109 5278584 4891571 5145344 6308927 8486942
37091H486942L727143M742501L162452p34913l750454l685663k000360j277183
$$ 8486942 12214085 16956586 20119038 19384125 15633671 11948008 9947648 8670465
37083H670465j739438j894105j292120p75184o80089n03976j19338P711k42375
$$ 8670465 6931027 5036922 3744802 2969618 2289529 1785553 1666215 1673926 1431551
37074A431551m60517m15005k17034P2615L83831L87542j13448p24610q85911n81446
$$ 1431551 971034 556029 338995 411610 795441 1182983 1069535 344925 -540986 -1122432
37064a122432k28461q1480j06250k19583l28099l01094j03823K11803O52043J103196
$$ -1122432 -1350893 -1432373 -1538623 -1758206 -2086305 -2387399 -2491222 -2279419 -1627376 -524180
37054e24180J127576M82468k42582k27951L19189L41670m76355j162397q09141
$$ -524180 603396 1085864 843282 615331 934520 1276190 799835 -362562 -1171703
37045a171703L11038J321177J684769J260213J97679q34371j055021n67669k42954
$$ -1171703 -860665 460512 2145281 3405494 3603173 2768802 1713781 1146112 903158
37036I03158l64104k83854K59729N57837K04200j07721K02698N61580K80221k07787
$$ 903158 539054 255200 514929 1072766 1276966 1169245 1371943 1933523 2213744 2005957
37026B005957j11028L90689N40961K07475j80753m25359n09751k64320J68272
$$ 2005957 1894929 2285618 2826579 3034054 2853301 2427942 1918191 1653871 1822143
37017A822143J02049o60203j173071o21356L54143O11189K30070J34030M19929
$$ 1822143 1924192 1263989 90918 -530438 -176295 434894 664964 798994 1218923
37008A218923L55490j38816k89372J76354O01606N15290K00642o2488m08841p58755
$$ 1218923 1574413 1435597 1146225 1322579 1924185 2439475 2640117 2577629 2168788 1410033
36998A410033o27871L3391N00575K19743m27861p14285m96877j49490J33144N13603
$$ 1410033 782162 815553 1316128 1535871 1108010 393725 -103152 -252642 -119498 394105
36988C94105J055269J409960J115439J84143p37777r90587o50729l65872m09873
$$ 394105 1449374 2859334 3974773 4158916 3421139 2430552 1779823 1413951 1004078
36979A004078l49000J35564N86467L90842k57764n52128j22550N30487O60079
$$ 1004078 655078 790642 1377109 1767951 1510187 958059 835509 1365996 2026075
36970B026075P3392o95992r26024m92017n7899k41765p32619p15143p6622M82434
$$ 2026075 2099467 1403475 477451 -14566 -72465 -314230 -1046849 -1761992 -1838614 -1356180
36960a356180N53759M23250K35727k80668r17092q42463N8132O86824L36218j29995
$$ -1356180 -802421 -379171 -143444 -424112 -1341204 -2183667 -2125535 -1438711 -1102493 -1232488
36950a232488L59866J333961J481395N54524m93856q76771n38286K45470R37360
$$ -1232488 -872622 461339 1942734 2497258 2003402 1126631 588345 833815 1771175
36941A771175Q38396j7363n67997k04105J22487o30668j715587j589137k93281
$$ 1771175 2609571 2592208 2024211 1820106 1942593 1311925 -403662 -1992799 -2286080
36932b286080P08868P90088O34401N66251J21910n31243m35153M34801Q07722
$$ -2286080 -1577212 -787124 -152723 413528 535438 4195 -430958 3843 811565
36923H11565J07245n62702j85642O05565O20452j66666q66345r57780n65487q85
$$ 811565 918810 356108 170466 776031 1396483 1229817 363472 -594308 -1159795 -1160680
36913a160680L60687K25772j41070r2490M18689O46446J74447m47545n71549k76373
$$ -1160680 -799993 -574221 -715291 -807781 -389092 257354 431801 -15744 -587293 -863666
36903h63666P2452L90888N60557K38181m91287q65748l85909M68034Q90914O76061
$$ -863666 -791214 -400326 160231 398412 -92875 -958623 -1344532 -876498 14416 690477
36893F90477J53878l07324m55878k97208k44495n69340p02181P4870J202772J266823
$$ 690477 844355 537031 81153 -216055 -460550 -1029890 -1732071 -1657201 -454429 812394
36883H12394J33518o34752r5111O87272M95130p4634J79466Q79926O97239l66961
$$ 812394 945912 311160 216049 903321 1398451 1323817 1503283 2383209 3080448 2713487
36873B713487r43923m55659J30512p3810o67209p89070l39126Q6020O865m78778
$$ 2713487 1769564 1313905 1444417 1370607 703398 -85672 -424798 -338778 -331913 -810691
36863h10691p94079m00081N55143J237727J050350L13020k85116n38288n81094
$$ -810691 -1604770 -2004851 -1449708 -211981 838369 1151389 866273 327985 -253109
36854b53109l20222L31683R22504Q52994J85752n05118r21114j086945q22995
$$ -253109 -573331 -241648 680856 1533850 1719602 1214484 293370 -793575 -1616570
36845a616570P3795J115436J304713K79918j126386j663989q29859O98620J621939
$$ -1616570 -1542775 -427339 877374 1157292 30906 -1633083 -2462942 -1764322 -142383
36836a42383J184519j7857o43455j74444N54038O16811J34824l12754o59616r56833
$$ -142383 1042136 1024279 380824 206380 760418 1377229 1512053 1199299 539683 -417150
36826d17150o90056M23749J394019R57299n03739j268002n95033M45396P31180
$$ -417150 -1107206 -683457 710562 1667861 1164122 -103880 -698913 -253517 477663
36817D77663N09853N20688O92554M98561l5232m37751n23089l98799o1126M46914
$$ 477663 987516 1508204 2200758 2699319 2664087 2226336 1703247 1304448 1243322 1690236
36807A690236P14177L71125k69646m79152n4699L80849J50917o31689j165805
$$ 1690236 2404413 2775538 2505892 2026740 1972041 2352890 2503807 1872118 706313
36798G06313q45741R5968Q78743R83007N01426k04596q30196j066493p02177n7425
$$ 706313 -139428 -43460 835283 1818290 2319716 2115120 1284924 218431 -483746 -541171
36788e41171J29427l54087p67581m09080L80384Q05655Q03212Q42310Q48630L29994
$$ -541171 -411744 -765831 -1533412 -1942492 -1562108 -756453 46759 889069 1737699 2067693
36778B067693m77523o66036r3509K35726l18417j011679q33265M0795O40525N71967
$$ 2067693 1590170 924134 830625 1066351 747934 -263745 -1097010 -1056215 -415690 156277
36768A56277K37584l1670l13109o14196o88532m40978r2118J72166L90562N60827
$$ 156277 393861 362191 49082 -565114 -1253646 -1694624 -1786742 -1614576 -1224014 -663187
36758f63187M83880P6654l37309l21340Q3544L13571L833m36442l13319L62744
$$ -663187 -179307 -102653 -439962 -761302 -677758 -364187 -360354 -796796 -1110115 -747371
36748g47371Q67257Q33086P17209Q62242P69407j5563q42045p35943M7604L34576
$$ -747371 119886 952972 1670181 2532423 3301830 3286267 2444222 1708279 1755883 2090459
36738B090459j45022m01541J08532N86238K69508l00279k14804L44252N17848
$$ 2090459 1945437 1543896 1652428 2238666 2508174 2207895 1993091 2337343 2855191
36729B855191J48369k04061l43200n87094q90465p02919R6417P97173P16837M7708
$$ 2855191 3003560 2799499 2456299 1869205 978740 275821 372238 1169411 1886248 1933956
36719A933956m42295k96576K68921P16655O82945J72117n58948j172193j319212
$$ 1933956 1491661 1195085 1464006 2180661 2863606 3035723 2476775 1304582 -14630
36710a4630p89568J52941P38296M18375l73552o50273j31678M45974M45399J34849
$$ -14630 -804198 -651257 87039 505414 131862 -518411 -650089 -204115 241284 376133
36700C76133K5063J6086k19730m73331l06875J49056L65095K12664R99j30223
$$ 376133 401196 417282 197552 -275779 -582654 -433598 -68503 144161 145160 14937
36690A4937k68665l25204j75710p3017k83840m53205n3687O25687P69197L23410
$$ 14937 -253728 -578932 -754642 -827659 -1111499 -1564704 -1618391 -992704 -223507 99903
36680I9903Q1261L23215L65496j56855n34910j41847M88603N19773Q7674j25251
$$ 99903 181164 504379 869875 713020 178110 36263 524866 1044639 1132313 1007062
36670A007062n2065o8507r1732J56231K86236k79617j089785j038846l4617Q00537
$$ 1007062 954997 886490 794758 950989 1237225 957608 -132177 -1171023 -1205640 -405103
36660d05103Q14246O15801P84924Q76165L73321k88858m79154m15695n85206p26289
$$ -405103 409143 1024944 1809868 2686033 3059354 2770496 2291342 1875647 1290441 564152
36650E64152l37940K66574L99938J53734J21138K42170j5654m93376m92877p5749
$$ 564152 226212 492786 892724 1046458 1167596 1409766 1394112 900736 407859 332110
36640C32110m0587m68322m83536K27488Q41352P92260N66788M99439p218j158697
$$ 332110 291523 -176799 -660335 -432847 408505 1200765 1767553 2266992 2259774 1101077
36630A101077j789727r35302M38459O40417l17339q86913l34845M52678N59306
$$ 1101077 -688650 -1623952 -1185493 -545076 -862415 -1749328 -2084173 -1631495 -1072189
36621a072189J92675j8360J04521M12514O35919K99868p61222j679652j266210
$$ -1072189 -879514 -897874 -793353 -380839 255080 554948 -206274 -1885926 -3152136
36612c152136K90182J358943R22834j51274m35939K14371Q27654P81281L69599
$$ -3152136 -2861954 -1503011 -580177 -731451 -1167390 -953019 -125365 655916 1025515
36603A025515J50844K98568N37577M46192n8953m81706l13695J52771J20663n11858
$$ 1025515 1176359 1474927 2012504 2458696 2399743 1918037 1604342 1757113 1877776 1365918
36593A365918r40020o95554l43149m79402p55130n26771J08520O31810R58985
$$ 1365918 425898 -269656 -612805 -1092207 -1847337 -2374108 -2265588 -1633778 -674793
36584f74793J220252J107539L02815o94700j026439o40282k06277K0364L68948
$$ -674793 545459 1652998 1955813 1261113 234674 -405608 -611885 -591521 -222573
36575b22573P69499N74970l16957j005251p66818p8247J25074k33939m29995n9301
$$ -222573 546926 1121896 804939 -200312 -967130 -1045377 -920303 -1154242 -1584237 -1643538
36565a643538N16692P97848O78279K86693k37781o25088n10671R8921O19439M89390
$$ -1643538 -1126846 -328998 349281 635974 398193 -226895 -737566 -638645 -19206 470184
36555D70184j15462m96160l28581K4877J70032K11402L53672L47183j89172j034073
$$ 470184 354722 -141438 -470019 -445142 -275110 -63708 289964 637147 447975 -586098
36545e86098j437637r79251k0037P41787Q99222N38081J06982P3858M32034O13087
$$ -586098 -2023735 -3002986 -3023023 -2281236 -1382014 -843933 -736951 -663093 -231059 382028
36535C82028K02273m05567n10221j21693J34776P4016J55148M91344M69774k42167
$$ 382028 584301 178734 -331487 -453180 -318404 -244388 -89240 402104 871878 629711
36525F29711j005084j056528n17594m876K94007N57286P22686N98005L54429L16439
$$ 629711 -375373 -1431901 -1949495 -1954371 -1660364 -1103078 -380392 217613 572042 888481
36515H88481L93500K26319k11003n91410p01171n53361k02715J92810L38505J98136
$$ 888481 1281981 1508300 1297297 705887 4716 -548645 -751360 -558550 -220045 -21909
36505b1909J59966M19004N45178J80591k06787M0961O50249P44693J96624k11851
$$ -21909 138057 557061 1102239 1282830 1076043 1117004 1767253 2511946 2708570 2496719
36495B496719o7127R4612k01455n23269k31997M49408O71402J07700o04198o42512
$$ 2496719 2429592 2524204 2322749 1799480 1567483 2016891 2688293 2795993 2191795 1549283
36485A549283K0336N81755L71896k77843m01870L14053J028535Q32280n3861o82480
$$ 1549283 1569619 2151374 2523270 2245427 1843557 2157610 3186145 4018425 3964564 3282084
36475C282084o88558n24107n13216m37020j59986M9709Q4323K55355O44463P60009
$$ 3282084 2593526 2069419 1556203 1119183 959197 1008906 1093229 1348584 1993047 2753056
36465B753056K92768k51289k19882K03912K78032k04923o87391o93882l58863
$$ 2753056 3045824 2794535 2574653 2778565 3056597 2851674 2164283 1470401 1111538
36456A111538K523L41479O34865O22996J98832j99551o6756L92939M63453p2203
$$ 1111538 1114061 1455540 2090405 2713401 2912233 2712682 2645926 3038865 3502318 3430115
36446C430115o39407p67163p33068r40954j137924q09061k7458O90857J126709
$$ 3430115 2790708 2023545 1290477 349523 -788401 -1597462 -1624920 -934063 192646
36437A92646J313780J030725J63259n95297m04205L34787L35028o09237j197403
$$ 192646 1506426 2537151 2700410 2105113 1700908 2035695 2370723 1761486 564083
36428E64083o45539Q4340r0607o14111l11372O29070J017496N56462N7573n4954
$$ 564083 -81456 2884 -87723 -701834 -1013206 -384136 633360 1189822 1247395 1192441
36418A192441k09077n91654o96753k30153L74936O20829M97008K08290q2608j41332
$$ 1192441 983364 391710 -305043 -535196 -160260 460569 957577 1165867 1083259 941927
36408I41927J81661O14649P37557N49816L21274N3853l49823n90881l25032J43014
$$ 941927 1123588 1738237 2475794 3025610 3346884 3400737 3050914 2460033 2135001 2278015
36398B278015K24233l1978j29244r3599l76145q21406o87925J27569P55811N51233
$$ 2278015 2502248 2470270 2341026 2247427 1871282 1049876 361951 489520 1245331 1796564
36388A796564q4213l97921k28179O8938J92712J20101R476j0812o9325l58255
$$ 1796564 1712351 1314430 1086251 1155189 1347901 1468002 1477478 1466666 1397341 1039086
36378A039086n67215o5738R47039J241813K73490o96700l02012Q09982R70877
$$ 1039086 471871 406133 1353172 2594985 2868475 2171775 1869763 2679745 3650622
36369C650622Q2456m53138j45837O5890k07358j70294M03351N30792k16586q69063
$$ 3650622 3733078 3279940 3134103 3199993 2992635 2822341 3225692 3756484 3539898 2670835
36359B670835p04576k99065j89252P6240P02290Q72467J93320l88876j56812J46743
$$ 2670835 1966259 1667194 1477942 1554182 2256472 3128939 3322259 2933383 2776571 2923314
36349B923314k24422n73040o5746O28878M63823j30480m1065N53928N44649k02936
$$ 2923314 2698892 2125852 2060106 2688984 3152807 3022327 2981262 3535190 4079839 3876903
36339C876903p40626o13380k75421p2682P2127O2388k77967n85947l27159K82540
$$ 3876903 3136277 2522897 2247476 2174794 2246921 2309309 2031342 1445395 1118236 1400776
36329A400776N09220J83482j42878m9032L29652O30176N56959K1593o45815q80680
$$ 1400776 1909996 2093478 1950600 1901568 2231220 2861396 3418355 3439948 2794133 1913453
36319A913453n62276j60361k2028k5450r4828l62541o02278k92038M88723J029668
$$ 1913453 1351177 1190816 1168788 1143338 1048510 685969 83691 -208347 280376 1310044
36309A310044J045514Q56453M64962l45288r16844k48185J127685J502625O24811
$$ 1310044 2355558 3212011 3676973 3331685 2414841 2166656 3294341 4796966 5421777
36300E421777N2175L44321J58297r40950j230810J78073J475868J061128Q6270
$$ 5421777 5473952 5818273 5976570 5035620 3804810 3982883 5458751 6519879 6606149
36291F606149J14119M25966p7572m04183N66206J576676J130931L34045Q46421
$$ 6606149 6720268 7146234 7068662 6664479 7230685 8807361 9938292 10272337 11118758
36282A1118758J804408J688303J429129K504361L716305L194307J863546J546282
$$ 11118758 12923166 14611469 16040598 18544959 22261264 25455571 27319117 28865399
36274B8865399J589575R60782J298380L813825O023848O320840Q226621J4177771
$$ 28865399 30454974 31415756 32714136 36527961 42551809 48872649 57099270 71277041
36266G1277041J9851316K3411554L4843392O1243813Q3872479O9045383J0528631
$$ 71277041 91128357 114539911 149383303 210627116 294499595 363544978 374073609
36259C74073609n3772930q0311094o5409896l9687670k6307274k2164537j6929063
$$ 374073609 320300679 239989585 174579689 134892019 108584745 86420208 69491145
36252F9491145j1023368r000487q833547o463873l417846k943557l725557k981986
$$ 69491145 58467777 49467290 40633743 34169870 30752024 27808467 24082910 21100924
36244B1100924j696997k010145k808183k131209j076178j507667k386929j852999
$$ 21100924 19403927 17393782 14585599 12454390 11378212 9870545 7483616 5630617
36236E630617p44957q11581j375641q49590J47809J13202l90372J09258J109522
$$ 5630617 4885660 4074079 2698438 1848848 1996657 2109859 1719487 1828745 2938267
36227B938267J006346j31775r75526j207972j293965r34005J97864J066700O25583
$$ 2938267 3944613 3812838 2837312 1629340 335375 -598630 -400766 665934 1291517
36218A291517k70990k04322M22897L02801l10397j80471M74113L34296n18895
$$ 1291517 1020527 816205 1239102 1541903 1231506 1051035 1525148 1859444 1340549
36209A340549o14226L52717R36191K44540q21367j111169o90405k45821k5941
$$ 1340549 726323 1079040 2015231 2259771 1438404 327235 -363170 -608991 -634932
36200f34932J31679L69803P12399R91291Q84393L96704K9553J7530j45139p96826
$$ -634932 -503253 -133450 578949 1570240 2454633 2851337 2880890 2898420 2753281 1956455
36190A956455j271052q20832N9552K35690l86548p95825m46355N9544L8716k75815
$$ 1956455 685403 -135429 -75877 159813 -226735 -1022560 -1468915 -1409371 -1370655 -1646470
36180a646470j57505N69895J205094Q90953l08188j207546p73979N00406J140644
$$ -1646470 -1803975 -1234080 -28986 861967 553779 -653767 -1427746 -927340 213304
36171B13304O08932j70347l53787k00550j47512K8402M55098N97865K52021J44798
$$ 213304 822236 651889 298102 97552 -49960 -21558 433540 1031405 1283426 1428224
36161A428224O60225R25053K02902p20198p46137k43280k73203p16654o38065
$$ 1428224 2088449 3013502 3216404 2496206 1750069 1506789 1233586 516932 -121133
36152a21133n4683J57587j34276k50392q7007j82389m43864j82782N07598P18997
$$ -121133 -175816 -18229 -152505 -402897 -489904 -672293 -1116157 -1298939 -791341 -72344
36142g2344K25367k23992k81106m18599p23486n60609J25741L99839j58613o10770
$$ -72344 153023 -70969 -352075 -770674 -1494160 -2054769 -1929028 -1529189 -1687802 -2298572
36132b298572p6314Q75213J084704M41000j48455n3698M88555Q85225P94915L32184
$$ -2298572 -2374886 -1499673 -414969 26031 -122424 -176122 312433 1197658 1992573 2324757
36122B324757o1195p4521O2578j00294m88444n16859K4775N69282M99225q4389
$$ 2324757 2263562 2189041 2251619 2151325 1662881 1146022 1170797 1740079 2239304 2154915
36112B154915n81313o33897m35094m19145p24784r23252m48532N47419J108850
$$ 2154915 1573602 939705 504611 85466 -639318 -1562570 -2011102 -1463683 -354833
36103c54833O24197k83357n60556j19231K66814K41811K00231L66270M24233K52403
$$ -354833 269364 -13993 -574549 -693780 -426966 -185155 15076 381346 805579 1057982
36093A057982K30254M99403N92008J76383l69960n15731k64095O8007L65268O27415
$$ 1057982 1288236 1787639 2379647 2556030 2186070 1670339 1406244 1474251 1839519 2466934
36083B466934O61228K67540l52976o57138k76627N54854J113925Q56668K4501
$$ 2466934 3128162 3395702 3042726 2385588 2108961 2663815 3777740 4634408 4658909
36074D658909o36695q07595q31088q78273n38616K90799P80380K16980p97234
$$ 4658909 4022214 3214619 2383531 1505258 966642 1257441 2037821 2254801 1457567
36065A457567j084023n05211O5938J28920m8481k31651m09410k88284L83104J045611
$$ 1457567 373544 -131667 -65729 63191 14710 -216941 -626351 -914635 -531531 514080
36055E14080R31891L82048M07261R31370P69547m18684j471303j439116p44720
$$ 514080 1445971 1828019 2235280 3166650 3936197 3517513 2046210 607094 -137626
36046a37626j32065L57737P56531O42611k3975m89288l07936K2446R0345K28332
$$ -137626 -269691 88046 844577 1487188 1463213 973925 665989 688435 778780 1007112
36036A007112N34918L64670m22455q26421k57945L46785J5131o81753p18751l29054
$$ 1007112 1542030 1906700 1484245 657824 399879 746664 761795 80042 -638709 -967763
36026i67763l00085m00358L1938O04643N08058J20672L99795J031319Q29467j72305
$$ -967763 -1267848 -1668206 -1636268 -1031625 -523567 -402895 -3100 1028219 1857686 1685381
36016A685381o75941k29786J86588o3392l79253k10780O4240M2231n3160q7062
$$ 1685381 1009440 779654 966242 902850 523597 312817 377057 419288 366128 279066
36006B79066l28790o03434j92114Q81668J471598Q47093k57445p53983n54627
$$ 279066 -49724 -653158 -845272 36396 1507994 2355087 2097642 1343659 789032
35997G89032k01075N0832Q3789l84899j167845j310641k84675J015223J309236
$$ 789032 587957 638789 722578 337679 -830166 -2140807 -2425482 -1410259 -101023
35988a01023N71950k09602n67927q67263j196452r75326M3226J114094J311549
$$ -101023 470927 261325 -306602 -1173865 -2370317 -3345643 -3302417 -2188323 -876774
35979h76774O34812r0116k52988q0182j73681o16799p72974j11671R23873J245525
$$ -876774 -241962 -332078 -585066 -665248 -838929 -1455728 -2228702 -2340373 -1416500 -170975
35969a70975M21609o92626r05034o0987Q66773R90013M52039M4825J38287K99902
$$ -170975 250634 -441992 -1347026 -1408013 -541240 448773 900812 945637 1083924 1383826
35959A383826k9o03925q67760n27776P913K69373K26838N1137j80674k91454J0011
$$ 1383826 1383797 779872 -87888 -615664 -607751 -338378 -111540 -60403 -241077 -532531 -522520
35948e22520N77679P43152K62326j62105O3313L86664K1457n60800k37113Q32373
$$ -522520 55159 798311 1060637 898532 961845 1348509 1369966 809166 572053 1404426
35938A404426J217322L74561n04879l25380L86792N35814Q9390k47786l07449
$$ 1404426 2621748 2996309 2491430 2166050 2552842 3088656 3178046 2930260 2622811
35929B622811m44776o58511n96415k54059j0735r8583m68105r27170j069247m95337
$$ 2622811 2178035 1519524 923109 669050 658315 559732 91627 -835543 -1904790 -2400127
35919b400127M81124Q79779L16779l52570k71032J74788J53485j70207k6693N49685
$$ -2400127 -1919003 -1039224 -722445 -1075015 -1346047 -1171259 -1017774 -1187981 -1214674 -664989
35909f64989Q41936P42710P57984Q30672L97851l12144l27929M17624P35424j219
$$ -664989 176947 919657 1677641 2508313 2906164 2594020 2266091 2683715 3419139 3417920
35899C417920q30481o96738M6847M78459N49612O63642N37293l03346j291180
$$ 3417920 2587439 1890701 1937548 2416007 2965619 3629261 4166554 3863208 2572028
35890B572028j323233m13542K71700J07410l04762l61950l37452n50082n46197
$$ 2572028 1248795 835253 1106953 1214363 909601 547651 210199 -339883 -886080
35881h86080J44022J001405J086752L72321k19436p6435L98698M58513m7196n93111
$$ -886080 -742058 259347 1346099 1718420 1498984 1422549 1821247 2279760 2232564 1639453
35871A639453o17531j05915L80207K75832l07869o34292k49660L81896M74138
$$ 1639453 1021922 916007 1296214 1572046 1264177 629885 380225 762121 1236259
35862A236259m8891n65027o66158m90985j66353M01120R86303R85798K96682l19560
$$ 1236259 1187368 622341 -43817 -534802 -701155 -300035 686268 1672066 1968748 1649188
35852A649188k44396J29435J05324k12892k38628K5165N1882k39156l98988k95736
$$ 1649188 1404792 1534227 1639551 1426659 1188031 1213196 1265078 1025922 626934 331198
35842C31198k57098l29559j71137K06474L43349J35262p380K9045j20690m55159
$$ 331198 74100 -255459 -426596 -220122 123227 258489 251109 280154 159464 -295695
35832b95695m37028P111K10840o8974j33890M30733R32100P06023J91980O258
$$ -295695 -732723 -725612 -514772 -583746 -717636 -286903 645197 1351220 1543200 1549458
35822A549458j80839p74163j084138l59093O33732N70828k59013l78379M05066
$$ 1549458 1368619 594456 -489682 -848775 -215043 355785 96772 -281607 123459
35813A23459O91684j01944p60377l26046M15715M27719P7622J66422L42228k11542
$$ 123459 815143 713199 -47178 -373224 42491 470210 547832 714254 1056482 844940
35803H44940j164792j395220o21172L89879R95672J096422O27249l33759j043233
$$ 844940 -319852 -1715072 -2336244 -1946365 -950693 145729 772978 439219 -604014
35794f04014p04118L06767P35339J46010n43104m82993J0419K46031K78072N32174
$$ -604014 -1308132 -1001365 -266026 -120016 -663120 -1146113 -1135694 -889663 -611591 -79417
35784g9417Q06078M79138l98987r76770p29502j71550j05027n05621o16880n6165
$$ -79417 726661 1205799 806812 -169958 -899460 -1071010 -1176037 -1681658 -2298538 -2354703
35774b354703O65721Q96406P02324N87535N98776K70479n10006j140622j073213
$$ -2354703 -1688982 -792576 -90252 497283 1096059 1366538 856532 -284090 -1357303
35765a357303n22834n6032J84287L87576M61863J06182n13345p28585k19780N01267
$$ -1357303 -1880137 -1936169 -1751882 -1364306 -902443 -796261 -1309606 -2038191 -2257971 -1756704
35755a756704P28127L95602q87q2378J60418O12505J079291J116884L55002q03509
$$ -1756704 -1028577 -632975 -633862 -716240 -555822 56683 1135974 2252858 2607860 1804351
35745A804351j303360o73479K49443M01816k5560N177O30487Q26257J73329k70853
$$ 1804351 500991 -172488 76955 478771 453211 458388 1088875 1915132 2088461 1817608
35735A817608L64995J196943Q36805l92674q44088N1951J104879J187899N03005
$$ 1817608 2182603 3379546 4216351 3823677 2979589 3031540 4136419 5324318 5827323
35726E827323k83457j013464j621584j696562j069708j64931O38218J278518J418687
$$ 5827323 5543866 4530402 2908818 1212256 142548 -22383 615835 1894353 3313040
35717C313040N91672o49754q96421J21450Q61196J82881r23509r90231l59674
$$ 3313040 3904712 3254958 2358537 2479987 3341183 3524064 2600555 1610324 1250650
35708A250650l22023q08333o94930M8387L26910o4010j37168L93998N58389j00902
$$ 1250650 928627 120294 -574636 -526249 -199339 -263349 -400517 -6519 551870 450968
35698D50968o52071l11669L24312K96148l58718q77109p34048N3021R51457J088050
$$ 450968 -201103 -512772 -188460 107688 -251030 -1128139 -1862187 -1809166 -857709 230341
35688B30341J62489p87783n13656N63147Q46755M0092m33819J11582M75838k62767
$$ 230341 392830 -394953 -908609 -345462 501293 541385 107566 219148 694986 432219
35678D32219j074270p21092K01659M27278J11816K11853O38442O27315K96626
$$ 432219 -642051 -1363143 -1161484 -734206 -622390 -410537 227905 855220 1151846
35669A151846K76853L29548j17790n59221j64600M73998J18069q53613q56324
$$ 1151846 1428699 1758247 1640457 1081236 916636 1390634 1508703 655090 -201234
35660b01234K46534Q84390M36301J19453O06369P32112l76769j583805j477406
$$ -201234 45300 929690 1365991 1485444 2091813 2823925 2447156 863351 -614055
35651f14055n02910K9937K0218K14628N60346L88077k15964n24147l59038o6587
$$ -614055 -1116965 -1087028 -1066810 -852182 -291836 96241 -119723 -643870 -1002908 -1069495
35641a069495L61535J022746J291055N06467o73823q72262J1575O07444R5164
$$ -1069495 -707960 314786 1605841 2112308 1438485 566223 577798 1185242 1280406
35632A280406p31624q35702l40613M5599K03863M68135Q11674Q46164M02783l29122
$$ 1280406 548782 -286920 -627533 -581934 -378071 90064 901738 1747902 2150685 1821563
35622A821563j034246j346808r95108j94821L81644L45433M1604k1110J27991
$$ 1821563 787317 -559491 -1554599 -1749420 -1367776 -1022343 -980739 -1001849 -873858
35613h73858J49216K3277L615J26656K18292K68919L64000L29547p0606n79424
$$ -873858 -724642 -701365 -697750 -571094 -352802 -83883 280117 609664 539058 -40366
35603d0366n91254j081N16042L18254m15874r59171q50119j92128O26806J196853
$$ -40366 -631620 -632701 -116659 201595 -214279 -1173450 -2023569 -2215697 -1588891 -392038
35593c92038J208839O58747o1709m97401n49400m22105k68105j20962p3920k04254
$$ -392038 816801 1475548 1413839 916438 367038 -55067 -323172 -444134 -518054 -722308
35583g22308l49304k87425j35608j86143l08758R705Q34431J457936J254933M98229
$$ -722308 -1071612 -1359037 -1494645 -1680788 -1989546 -1979841 -1145410 312526 1567459 2065688
35573B065688p9607k26132k04602j57764r963J28279N5255m6075J80723N37343
$$ 2065688 1986081 1759949 1555347 1397583 1387620 1515899 1571154 1525079 1705802 2243145
35563B243145L96601k67344o34624j96017M19135L09715m08592q26338n66894
$$ 2243145 2639746 2372402 1737778 1541761 1960896 2270611 1862019 1035681 468787
35554D68787k21116l77449p70071o94895J5635P82113J011007P81771O49817Q58200
$$ 468787 247671 -129778 -899849 -1594744 -1579109 -796996 214011 995782 1645599 2503799
35544B503799J001372N98217k16030q43783r61005p84729o56668o98096q57176
$$ 2503799 3505171 4103388 3887358 3043575 2082570 1297841 641173 -56923 -914099
35535i14099r34914n89872K47699R86594R46420L46800N2906K33140J39328m64680
$$ -914099 -1849013 -2438885 -2191186 -1204592 -258172 88628 141534 374674 514002 49322
35525D9322o92768l7038N44873J11774n58784j78580P34704N23201p51701j091877
$$ 49322 -643446 -680484 -135611 -23837 -582621 -761201 -26497 496704 -254997 -1346874
35515a346874K76806J406160M41680j526764j994043n28854R50455J032848L18504
$$ -1346874 -1070068 336092 777772 -748992 -2743035 -3271889 -2321434 -1288586 -970082
35506i70082o8465o5780k12289n40594o20202k69409K58809O14920O71996O46229
$$ -970082 -1038547 -1104327 -1316616 -1857210 -2477412 -2746821 -2488012 -1873092 -1201096 -554867
35496e54867Q68247J233993J126767K97169n08426m85649p1467l36442j129045
$$ -554867 313380 1547373 2674140 2971309 2462883 1977234 1905767 1569325 440280
35487D40280j041246L91172J661486J289017j03092p86943l60718O0319k11457
$$ 440280 -600966 -209794 1451692 2740709 2637617 1850674 1489956 1550275 1338818
35478A338818n91960m41123j2209J84450J23712m7392l79142p37570o43010K9417
$$ 1338818 746858 305735 293526 477976 601688 554296 175154 -562416 -1205426 -1176009
35468a176009O61355O75969L01658P6102k0919l63836q68520j000985n54227O1215
$$ -1176009 -514654 161315 462973 539075 518156 154320 -714200 -1715185 -2269412 -2208197
35458b208197L35717J56324j92176k86064P3470N47083N15374j01010n81938l29427
$$ -2208197 -1872480 -1716156 -1908332 -2194396 -2120926 -1573843 -1058469 -1159479 -1741417 -2070844
35448b070844K91513N30589L37627K14197K43815R4539j07207J67932P99209R33480
$$ -2070844 -1779331 -1248742 -911115 -696918 -453103 -358564 -465771 -297839 501370 1434850
35438A434850K58723m84422o52855n20166m48276j32121N82486R30336K64961
$$ 1434850 1693573 1209151 556296 36130 -412146 -544267 38219 968555 1233516
35429A233516p09599q30897k16071M8884k56252k30544M83955J029162P24286
$$ 1233516 523917 -306980 -523051 -474167 -730419 -960963 -477008 552154 1276440
35420A276440R1280p1397J78568L09130J74168n9519k84217k72484K90780J123849
$$ 1276440 1367720 1296323 1474891 1784021 1958189 1898670 1614453 1341969 1632749 2756598
35410B756598J331350O01322k67443o40910j031771j920818k421508j425575M13629
$$ 2756598 4087948 4689270 4421827 3780917 2749146 828328 -1593180 -3018755 -2605126
35401b605126J332308R50945N93453R71925J148799L66749n70558o86860m00055
$$ -2605126 -1272818 -321873 271580 1243505 2392304 2759053 2188495 1501635 1101580
35392A101580n49889p96511l10525N59975P02141J8344n22177m93248l89188l67505
$$ 1101580 551691 -244820 -555345 4630 706771 725115 202938 -290310 -679498 -1047003
35382a047003N1479P50565P85896m8184n83790J7698R09740Q51634P4248k38540
$$ -1047003 -995524 -244959 540937 492753 -91037 -73339 836401 1688035 1762283 1523743
35372A523743J81511N00743K55065r9953j64475j78491m20060p44306r36685r49479
$$ 1523743 1705254 2205997 2461062 2361109 2196634 2018143 1598083 853777 -82908 -1032387
35362a032387o65458n180O43531P30249L80148K51436M28484K60769m09737p39985
$$ -1032387 -1697845 -1703025 -1059494 -329245 50903 302339 730823 991592 581855 -158130
35352a58130j60828O04847N49257j64764n86765m19473j94338k14223j97358K8771
$$ -158130 -318958 285889 835146 670382 83617 -335856 -530194 -744417 -941775 -913004
35342i13004K38368L01238L32212K72923o2796m34950k96447L66439Q94610Q53657
$$ -913004 -674636 -373398 -41186 231737 168941 -266009 -562456 -196017 698593 1552250
35332A552250N10209K03643j50701o16775q85194p85832o36776o19806l27047
$$ 1552250 2062459 2266102 2115401 1498626 613432 -172400 -809176 -1428982 -1756029
35323a756029M72617J077159O54776m20544q72435j80425Q13883J106615O32031
$$ -1756029 -1283412 -206253 448523 27979 -844456 -1024881 -210998 895617 1527648
35314A527648j25609r36224j683594j883673j090201K73793J111388Q61743J04502
$$ 1527648 1402039 465815 -1217779 -3101452 -4191653 -3917860 -2806472 -1944729 -1840227
35305a840227k70510j44048m5996j75105j00210M30615Q87260O18021j23190l98956
$$ -1840227 -2110737 -2254785 -2300781 -2475886 -2576096 -2145481 -1258221 -640200 -763390 -1162346
35295a162346R0988M81260r9983j231325j612564o86104O86769J286117Q37270
$$ -1162346 -1071358 -590098 -690081 -1921406 -3533970 -4220074 -3533305 -2247188 -1409918
35286a409918J8040m82823n16319k32656K55253Q32449J267525J347732J063940
$$ -1409918 -1391878 -1874701 -2391020 -2623676 -2368423 -1535974 -268449 1079283 2143223
35277B143223N67007K2062m09781n69460m59327l45345m73163o55026l90760M48002
$$ 2143223 2710230 2732292 2322511 1753051 1293724 948379 475216 -179810 -570570 -122568
35267a22568J254505J267441M58429m01521n97561k13676N2202k96383j003104
$$ -122568 1131937 2399378 2857807 2456286 1858725 1645049 1697251 1400868 397764
35258C97764j308501p66889J93148O73595L51582j22569j9616M24535L38238m74495
$$ 397764 -910737 -1677626 -1484478 -810883 -459301 -581870 -601486 -176951 161287 -313208
35248c13208j134243q03407K66384J125619J214001P02442L7914m38735n81805
$$ -313208 -1447451 -2250858 -1984474 -858855 355146 1057588 1095502 656767 74962
35239G4962n13705n07032n41791k19002N39322J022100N46028m27382p07636L2357
$$ 74962 -438743 -945775 -1487566 -1706568 -1167246 -145146 400882 -26500 -734136 -701779
35229g01779P98697O74259M062k97213j00507n2719m42191p65943n10499J37463
$$ -701779 96918 771177 775239 478026 377519 324800 -117391 -883334 -1393833 -1256370
35219a256370N75772M94145R1061k64019m08350m48580n21778n41895k71629L21290
$$ -1256370 -680598 -186453 -95392 -359411 -767761 -1216341 -1738119 -2280014 -2551643 -2230353
35209b230353R24799J217093J192457R74986M83152l78591j234142j362338n15384
$$ -2230353 -1305554 -88461 1103996 2078982 2562134 2183543 949401 -412937 -928321
35200i28321O39681J144411O98545j81912p97231q04199k41980N98471J220019
$$ -928321 -288640 855771 1554316 1372404 575173 -229026 -471006 127465 1347484
35191A347484J143210L61377n28779q77653o27455k27426J0049J59723K66005
$$ 1347484 2490694 2852071 2323292 1445639 818184 590758 600807 760530 1026535
35182A026535Q1277n02670j045272r81449l35860L78024Q74509J209386J193664
$$ 1026535 1107812 605142 -440130 -1421579 -1757439 -1379415 -504906 704480 1898144
35173A898144M01881r04921j539989p59215N34264P87238j40886q18613k82132
$$ 1898144 2300025 1395104 -144885 -904100 -369836 417402 276516 -542097 -824229
35164h24229O88692Q16967R3958m52946k99548J09872K75853K30403J52203N7135
$$ -824229 -135537 681430 775388 322442 22894 132766 408619 639022 791225 848360
35154H48360K9444K05831L46664m2325r02112j428549j038694j33501M73388N38252
$$ 848360 877804 1083635 1430299 1387974 485862 -942687 -1981381 -2114882 -1641494 -1103242
35144a103242L90429K67046J45770O7525J29556K06472Q8419j30717j66983q156
$$ -1103242 -712813 -445767 -299997 -232472 -102916 103556 191975 61258 -105725 -113881
35134a13881J05179J21470J97979K73920O0675m36275p75302o27071j65271K34520
$$ -113881 -8702 112768 310747 584667 645342 209067 -566235 -1193306 -1358577 -1124057
35124a124057M09018L86664K29336N2473j8797k0358n0827K4604M20580R07554
$$ -1124057 -715039 -328375 -99039 -46566 -65363 -85721 -136548 -111944 308636 1216190
35114A216190R03870L15898j86299j05154J05874k57382r66076j057393j93396
$$ 1216190 2120060 2435958 2249659 2144505 2250379 1992997 1026921 -30472 -223868
35105b23868Q14975J043128N41041P7727R7927L07528K31092j29812l42444j55963
$$ -223868 591107 1634235 2175276 2253003 2350930 2658458 2889550 2759738 2417294 2261331
35095B261331J24642K0698m37505o72517l12305K59958L55215j49652o75026o71737
$$ 2261331 2385973 2406671 1969166 1296649 984344 1244302 1599517 1449865 774839 103102
35085A03102k53644m081k57427o69263n57797K70512J133073J155629L52032l33315
$$ 103102 -150542 -154623 -412050 -1081313 -1639110 -1368598 -235525 920104 1272136 938821
35075I38821k11877L22199M73732J66571n5249k0081j52070o54957j069823q85215
$$ 938821 726944 1049143 1522875 1689446 1634197 1614116 1462046 807089 -262734 -1147949
35065a147949j86482N34348R10437Q54489M80422Q6214k0291J31360J93622j7044
$$ -1147949 -1334431 -800083 110354 964843 1445265 1531479 1511188 1642548 1836170 1819126
35055A819126l04928m66732n49827n62898k97779K61402O66606N14266m110m13973
$$ 1819126 1514198 1047466 497639 -65259 -363038 -101636 564970 1079236 1075126 661153
35045F61153n72235n53282j99494N94507J264574R87983j28100r45523p27116
$$ 661153 88918 -464364 -663858 -69351 1195223 2183206 2055106 1109583 382467
35036C82467r4868p4970o58734r60221n39428J38971N11625N08579K54458j79127
$$ 382467 287599 212629 -446105 -1406326 -1945754 -1806783 -1295158 -786579 -532121 -711248
35026g11248m97720k54425M40227P80185L00125l54560k49726N24910R85853N82370
$$ -711248 -1208968 -1463393 -1023166 -242981 57144 -297416 -547142 -22232 963621 1545991
35016A545991k19004p02823p01499m75916k40188k3525K36535N65286P72660N40525
$$ 1545991 1326987 624164 -77335 -553251 -793439 -816964 -580429 -15143 757517 1298042
35006A298042l4555k53313L10791R77531P28024k99839r62820p99956n32659o03957
$$ 1298042 1263487 1010174 1320965 2298496 3026520 2726681 1763861 963905 431246 -172711
34996a72711l86583M79854J039300L52835q72754j173024l97916K72290J41842
$$ -172711 -559294 -79440 959860 1312695 439941 -733083 -1130999 -858709 -716867
34987g16867l12547n11658m54555k29714K04368N85432N25152K54989L86565Q21078
$$ -716867 -1029414 -1541072 -1995627 -2225341 -2020973 -1435541 -910389 -655400 -268835 552243
34977E52243P78225R9345l94172j64693K75214K58895j46249n58369q47721q67916
$$ 552243 1330468 1429813 1035641 870948 1146162 1405057 1258808 700439 -147282 -1015198
34967a015198l79933K94327L30161l40748o36349J28112J086023J071961L41577
$$ -1015198 -1395131 -1100804 -770643 -1111391 -1747740 -1619628 -533605 538356 879933
34958H79933J0150K73667L46365n0166k91124m589L62811L36371m1913o59623
$$ 879933 890083 1163750 1510115 1459949 1168825 1164236 1527047 1863418 1821505 1161882
34948A161882j534653k267329k042052o70130R00515J628998J543834J356799
$$ 1161882 -372771 -2640100 -4682152 -5352282 -4451767 -2822769 -1278935 77864
34940G7864J263832Q14141q9573p74268o89148k36005k08289o23439p10171j04390
$$ 77864 1341696 2155837 2066264 1291996 602848 366843 158554 -464885 -1175056 -1279446
34930a279446N56530N59376J26072l0968J86041K64233L1605j03897R9756L73117
$$ -1279446 -722916 -163540 -37468 -68436 117605 381838 413443 309546 409302 782419
34920G82419M55116M02749K76192N6395n7743J33841K79335j47666q43233q97064
$$ 782419 1237535 1640284 1916476 1972871 1915128 2048969 2328304 2180638 1337405 440341
34910D40341k08039K78943Q0014j31179J40167K83159k01420n85632q6516O68946
$$ 440341 232302 511245 591259 460080 600247 883406 681986 96354 9838 678784
34900F78784N63669k22521o05516l65363k34975m25997l22995L19799R39726J034539
$$ 678784 1242453 1019932 414416 49053 -185922 -611919 -934914 -615115 324611 1359150
34890A359150O36467p0423q27767j117571p02220j64029r2309p9578M67588R46147
$$ 1359150 1995617 1925194 1097427 -20144 -722364 -886393 -978702 -1058280 -590692 355455
34880C55455L39318q48716j020054N2421P92731K43331o31283p07189l28469k75641
$$ 355455 694773 -153943 -1173997 -1121576 -328845 -85514 -716797 -1423986 -1752455 -2028096
34870b028096l25509P8874O03294N36092n4861n51880p00922o11487l46334r8493
$$ -2028096 -2353605 -2274731 -1671437 -1135345 -1190206 -1742086 -2443008 -3054495 -3400829 -3499322
34860c499322k15638n11538k28578P22029J261182O58301j95335j0961R47140
$$ -3499322 -3714960 -4226498 -4455076 -3733047 -2471865 -1813564 -2008899 -2019860 -1072720
34851a072720J233847L13843p40733p20848K66686J011831N45193p81836j529906
$$ -1072720 161127 474970 -265763 -986611 -719925 291906 837099 55263 -1474643
34842a474643p40854Q02244J480107R56591M26257N66158N38466k83959r09220
$$ -1474643 -2215497 -1413253 66854 1023445 1449702 2015860 2554326 2270367 1361147
34833A361147k47809R21205R36587l52387j561991j801779j402798q13217p4979
$$ 1361147 1113338 2034543 2971130 2618743 1056752 -745027 -2147825 -2961042 -3036021
34824c036021N66549O68607L42963J09929M537l08019o44960n15992j36525j75861
$$ -3036021 -2469472 -1800865 -1457902 -1347973 -1343436 -1651455 -2296415 -2812407 -2948932 -3124793
34814c124793m99752k68735N97903J156957Q69619K68601p3572k47379l59844
$$ -3124793 -3624545 -3893280 -3295377 -2138420 -1268801 -1000200 -1073772 -1321151 -1680995
34805a680995j66614K51726L59435J25000K04360P10790P49879j89056j227786
$$ -1680995 -1847609 -1595883 -1236448 -1111448 -907088 -196298 553581 364525 -863261
34796h63261j248961l92359L72449O42103P46403Q69370P89909M03561p0019m01873
$$ -863261 -2112222 -2504581 -2132132 -1490029 -743626 125744 915653 1319214 1249195 847322
34786H47322n48050n81220o00994n92656l50592K01613O83122O84484M42527M72828
$$ 847322 299272 -281948 -882942 -1475598 -1826190 -1624577 -941455 -256971 185556 658384
34776F58384N83386R7316q26122j098178l29471M32100K27032m36415n36582j14177
$$ 658384 1241770 1339086 512964 -585214 -914685 -482585 -255553 -691968 -1228550 -1342727
34766a342727P6108o1718M840L25949L91989Q4399j59523j60431k51373o17857
$$ -1342727 -1266619 -1328337 -1323497 -997548 -605559 -521160 -680683 -841114 -1092487 -1710344
34756a710344r36397p84857q3722Q16517J245097O85493n27357j353247j266421
$$ -1710344 -2646741 -3431598 -3515320 -2698803 -1453706 -768213 -1295570 -2648817 -3915238
34747c915238q25449n69112r7126R17493J569042Q60086m55337o78953K96489
$$ -3915238 -4740687 -5309799 -5406925 -4489432 -2920390 -2060304 -2515641 -3194594 -2898105
34738b898105Q70181L63290O1741R39160J904567J469294o288j041765j173170
$$ -2898105 -2027924 -1664634 -1602893 -663733 1240834 2710128 2703840 1662075 488905
34729D88905j003055p31675j03799M88896L30715k14673k9241Q63001J132256
$$ 488905 -514150 -1245825 -1349624 -860728 -530013 -744686 -773927 89074 1221330
34720A221330K92054l98554L3244O14386q423j259577j369526l4712J131971Q90248
$$ 1221330 1513384 1114830 1148074 1762460 1754037 494460 -875066 -909778 222193 1112441
34710A112441j68412q19107p85976n31404k78924J8911K24540J91611J07821J60537
$$ 1112441 944029 124922 -661054 -1192458 -1471382 -1452471 -1227931 -1036320 -928499 -767962
34700g67962J62552k0472k6209M48110R55189Q46784L27423K10255O52788R14367
$$ -767962 -605410 -625882 -652091 -203981 751208 1597992 1925415 2135670 2788458 3702825
34690C702825N24806n5437k82924l79720p97019j287299j179511m36820J63494
$$ 3702825 4227631 4172194 3889270 3509550 2712531 1425232 245721 -191099 -27605
34681b7605J6291n54451p46912k73731L61298N55947L35047K10495M44251P53121
$$ -27605 -11314 -565765 -1312677 -1586408 -1225110 -669163 -334116 -123621 320630 1073751
34671A073751P83041N34074J40816m07538j001405j187274o71652J58679O93794
$$ 1073751 1856792 2390866 2531682 2124144 1122739 -64535 -736187 -577508 116286
34662A16286Q74955R67411P96075o834j028182j252275m72578K75732J05480n87693
$$ 116286 991241 1958652 2754727 2747893 1719711 467436 -5142 270590 376070 -211623
34652b11623q58256m47111K80401J051045J633913J523673N00205o96386j033776
$$ -211623 -1069879 -1516990 -1236589 -185544 1448369 2972042 3472247 2775861 1742085
34643A742085n11876j43954n39284j125175j020585k28804M01264K38044m02476
$$ 1742085 1230209 1086255 546971 -578204 -1598789 -1827593 -1426329 -1188285 -1590761
34634a590761o74086k56822K37402J14035l76457l55517L77016J006587Q77716
$$ -1590761 -2264847 -2521669 -2284267 -2170232 -2546689 -2902206 -2525190 -1518603 -640887
34625f40887L32051k4589k45483o36058r42785o73237P4004P37448J005697Q71388
$$ -640887 -308836 -333425 -578908 -1214966 -2157751 -2830988 -2756984 -2019536 -1013839 -142451
34615a42451L37761l17307m01550L18584R85011P24240k2528k28072J5671k45924
$$ -142451 195310 -121997 -523547 -204963 780048 1504288 1481760 1253688 1269359 1023435
34605A023435j012567j175665l80484L37696K50098q100K44675N14495J16034
$$ 1023435 10868 -1164797 -1545281 -1207585 -957487 -965587 -720912 -206417 -90383
34596i0383n44293o42737k06532K14549N48511R45547J037721M29848m23119p36350
$$ -90383 -634676 -1277413 -1483945 -1269396 -720885 224662 1262383 1692231 1269112 532762
34586E32762n09825k96808j89551P2440K88254Q1398j96180J19468P63793P76332
$$ 532762 22937 -273871 -463422 -390982 -102728 -21330 -217510 -98042 665751 1442083
34576A442083J5991o12581o05493m74636o21136o37751k21673J38945M94k65658
$$ 1442083 1458074 845493 240000 -234636 -855772 -1493523 -1715196 -1576251 -1575757 -1841415
34566a841415j56525J57541L14270M31523O66663O81852K25638k75674l97839
$$ -1841415 -1997940 -1840399 -1526129 -1094606 -427943 253909 479547 203873 -193966
34557a93966m60420q30845j037616n11202K51047L57873N8311L66457J232506
$$ -193966 -654386 -1485231 -2522847 -3034049 -2783002 -2425129 -2366818 -2000361 -767855
34548g67855J429674N11420m14359l99986J0552q1174m49254l58347Q4002K49351
$$ -767855 661819 1173239 758880 358894 369446 288272 -160982 -519329 -435327 -185976
34538a85976J78234L77021P03581N22556j00835l82727j00852N5183l21403o73956
$$ -185976 -7742 369279 1072860 1595416 1494581 1111854 1011002 1066185 744782 70826
34528G0826m40234J1012k4689n25740q54453o43923o4901N96549J126589J231385
$$ 70826 -369408 -358396 -383085 -908825 -1763278 -2407201 -2472102 -1875553 -748964 482421
34518D82421O94712j99486p49328n46396O2650M07452K88069J07959K00079L27192
$$ 482421 1177133 977647 228319 -318077 -255427 152025 440094 548053 748132 1075324
34508A075324J20178k10867j04484M15083O33699K16422k41945j82791K0424j80815
$$ 1075324 1195502 984635 880151 1295234 1928933 2145355 1903410 1720619 1741043 1560228
34498A560228m26188r4463L57505n3372j013253j025423L11771J474241J143622
$$ 1560228 1134040 1039577 1397082 1343710 330457 -694966 -383195 1091046 2234668
34489B234668p531n91944n40080o43910q28026l37567O31774R16404J29568p33168
$$ 2234668 2227137 1635193 1095113 451203 -376823 -714390 -82616 833788 963356 230188
34479B30188p33420j16530L34021K86487j54456p70631j140617q06285M5576N37028
$$ 230188 -503232 -619762 -285741 746 -153710 -924341 -2064958 -2871243 -2825667 -2288639
34469b288639J62752m70562l96874M75935J285830J231246L50397o44978j076429
$$ -2288639 -2125887 -2596449 -2993323 -2517388 -1231558 -312 350085 -294893 -1371322
34460a371322q30628l04203J03158L18363L71624J30089m13205p63595l22342
$$ -1371322 -2201950 -2506153 -2402995 -2084632 -1713008 -1582919 -1996124 -2759719 -3082061
34451c082061P92041J705552J683484Q06908k58731q79751q39123m26786j84416
$$ -3082061 -2290020 -584468 1099016 1905924 1647193 767442 -71681 -498467 -682883
34442f82883l13121m03754n4100M18890L79333j02081k51360K68036Q22303O95024
$$ -682883 -996004 -1399758 -1453858 -1034968 -655635 -757716 -1009076 -741040 81263 776287
34432G76287L5478m31857l40946p474K6246m17928r28799q67598j09181O99600
$$ 776287 811765 379908 38962 31488 57734 -360194 -1288993 -2156591 -2265772 -1566172
34422a566172Q92561O00087L96140L60645J24558k75281l72838j72486k57300
$$ -1566172 -673611 -73524 322616 683261 807819 532538 159700 -12786 -270086
34413b70086p54989r62595l81501N24672J007942Q93790M01054k72698p65843
$$ -270086 -1025075 -1987670 -2369171 -1844499 -836557 57233 458287 185589 -580254
34404e80254n88267J39836N55433K02949k39755J0952O30416P20881J49635m00568
$$ -580254 -1168521 -1028685 -473252 -270303 -510058 -499106 131310 852191 1001826 601258
34394F01258m48040q6187M47318R23352J000501N43667n5824l57354m58462o33173
$$ 601258 153218 67031 514349 1437701 2438202 2981869 2926045 2568691 2110229 1477056
34384A477056o98744l48447J46524K37399o3826k75669k27840j36949o6243M1785
$$ 1477056 778312 429865 576389 813788 749962 474293 246453 109504 43261 85046
34374H5046m9982n42486r47878n29860N71485J368425J283002P31255L26871J27524
$$ 85046 35064 -507422 -1455300 -1985160 -1413675 -45250 1237752 1969007 2295878 2423402
34364B423402j12181m47605p46675q61359p00867l97615l15178n58756o79605
$$ 2423402 2311221 1863616 1116941 255582 -445285 -842900 -1158078 -1716834 -2396439
34355b396439l14327J48730J34748j53357o7529M08584P60697R54710J359660
$$ -2396439 -2710766 -2562036 -2427288 -2580645 -2648174 -2239590 -1478893 -524183 835477
34346H35477J707745J247010J03680o19909m43916j36053k98257m20838Q275M54810
$$ 835477 2543222 3790232 3893912 3274003 2830087 2694034 2395777 1974939 1983214 2438024
34336B438024K21119m30178q67286j077187j209482q63350J45171Q98305M30534
$$ 2438024 2659143 2228965 1361679 284492 -924990 -1788340 -1643169 -744864 -314330
34327c14330o75536r23495p735Q41210O80334j8357l27005q7619K13152J96143
$$ -314330 -989866 -1913361 -1921096 -1079886 -399552 -417909 -744914 -832533 -619381 -423238
34317d23238j40452n14692n24874m5912M82460N15816J09343k59247m45756o34746
$$ -423238 -563690 -1078382 -1603256 -1649168 -1166708 -650892 -541549 -800796 -1246552 -1881298
34307a881298o68358j46395O81131R10288K19193n47249m73102K70074Q31299
$$ -1881298 -2549656 -2696051 -2014920 -1104632 -885439 -1432688 -1905790 -1635716 -804417
34298h04417Q07168M44141M7107k63185l71451k21071J9527J62577K47719L15698
$$ -804417 2751 446892 493999 230814 -140637 -361708 -342181 -179604 68115 383813
34288C83813J70101k70746o16634m60703k6020J51738O6775J70109M83272M96680
$$ 383813 553914 283168 -333466 -794169 -820189 -668451 -601676 -431567 51705 548385
34278E48385J25469J6250M65665P09583n539j105307j319841m55520L88022M38897
$$ 548385 673854 690104 1155769 1865352 1859813 754506 -565335 -1020855 -632833 -193936
34268a93936J47796J23108Q6638m16304r45779p29162M2745M20585J13477j88086
$$ -193936 -46140 76968 163606 -252698 -1198477 -1927639 -1884894 -1464309 -1350832 -1538918
34258a538918N627L29070L47385K23069J99116Q6506k39430l98262j07783K59155
$$ -1538918 -1533291 -1204221 -856836 -633767 -434651 -348145 -587575 -985837 -1093620 -834465
34248h34465K98248K81797N63692P13533J10397q52306j121786n24033J2880o4326
$$ -834465 -536217 -254420 309272 1022805 1133202 280896 -840890 -1364923 -1352043 -1416369
34238a416369j92209J78629N90833L77364j80727k69810K28565O57952N91193
$$ -1416369 -1608578 -1429949 -839116 -461752 -642479 -912289 -683724 -25772 565421
34229E65421K85458J53179K78020M83565N03087R0915o93489j346087j384635
$$ 565421 850879 1004058 1282078 1765643 2268730 2359645 1666156 320069 -1064566
34220a064566q96984l21407J74323O82519J058408R72780M70199m0899m06641
$$ -1064566 -1961550 -2282957 -2108634 -1426115 -367707 605073 1075272 1034373 627732
34211F27732q07307j143157r62068k29966M23953N71221N45619P40196Q94123
$$ 627732 -179575 -1322732 -2284800 -2514766 -2090813 -1519592 -973973 -233777 660346
34202F60346O17307J48972m9115q5641l30802o08938m72209j01256j04340m51070
$$ 660346 1277653 1426625 1377510 1291869 961067 352129 -120080 -221336 -325676 -776746
34192g76746m35087K01570Q88284J132462J041770P34884N4102p85257j076490
$$ -776746 -1211833 -1010263 -121979 1010483 2052253 2787137 2841239 2055982 979492
34183I79492o58291l26243o05603q27761k02306P99916J080802N42299P4341Q8001
$$ 979492 321201 -5042 -610645 -1438406 -1640712 -840796 240006 782305 856646 944647
34173I44647P4764k96655n65690k61469L74176P69961O57983J12227n87412r44645
$$ 944647 1019411 722756 157066 -104403 269773 1039734 1697717 1809944 1222532 277887
34163B77887n74572K15873N93840K14652k96108j74268M66161P98058L24060n46738
$$ 277887 -296685 -80812 513028 727680 431572 257304 723465 1521523 1845583 1298845
34153A298845r84012o52583m4518J63772j3385L9605M96583O46137q3310j092106
$$ 1298845 314833 -337750 -382268 -218496 -231881 -192276 304307 950444 867134 -224972
34143b24972j288743n74376J28740K74307K65891M78837N68801J88985k81458
$$ -224972 -1513715 -2088091 -1959351 -1685044 -1419153 -940316 -371515 -182530 -463988
34134d63988l00788p969P8926o6751K1836N12507R44953Q03042J81344k76553
$$ -463988 -764776 -772745 -693819 -760570 -738734 -226227 718726 1521768 1703112 1426559
34124A426559j14476L46938L64672k23239p07129m99364n016L0298l13095l50714
$$ 1426559 1312083 1659021 2023693 1800454 1093325 593961 588945 619243 306148 -44566
34114d4566M7409L93200N71463Q87496J065902L47441j068814j811335j169997
$$ -44566 2843 396043 967506 1855002 2920904 3268345 2199531 388196 -781801
34105g81801j42608R9305j38046R7491O84741O85835j00599r35060j300130j313789
$$ -781801 -924409 -825104 -963150 -865659 -180918 504917 404318 -530742 -1830872 -3144661
34095c144661j053400l35836P30521J606860J851282J429669O15013r9565k69524
$$ -3144661 -4198061 -4533897 -3803376 -2196516 -345234 1084435 1699448 1599883 1330359
34086A330359m7716p3583m31916l33917N60829J226362O23647o08735r99591m33411
$$ 1330359 1282643 1209060 777144 443227 1004056 2230418 2854065 2245330 1245739 812328
34076H12328j86214q40482j476108j166726j41218Q86892J542013J564199P33853
$$ 812328 626114 -214368 -1690476 -2857202 -2998420 -2111528 -569515 994684 1728537
34067A728537m73436r73672l75370M39162N04227n0818m55669l57945M0343M15227
$$ 1728537 1255101 281429 -93941 345221 849448 798630 342961 -14984 25359 440586
34057D40586M55619o111o36747p98217l93748l8751j10880k03186J03829N07859
$$ 440586 896205 890094 253347 -544870 -938618 -977369 -1088249 -1291435 -1187606 -679747
34047f79747N09731J86680o7895j72839k37185j69289J08013L39167K53218m9948
$$ -679747 -170016 16664 -51231 -224070 -461255 -630544 -522531 -183364 69854 19906
34037A9906l26869m63873k81124M21391J257415J283221J82058j093395j485619
$$ 19906 -306963 -770836 -1051960 -630569 626846 1910067 2092125 998730 -486889
34028d86889j157795r35461q82996l79261N88280J191008R23133K15839k86371
$$ -486889 -1644684 -2580145 -3463141 -3842402 -3254122 -2063114 -1139981 -924142 -1210513
34019a210513m18661k92873K010K71983K86118J75484L15373O45974O05511k3479
$$ -1210513 -1629174 -1922047 -1920037 -1648054 -1361936 -1186452 -871079 -225105 380406 356927
34009C56927o78401p45406l24653P8689K74582L97465M68967L98842K80834K89016
$$ 356927 -321474 -1066880 -1391533 -1312844 -1038262 -640797 -171830 227012 507846 796862
33999G96862L64578L58916L88829O44585R03515P17418J37910k70683l29954n85332
$$ 796862 1161440 1520356 1909185 2553770 3457285 4174703 4312613 4041930 3711976 3126644
33989C126644j328842j811442j142406K88189J112079P14759j48843o38442q41028
$$ 3126644 1797802 -13640 -1156046 -867857 244222 958981 810138 171696 -669332
33980f69332j047571q83646J0940J011135J189369O75557L65174M25260J56298
$$ -669332 -1716903 -2600549 -2589609 -1578474 -389105 286452 651626 1076886 1233184
33971A233184n83536r39187m48554J11751q5751o47069o37361L751N32031N49156
$$ 1233184 649648 -289539 -738093 -626342 -712093 -1359162 -1996523 -1992772 -1460741 -911585
33961i11585L04342L1731k64598m10384j44702L16052M12315R6798j1607M09190
$$ -911585 -607243 -575512 -840110 -1250494 -1395196 -1079144 -666829 -570031 -581638 -172448
33951a72448P88328M71619k19661l25865L95270J004591N32096p55672j640005
$$ -172448 615880 1087499 867838 541973 937243 1941834 2473930 1718258 78253
33942G8253j378023m20016L31020N12864L29468J7143k63583k52782J63591N90895
$$ 78253 -1299770 -1719786 -1388766 -875902 -546434 -529291 -792874 -1045656 -882065 -291170
33932b91170M74747j67107p54261q81110o39418k28013K58821N85186M48962n051
$$ -291170 183577 16470 -737791 -1618901 -2258319 -2486332 -2227511 -1642325 -1193363 -1198414
33922a198414k18355m158J30764k62506q74765j023164m79925L55940R05938Q38523
$$ -1198414 -1416769 -1420927 -1290163 -1552669 -2427434 -3450598 -3930523 -3574583 -2668645 -1830122
33912a830122K89172j64726J0199O81010J144702R52782L58002j49164l91263
$$ -1830122 -1540950 -1705676 -1695477 -1014467 130235 1083017 1441019 1291855 900592
33903I00592m37919l39795j38730R6091L46525N29884L64914k45778p71210n52747
$$ 900592 462673 122878 -15852 80239 426764 956648 1321562 1075784 304574 -248173
33893b48173K33842P43348O44607M14195L19998k5806p56508j233901r57751l01513
$$ -248173 -14331 729017 1373624 1787819 2107817 2082011 1325503 91602 -866149 -1167662
33883a167662J53320L37167K74924k57258j037393j161156k86647N93958M92128
$$ -1167662 -1014342 -677175 -402251 -659509 -1696902 -2858058 -3144705 -2550747 -2058619
33874b058619j26731j94495K63174M03288J02126MK11640J79780j80049k73221
$$ -2058619 -2185350 -2379845 -2116671 -1713383 -1611257 -1611253 -1399613 -1219833 -1399882 -1673103
33864a673103Q1023K77166j12406p15587r05599m32512N14653J343768J271515
$$ -1673103 -1592080 -1314914 -1427320 -2142907 -3048506 -3481018 -2966365 -1622597 -351082
33855c51082J55997r72723r19274J77941J036426Q70836J41113l13370j67883
$$ -351082 -195085 -1167808 -2087082 -1909141 -872715 -1879 139234 -174136 -342019
33846c42019L92307R07276Q32048P5615o72533o91955j58349K49981L75367M69894
$$ -342019 50288 957564 1789612 1865227 1192694 500739 342390 592371 967738 1437632
33836A437632L94382j24730o50125m61507K83583Q05679R43100J020868P00195
$$ 1437632 1832014 1707284 1057159 595652 879235 1684914 2628014 3648882 4349077
33827D349077o12236k173638k308013p94021O30078P19472K51232L51073O96968
$$ 4349077 3736841 1563203 -744810 -1538831 -908753 -189281 61951 413024 1109992
33818A109992M57572j21282k93042j56956k46645l86982r8036K98251O0681p07670
$$ 1109992 1567564 1446282 1153240 996284 749639 362657 264621 562872 623553 -84117
33808h4117j093689n85102M08625J125176J079621L75000k52926q4741N85289
$$ -84117 -1177806 -1762908 -1354283 -229107 850514 1225514 972588 887847 1473136
33799A473136O79890q3442o39047j72346N81835M84027l02308p53154n66686k31954
$$ 1473136 2153026 2069584 1430537 1258191 1840026 2324053 2021745 1268591 701905 469951
33789D69951O7226N08309Q40768O18923J13257O514K53795J92493k69964n63031
$$ 469951 537177 1045486 1886254 2505177 2618434 2624948 2878743 3071236 2801272 2238241
33779B238241n61104p48220j107159q86960J21748R87197Q79411K16203o1745
$$ 2238241 1677137 928917 -178242 -1065202 -943454 43743 923154 1139357 1077612
33770A077612J60768K40852j16169n31883o85588p28962p88307n69280J29348
$$ 1077612 1238380 1479232 1363063 831180 145592 -583370 -1371677 -1940957 -1811609
33761a811609Q09101P58959J26330j47911K92649O07521R6169n24611j59164P86286
$$ -1811609 -1002508 -243549 -117219 -265130 27519 635040 731209 206598 47434 833720
33751H33720Q59999j48895q22465l64802K22759j7160l46738K71872J166150Q41814
$$ 833720 1693719 1544824 722359 357557 580316 563156 216418 488290 1654440 2496254
33741B496254o34927j609594j098629J30604Q25210O29422M0273l03507j48319
$$ 2496254 1861327 251733 -846896 -716292 108918 738340 778613 475106 326787
33732C26787J19286j50032q83320j110927l22268N92888N84890O0402J72386Q99419
$$ 326787 446073 296041 -587279 -1698206 -2020474 -1427586 -842696 -782294 -609908 289511
33722B89511J111130M36928k12694j39620K69837M42850L82995J80742l62164
$$ 289511 1400641 1837569 1624875 1485255 1755092 2197942 2580937 2761679 2399515
33713B399515j190666j744323j622776j035702m18897m3272P18p0216K40104R65145
$$ 2399515 1208849 -535474 -2158250 -3193952 -3612849 -3656121 -3655403 -3725619 -3485515 -2520370
33703b520370J246515M38435o87661q73994k47065o866l77481l45009M05187Q60333
$$ -2520370 -1273855 -835420 -1523081 -2397075 -2644140 -2651006 -3028487 -3373496 -2968309 -2107976
33693b107976M73814R5868L90010O92317L52872l4302J90608M37246p0164q00815
$$ -2107976 -1634162 -1538294 -1148284 -455967 -103095 -137397 53211 490457 420293 -380522
33683c80522p51467o4329M59404Q48499J571315K073405J238973o80592j971971
$$ -380522 -1131989 -1196318 -736914 111585 1682900 3756305 4995278 4314686 2342715
33674B342715j598132l75117L33758K07056j65850k78354o5886K88071N01829
$$ 2342715 744583 369466 703224 910280 744430 466076 400190 688261 1190090
33665A190090L95481J39188O5356J61683O8867l29020o51757n18493l2610M02057
$$ 1190090 1585571 1724759 1790115 1951798 2020665 1691645 1039888 521395 488785 890842
33655H90842N60826N04085K92642j74406q81124j334964q69890L93143J232890
$$ 890842 1451668 1955753 2248395 2073989 1192865 -142099 -1011989 -618846 614044
33646F14044O17481q01419j309695l90491N92338M32656k13511p1549O45327O96297
$$ 614044 1231525 430106 -879589 -1270080 -677742 -245086 -458597 -530146 115181 811478
33636H11478l5473l59492J71757M91769j83340j051284j057375n32194m26021
$$ 811478 776005 416513 588270 1080039 896699 -154585 -1211960 -1744154 -2170175
33627b170175o21540k73163N26879P77704K92108N3434M73295N82265k52065r15115
$$ -2170175 -2791715 -3064878 -2537999 -1760295 -1468187 -1414753 -941458 -359193 -611258 -1526373
33617a526373p1354J600326K128552R66588m37351q66788p12821p20791p33876
$$ -1526373 -1597727 2599 2131151 3097739 2660388 1793600 1080779 359988 -373888
33608c73888m55283l17592o21211p19113r8875N12891K47455m14524m89667k00722
$$ -373888 -829171 -1146763 -1767974 -2487087 -2585962 -2073071 -1825616 -2240140 -2729807 -2930529
33598b930529m09775q11528l28225Q45513J283496N82259k3143L10402Q56531
$$ -2930529 -3340304 -4151832 -4480057 -3634544 -2351048 -1768789 -1791932 -1481530 -624999
33589f24999P22201J26211l28291n04286l19620L58583R27432M40494o72307p32279
$$ -624999 97202 223413 -104878 -609164 -928784 -570201 357231 797725 125418 -606861
33579f06861N91807J390860L10324j293235j433043l92692J73234k6935k3716
$$ -606861 -15054 1375806 1686130 392895 -1040148 -1432840 -1259606 -1286541 -1310257
33570a310257K76022Q2444m24377j66965Q48056J337960P65499L3552j44449j47891
$$ -1310257 -1034235 -951791 -1376168 -1543133 -695077 642883 1408382 1441934 1297485 1149594
33560A149594l08311j95944L58426O45656J79400m30128l70076K31627O26584
$$ 1149594 841283 645339 1003765 1649421 1828821 1398693 1028617 1260244 1886828
33551A886828M42469q9886n42531n90929j90409L31768N47326L19663k17847q45309
$$ 1886828 2329297 2239411 1696880 1105951 915542 1247310 1794636 2114299 1896452 1051143
33541A051143j161327p32361J94783O22169Q8517n01916j75339N26842L56190
$$ 1051143 -110184 -842545 -647762 -25593 62924 -438992 -614331 -87489 268701
33532B68701o49493j259160r52065l99375n7443L57320Q15887P29684J02506k59392
$$ 268701 -380792 -1639952 -2592017 -2991392 -3048835 -2691515 -1875628 -1145944 -1043438 -1302830
33522a302830n1771J35453M3220J57406N26142M45216j74711m41037j01423j47969
$$ -1302830 -1354601 -1219148 -1175928 -1018522 -492380 -47164 -221875 -662912 -764335 -912304
33512i12304r52062j206976M2854J500813J258480m20094j485351q91660L87308
$$ -912304 -1864366 -3071342 -3028488 -1527675 -269195 -689289 -2174640 -3066300 -2678992
33503b678992R96392O45243j22417o24254l81295N00116J204960J012451J77343
$$ -2678992 -1682600 -1037357 -1159774 -1784028 -2165323 -1665207 -460247 552204 729547
33494G29547m52335m98236k12791J67027N90618Q49544O59913Q8036m85061p39872
$$ 729547 277212 -221024 -433815 -266788 323830 1173374 1833287 1921323 1436262 696390
33484F96390n36799L8296M97690K85785l65634m92763K07717O98402K4210j167388
$$ 696390 159591 197887 695577 981362 615728 122965 330682 1029084 1053294 -114094
33474a14094j426942m45274P20585J135408Q19706K17465l29827n57622l97790
$$ -114094 -1541036 -1986310 -1265725 -130317 689389 906854 577027 19405 -378385
33465c78385j65934j78670l30253m47347o78728r94324q15856R6989R09253P91781
$$ -378385 -544319 -722989 -1053242 -1500589 -2179317 -3173641 -3989497 -3892508 -2983255 -2191474
33455b191474K58066L12923P01804L87488m47088m76143N19843J100038M14155
$$ -2191474 -1933408 -1620485 -918681 -531193 -978281 -1454424 -934581 165457 579612
33446E79612m68251l48533K39474J20039m67344k54944R54374J798277J117336
$$ 579612 111361 -237172 2302 122341 -345003 -599947 354427 2152704 3270040
33437C270040n58602j600130j073724K51002P63640p3153j013199o81477M73426
$$ 3270040 2711438 1111308 37584 288586 1052226 979073 -34126 -715603 -242177
$$ [...]
##END NTUPLES=NMR SPECTRUM
##END=
