##TITLE=31P_DE-80H_X3
 64 sc D2O
 26.2.2025
##JCAMPDX= 6.0         $$ Bruker NMR JCAMP-DX V2.0
##DATA TYPE= NMR SPECTRUM
##DATA CLASS= NTUPLES
##ORIGIN= UXNMR, Bruker Analytische Messtechnik GmbH
##OWNER= root
$$ XWIN-NMR		Version 3.5
$$ Mon Jun 30 10:39:56 2025 Russian Standard Time (UT+4h)  Yarkov@DPX200
##.OBSERVE FREQUENCY= 81.013821
##.OBSERVE NUCLEUS= ^31P
##.ACQUISITION MODE= SIMULTANEOUS
##.ACQUISITION SCHEME= undefined
##.AVERAGES= 64
##.DIGITISER RES= 17
##SPECTROMETER/DATA SYSTEM= spect
##.PULSE SEQUENCE= zgpg30
##.SOLVENT NAME= DMSO
##.SHIFT REFERENCE= (INTERNAL, DMSO, 0, 198.062)
##AUDIT TRAIL= $$ (NUMBER, WHEN, WHO, WHERE, WHAT)
$$ ##TITLE= Audit trail, XWIN-NMR		Version 3.5
$$ ##JCAMPDX= 5.01
$$ ##ORIGIN= Bruker BioSpin GmbH
$$ ##OWNER= Yarkov
$$ C:/Bruker/XWIN-NMR/data/yarkov2/nmr/P31/2/pdata/1/auditp.txt
$$ ##AUDIT TRAIL=  $$ (NUMBER, WHEN, WHO, WHERE, WHAT)
(   1,<2025-06-30 10:39:00.46 +0400>,<Yarkov>,<DPX200>,
      <created by zg, POWCHK disabled, PULCHK disabled
       configuration hash MD5:
       00 E9 B6 7A A2 85 ED C7 34 08 36 98 17 FE 4E 26
       data hash MD5: 32K
       F2 94 DE C1 49 8F 07 84 8F 5C 56 8C 14 80 56 A4>)
(   2,<2025-06-30 10:39:08.87 +0400>,<Yarkov>,<DPX200>,
      <Start of raw data processing
       efp BC_mod = 2 LB = 1.5 FT_mod = 6 PKNL = 1 PHC0 = 1676.894 PHC1 = 46.35953 SI = 64K 
       data hash MD5: 64K
       4E 94 FC 87 24 72 B9 0C F8 2C 98 C5 3F 82 B7 0A>)
(   3,<2025-06-30 10:39:28.95 +0400>,<Yarkov>,<DPX200>,
      <pk PHC0 = 0.199997 PHC1 = 0 
       data hash MD5: 64K
       00 3E 2E 94 1C FD 16 F4 D9 55 80 2C 6A 1B F3 6D>)
$$ ##END=
$$ 
$$ hash MD5
$$ 96 45 52 8B A6 96 37 84 C6 1A 1D 89 FE 07 D5 33
##$RELAX= 
##$RELAX= 
##$RELAX= 
##$RELAX= 
##$RELAX= 
##$RELAX= 
##$RELAX= 
##$RELAX= 
$$ Bruker specific parameters
$$ --------------------------
##$DU= <C:/Bruker/XWIN-NMR>
##$EXPNO= 2
##$NAME= <P31>
##$PROCNO= 1
##$TYPE= <nmr>
##$USER= <yarkov2>
##$AMP= (0..31)
100 100 100 100 100 100 100 100 100 100 100 100 100 100 100 100 100 100 
100 100 100 100 100 100 100 100 100 100 100 100 100 100 
##$AQSEQ= 0
##$AQ_mod= 1
##$AUNM= <au_zg>
##$AUTOPOS= <>
##$BF1= 81.014009
##$BF2= 200.13
##$BF3= 200.13
##$BF4= 200.13
##$BF5= 200.13
##$BF6= 200.13
##$BF7= 200.13
##$BF8= 200.13
##$BYTORDA= 1
##$CFDGTYP= 0
##$CFRGTYP= 5
##$CHEMSTR= <none>
##$CNST= (0..31)
1 1 145 1 1 1 1 1 1 1 1 1 1 1 1 1 1 1 1 1 1 1 1 1 1 1 1 1 1 1 1 1 
##$CPDPRG= <waltz16>
##$CPDPRG1= <>
##$CPDPRG2= <waltz16>
##$CPDPRG3= <>
##$CPDPRG4= <mlev>
##$CPDPRG5= <mlev>
##$CPDPRG6= <mlev>
##$CPDPRG7= <mlev>
##$CPDPRG8= <mlev>
##$CPDPRGB= <>
##$CPDPRGT= <>
##$D= (0..31)
0 1 0 0 0 0 0 0 0 0.06 0 0.03 2e-05 3e-06 0 0 0.0002 0 0 0 0 0 0 0 0 0 
0 0 0 0 0 0 
##$DATE= 1751265539
##$DBL= (0..7)
120 120 120 11 120 120 24 19 
##$DBP= (0..7)
150 150 150 150 150 150 150 150 
##$DBP07= 0
##$DBPNAM0= <>
##$DBPNAM1= <>
##$DBPNAM2= <>
##$DBPNAM3= <>
##$DBPNAM4= <>
##$DBPNAM5= <>
##$DBPNAM6= <>
##$DBPNAM7= <>
##$DBPOAL= (0..7)
$$ [...]
##$SUBNAM2= <"">
##$SUBNAM3= <"">
##$SUBNAM4= <"">
##$SUBNAM5= <"">
##$SUBNAM6= <"">
##$SUBNAM7= <"">
##$SUBNAM8= <"">
##$SUBNAM9= <"">
##$SW= 400.765351723535
##$SWIBOX= (0..15)
0 1 3 0 0 0 0 0 0 0 0 0 0 0 0 0 
##$SW_h= 32467.5324675325
##$TD= 32768
##$TD0= 1
##$TE= 0
##$TE2= 300
##$TE3= 300
##$TEG= 300
##$TL= (0..7)
0 120 53 12 22 120 120 120 
##$TP= (0..7)
150 150 150 150 150 150 150 150 
##$TP07= 0
##$TPNAME0= <>
##$TPNAME1= <>
##$TPNAME2= <>
##$TPNAME3= <>
##$TPNAME4= <>
##$TPNAME5= <>
##$TPNAME6= <>
##$TPNAME7= <>
##$TPOAL= (0..7)
0.5 0.5 0.5 0.5 0.5 0.5 0.5 0.5 
##$TPOFFS= (0..7)
0 0 0 0 0 0 0 0 
##$TUNHIN= 0
##$TUNHOUT= 0
##$TUNXOUT= 0
##$USERA1= <user>
##$USERA2= <user>
##$USERA3= <user>
##$USERA4= <user>
##$USERA5= <user>
##$V9= 5
##$VALIST= <valist>
##$VCLIST= <CCCCCCCCCCCCCCC>
##$VD= 0
##$VDLIST= <DDDDDDDDDDDDDDD>
##$VPLIST= <PPPPPPPPPPPPPPP>
##$VTLIST= <TTTTTTTTTTTTTTT>
##$WBST= 1024
##$WBSW= 4
##$XGAIN= (0..3)
0 0 0 0 
##$XL= 0
##$YL= 0
##$YMAX_a= 327
##$YMIN_a= -337
##$ZGOPTNS= <>
##$ZL1= 120
##$ZL2= 120
##$ZL3= 120
##$ZL4= 120
##$ABSF1= 0
##$ABSF2= 0
##$ABSG= 0
##$ABSL= 0
##$ALPHA= 0
##$AQORDER= 0
##$ASSFAC= 0
##$ASSFACI= 0
##$ASSFACX= 0
##$ASSWID= 0
##$AUNMP= <proc_1d>
##$AZFE= 0.1
##$AZFW= 0.5
##$BCFW= 0
##$BC_mod= 2
##$BYTORDP= 0
##$COROFFS= 0
##$CY= -3
##$DATMOD= 1
##$DC= 0
##$DFILT= <>
##$DTYPP= 0
##$F1P= 0
##$F2P= 0
##$FCOR= 1
##$FTSIZE= 65536
##$FT_mod= 6
##$GAMMA= 0
##$GB= 0
##$INTBC= 1
##$INTSCL= 9.790993e-09
##$ISEN= 30
##$LB= 1.5
##$LEV0= 0
##$LPBIN= 0
##$MAXI= 10000
##$MC2= 0
##$MEAN= 0
##$ME_mod= 0
##$MI= 50
##$NCOEF= 0
##$NC_proc= -10
##$NLEV= 6
##$NOISF1= 182.463
##$NOISF2= 159.3651
##$NSP= 0
##$NTH_PI= 0
##$NZP= 0
##$OFFSET= 198.0616
##$PC= 4
##$PHC0= 1677.094
##$PHC1= 46.35953
##$PH_mod= 1
##$PKNL= yes
##$PPARMOD= 0
##$PSCAL= 0
##$PSIGN= 0
##$REVERSE= no
##$SF= 81.0140089999434
##$SI= 65536
##$SIGF1= 159.3651
##$SIGF2= -187.1042
##$SINO= 113.3802
##$SIOLD= 16384
##$SREGLST= <1H.CDCl3>
##$SSB= 0
##$STSI= 65536
##$STSR= 0
##$SW_p= 32467.5324675325
##$SYMM= 0
##$S_DEV= 0
##$TDeff= 32768
##$TDoff= 0
##$TI= <>
##$TILT= no
##$TM1= 0
##$TM2= 0
##$TOPLEV= 0
##$USERP1= <user>
##$USERP2= <user>
##$USERP3= <user>
##$USERP4= <user>
##$USERP5= <user>
##$WDW= 1
##$XDIM= 65536
##$YMAX_p= 453830107
##$YMIN_p= -10722514
$$ End of Bruker specific parameters
$$ ---------------------------------
##NTUPLES= NMR SPECTRUM
##VAR_NAME=  FREQUENCY,     SPECTRUM/REAL,   SPECTRUM/IMAG
##SYMBOL=    X,             R,               I
##VAR_TYPE=  INDEPENDENT,   DEPENDENT,       DEPENDENT
##VAR_FORM=  AFFN,          ASDF,            ASDF
##VAR_DIM=   65536,         65536,           65536
##UNITS=     HZ,            ARBITRARY UNITS, ARBITRARY UNITS
##FACTOR=    0.49542278885378, 1,            1
##FIRST=     16045.7642231865, 0,            0
##LAST=      -16421.768244346, 0,            0
##MIN=       -16421.768244346, -10722514,    0
##MAX=       16045.7642231865, 453830107,    0
$$ Real data points
##PAGE= N=1
##DATA TABLE= (X++(R..R)), XYDATA
$$ [...]
41479 -248623 -164012 -220798 -462670 -678734 -623238 -231743 354961 881191 1094018 875339
41469 875339 323480 -296942 -706713 -765887 -551227 -291462 -169753 -177762 -195449 -167341
41459 -167341 -117745 -60012 -45265 -252320 -798893 -1435502 -1683195 -1393756 -955237 -792972
41449 -792972 -876236 -907877 -793481 -652551 -506793 -267197 20583 199230 256027 309193
41439 309193 358528 316208 279858 462425 783748 844572 450752 -102591 -440150 -547557
41429 -547557 -586250 -507095 -173566 243574 339403 -23484 -528113 -781101 -704188 -492949
41419 -492949 -340698 -294001 -292135 -264134 -199561 -128286 -16374 246538 665759 1011545 1017637
41408 1017637 698555 323754 71096 -123089 -316371 -350646 -48688 466808 820742 766869
41398 766869 427718 133722 91130 248986 455808 666008 927623 1196775 1302096 1185177
41388 1185177 1069125 1207652 1490628 1512144 1104020 612930 493634 744369 932518 743616
41378 743616 325719 48631 54412 154154 146022 133184 420266 1065569 1656738 1698059 1199441
41367 1199441 683294 559131 707842 803671 808007 891800 1025214 977707 711619 474379
41357 474379 429804 442179 333914 157952 76333 108765 141386 99206 -5628 -145968 -311105
41346 -311105 -473299 -539864 -342638 217730 904071 1157951 651066 -214554 -671372 -496996
41336 -496996 -228273 -360656 -718662 -867299 -787926 -748722 -738364 -496614 -35115 304438
41326 304438 338325 224575 108156 -68701 -296954 -366457 -183491 14435 -36884 -256147
41316 -256147 -320312 -52938 409340 771404 828145 620762 377684 246072 129886 -89819
41306 -89819 -277155 -233051 -122421 -373095 -1058158 -1690528 -1805315 -1495224 -1172635 -1027767
41296 -1027767 -961383 -880238 -793480 -702244 -606849 -565108 -593819 -608488 -597279 -706869 -970192
41285 -970192 -1100765 -805592 -216193 225116 251140 -54460 -475886 -830317 -989440 -975803
41275 -975803 -978959 -1051668 -902163 -301675 387482 509615 -7830 -490131 -397809 -13163
41265 -13163 23465 -397458 -761727 -620919 -84935 379437 449976 206817 -8509 54387
41255 54387 335450 600924 735893 784964 741102 495596 58781 -345413 -506493 -423154
41245 -423154 -209576 28150 133493 -86297 -616708 -1137581 -1341554 -1267552 -1184637 -1246926
41235 -1246926 -1402407 -1529810 -1503288 -1229314 -801510 -520540 -561928 -722907 -734242 -726498
41225 -726498 -1058161 -1671767 -1973107 -1505984 -505243 389485 777098 684051 316864 -103070
41215 -103070 -348679 -315697 -174113 -191090 -359567 -386180 -116377 221669 342044 310913
41205 310913 396321 569782 459868 -78101 -590365 -494573 148447 617414 359529 -386514
41195 -386514 -946226 -1011595 -846507 -765339 -717658 -510545 -214630 -102610 -249329 -437679
41185 -437679 -514155 -632592 -1001427 -1524313 -1893124 -1991294 -1989370 -2012544 -1935420 -1628410 -1228041
41174 -1228041 -965588 -818764 -542968 -36409 496877 767518 662933 301076 -41343
41165 -41343 -72009 269816 678039 751546 450277 137248 124508 336239 480555 380024
41155 380024 36234 -459548 -930207 -1147443 -1019986 -698290 -417954 -328115 -509943 -965973
41145 -965973 -1452781 -1520019 -951956 -76478 568333 787634 746453 545346 79742 -671312
41135 -671312 -1487534 -2117885 -2457674 -2460513 -2078982 -1404123 -715574 -268958 -105664 -123562
41125 -123562 -224498 -321987 -310740 -128673 196982 604408 1016813 1265805 1117519 507632
41115 507632 -276693 -758716 -660101 -121725 440177 669304 489240 69675 -351704 -609614
41105 -609614 -664646 -612345 -608704 -682435 -644852 -327449 101197 258176 36469 -254187 -339370
41094 -339370 -314878 -352452 -355379 -211000 -150677 -450732 -912000 -1089477 -986684 -1030677 -1314872
41083 -1314872 -1390402 -991095 -483358 -308960 -394928 -470182 -602694 -972436 -1371110 -1438968
41073 -1438968 -1278484 -1325771 -1614957 -1649588 -1117935 -333156 217510 431914 481681 422412
41063 422412 218391 8526 33815 299343 524805 472194 179182 -161200 -411189 -517210
41053 -517210 -457772 -286846 -172255 -252702 -436377 -438810 -68832 571866 1186436 1508632
41043 1508632 1429451 1035072 600632 430712 576652 770603 734751 472303 154495 -142790
41033 -142790 -416118 -579499 -574766 -555058 -694909 -879515 -880383 -792229 -929240 -1269215 -1407704
41022 -1407704 -1164738 -821180 -583811 -252305 305062 752818 747920 480340 340552 313656
41012 313656 157591 -41285 -17344 102051 -58565 -422235 -484008 -155999 -38964 -568362
41002 -568362 -1307046 -1472382 -949680 -417047 -503513 -1070593 -1384402 -907821 131035 982222
40992 982222 1162777 868158 545330 311434 50392 -134391 2341 365106 557835 475843
40982 475843 441902 612537 655963 272085 -283338 -498078 -240709 146730 254918 -69160
40972 -69160 -636576 -982775 -707055 52232 643816 601666 159106 -126724 -73584 60882
40962 60882 53054 -73822 -256572 -496028 -704903 -688369 -376771 49362 337261 399141
40952 399141 347698 341939 406219 397877 192460 -114725 -285025 -207620 30327 328107 633673
40941 633673 802634 643371 204969 -203617 -400236 -507493 -622900 -599943 -369735 -199238
40931 -199238 -327806 -562098 -562044 -355110 -206777 -115082 156928 589131 849915 782889 604806
40920 604806 527630 471956 277888 -14995 -218669 -199147 17139 231070 193284 -125608
40910 -125608 -454530 -565404 -567243 -638609 -651869 -425315 -210249 -439430 -998756 -1276726
40900 -1276726 -1055773 -824423 -962843 -1129515 -852236 -321098 -85544 -206572 -247680 -22910
40890 -22910 162747 84519 -26503 131475 458149 592991 393763 86466 -27345 96266
40880 96266 211660 55356 -349858 -678743 -618803 -183662 306227 507849 287350 -255904
40870 -255904 -897450 -1427197 -1756709 -1928446 -2029005 -2103121 -2126657 -2017296 -1694607 -1195382
40860 -1195382 -707204 -409205 -308973 -326261 -468561 -752969 -990021 -882164 -402435 119725
40850 119725 378953 394480 351375 324125 273898 166516 -23245 -292636 -516249 -541241
40840 -541241 -461558 -578329 -953752 -1240416 -1141174 -799578 -489598 -163596 335704 782037
40830 782037 727404 158775 -390907 -481008 -215915 48021 180893 295975 465853 606822
40820 606822 587887 349037 -66991 -558870 -1045744 -1470981 -1714777 -1623201 -1226040 -806066
40810 -806066 -595041 -498024 -294093 -5851 155505 137903 89573 91241 99287 131458 243451
40799 243451 324998 195093 -87525 -295093 -426194 -694436 -1054113 -1107398 -657170 -38453
40789 -38453 309603 332952 211849 -4272 -328449 -606549 -662522 -566560 -518827 -568728 -660122
40778 -660122 -828933 -1111363 -1339670 -1263381 -838584 -243980 298418 577313 440634 22445
40768 22445 -226097 -11796 394877 509602 293876 139865 246906 376795 275285 7408
40758 7408 -235421 -396776 -496182 -509220 -413257 -201836 178933 707886 1077748 880131
40748 880131 129386 -610892 -772872 -315134 365280 853087 941048 650371 201630 -159921
40738 -159921 -424439 -761123 -1125088 -1155775 -650851 55261 420887 280362 -105190 -436331
40728 -436331 -563254 -402922 13898 418589 512688 360036 341710 641607 985597 1009729
40718 1009729 715163 399862 253410 205151 138802 69189 39615 -26995 -237630 -518658
40708 -518658 -634212 -466001 -175501 -13907 -64985 -278245 -646120 -1161718 -1650415 -1859846
40698 -1859846 -1739445 -1458886 -1154444 -859839 -670267 -690642 -778503 -662142 -417888 -466778
40688 -466778 -905132 -1224288 -1012268 -586818 -504392 -709204 -686880 -318628 -36866 -149285
40678 -149285 -514574 -933298 -1367292 -1661577 -1533580 -1050383 -719233 -863391 -1224107 -1385250
40668 -1385250 -1272299 -1016369 -660582 -287564 -163688 -446185 -932902 -1338290 -1603524
40659 -1603524 -1713530 -1489502 -882587 -244744 42708 37028 2796 -86856 -409812 -791036
40649 -791036 -802606 -371869 98607 266532 181059 31023 -135187 -356949 -657936 -1043701
40639 -1043701 -1420624 -1555163 -1345713 -1067532 -1041528 -1099421 -744633 115214 956815 1259973
40629 1259973 1023606 572596 181665 21837 147672 340252 229493 -237550 -685061
40620 -685061 -820874 -792977 -850857 -936839 -866620 -678127 -524579 -409099 -287872 -256136
40610 -256136 -359992 -397768 -206499 4938 -73263 -373440 -579873 -632929 -724377 -838708
40600 -838708 -723632 -384224 -212817 -460123 -877704 -1077623 -1014996 -920483 -942707 -1057553
40590 -1057553 -1187953 -1215286 -979149 -467795 43958 215572 -29057 -513339 -1068867 -1596872
40580 -1596872 -1916119 -1813500 -1350518 -930433 -886464 -1089203 -1123250 -805120 -352782 -43484
40570 -43484 105227 234235 377306 431298 312782 30944 -336696 -648626 -758633 -682527
40560 -682527 -623597 -704591 -772334 -639177 -422065 -410440 -648167 -902904 -1036157 -1122427
40550 -1122427 -1171318 -1037224 -711745 -433363 -362385 -375006 -314264 -215909 -142876 -32145
40540 -32145 128609 197548 115295 9564 -94095 -376954 -833795 -1093798 -919998 -581567
40530 -581567 -392546 -196056 267312 773553 931147 868761 1005771 1257426 1125586 578819
40520 578819 163838 114346 8222 -444117 -885784 -941479 -822148 -862621 -895964 -593069
40510 -593069 -104659 164292 221001 414655 798535 1036207 941401 714101 594062 604106
40500 604106 699638 895505 1147236 1299035 1237746 994429 682305 424811 296560 222295
40490 222295 9184 -387611 -730086 -799715 -739464 -881764 -1293698 -1712665 -1901825 -1844453
40480 -1844453 -1590225 -1149703 -616583 -223824 -177941 -497768 -1017236 -1468011 -1604455 -1377803
40470 -1377803 -978224 -621330 -365216 -240260 -397159 -869603 -1276711 -1101078 -325706
40461 -325706 481958 822604 756286 622132 538805 425015 336671 467609 827372 1165906
40451 1165906 1280536 1221759 1110138 902407 497934 18043 -202782 29585 517335 850173
40441 850173 790649 429647 30039 -195960 -218028 -216813 -434408 -861309 -1133310 -933960
40431 -933960 -457807 -206960 -303846 -324755 61251 614917 909046 888525 742061 477916
40421 477916 40816 -311808 -233613 129531 246985 -28303 -240226 -50801 233291 154675
40411 154675 -186876 -312554 -99372 65988 -114558 -425148 -446711 -99687 293086 402984
40401 402984 195697 -154212 -478979 -645006 -489594 45841 692933 983686 740963 304139
40391 304139 114654 199079 247739 103264 -62281 -21097 277163 734337 1158373 1289948
40381 1289948 993999 469999 94530 16802 63572 44071 -45619 -146322 -261842 -394541
40371 -394541 -495000 -507996 -370695 -38872 327064 356914 -46659 -355559 11025 791117
40361 791117 1079209 525257 -206297 -399764 -163075 25814 129087 355880 521359 248325
40351 248325 -331978 -672505 -585478 -418729 -437826 -513263 -512661 -573314 -827945 -1185414 -1513300
40340 -1513300 -1750356 -1740137 -1268334 -420353 358916 725593 762736 746938 816535 984197
40330 984197 1241678 1498399 1606759 1582110 1611991 1727669 1678971 1292022 754123 361981
40320 361981 158026 10528 -95082 -64849 94922 275105 419702 534854 596728 579478
40310 579478 518146 432637 258065 -36543 -320185 -391477 -162811 273582 663807 677517
40300 677517 185933 -463780 -690788 -359145 1646 -147976 -694498 -1103729 -1099188 -792367
40290 -792367 -326310 191790 480254 263721 -262314 -527298 -279795 108584 153166 -207332
40280 -207332 -707850 -1101571 -1225956 -975307 -444020 48747 267121 290005 319571 396833
40270 396833 418200 286728 -49233 -535795 -908689 -877219 -532618 -318243 -444725 -630917
40260 -630917 -622238 -603170 -766646 -833044 -482668 -9249 35935 -280668 -376520 -113084 5120
40249 5120 -268815 -466109 -156482 362962 530122 274451 -95160 -435680 -771301 -990103
40239 -990103 -980017 -926594 -1087552 -1370607 -1468251 -1299056 -994658 -592120 -109235 201922
40229 201922 108625 -145126 -67576 384857 758431 791716 720807 776268 790350 519613 42121
40218 42121 -389926 -652727 -725017 -595092 -373831 -279682 -330185 -256209 99515 510492
40208 510492 688626 675900 692299 762104 722525 479140 55180 -484949 -983391 -1224880
40198 -1224880 -1231709 -1337916 -1702360 -1922151 -1487373 -538945 212709 352542 187228 196534
40188 196534 379809 377138 55501 -292357 -325080 -61298 160302 85510 -163389 -255007
40178 -255007 -79833 107589 28476 -264466 -482907 -454624 -237930 42091 309462 520728
40168 520728 677331 839972 1018573 1095605 986164 802133 682399 527467 146987 -327852
40158 -327852 -456120 -27854 610030 920169 731535 293483 -91957 -299678 -313262 -160019
40148 -160019 19580 -5182 -321658 -697941 -760569 -391134 112604 320583 83326 -372349
40138 -372349 -698662 -701425 -421771 -82248 52676 -97725 -317480 -335150 -196396 -228608
40128 -228608 -581318 -994722 -1136605 -986235 -728749 -440099 -92594 239847 421085 458474
40118 458474 468066 449730 274360 -99507 -537449 -858703 -944570 -749899 -336692 113474
40108 113474 425723 565202 593368 563904 538441 612374 819325 1071432 1246293 1236553 927240
40097 927240 355721 -84900 30221 482776 498519 -186710 -809726 -620822 -27022 3098
40087 3098 -580034 -867964 -424121 115906 109482 -201637 -277118 -133127 -105202 -214904 -297441
40076 -297441 -436325 -770574 -1098917 -1137695 -1007950 -1047313 -1264337 -1368366 -1249614 -1073152
40066 -1073152 -962314 -911494 -958427 -1141630 -1326836 -1352931 -1315022 -1431870 -1642519 -1595019
40056 -1595019 -1092756 -390408 3112 -231607 -912098 -1437082 -1319565 -707761 -203348
40047 -203348 -115482 -182511 -139055 -148151 -374593 -514598 -213391 289683 426940 77622
40037 77622 -391906 -754972 -1077629 -1270220 -1031648 -374383 231829 425103 338555 282636
40027 282636 345683 459840 590022 690364 681600 600573 589378 653104 628101 461495 302375
40016 302375 228552 102852 -184515 -514570 -691817 -657079 -481013 -284378 -200249 -266678
40006 -266678 -344211 -295307 -214046 -271339 -375411 -260777 83048 365970 420588 381614 384391
39995 384391 373883 288406 153516 -68615 -418619 -671806 -495791 9395 311472 155408
39985 155408 -112029 -141878 -101309 -280064 -544991 -591771 -481059 -505612 -695052 -842660
39975 -842660 -897118 -958487 -981013 -832470 -583139 -415779 -318009 -178330 -107830 -316766
39965 -316766 -708122 -937597 -868020 -637448 -301467 204246 698839 760398 265106 -371136
39955 -371136 -653726 -482404 -63164 363098 544845 266512 -372622 -915215 -1023444 -859884
39945 -859884 -780803 -811308 -701437 -404030 -180288 -214344 -386680 -504088 -549503 -601675
39935 -601675 -655949 -634969 -489847 -225572 82466 255891 135162 -177873 -337232 -147356
39925 -147356 173386 284773 173072 91497 125656 98718 -77130 -251904 -337120 -470469
39915 -470469 -713414 -836061 -628881 -230729 83055 240820 250768 -18476 -553874 -883142
39905 -883142 -535121 237109 693344 595591 437769 572909 686415 437533 110746 161117
39895 161117 455647 488682 178686 -38792 136914 538020 856520 964729 865383 603514
39885 603514 300639 86493 -39121 -139839 -176755 -77159 70732 65746 -182187 -590071
39875 -590071 -979759 -1108485 -799748 -243628 27110 -248782 -630045 -511176 13893 233561
39865 233561 -251489 -1077587 -1635768 -1653743 -1185817 -430660 257669 509302 319038 68946
39855 68946 19717 19130 -141582 -364977 -448839 -396855 -288503 -66235 268682 432563 154100
39844 154100 -393726 -737080 -627972 -194083 358299 900729 1257962 1238674 892095 516060
39834 516060 296760 111152 -199300 -521308 -600301 -376045 -6261 395345 835754 1223964
39824 1223964 1296455 936524 459171 357471 756352 1291784 1555633 1466339 1138584 633285
39814 633285 27516 -457894 -671242 -777592 -1022833 -1298698 -1241862 -794504 -368127 -327926
39804 -327926 -545906 -626463 -411000 -89259 86686 38619 -143769 -316674 -371360 -258848
39794 -258848 28681 427039 722344 644236 184446 -284904 -414535 -321545 -392816 -717797
39784 -717797 -1026185 -1168134 -1280546 -1393170 -1249259 -711185 -45505 403499 572489 534671
39774 534671 289137 -76227 -296690 -278771 -268041 -370861 -207050 545743 1495435 1927431
39764 1927431 1744004 1498109 1505906 1458876 1044555 477032 160825 158563 246833 268639 211071
39753 211071 113735 80898 222627 435889 421177 67656 -368877 -649126 -911402 -1402188
39743 -1402188 -1986032 -2215908 -1864519 -1151556 -440903 82009 410725 603950 762341
39734 762341 981544 1220043 1281548 1020402 551671 206154 251949 636011 995242 980932
39724 980932 616918 269323 189104 184403 -86742 -560138 -772587 -512514 -200432 -381330
39714 -381330 -989454 -1421366 -1304441 -873003 -514027 -269617 -4623 186548 77624 -265515
39704 -265515 -474701 -339091 -58274 22118 -232955 -686953 -1059975 -1077037 -660820 -57772
39694 -57772 344744 376603 165789 -110904 -379450 -579789 -661199 -711641 -850754 -940758
39684 -940758 -703780 -241006 -81421 -470289 -924538 -832612 -251576 276524 501406 598859
39674 598859 643263 474881 145319 9492 203630 422778 414896 335206 357617 270170 -184541
39663 -184541 -788436 -1070906 -965555 -863193 -997189 -1128574 -958785 -568223 -250693 -113819
39653 -113819 -78712 -138977 -320796 -417894 -116995 480301 778698 414454 -164714 -235819
39643 -235819 190207 374003 -79086 -657650 -708941 -332397 -112210 -259298 -482685 -545859
39633 -545859 -482451 -323643 -51681 166998 89090 -234841 -530959 -721425 -889662 -860628
39623 -860628 -323401 521845 954603 622405 27659 -154522 108779 380441 431080 398641
39613 398641 479555 762378 1210574 1587579 1592882 1269476 1028855 1063741 1049309 703024
39603 703024 289965 183442 239775 88216 -204381 -294041 -213886 -291631 -490395 -423173
39593 -423173 -53595 175704 16460 -284460 -475658 -603255 -677126 -534030 -246012 -193878
39583 -193878 -470861 -650279 -440985 -146717 -122552 -184120 3247 285317 274417 20115
39573 20115 -85344 49138 133110 -4290 -251900 -507967 -739305 -800257 -600286 -413215
39563 -413215 -584769 -949172 -1020226 -795657 -816332 -1264661 -1574020 -1259310 -644793 -330129
39553 -330129 -325405 -240449 -60199 -134180 -489302 -723822 -628147 -421160 -277361 -89115
39543 -89115 137268 102774 -297864 -688845 -739250 -658219 -780877 -932834 -701697 -198767
39533 -198767 12806 -209145 -321772 93233 705482 927437 679938 294471 -83372 -540493
39523 -540493 -975054 -1102955 -907050 -672113 -491899 -127228 499822 1040233 1176493 1031211
39513 1031211 840337 518401 -64304 -587801 -552476 1425 504070 639391 677292 878901
39503 878901 1002388 692950 52021 -524167 -863352 -1031657 -997503 -683591 -300766 -227182
39493 -227182 -491003 -708569 -640824 -499676 -539600 -631213 -496908 -185264 -17868 -128743
39483 -128743 -318248 -384286 -389010 -512585 -771091 -986315 -995229 -815013 -594087 -440504
39473 -440504 -336344 -216675 -72107 68298 193702 275097 238718 97832 53863 284309
39463 284309 634773 729120 441822 69654 -46197 116114 361332 535071 547215 342996
39453 342996 31050 -127680 -40148 68373 -9088 -179065 -310953 -532487 -942233 -1239990
39443 -1239990 -1058608 -552815 -233150 -265824 -363414 -346196 -344208 -399565 -358807 -287344 -508999
39432 -508999 -1025916 -1343991 -1140499 -709627 -457830 -340696 -136850 80634 149646 202382
39422 202382 416708 614132 533386 319246 312281 502869 617596 618465 683515 791932 758686
39411 758686 595650 414587 91380 -472712 -856598 -502643 369093 856983 543164 -31202
39401 -31202 -281322 -357685 -622838 -874758 -630582 118364 933187 1517922 1839335 1802151
39391 1802151 1273525 441266 -210476 -374490 -189191 -19932 -96651 -336342 -445821 -282567
39381 -282567 -130318 -401312 -1007758 -1352120 -1105072 -625459 -333308 -63442 510205 1128145
39371 1128145 1218741 786067 429163 468468 594659 463652 134279 -219049 -556778 -766616
39361 -766616 -660408 -390771 -424475 -833494 -1060039 -745987 -371199 -578113 -1189391 -1496397
39351 -1496397 -1361393 -1386058 -1941384 -2618114 -2849049 -2617185 -2259119 -1914706 -1518256 -1117266
39341 -1117266 -840481 -633260 -324170 62514 300695 272207 77383 -165395 -410288 -544254
39331 -544254 -412275 -106369 -521 -281910 -600178 -452638 143103 651835 730562 656366
39321 656366 913465 1579064 2319587 2846712 3147287 3335796 3505612 3714118 3921553 3931999
39311 3931999 3556341 2836339 1955827 977826 -87225 -964362 -1222872 -870930 -532637
39302 -532637 -736471 -1228085 -1337241 -909179 -459034 -383275 -448956 -261711 104984 277086
39292 277086 189210 162117 400524 732974 926761 1008410 1125866 1260497 1250940 1029411
39282 1029411 696202 401788 271837 414309 858857 1443093 1833972 1735286 1114185 262036
39272 262036 -380463 -549627 -358292 -104212 132063 546925 1195294 1722814 1741642 1344170
39262 1344170 968102 826728 788882 782853 906217 1041363 796715 83569 -598703 -775847
39252 -775847 -617934 -590657 -741748 -773140 -644043 -591824 -615709 -467554 -196783 -173426
39242 -173426 -417909 -418460 106861 690250 709703 194313 -326275 -536928 -530953 -461041 -371671
39231 -371671 -304577 -267921 -151561 97657 318793 378748 411352 534679 512696 80222
39221 80222 -519082 -764475 -591941 -432398 -475324 -386520 62907 523490 513884 44222
39211 44222 -486402 -791805 -835301 -644338 -260577 202298 624550 936753 1049199 907039
39201 907039 698010 747812 1047285 1140083 688869 -89689 -770283 -1207402 -1389044 -1132519
39191 -1132519 -388995 357798 531893 240366 107813 352341 554267 413779 187610
39182 187610 171720 252127 266847 376003 691428 888221 625605 115878 -176377 -246449
39172 -246449 -494744 -1014773 -1393680 -1293539 -860918 -441142 -194357 -146162 -354365 -801627
39162 -801627 -1251259 -1397740 -1137071 -623308 -114952 201771 317327 357774 379208 243936
39152 243936 -161053 -622323 -746626 -462517 -140007 -84564 -138977 3686 283737 383990
39142 383990 282862 341805 743802 1133989 1036721 473305 -74019 -249835 -133615 53569
39132 53569 281469 579191 750565 511675 -62741 -462933 -260109 401948 961213 1029682
39122 1029682 709883 352337 150054 34053 -121469 -296936 -346192 -178348 117825 354249
39112 354249 436499 433954 451523 492846 491027 422728 330089 257525 220137 210685 195408 145464
39100 145464 127606 302700 729574 1193897 1353732 1091006 642190 343164 297920 331640
39090 331640 224997 -55269 -356763 -539191 -625941 -722220 -823521 -812788 -668670 -552156
39080 -552156 -603205 -747160 -805599 -720928 -561399 -381192 -207909 -107988 -121525 -172836 -175578
39069 -175578 -171946 -228229 -270519 -209234 -154097 -266631 -434102 -371090 -76816 94073 -92662
39058 -92662 -474067 -821112 -1178148 -1654392 -2077086 -2127361 -1753118 -1234178 -856649 -672409
39048 -672409 -565740 -434962 -291325 -226189 -275937 -338863 -298866 -191302 -102657 56165
39038 56165 443282 921301 1070030 687739 54649 -433210 -658318 -661481 -404076 96228
39028 96228 593548 844661 870618 774461 491822 -9138 -463932 -568157 -371345 -118841
39018 -118841 145036 465789 617849 300063 -336592 -780834 -815792 -699468 -653083 -581914
39008 -581914 -417161 -338447 -456854 -580613 -499850 -273580 -74667 31094 15610 -173310
38998 -173310 -458871 -623650 -573905 -417791 -199688 186054 706200 1097456 1221719 1244781
38988 1244781 1295347 1233990 970470 719954 669973 636301 347272 -131693 -552786 -865927
38978 -865927 -1111501 -1108219 -654549 10643 328433 55831 -479396 -800438 -754186 -550292
38968 -550292 -512743 -800524 -1229240 -1392961 -1085859 -537329 -122031 15577 -102674 -492388
38958 -492388 -1040014 -1308014 -915547 -84345 552878 685386 523699 290696 -43948 -418467
38948 -418467 -518457 -227387 78716 -8974 -377878 -574659 -388197 21306 468848 916558
38938 916558 1290614 1385297 1077001 528844 71789 -114624 -158922 -313736 -638706 -940541
38928 -940541 -1055734 -1072701 -1149380 -1214657 -1065965 -734605 -499167 -475090 -443527 -240266
38918 -240266 -103375 -383130 -983457 -1344420 -1045775 -290269 307928 366676 77355 -117214
38908 -117214 -94254 -153912 -530808 -996455 -1122554 -823614 -401222 -95245 126644 284497
38898 284497 186679 -300020 -960371 -1415700 -1518659 -1415580 -1289843 -1194771 -1108101 -1018838
38888 -1018838 -940583 -890226 -842648 -699574 -383478 -4271 164292 -37230 -453861 -770272
38878 -770272 -829010 -740772 -716920 -847444 -1031133 -1100645 -1009247 -844811 -629857 -228717
38868 -228717 405062 992799 1178192 987887 793796 801501 856932 815541 766929 739051 523174
38857 523174 66265 -243716 -40307 449724 662752 426691 85960 -31549 86789 334751
38847 334751 581398 521576 -153280 -1254121 -2078239 -2109454 -1511206 -760954 -76542 533282
38837 533282 907114 836785 484892 315640 509440 714409 527427 29845 -341148 -343359
38827 -343359 -149622 -48961 -130150 -314046 -516270 -636190 -512502 -104040 322724 427350
38817 427350 263148 264393 641470 1042719 1051414 795199 705154 800674 674443 218205 -128430
38806 -128430 -66818 59044 -180707 -560651 -496049 68333 571378 645791 539722 594314
38796 594314 718670 634118 335627 23963 -210228 -360093 -336199 -116585 72753 33870
38786 33870 -44424 170055 610733 871502 807467 696026 724338 705155 470717 191920
38776 191920 60794 -40664 -259315 -410245 -239219 126611 331048 270094 97998 -125940
38766 -125940 -432200 -659986 -577888 -289795 -158363 -293988 -462792 -528618 -610089 -730217
38756 -730217 -703547 -503797 -378225 -440113 -495137 -426629 -375000 -349208 -85236 435083 752508
38745 752508 590456 359980 550613 946600 986563 665751 483537 603626 667252 458194
38735 458194 209188 148603 205774 287142 431127 553860 417417 5187 -382379 -521106
38725 -521106 -463783 -298997 -55215 109694 33874 -50941 288622 948799 1247522 878013
38715 878013 405100 442045 779140 796341 384043 -79337 -421990 -794183 -1206190 -1459969
38705 -1459969 -1510655 -1475089 -1323230 -968627 -618362 -593372 -796634 -796337 -485610 -230381
38695 -230381 -271528 -408107 -432142 -484912 -759086 -1156402 -1459294 -1587384 -1505914 -1153117
38685 -1153117 -652797 -319692 -223343 -10813 577116 1262290 1592387 1513428 1248481 836619
38675 836619 229015 -296744 -335614 -2907 81240 -401970 -1061888 -1381846 -1365120 -1337657
38665 -1337657 -1379795 -1289549 -982850 -629718 -427843 -453370 -683938 -960128 -976489 -557367
38655 -557367 49528 389633 363548 348816 656138 1067060 1094618 595118 -62190 -402339
38645 -402339 -284360 49175 236352 90777 -275623 -582032 -660437 -609144 -641540 -815662
38635 -815662 -976095 -956010 -772104 -590980 -524338 -487402 -297014 65695 352194 316817
38625 316817 73363 16835 331264 749521 926684 877516 830950 779562 476189 -118497
38615 -118497 -667006 -833827 -644860 -383503 -297050 -480727 -859249 -1160496 -1084335 -662735
38605 -662735 -320523 -406345 -767805 -970131 -844560 -606371 -469654 -381124 -190386 97107
38595 97107 345011 470044 506497 523488 539046 511981 401669 242458 151866 245272 544269
38584 544269 964065 1346706 1489427 1216743 524564 -334304 -974827 -1156694 -967219 -717024
38574 -717024 -616276 -558795 -297770 158244 468893 377435 47504 -199199 -338493 -551624
38564 -551624 -765246 -669541 -238645 168155 368573 613121 1024648 1181969 685017 -126798
38554 -126798 -511809 -277686 62505 66257 -150047 -279916 -293150 -349806 -495333 -614220
38544 -614220 -563021 -282816 109146 353281 314124 149481 39236 -120290 -467829 -764147
38534 -764147 -651637 -290150 -248514 -677018 -1071257 -1036721 -813743 -764069 -772851 -549895
38524 -549895 -194920 -26177 -53693 -33674 81151 105949 -54261 -349591 -740615 -1118245
38514 -1118245 -1211038 -911978 -586767 -694416 -1166705 -1513962 -1482358 -1225514 -864908 -324702
38504 -324702 320984 743954 765023 559810 336501 101245 -132472 -219165 -159104 -233985
38494 -233985 -642090 -1193387 -1557944 -1628368 -1452460 -1021798 -386865 164314 331032 166413
38484 166413 5696 48180 181914 203195 48347 -198283 -400094 -454802 -367417 -243469
38474 -243469 -173309 -162737 -204889 -326806 -496158 -580272 -499062 -345774 -260788 -256493 -260377
38463 -260377 -256378 -285004 -376504 -572039 -906417 -1252124 -1304749 -910520 -337678 -21518
38453 -21518 -61734 -153034 -1507 375112 765021 981355 918709 576675 118949 -215427
38443 -215427 -331332 -309914 -205589 20076 294055 354204 42509 -425444 -643310 -424874
38433 -424874 63875 501649 621665 319014 -268548 -806684 -1049424 -1082493 -1154337 -1294443
38423 -1294443 -1290573 -1070074 -882187 -972237 -1232021 -1343786 -1186979 -942705 -842933 -963650
38413 -963650 -1231212 -1472850 -1464886 -1103200 -580811 -262626 -312301 -545535 -710808 -786617
38403 -786617 -889384 -999068 -965653 -788002 -712841 -946958 -1335388 -1456295 -1087669 -508532
38393 -508532 -222679 -379266 -611394 -535058 -247826 -128108 -253555 -344072 -301943 -432333
38383 -432333 -928407 -1444501 -1498487 -1119460 -764004 -692786 -768854 -828389 -892726 -966578 -949817
38372 -949817 -861749 -898278 -1143812 -1423435 -1529570 -1411641 -1101589 -691008 -430821 -549986
38362 -549986 -854014 -813451 -238999 411422 610311 370496 42400 -196560 -325596 -228736
38352 -228736 115663 360320 143515 -361441 -657830 -625680 -590052 -717907 -799975 -685966
38342 -685966 -507499 -371594 -235526 -188491 -426486 -796390 -818716 -394931 -50540 -171164
38332 -171164 -423897 -334263 -55262 -61297 -351242 -503385 -359177 -103260 240275 804832
38322 804832 1360920 1394408 870482 413115 483092 795651 815764 449462 -62858 -592318
38312 -592318 -1077804 -1293897 -1084785 -693640 -479047 -397805 -142955 263619 421374 130739
38302 130739 -343133 -677875 -832539 -848708 -644214 -236323 72409 5340 -322723 -572069
38292 -572069 -587515 -424550 -108449 329193 632089 482952 -38853 -444683 -415882 -174968
38282 -174968 -122989 -301827 -422289 -288614 37670 421752 762426 924428 789521 432706
38272 432706 87273 -118419 -253969 -386361 -453886 -411353 -336608 -275674 -114889 245158
38262 245158 668285 873244 705899 234673 -343968 -782368 -859149 -558348 -152120 46098
38252 46098 17122 10722 202142 504555 716541 714546 484166 102044 -265018 -444202 -379587
38241 -379587 -117050 282640 690563 843348 563943 61288 -238623 -226083 -210748 -378704
38231 -378704 -449734 -123470 369177 498950 120034 -389726 -621711 -486868 -112720 298842
38221 298842 493075 347868 105345 139446 417188 487974 116940 -399045 -721670 -922264
38211 -922264 -1151844 -1198135 -829998 -388033 -476058 -1047780 -1325806 -819146 -925 316353
38201 316353 -22424 -478756 -581534 -352705 -40086 222219 419674 563420 685591 787581
38191 787581 757496 491331 124811 -42335 63490 145792 -90325 -558296 -930379 -1049399
38181 -1049399 -1025727 -999080 -1008972 -1076561 -1187331 -1155263 -750112 -97984 251457 -110536
38171 -110536 -914833 -1464324 -1372680 -839401 -251176 168188 265423 -86189 -672866 -877481
38161 -877481 -334352 473541 686737 130273 -512613 -662272 -516873 -520869 -596433 -377291
38151 -377291 24010 52715 -453122 -950800 -910335 -491272 -234766 -308730 -367168 -77669
38141 -77669 479465 959747 1116840 951085 606261 219367 -115623 -284277 -158294 241941
38131 241941 653482 799544 712741 654741 689108 565914 141171 -334176 -559949 -625401
38121 -625401 -810290 -1070062 -1072532 -739780 -395319 -266827 -162391 152047 490212 438376
38111 438376 -89189 -735567 -1123526 -1196367 -1123036 -1038861 -958026 -847519 -706414 -587795
38101 -587795 -554684 -592726 -591619 -469857 -296033 -201888 -172691 -28372 330105 731006 875690
38090 875690 649067 221447 -135319 -256327 -129142 147736 407440 521450 546730 683704
38080 683704 987488 1206434 1060198 625414 253705 113500 29312 -185229 -481149 -770494
38070 -770494 -1111559 -1489577 -1625064 -1290201 -699692 -292310 -180254 -97954 134959 397159
38060 397159 516790 439867 116078 -464376 -1037659 -1195509 -893937 -543993 -443143 -435464
38050 -435464 -348230 -405706 -830323 -1281299 -1164298 -442377 272696 470064 243019 -14648
38040 -14648 -100933 -74968 -84605 -278194 -721865 -1267474 -1612384 -1593087 -1340522 -1084118 -890843
38029 -890843 -660929 -313239 86074 363541 408129 307118 239781 207583 22162 -336131
38019 -336131 -557873 -438454 -289817 -557749 -1109927 -1334455 -991509 -525904 -369453 -355332
38009 -355332 -118185 268577 449844 375749 320734 400964 449154 369537 292379 322357 395057
37998 395057 445076 489435 484903 328072 79675 -29407 68073 134380 -32147 -287132 -356692
37987 -356692 -232088 -131308 -145124 -160459 -125198 -145411 -252150 -289220 -168214 -69777 -214665
37976 -214665 -543064 -812068 -937948 -1025427 -1091630 -1012097 -776236 -545046 -366845 -91536
37966 -91536 283094 438972 152778 -320690 -570704 -577503 -598991 -625263 -363667 219546
37956 219546 749845 942112 885453 688556 219537 -537532 -1170088 -1236376 -835381 -474317
37946 -474317 -442387 -574552 -597581 -474103 -377410 -471497 -736365 -945137 -856358 -474007
37936 -474007 -27862 324597 600725 747743 564662 44063 -455369 -629003 -622380 -735442
37926 -735442 -922970 -929398 -782612 -764593 -940429 -1092345 -1120650 -1140730 -1137877 -891681 -351055
37915 -351055 234258 675880 1033871 1301578 1229343 710665 114543 -53228 276369 704236
37905 704236 826757 561893 87737 -357030 -605949 -625217 -501108 -358506 -276233 -232747
37895 -232747 -105978 180796 441524 310879 -275124 -829526 -825224 -373373 -75445 -247051
37885 -247051 -658290 -1041117 -1402626 -1711474 -1727649 -1399233 -1067625 -999606 -1030968 -954695
37875 -954695 -925217 -1111112 -1237649 -919295 -273505 211717 293296 77791 -325599 -807053
37865 -807053 -1033630 -754236 -330392 -442010 -1154558 -1746576 -1634255 -1047704 -583635 -488677
37855 -488677 -661152 -1002838 -1397858 -1572209 -1347148 -917199 -579150 -296304 166659 761858
37845 761858 1150519 1191258 1137704 1260889 1498016 1589966 1407766 1026405 585986 194952
37835 194952 -85569 -248147 -314925 -291125 -197703 -152683 -308238 -645472 -931322 -976417
37825 -976417 -860644 -788229 -784922 -696188 -461896 -209739 -45328 67789 157093 177584 221310
37814 221310 563490 1269526 1926463 2058273 1705294 1282410 959612 586788 208192 142483
37804 142483 391401 450481 10726 -546655 -724226 -633637 -700391 -916906 -924171 -692628
37794 -692628 -558363 -594200 -485233 -131573 102094 -77874 -477954 -715908 -638457 -319815
37784 -319815 39589 103101 -348375 -995757 -1193846 -805597 -424650 -496180 -650718 -339958
37774 -339958 229351 374640 -27879 -396988 -341301 -137240 -155851 -291294 -254321 -104774
37764 -104774 -121417 -282888 -232923 204602 730974 928601 776730 623330 661972 669554
37754 669554 419097 169372 416186 1157823 1762148 1721634 1238973 811199 494425 -29018
37744 -29018 -753649 -1144234 -737722 295132 1307053 1757618 1595800 1201948 1007542
37735 1007542 1096140 1178138 998039 643625 322053 3554 -436382 -823072 -795608 -348343
37725 -348343 74381 128444 -79046 -311068 -552300 -813100 -855212 -452557 182418 539386
37715 539386 375961 -66368 -404732 -477278 -343082 -106245 165108 424365 615935 647638
37705 647638 423434 -29632 -489806 -685750 -531268 -170328 191105 422972 454518 240755
37695 240755 -169471 -571180 -710147 -516269 -216901 -149814 -416838 -761194 -855643 -687341
37685 -687341 -553735 -658533 -834326 -760508 -378054 53326 307218 448459 644946 821137
37675 821137 688146 166481 -391932 -578289 -449559 -447086 -764919 -1050954 -886153 -351623
37665 -351623 117360 302101 338194 351459 285586 136412 61292 142106 273828 396199
37655 396199 593084 823618 818221 471001 130877 225271 715324 1184488 1373862 1361892
37645 1361892 1278092 1131185 929261 719697 487970 239266 165634 441749 822124 791543
37635 791543 269821 -160745 7850 505172 660534 321751 -21402 -16602 81268 -110786
37625 -110786 -495731 -674698 -562396 -483443 -658436 -885732 -852676 -570655 -329467 -311187
37615 -311187 -421060 -485920 -472242 -467584 -549736 -731046 -952004 -1054040 -822916 -190013
37605 -190013 577536 989947 757424 115980 -353937 -299451 62665 253493 114506 -94301
37595 -94301 -184323 -356317 -823094 -1304723 -1247775 -550398 247252 601186 529666 392204
37585 392204 355069 325435 257352 231929 272259 313320 353901 447251 543388 527121 428958
37574 428958 426179 602643 850095 1018824 1017271 769078 267472 -290202 -618266 -663490
37564 -663490 -636278 -659421 -593788 -328823 -44813 -10396 -254530 -593062 -846974 -886977
37554 -886977 -637536 -257457 -159975 -555229 -1049123 -1016819 -374224 326148 595843 478268
37544 478268 238242 -31617 -264723 -217996 211141 653080 656427 340538 252974 551519
37534 551519 742479 387115 -297625 -804683 -1016954 -1174930 -1338542 -1289345 -965414 -636371
37524 -636371 -536326 -580344 -582190 -557127 -648292 -870634 -1060624 -1015231 -628872 -7908 503531
37513 503531 577260 277747 30656 112316 349854 461014 468631 545813 639080 555847 316862
37502 316862 96298 -120611 -463335 -779860 -721461 -309406 -19685 -121544 -291306 -143366
37492 -143366 170084 238309 50739 -28560 138948 280756 164637 -78432 -187014 -102615
37482 -102615 50447 174393 276041 406979 584745 733333 709140 456267 115751 -106966
37472 -106966 -162405 -156039 -165638 -178383 -186961 -215982 -250235 -254306 -260698 -310604 -303859 -60021
37460 -60021 419497 878281 1075972 1052065 1038503 1148212 1219009 985019 401897 -224514
37450 -224514 -508698 -405074 -245149 -284397 -359001 -162631 247669 474337 299555 -61286
37440 -61286 -289924 -338728 -359312 -418464 -442359 -380349 -298822 -301110 -393826 -456196 -389971 -310577
37428 -310577 -464582 -860038 -1132050 -981185 -631551 -572970 -895458 -1197091 -1166132 -904987
37418 -904987 -583218 -133144 500680 1098849 1408093 1442474 1329286 1068557 687418 424847
37408 424847 467158 648242 702528 681010 801965 998601 971934 656501 288130 5184
37398 5184 -270026 -499688 -434330 6520 538602 867934 1010039 1074259 948563 460887
37388 460887 -243306 -732506 -719210 -333323 30881 52324 -297880 -754012 -955475 -745020
37378 -745020 -327691 -99983 -269414 -638680 -797867 -542464 -68140 262280 273170 39173
37368 39173 -296181 -596185 -686030 -482062 -204376 -199977 -443612 -474114 -1959 668777
37358 668777 1053918 1081941 978086 788498 428455 70951 19780 193155 167120 -183995
37348 -183995 -473174 -348528 82403 512314 799149 910702 802136 542732 319099 137509
37338 137509 -230280 -821667 -1261948 -1205734 -796625 -450851 -357415 -425757 -560625 -709730
37328 -709730 -723474 -423272 179328 841740 1218881 1007791 171790 -850182 -1375403 -1126755
37318 -1126755 -511017 -104471 -67447 -246089 -572145 -1023085 -1360307 -1288202 -828926 -250152
37308 -250152 313866 877764 1311654 1371254 1041706 577229 174174 -161404 -432939 -601984
37298 -601984 -723963 -874873 -928043 -674882 -206752 96856 34456 -210888 -404509 -541899
37288 -541899 -687256 -774250 -726214 -593663 -423926 -147288 261466 633183 757918 609146
37278 609146 324148 54393 -88556 -53500 79800 134554 31755 -118444 -185557 -189708
37268 -189708 -221892 -278439 -289328 -278880 -389014 -705730 -1102063 -1307367 -1169461 -826974
37258 -826974 -549861 -412132 -241774 67933 360226 443009 368784 323638 355391 397073
37248 397073 452116 533879 497846 182316 -304947 -662447 -752167 -690333 -606119 -500203 -308640
37237 -308640 69288 714330 1434174 1704177 1201638 330191 -165936 -90690 95824 49482
37227 49482 -65065 -66833 -137684 -431115 -685584 -556613 -90514 384729 617501 489554
37217 489554 -4376 -601926 -872207 -727640 -585473 -765725 -1002147 -856326 -369636 35621
37207 35621 108049 -92801 -398510 -549537 -244223 442514 896071 652538 82995 -85475
37197 -85475 212562 402122 250994 187290 496403 805367 684473 301824 87774 77275
37187 77275 13320 -104143 -31273 206713 236610 -125468 -573929 -746659 -753133 -998138 -1531190
37176 -1531190 -1864339 -1564165 -819007 -195866 46726 115746 190305 136065 -152228 -446146
37166 -446146 -494237 -446485 -669880 -1210542 -1683695 -1688229 -1171490 -416358 205154 517610
37156 517610 687362 1010144 1486362 1751242 1516353 891507 152050 -569479 -1171968 -1425206
37146 -1425206 -1204088 -719056 -281316 -15044 20085 -269872 -710104 -814180 -448732 -196991
37136 -196991 -557541 -1119009 -1172496 -859706 -906524 -1349916 -1449158 -947226 -491968 -514958
37126 -514958 -568522 -248147 7361 -317323 -840768 -806350 -205207 304485 362818 174666
37116 174666 -25141 -190285 -222295 -24430 218981 227669 55021 -26832 8592 -27019 -114649
37105 -114649 -39797 196344 355251 355715 352072 417905 471155 503037 563368 546940 346052
37094 346052 197837 478132 1099655 1519990 1464805 1261467 1286912 1451752 1483491 1416336
37084 1416336 1466254 1587311 1484385 1044193 526104 297694 499787 961085 1341891 1373919
37074 1373919 1054328 633657 380085 331957 266195 -86516 -741509 -1352126 -1498456 -1159777
37064 -1159777 -785507 -764018 -945939 -915044 -640382 -526619 -762065 -961404 -683827 -77066
37054 -77066 308524 266354 163347 351869 642375 599504 217798 -21318 189686 568358
37044 568358 675561 517623 393901 297537 -81763 -732614 -1182000 -1188406 -1147434 -1462865
37034 -1462865 -1857805 -1765825 -1191258 -682097 -542670 -570268 -566978 -613410 -736520 -762232
37024 -762232 -664302 -652381 -713334 -462765 267097 1028642 1277547 1032606 690756 425552
37014 425552 158913 -42075 12045 252264 391315 363476 353964 335922 -18124 -770026
37004 -770026 -1386810 -1275161 -486874 360126 761708 698009 413680 121493 -34859 20746
36994 20746 180885 173320 -139251 -528330 -608194 -274902 168380 338355 129091 -282089
36984 -282089 -671500 -914793 -960071 -801286 -529476 -331539 -346001 -511370 -614626 -531197
36974 -531197 -384429 -391318 -539067 -520145 -87920 583965 1041966 1049503 786694 519478
36964 519478 270078 -41082 -301445 -316319 -164024 -154068 -347224 -357862 177579 1069718
36954 1069718 1725790 1782687 1390226 867699 321854 -261502 -730932 -828784 -531623 -133301
36944 -133301 79565 105928 122268 227297 389518 533855 556446 351346 -20168 -253307
36934 -253307 -78720 387373 732299 697518 396950 82866 -131991 -267125 -348044 -387847
36924 -387847 -415100 -460339 -563513 -780955 -1082502 -1258748 -1074296 -538516 80699 494596
36914 494596 531026 129783 -555298 -1075092 -1000617 -401571 206874 438085 325863 47564
36904 47564 -303995 -595732 -671785 -645534 -807822 -1058505 -842280 50600 1007788 1318250
36894 1318250 1059425 808360 718640 421291 -253186 -965828 -1316673 -1218596 -791821 -210430
36884 -210430 308962 625862 801981 938491 996849 987561 1130693 1503663 1731557 1448551
36874 1448551 917784 715872 889301 934701 596387 155027 -134975 -378606 -668344 -826290
36864 -826290 -702539 -396217 -64915 179967 171993 -126595 -329528 21093 749381 1180310
36854 1180310 1056597 786875 669480 484962 91349 -196232 -165454 -80229 -100682 112473
36844 112473 723869 1166469 866351 149638 -205032 -55886 83612 -64499 -261692 -304644
36834 -304644 -290989 -300109 -269442 -242101 -356198 -540787 -550256 -344220 -166311 -232211 -553471
36823 -553471 -1010427 -1368316 -1322617 -812366 -221079 2729 -136290 -277695 -217341 -65065
36813 -65065 -4 -135234 -515471 -988435 -1214510 -1075117 -898889 -977944 -1078951 -832794
36803 -832794 -402979 -266587 -454937 -555177 -423429 -331168 -361316 -231180 137747 399934
36793 399934 351345 249931 317611 347942 122383 -139526 -102797 166754 351790 355645 290574
36782 290574 132242 -265310 -837620 -1285857 -1442271 -1466319 -1593055 -1798402 -1817192 -1481959
36772 -1481959 -964127 -597552 -474987 -352568 -18081 403133 657236 737170 831668 981485
36762 981485 1026478 871984 594494 295510 48963 -28330 133419 395013 520110 437150
36752 437150 232135 -49137 -396531 -723794 -983431 -1273529 -1566139 -1501119 -844277 -28508
36742 -28508 251887 -38527 -284701 -185058 -105727 -292503 -358210 51972 584826 667555
36732 667555 327941 16667 -142863 -393003 -763086 -983714 -971357 -923159 -859325 -509341
36722 -509341 178117 773837 869715 608225 445135 521983 549345 279216 -166801 -512353
36712 -512353 -666599 -700264 -607642 -295597 210713 730396 1112806 1299835 1205444 778079
36702 778079 259780 96355 390642 684475 537380 104679 -174468 -265129 -490041 -883451
36692 -883451 -1056408 -768410 -241015 218242 573993 892916 1084624 995118 613659 96892
36682 96892 -301098 -347230 -56532 254392 353739 423435 712420 1020177 969975 698141
36672 698141 700946 963320 872806 194674 -483039 -614179 -466726 -604490 -1040600 -1389147
36662 -1389147 -1515143 -1524157 -1346138 -833530 -144947 392871 716323 981238 1216561 1344338
36652 1344338 1394091 1369397 1077046 461600 -53968 10698 521168 882511 801448 500809
36642 500809 239575 60420 18151 208068 463792 407312 -56302 -583732 -826432 -726603
36632 -726603 -311605 431288 1276510 1688749 1356852 646133 227076 308403 475715 278686
36622 278686 -254843 -769330 -1057566 -1200707 -1299597 -1303042 -1193298 -1140455 -1254975 -1295216
36612 -1295216 -906078 -156065 436398 488192 131334 -263280 -484284 -498008 -350234 -219378
36602 -219378 -316237 -550663 -559571 -266822 -103864 -371292 -678905 -450917 193043 539909
36592 539909 224459 -369667 -698956 -665703 -514172 -430865 -427518 -439907 -393271 -261266 -130683
36581 -130683 -130105 -269348 -426028 -488087 -431888 -281944 -80427 113927 250909 290609 177884
36570 177884 -96711 -408660 -606090 -705671 -801487 -789269 -460939 69665 366739 244634
36560 244634 29381 80377 375616 749826 1139920 1324323 882764 -132439 -867931 -580202
36550 -580202 359169 926718 738121 295764 66500 -44317 -255738 -522232 -725143 -817775
36540 -817775 -669013 -148371 553480 1058937 1305969 1530488 1724605 1586243 1129904 871391
36530 871391 1152588 1630732 1704472 1218100 544580 151224 218472 533378 695448 573841
36520 573841 514606 865975 1405893 1610317 1422894 1278172 1331687 1226291 813401 552567
36510 552567 818754 1233677 1160905 623203 250353 398795 748714 833818 651095 570569
36500 570569 778825 1005184 857133 338725 -122874 -204449 -57699 -18273 -126234 -169739
36490 -169739 -75366 32975 104434 210500 349321 449956 530625 606007 517094 156311
36480 156311 -206586 -174822 223403 590236 755136 923616 1190169 1323081 1184089 1021426
36470 1021426 1150574 1559068 1951730 2022895 1661656 1090326 778348 977123 1380737 1506370
36460 1506370 1311798 1098033 926657 611174 253361 239656 588643 805401 601006 356999
36450 356999 631409 1486746 2490652 3150967 3240060 2916242 2592870 2496211 2398225 2016920
36440 2016920 1512294 1208591 1014194 641620 267462 332892 712833 768086 311670 -134926
36430 -134926 -178117 12327 260358 683710 1197627 1395506 1233148 1201851 1492430 1612757
36420 1612757 1214618 701623 584086 759605 858872 811478 660103 302018 -170016 -340847
36410 -340847 -92033 116670 -26044 -163607 108089 586673 863411 915396 882975 737413
36400 737413 592325 835214 1481025 1889374 1605890 999130 595691 327279 -27895 -213214
36390 -213214 65958 545031 865910 1188310 1717512 2089255 1902824 1452761 1252019 1222846
36380 1222846 1042442 883741 1069931 1351414 1292332 1068403 1117391 1289119 1148201 885728
36370 885728 1080464 1662173 1915612 1513937 865526 420899 232347 218837 353705 561467
36360 561467 785822 1069134 1296589 1154492 689481 515047 998858 1634862 1741662 1414196
36350 1414196 1248077 1475719 1889460 2247736 2282695 1754775 976827 747977 1263077 1720814
36340 1720814 1571845 1396463 1837443 2474224 2634808 2547965 2699200 2787600 2414313 2106180
36330 2106180 2470901 2970122 2769449 2214654 2172439 2465552 2319413 1846193 1670753 1558516
36320 1558516 896109 121967 156057 760942 1001692 978887 1494628 2313053 2453616 2002989
36310 2002989 1931621 2274530 2213756 1828200 2000927 2679199 2988333 2976513 3451683 4215112
36300 4215112 4345730 4113302 4619334 5645917 5957371 5644189 5930841 6710157 6679632
36291 6679632 5989478 6221221 7535880 8425216 8552676 9177643 10474468 11230112 11534655
36282 11534655 12838560 15019043 16556254 17943172 21383374 26594707 30684220 32778201
36274 32778201 34735855 36830331 37546054 38361414 43143024 51714259 60410529 70297635
36266 70297635 87027480 111120577 139768832 182472420 258334598 362454223 446202457
36259 446202457 453830107 380493336 277627682 198253245 152791003 122465496 95709403
36252 95709403 75709887 63658224 53519377 42595293 34601396 30980145 27984767
36245 27984767 23573181 20046693 18511913 16656936 13444099 11014165 10460584 9885973
36237 9885973 8027061 6245719 5667493 5426462 4855247 4677230 5029225 4754270 3567574
36228 3567574 2759581 2994755 3375768 3260370 3108821 3055555 2500895 1575628 1244002 1556403
36218 1556403 1501236 904347 748321 1284369 1555790 1165969 841091 856987 569027 -73236
36208 -73236 -183941 393860 636315 80280 -450679 -390909 -286770 -548026 -685554 -373448
36198 -373448 -42691 99586 450396 961021 934529 333264 52552 408042 595231 168642
36188 168642 -214936 -123894 -152449 -687776 -1075066 -815707 -522892 -843374 -1383003 -1539535
36178 -1539535 -1534747 -1779303 -1978819 -1695319 -1158763 -799538 -562955 -295473 -186455 -262315
36168 -262315 -108089 348982 481852 -20682 -489186 -263524 313551 532361 310383 -79252
36158 -79252 -625191 -1248682 -1466864 -1083611 -668928 -697361 -795881 -537626 -354036 -821470
36148 -821470 -1562912 -1767601 -1433881 -1210137 -1269358 -1210523 -926699 -756798 -806704 -808484
36138 -808484 -668126 -590111 -652980 -726207 -779667 -888929 -1022123 -1160902 -1462875 -1952294
36128 -1952294 -2267736 -2101049 -1663633 -1335992 -1115530 -824299 -575077 -551372 -584554 -460251
36118 -460251 -407776 -738957 -1202297 -1281576 -1004125 -864328 -1014417 -1111500 -963835 -775424
36108 -775424 -688387 -583777 -444726 -485855 -791356 -1170724 -1468653 -1701588 -1815647 -1631298
36098 -1631298 -1141762 -618184 -327348 -326937 -543810 -835854 -984950 -870793 -661702 -611467
36088 -611467 -682134 -615101 -370357 -218026 -339292 -579543 -682841 -577336 -343725 -66896
36078 -66896 180532 321172 341915 346673 494020 864249 1342383 1639092 1543378 1192623
36068 1192623 943727 901718 760507 257301 -392003 -733492 -647436 -444323 -420423 -524827
36058 -524827 -492765 -164037 367242 831251 990722 823089 502537 202858 -27858 -203209
36048 -203209 -325022 -423100 -569678 -784673 -982818 -1054980 -967814 -795816 -693598 -759083
36038 -759083 -845715 -646064 -119497 315673 252765 -178245 -543358 -717786 -890363 -1069593
36028 -1069593 -1067596 -974121 -1138858 -1580946 -1888627 -1842864 -1672110 -1517838 -1138512 -403039
36018 -403039 356853 767923 805155 526654 -130305 -981223 -1469830 -1302571 -852821 -586793
36008 -586793 -465908 -275484 -112213 -87980 43018 421418 594705 99785 -710135 -1042639
35998 -1042639 -727392 -315244 -210476 -285334 -347890 -447751 -628201 -794271 -913905 -1037722
35988 -1037722 -1106865 -1030686 -921049 -968492 -1154043 -1347871 -1558129 -1784644 -1812671 -1524463
35978 -1524463 -1238469 -1316604 -1584687 -1587887 -1281700 -990496 -807078 -567749 -350843 -430677
35968 -430677 -721097 -801039 -550482 -269965 -123428 34450 216881 215333 56374 38863
35958 38863 184503 155148 -126482 -286344 -138072 -21427 -242976 -618866 -847631 -932264
35948 -932264 -956411 -836287 -590833 -483931 -592338 -604301 -377156 -304380 -708569 -1209780
35938 -1209780 -1197477 -693144 -216713 54316 420438 958488 1243496 960792 388851 7115
35928 7115 -112379 -232555 -416563 -382965 64421 678904 983346 763452 229638 -277373
35918 -277373 -606994 -813728 -1000349 -1222808 -1448718 -1544460 -1406281 -1146578 -994270 -949764
35908 -949764 -753548 -315622 72089 138407 -9432 -175868 -446958 -924977 -1339708 -1361235
35898 -1361235 -1133227 -1028488 -1000853 -702091 -182781 96107 -6560 -142640 -161457 -390517
35888 -390517 -978947 -1470128 -1390226 -906229 -549833 -540403 -677563 -703374 -522919 -225260
35878 -225260 -53828 -181241 -407119 -314589 165215 609091 631850 280454 -191388 -600277
35868 -600277 -765249 -557742 -213715 -212930 -619626 -927543 -813007 -616652 -725901 -882876
35858 -882876 -570877 194021 927135 1329203 1434741 1278421 878945 476602 359258 448135
35848 448135 377743 -18971 -552474 -938498 -982572 -613276 -4004 424130 381748 33726
35838 33726 -238808 -251934 -6815 484119 1043083 1220706 742799 -58678 -612974 -769062
35828 -769062 -732030 -544979 -127347 286072 308691 30749 -34146 282736 580959 562878
35818 562878 438585 450905 457757 290461 145791 249609 392701 182568 -387536 -949612
35808 -949612 -1251486 -1343976 -1320859 -1146773 -794671 -386163 -128668 -161368 -434344 -690876
35798 -690876 -653316 -320403 -2341 48016 -45611 17739 258982 368630 148149 -194381
35788 -194381 -316904 -178536 -16794 52894 180411 461680 698966 659761 427705 253938
35778 253938 132182 -185098 -714002 -1076974 -961995 -536037 -228968 -257368 -525386 -849433
35768 -849433 -1073909 -1058592 -781308 -454351 -370210 -587106 -850183 -849201 -522705 -109358
35758 -109358 105225 105317 130443 270646 246821 -154237 -561528 -356871 450022 1150037 1285719
35747 1285719 1189517 1297230 1414306 1124802 560645 208827 174181 183930 172909 281734
35737 281734 333888 -71454 -854827 -1382259 -1267244 -810158 -466272 -285631 -93334 135165
35727 135165 328014 471413 499014 278236 -104184 -303468 -175943 -33389 -198038 -513789
35717 -513789 -573861 -289096 53099 232510 341901 559291 837440 902179 548723 -71517
35707 -71517 -527241 -561276 -390957 -382082 -495890 -345900 170096 620668 573535 118004
35697 118004 -333996 -551502 -570959 -460558 -265593 -106435 -90039 -132082 -33064 274262
35687 274262 676422 1052259 1361833 1550595 1472815 984923 131372 -771714 -1309403 -1315311
35677 -1315311 -1025934 -808167 -784714 -844707 -933144 -1099966 -1277014 -1271345 -1057009 -859926
35667 -859926 -872456 -1076308 -1388836 -1719557 -1801434 -1307620 -358243 375774 375285 -120002
35657 -120002 -506035 -620325 -765680 -1037744 -1096134 -697909 -87815 326695 430749 338595
35647 338595 88483 -341454 -807329 -1041074 -940445 -657744 -372436 -119833 100860 200100
35637 200100 120146 2922 53955 228876 227195 -124089 -620725 -930455 -977625 -928482 -882196
35626 -882196 -779947 -608960 -493250 -515072 -588331 -593334 -547842 -571410 -730805 -966230 -1144933
35615 -1144933 -1185419 -1153831 -1194602 -1315180 -1317788 -1049687 -652938 -428809 -500338 -747994
35605 -747994 -1022468 -1246368 -1344954 -1282873 -1178143 -1192668 -1294494 -1308420 -1207824 -1150079
35595 -1150079 -1192903 -1195068 -1072291 -956585 -997824 -1141977 -1180305 -923228 -334935 356367
35585 356367 720234 519379 49294 -147226 83985 406805 530514 530700 573906 660205
35575 660205 765896 921850 998313 740350 212124 -123324 -16979 181087 42118 -324578
35565 -324578 -531245 -549402 -663450 -906872 -961369 -622874 -63432 383535 476894 159175
35555 159175 -361054 -665919 -520895 -194393 -168572 -564768 -1065253 -1343862 -1326175 -1069642
35545 -1069642 -679678 -376172 -376309 -618561 -787240 -682527 -414970 -188445 -55511 28035
35535 28035 24951 -194266 -680784 -1232724 -1424921 -949977 -14513 731582 799893 312909
35525 312909 -255981 -638767 -883716 -1060833 -1149353 -1191417 -1283199 -1359653 -1203021 -753418
35515 -753418 -258855 -18311 -54928 -108830 79031 491644 832000 836024 608617 550644
35505 550644 883088 1346106 1478112 1120670 540668 107370 -52510 -101635 -246632 -444754
35495 -444754 -425212 -104160 155233 -32475 -463676 -547644 -157675 166901 27414 -288818
35485 -288818 -345634 -197451 -106934 -12928 238635 419765 194369 -307728 -660361 -737098
35475 -737098 -697033 -539304 -149960 329734 650674 856472 1081373 1113170 696617 134599
35465 134599 -24832 167468 169648 -118211 -211403 102085 452527 588859 714424 901622
35455 901622 826815 393553 28705 18671 86087 -40401 -175058 -160038 -260437 -643422
35445 -643422 -967090 -968542 -990658 -1380287 -1776697 -1609324 -993633 -505454 -279995 32974
35435 32974 520848 815119 667794 247959 -184093 -525974 -727848 -753541 -673668 -569303
35425 -569303 -382486 -57857 280177 502567 672203 835928 813388 464004 -30040 -425960
35415 -425960 -740475 -1008275 -1009080 -643078 -307252 -391515 -604861 -376078 194240 403534
35405 403534 -29577 -617821 -880823 -895646 -882758 -773767 -505248 -345777 -566650 -1019955
35395 -1019955 -1351171 -1481077 -1610396 -1821383 -1908243 -1651544 -1161277 -843025 -942652 -1171289
35385 -1171289 -990431 -326162 276509 368787 138077 -48715 -275076 -764371 -1211393 -1069742
35375 -1069742 -449346 -81760 -282841 -529517 -287679 231171 443741 175478 -232212
35366 -232212 -377580 -147883 225124 339375 4377 -522591 -852837 -929295 -894244 -661941
35356 -661941 -110683 382065 233706 -414966 -710710 -257397 342500 430427 160895 -1127
35346 -1127 -63019 -205613 -180991 296704 853890 847694 308519 -143985 -257295 -409864 -898892
35335 -898892 -1514968 -1921576 -2002170 -1732171 -1122697 -413527 38644 183722 275848 369787
35325 369787 175014 -446034 -1158016 -1531535 -1517171 -1373833 -1306378 -1311067 -1226299 -843024
35315 -843024 -130748 573021 798975 481899 84323 71883 427470 792851 907578 745262
35305 745262 361077 -182945 -767311 -1224954 -1414831 -1266279 -833476 -351530 -116701 -196976
35295 -196976 -336023 -263707 -53792 -39105 -369439 -782614 -885416 -589137 -164748 111782
35285 111782 225074 257720 112338 -376187 -1061250 -1478320 -1357348 -966688 -771787 -880335
35275 -880335 -1027752 -1016257 -910330 -795449 -596294 -253630 67294 103656 -184791 -520779
35265 -520779 -595448 -433808 -373723 -599424 -815531 -606572 -69715 242194 87899 -126766
35255 -126766 -2689 230661 125110 -238125 -407040 -322283 -377158 -704945 -928152 -758371
35245 -758371 -406322 -192004 -109328 -10631 73250 50717 -4390 36395 170043 324927 438773
35234 438773 385865 65697 -325597 -391944 -64227 246461 200408 -60410 -261926 -424536
35224 -424536 -638309 -723089 -511839 -252724 -298412 -531071 -525706 -217260 9799 -108647
35214 -108647 -428676 -701513 -830167 -795865 -645888 -594152 -835040 -1213301 -1359394 -1178520
35204 -1178520 -909940 -686046 -388098 -21563 129053 -108132 -524980 -821190 -926491
35195 -926491 -911713 -828136 -762220 -795483 -786348 -474880 49775 301838 26079 -425027 -577973
35184 -577973 -398655 -79065 414997 1156532 1816690 1892003 1357533 738089 523841 786602
35174 786602 1313582 1794970 1901537 1526213 1015626 886260 1234678 1640543 1682066 1329185
35164 1329185 816745 380586 173925 224555 399356 549202 673471 792428 771019 528794
35154 528794 304163 345970 422178 93592 -518317 -763585 -396675 50083 73691 -111801
35144 -111801 -36138 316085 665932 936534 1131617 1042739 589549 193526 259458 474860
35134 474860 213786 -482689 -955314 -921691 -771880 -798503 -787342 -570046 -366505 -275394
35124 -275394 18611 641353 1118678 1029849 672108 560885 591653 289783 -300307 -610279
35114 -610279 -410775 -98136 -19023 -23606 103212 192455 -29602 -492668 -903054 -1120418
35104 -1120418 -1138018 -837828 -99887 846869 1470904 1456120 1019128 598002 352238 137168
35094 137168 -99141 -152103 104649 430378 494066 344476 327486 538259 668938 518946
35084 518946 356810 526957 900444 1027524 756887 413948 360415 606689 891571 966500
35074 966500 772742 479812 353725 467724 592434 520411 400399 502639 716852 622994
35064 622994 121297 -339109 -325643 42249 327702 344627 254493 232297 295025 414771
35054 414771 560282 585384 262457 -448650 -1220347 -1562010 -1275025 -686242 -332321 -369501
35044 -369501 -417701 -97146 431326 685823 523437 271258 202489 224939 188957 173549
35034 173549 274003 369751 324937 211151 126045 2095 -186655 -252409 -88646 79855
35024 79855 46541 14048 260177 576312 493376 18427 -317805 -211203 31682 -11552
35014 -11552 -354636 -741333 -1016201 -1169015 -1229737 -1279750 -1382639 -1388928 -1024041 -309463
35004 -309463 305026 389188 -33123 -592923 -930894 -845536 -326265 379464 901326 1103651
34994 1103651 1153145 1130322 832207 169346 -480671 -623283 -237375 247548 489004 511785
34984 511785 508418 587896 724531 811162 775351 702611 726987 728847 359796 -459953 -1291389
34973 -1291389 -1666337 -1627088 -1493894 -1307978 -908021 -440452 -323743 -663008 -1092301 -1294506
34963 -1294506 -1349019 -1454146 -1601651 -1663466 -1566423 -1270760 -788596 -302623 -39424 44861
34953 44861 202796 446333 453538 63629 -416126 -594752 -461074 -259588 -106805 38859
34943 38859 178448 280941 403280 608050 819370 906224 850499 723392 571712 423248
34933 423248 321187 272427 246089 265605 381126 526918 578658 582941 705786 890286 829102
34922 829102 396537 -152878 -558804 -851713 -1105971 -1208417 -1123744 -1100076 -1299645 -1473715
34912 -1473715 -1345802 -1093546 -1065351 -1199033 -1139115 -809036 -446896 -157037 149323 419999
34902 419999 502479 498587 637996 797036 629906 248559 243528 819578 1386700 1329609 814021
34891 814021 458778 477668 559505 466746 346463 413583 616601 743199 720800 681606 735267
34880 735267 771962 605747 308483 205972 417489 608238 451455 167768 243779 685562
34870 685562 963840 747388 304315 56064 74922 185710 281011 360779 466046 676527
34860 676527 970746 1071642 725020 145979 -184415 -207583 -324565 -660269 -836073 -684401
34850 -684401 -601271 -822537 -907559 -448048 183473 393290 296439 412326 689808 569295
34840 569295 -64949 -680957 -889556 -851828 -811952 -746410 -606395 -474659 -361055 -196247
34830 -196247 -70821 -120145 -188655 -26786 214447 186719 33404 279647 935068 1333587
34820 1333587 1090299 621551 411518 346075 185815 157913 524471 953194 917133 491729
34810 491729 201672 219073 234320 57857 -130099 -145296 -28734 112640 176332 -15865
34800 -15865 -553608 -1192667 -1571032 -1675050 -1809340 -2110126 -2390561 -2485656 -2435127 -2260725
34790 -2260725 -1866093 -1276014 -727971 -400802 -254365 -233784 -406383 -759797 -1075572 -1188506
34780 -1188506 -1212658 -1302984 -1307326 -914592 -160099 445766 437097 -48193 -389652 -186537
34770 -186537 303567 537775 382118 211702 338494 628639 810807 889108 1002208 1074967
34760 1074967 941266 724229 753615 1094812 1446449 1537335 1365632 1028480 617151 338974
34750 338974 403493 638149 532954 -108034 -816997 -1020762 -739653 -449817 -426666 -552316
34740 -552316 -663739 -731254 -703380 -509840 -278269 -261272 -455713 -548366 -357389 -92375
34730 -92375 -20310 -85073 -66803 42866 79267 31323 46203 88019 -133311 -732952 -1311891
34719 -1311891 -1278165 -525294 359354 649351 178962 -583532 -1090103 -1187710 -1036169 -772029
34709 -772029 -442942 -172493 -132786 -303592 -441951 -368499 -139381 130429 436216 758048
34699 758048 942843 898590 784980 804477 889754 823386 613125 491411 531056 513335 252964
34688 252964 -152487 -486125 -636952 -560932 -209519 335504 775060 818085 470068 12851
34678 12851 -255797 -211170 77463 416114 603747 528704 161002 -451164 -1057894 -1213329
34668 -1213329 -697857 74296 398537 107175 -279740 -340271 -276884 -413825 -587260 -451826
34658 -451826 -94018 137464 205226 280773 221712 -267113 -972240 -1263635 -963561 -595940
34648 -595940 -588309 -721307 -636548 -448721 -490737 -758049 -967546 -974889 -843491 -660053 -514808
34637 -514808 -501832 -549695 -447858 -204230 -100916 -184632 -46913 551896 1169182 1254428
34627 1254428 995078 1033695 1456712 1677377 1381806 996793 981947 1139237 975466 427698
34617 427698 -140401 -464642 -550795 -432330 -101455 316160 584689 612727 510806 372834
34607 372834 182724 -18017 -69708 78882 236584 224054 154251 260726 507546 620778
34597 620778 533722 523159 756831 946959 705540 99166 -432900 -640223 -644738 -583629
34587 -583629 -400258 -88102 132141 49210 -282810 -641077 -850207 -831573 -610130 -371780
34577 -371780 -362089 -629271 -986349 -1267603 -1461584 -1567981 -1538999 -1409456 -1249846 -947665
34567 -947665 -327065 437275 862632 748991 385694 25398 -420633 -915243 -1005633 -449316
34557 -449316 227278 323384 -101108 -390967 -233368 81715 236658 209064 51857 -173733
34547 -173733 -246087 -4771 282565 221087 -55505 -33595 324948 416403 -140599 -951880
34537 -951880 -1400560 -1355863 -1068878 -711641 -336960 -64888 -6620 -101912 -202349 -224175
34527 -224175 -149095 -19757 28254 -90083 -221368 -139635 114192 311844 417755 563686
34517 563686 672207 517355 205559 151084 449738 712482 688878 615403 716368 788292
34507 788292 586289 264422 101336 72202 -4611 -144260 -279535 -418557 -497667 -369262
34497 -369262 -158047 -283388 -848788 -1356761 -1346673 -973298 -618489 -309810 55068 272635
34487 272635 140925 -70000 10456 216650 110234 -284643 -539979 -489123 -307975 -47824
34477 -47824 351533 645143 464570 -56540 -373833 -302436 -191477 -281089 -418929 -514231
34467 -514231 -722323 -994289 -963762 -543711 -189904 -276232 -583770 -712429 -675727 -769174
34457 -769174 -1096075 -1512449 -1843782 -1918158 -1589681 -972421 -477106 -388066 -544281 -615818
34447 -615818 -528237 -435326 -450606 -605393 -912790 -1263970 -1387447 -1108852 -565315 -31130
34437 -31130 343973 510464 427153 180975 33262 121867 225105 31907 -435013 -859914
34427 -859914 -1030950 -1014839 -987286 -1056212 -1214066 -1320468 -1176592 -756006 -318364 -162508
34417 -162508 -313646 -578622 -831081 -1058347 -1168055 -984733 -521540 -97550 -52452 -394889
34407 -394889 -823087 -1070472 -1144661 -1203631 -1275083 -1198708 -854555 -352056 76937 316760
34397 316760 422485 479161 500896 469075 413034 443288 678792 1046815 1178181 730381
34387 730381 -80186 -531734 -222294 389125 608102 471437 590008 1079224 1254877 617687
34377 617687 -360141 -819775 -571558 -154504 -34424 -179367 -393349 -665276 -1043752 -1394794
34367 -1394794 -1472285 -1199270 -805327 -653056 -891937 -1284789 -1439241 -1211557 -795204 -419679
34357 -419679 -102454 266557 739212 1271937 1749332 1982412 1808284 1278932 684884 358405
34347 358405 494402 1073910 1794217 2155533 1886066 1285905 894265 821398 713492 377192
34337 377192 36012 -124037 -218877 -280183 -54371 493784 869335 653916 146536 -18063
34327 -18063 324104 839381 1259711 1522683 1514845 1173019 775919 663634 685025 381826
34317 381826 -265895 -761302 -849686 -876177 -1173607 -1493586 -1358370 -742877 -114684 99618
34307 99618 -111451 -439745 -587733 -517792 -419138 -430998 -480093 -458980 -404186 -327865 -77019
34296 -77019 328967 403134 -287598 -1328552 -1713353 -1044929 -17157 525550 556420 553827
34286 553827 628527 483170 66089 -256016 -220147 622 79482 -87284 -358084 -531957
34276 -531957 -525616 -502785 -789818 -1459419 -2025637 -1844783 -917707 -20205 169703 -137865
34266 -137865 -221686 109217 262501 -262316 -1137340 -1634206 -1527017 -1174560 -844732 -459271
34256 -459271 -61025 -2068 -379283 -688425 -442733 127837 418868 305707 197273 339189
34246 339189 549582 653970 714635 734395 555093 203196 -23866 15900 108016 55335
34236 55335 -59347 -137539 -268486 -486861 -638932 -677774 -768939 -909544 -821574 -483889
34226 -483889 -346919 -630864 -816395 -372989 306026 350419 -327293 -895164 -779652 -351552
34216 -351552 -234666 -474107 -720358 -830906 -881929 -818370 -502799 -61249 120483 -201286
34206 -201286 -860436 -1419679 -1504954 -1039177 -225348 675524 1502525 2088272 2136707 1455891
34196 1455891 320752 -643990 -1037234 -964558 -715616 -434516 -246006 -403549 -992711
34187 -992711 -1630172 -1802116 -1507185 -1284422 -1523800 -1967852 -2041322 -1545251 -848449 -416065
34177 -416065 -318110 -294894 -197320 -159243 -298592 -470433 -504283 -526203 -748904 -1008504 -894185
34166 -894185 -424871 -202144 -639298 -1346172 -1619293 -1329682 -941693 -790662 -776269 -739674
34156 -739674 -695287 -599958 -295356 155139 416595 369101 333184 569706 839497 760661
34146 760661 376913 34359 -135200 -241912 -269638 -93783 149406 119802 -217453 -494588
34136 -494588 -481222 -391480 -466190 -559315 -430270 -233827 -359420 -839228 -1245600 -1246969 -1019786
34125 -1019786 -962344 -1150473 -1278023 -1118256 -846192 -776432 -887914 -823181 -386199 172213
34115 172213 482380 475729 300149 16240 -335524 -514373 -318132 -15494 -125544 -688452
34105 -688452 -1152429 -1130443 -879912 -820355 -960760 -1106739 -1289412 -1598872 -1846933 -1810335
34095 -1810335 -1625980 -1535130 -1397474 -915573 -242592 128825 91986 75877 384090 788989
34085 788989 910045 655305 167403 -355333 -673898 -659900 -554701 -770588 -1302084 -1645384
34075 -1645384 -1456432 -976369 -617381 -439581 -287083 -173542 -227710 -412319 -551048 -534598
34065 -534598 -338912 17285 391985 574578 555134 525086 486324 177370 -383523 -643450
34055 -643450 -208041 462988 548582 -48630 -606774 -588554 -259589 -158156 -360805 -549001
34045 -549001 -544323 -462201 -429993 -420183 -385341 -376084 -434750 -461523 -310921 -31037 111750
34034 111750 -57027 -359631 -455611 -252273 40346 238404 344222 347570 123900 -351033
34024 -351033 -892881 -1337591 -1682786 -1896718 -1838014 -1530067 -1257147 -1164219 -998044 -508423
34014 -508423 109081 470098 518009 465142 377204 168317 -96118 -245154 -293314 -372391
34004 -372391 -442447 -388826 -327109 -453367 -634561 -519478 -62507 398909 584433 461764
33994 461764 48977 -564362 -1001542 -866996 -329172 -12835 -180562 -430482 -359379 -96574
33984 -96574 45696 45415 -1404 -177538 -521583 -762236 -622759 -232118 44597 45068 -138771
33973 -138771 -364381 -458598 -223785 304425 748057 788311 551514 372858 336810 315452
33963 315452 310815 435034 616117 628491 421463 189870 118229 236192 496420 809520
33953 809520 1018858 996883 748624 328292 -232288 -777147 -981535 -700212 -246948 -47573
33943 -47573 -78828 45983 438194 701075 446201 -188546 -695531 -762379 -561592 -505233
33933 -505233 -760349 -1039342 -952594 -572395 -444189 -889831 -1499354 -1593215 -1083633 -549026
33923 -549026 -458878 -654707 -689114 -382698 133598 708323 1253509 1621668 1628747 1260768
33913 1260768 763247 448926 406269 427982 270620 -37690 -250959 -282122 -361016 -696050
33903 -696050 -1120502 -1273204 -1064448 -759723 -616943 -625427 -615725 -467085 -184888 92163
33893 92163 155034 -72035 -392683 -538927 -495955 -472593 -567296 -658474 -646263 -599005 -599951
33882 -599951 -642267 -763550 -1092968 -1620365 -2057006 -2096203 -1752833 -1315546 -1003179 -780184
33872 -780184 -488610 -56145 443418 866811 1101937 1119083 964595 731773 531693 451368
33862 451368 513434 684091 903688 1072757 1061033 849992 645201 671765 827546 748848
33852 748848 308932 -178217 -402107 -464704 -617540 -810818 -816631 -649350 -514984 -427839
33842 -427839 -231928 34971 153544 99839 67527 93314 -191 -256592 -529885 -811092
33832 -811092 -1219825 -1597484 -1547101 -1043194 -579345 -476097 -434916 -67143 493516 849611
33822 849611 912501 852371 721842 507396 364955 424761 492695 290078 -114897 -415373
33812 -415373 -478844 -363433 -84758 304719 563730 551526 522816 752579 1030052 986385
33802 986385 795144 989421 1591991 1996104 1807541 1273847 733564 180651 -388038 -711183
33792 -711183 -688564 -633135 -720134 -580520 97131 872011 993946 384466 -325479 -659197
33782 -659197 -698808 -617806 -319859 265101 892215 1268506 1403879 1489124 1579904 1608999
33772 1608999 1610864 1703190 1834463 1733658 1212905 435470 -236701 -638593 -902112 -1120235
33762 -1120235 -1101037 -652995 -6371 339394 215728 -37185 -78799 15164 -5470 -172665
33752 -172665 -381610 -644288 -970660 -1154719 -1003747 -692104 -561784 -616037 -541289 -224176
33742 -224176 101693 272114 398607 539177 506856 217944 -41143 43455 377653 607593
33732 607593 581140 447731 394877 476847 617307 608885 220048 -493792 -1085836 -1162712 -873472
33721 -873472 -709494 -858805 -1043064 -1015162 -911798 -985372 -1228566 -1438474 -1479234 -1304873
33711 -1304873 -871199 -245043 273270 360269 18817 -428898 -704417 -791257 -780460 -670769
33701 -670769 -429960 -160028 -63784 -239619 -583518 -916743 -1163079 -1362329 -1533885 -1592695
33691 -1592695 -1437317 -1083006 -640803 -173289 338165 843498 1135343 1019521 552419
33682 552419 17097 -329747 -400094 -193860 242994 684739 714138 89864 -853857 -1391664
33672 -1391664 -1148760 -565940 -447132 -1051678 -1811959 -2013078 -1575306 -1000784 -677534
33663 -677534 -519065 -312942 -113887 -80096 -121748 -19391 173468 173257 -40551 -99504 217868
33652 217868 598074 607762 305031 103712 129092 98544 -126361 -262760 -55018 314628
33642 314628 519024 564506 680182 868971 886381 626862 254600 -54653 -266088 -381743
33632 -381743 -433761 -600856 -1054734 -1612510 -1816379 -1498256 -1018583 -764261 -641709 -318176
33622 -318176 208995 596228 649560 552157 564608 703539 771612 574253 86592 -487354
33612 -487354 -841101 -870508 -810336 -920044 -1089325 -967257 -483682 -10268 79851 -159363
33602 -159363 -351567 -202056 280186 847283 1217559 1291865 1203637 1092672 886636 479008
33592 479008 76833 76230 500978 854127 730889 359036 267316 552522 766108 505445
33582 505445 -114396 -601197 -535152 123682 1012498 1607987 1605583 1119128 502364 40290
33572 40290 -141208 -15290 307929 548475 468846 140786 -135784 -180175 -73128 19846
33562 19846 3239 -169536 -489219 -808783 -918483 -778530 -569567 -454157 -396929 -288759
33552 -288759 -141500 -52645 -32364 24148 187534 396397 558449 713419 992057 1356253
33542 1356253 1497525 1181830 655453 438394 641827 790381 509204 84462 19713 284959
33532 284959 453245 445665 606496 1012679 1248435 1049412 703824 543791 444723 178329
33522 178329 -73190 13816 329063 457752 285215 72158 -30780 -151377 -343525 -426745
33512 -426745 -300634 -150539 -190658 -388056 -578218 -716411 -872584 -1037653 -1044510 -714399
33502 -714399 -106695 388986 355917 -139121 -486886 -204260 438534 743371 498568 212566
33492 212566 339463 628628 514058 -65975 -571696 -539902 -84914 333102 443592 346962
33482 346962 250321 172524 -14926 -287856 -347770 54166 695911 986799 604156 -107136
33472 -107136 -532899 -502465 -401294 -594348 -983011 -1237828 -1263998 -1223397 -1191098 -1038385
33462 -1038385 -683045 -255886 59998 204591 183824 10350 -186996 -188624 -5848 9308
33452 9308 -348489 -691321 -463575 226584 643639 389625 -103898 -262817 -135990 -125551
33442 -125551 -275905 -284677 -63018 147828 166333 22919 -225552 -498874 -575276 -330268
33432 -330268 -41226 -60647 -221490 -24216 554863 945379 799615 421386 164304 -86288
33422 -86288 -488239 -762610 -616166 -326493 -392921 -787572 -1036969 -941683 -756783 -703534
33412 -703534 -733832 -791006 -918814 -1066591 -1112080 -1102693 -1164248 -1176821 -893546 -395984 -45159
33401 -45159 78523 277333 661771 893574 706159 307496 14825 -177702 -390261 -533786
33391 -533786 -520542 -517299 -618721 -512662 92555 868108 1161525 833800 349021 34685
33381 34685 -267212 -696060 -972151 -767744 -198177 319080 530617 479953 324913 214779
33371 214779 256274 439047 620660 645274 437410 24173 -387136 -427201 50142 596807
33361 596807 557385 -57063 -493374 -295487 6491 -332791 -1147453 -1571598 -1229629 -625518
33351 -625518 -336893 -388543 -563367 -811908 -1087993 -1190253 -1082118 -1054763 -1258033 -1346548
33341 -1346548 -947244 -267952 145102 134222 38842 129263 292242 313131 175787 14727
33331 14727 -7131 265589 839531 1407816 1537898 1112574 428398 -187124 -662582 -1021538
33321 -1021538 -1166059 -1002030 -657730 -400955 -380129 -556964 -835578 -1127717 -1312343 -1270446
33311 -1270446 -1021590 -765051 -717571 -914075 -1209149 -1463530 -1639851 -1674328 -1400375 -791091
33301 -791091 -200372 -64197 -307631 -375490 -21155 282855 44183 -446360 -509082 -119394
33291 -119394 45977 -326863 -677490 -423377 127389 156963 -580388 -1459537 -1723185 -1246587
33281 -1246587 -559246 -268576 -490913 -845958 -1069523 -1477179 -2456983 -3528677 -3510601
33272 -3510601 -1980574 -97434 590890 -107811 -1055962 -1362171 -1211875 -1090232 -942162
33263 -942162 -491032 110654 431935 328382 -7846 -384058 -673658 -707957 -446707 -177089
33253 -177089 -224225 -494874 -606756 -468881 -413566 -666235 -986688 -1037251 -897186 -937831
33243 -937831 -1261780 -1544382 -1488871 -1219121 -1079435 -1191138 -1399233 -1577097 -1737564 -1822655
33233 -1822655 -1648392 -1200645 -773391 -596281 -477983 -94637 448827 670319 356896
33224 356896 -140140 -369221 -282730 -114602 30997 244288 580825 971813 1305198 1455265
33214 1455265 1322117 999537 804826 939995 1188675 1174385 885128 677071 725218 765035
33204 765035 533539 218179 200588 484320 691288 630978 566183 777350 1113716 1230141
33194 1230141 1128493 1139624 1372025 1521449 1370006 1170219 1257763 1485622 1397770 890330
33184 890330 341141 71091 28953 79470 225620 371159 227232 -247184 -583506 -337454
33174 -337454 278431 635594 449709 -18247 -399629 -488819 -170814 471785 958917 775561
33164 775561 67967 -412264 -224976 263599 488316 393240 251242 146726 34293 44819
33154 44819 282842 469327 226081 -353783 -824708 -1027433 -1177591 -1309982 -1115345 -496226
33144 -496226 110620 220707 -153250 -672563 -1164702 -1684372 -2221334 -2606355 -2695504 -2514802
33134 -2514802 -2238572 -2067927 -2049365 -1988154 -1669389 -1186804 -871838 -847970 -877491 -755134
33124 -755134 -624378 -730999 -1037097 -1254758 -1136087 -622977 100868 591009 436719 -226890
33114 -226890 -755966 -783603 -686819 -952860 -1376741 -1356459 -801044 -216884 39286 61275
33104 61275 -49989 -362254 -722501 -734849 -362825 -92362 -218775 -392203 -196653 207286
33094 207286 415505 439433 579090 848900 992931 963793 959447 1032730 1056268 1054457 1172681
33083 1172681 1268331 915104 -25749 -1091632 -1628259 -1361158 -500844 513957 1254995
33074 1254995 1438349 1000241 95902 -936424 -1629563 -1628158 -1079562 -632173 -761623 -1186024
33064 -1186024 -1255848 -837551 -403111 -248604 -122717 202065 469837 378751 111072 37726
33054 37726 167675 304031 513767 945611 1314303 1128662 462931 -26742 9028 192330
33044 192330 97709 -114300 -74974 169987 337749 431702 631712 844636 831767 677754
33034 677754 672994 806163 865805 994554 1547123 2323291 2591810 2124006 1585382 1520073
33024 1520073 1531203 1007676 171616 -280500 -255469 -250681 -439931 -507941 -350159 -224878
33014 -224878 -155568 140128 600131 740383 407319 5995 -211118 -456843 -780225 -803316
33004 -803316 -438006 -202304 -360776 -382234 160135 706186 438423 -494491 -1201065 -1228881
32994 -1228881 -853398 -414727 -56402 21892 -266802 -532843 -323510 148556 258633 -125481
32984 -125481 -580348 -878285 -1139298 -1253390 -855892 9484 813967 1242863 1411897 1339975
32974 1339975 859952 180808 -124705 97434 401550 503077 571834 581418 114606 -828593
32964 -828593 -1515569 -1418998 -893660 -504941 -277086 -66704 -69945 -377900 -542551 -201511
32954 -201511 277331 340756 40559 -247319 -432199 -458267 48305 1188527 2331155 3018044
32944 3018044 3803325 5183233 6126939 5013842 2047829 -566149 -1223692 -616786 -332873
32935 -332873 -760737 -1162776 -1115573 -939084 -953408 -1063895 -1064980 -870499 -449440 127571
32925 127571 603984 750306 615587 394371 156562 -109878 -320375 -373943 -334099 -347055
32915 -347055 -427612 -460125 -363420 -153526 105825 338126 483782 532338 482825 302962
32905 302962 28813 -147680 -60209 179354 287088 154873 -92200 -354154 -629583 -830305
32895 -830305 -806957 -636079 -623071 -900832 -1234611 -1333423 -1156203 -806688 -342867 154088
32885 154088 492344 525556 309114 -4839 -340435 -691461 -1028631 -1268059 -1279946 -976712
32875 -976712 -519707 -340689 -694488 -1210255 -1208889 -553851 115367 159544 -300787 -607120
32865 -607120 -359201 237556 714492 804645 566846 205989 -125223 -328494 -254988 186450
32855 186450 723429 786659 174072 -523923 -538560 133313 820354 1143370 1329652 1464797
32845 1464797 1078122 -102050 -1407683 -1800555 -1069078 -52079 317853 -84017 -634241
32836 -634241 -712010 -320629 1969 -115465 -382948 -254371 273305 645921 574985 414414
32826 414414 501035 560826 164557 -520647 -887919 -668869 -163352 252894 508504 719827
32816 719827 965800 1221423 1348382 1155501 599853 -100316 -640371 -843516 -662644 -170493
32806 -170493 321860 368632 -143556 -770089 -979575 -742408 -435715 -275529 -102517 294545
32796 294545 858426 1308836 1411280 1183835 844315 530147 188876 -92659 132093 1100590
32786 1100590 2109097 1987437 536551 -1076272 -1704785 -1455827 -1071884 -658255 222605
32777 222605 1496997 2429179 2492802 1775921 566822 -845647 -1972283 -2388102 -2335765
32768 -2335765 -2512116 -3081949 -3374364 -2721054 -1188409 608744 1964879 2304383 1548916
32759 1548916 473997 108583 464208 432068 -639558 -1856705 -1934537 -1042163 -648076
32750 -648076 -1572912 -3002012 -3687121 -3469715 -3100421 -2946255 -2570882 -1608853 -442428
32741 -442428 312567 592112 695616 569518 -82737 -968439 -1196948 -446668 422425 429973
32731 429973 -267576 -764357 -713803 -541234 -533465 -505299 -389165 -395097 -434244 -106460 493566
32720 493566 673840 221067 -102479 332400 999052 971326 279763 -250962 -289436 -308323
32710 -308323 -595032 -730860 -358034 97521 -61710 -821335 -1416476 -1258181 -591242 -115554
32700 -115554 -134231 -289730 -127697 322671 696522 845546 946055 1089951 1088520 778603
32690 778603 278694 -169848 -406137 -308104 199154 941849 1515462 1672145 1544608 1395954
32680 1395954 1341030 1379790 1434935 1257161 626769 -177740 -474850 -12498 626167 768351
32670 768351 471718 195982 -22270 -492657 -1117041 -1344610 -973261 -500511 -487317 -920705
32660 -920705 -1388914 -1616155 -1639124 -1636255 -1723182 -1801628 -1571616 -854228 77718 688158
32650 688158 740504 493205 322130 369121 582934 824886 846087 460991 -86868 -217635
32640 -217635 272419 827888 796768 315018 118333 508356 968316 948721 598581 387355
32630 387355 330025 84000 -302440 -296327 333053 1086229 1358619 1167218 946385 876153
32620 876153 783065 568639 372925 339524 470906 670114 744601 512097 106773 -43694
32610 -43694 187044 344310 67709 -307632 -318007 -126947 -17290 441012 1725272 3211955
32600 3211955 4056350 5129945 8268802 12958605 15585880 13433586 8215954 4007777
32592 4007777 2501234 2112755 1239093 218197 -193240 -328384 -731532 -1122057 -1155463
32583 -1155463 -1231305 -1678566 -1943057 -1452565 -660567 -393233 -648572 -820509 -689508 -421922
32573 -421922 46537 814822 1444669 1377262 804978 410681 321849 50905 -529547 -913843
32563 -913843 -835222 -731177 -1020405 -1441597 -1502712 -1223913 -1026861 -1093348 -1201734 -1118840
32553 -1118840 -864086 -589488 -409304 -391910 -580848 -937012 -1294607 -1441546 -1286364 -946480
32543 -946480 -641484 -502501 -524875 -666574 -866561 -957625 -738646 -242656 190216 238206
32533 238206 -68756 -417136 -511729 -239573 310690 851117 1046982 835175 491699 239164
32523 239164 -56569 -579687 -1117674 -1269589 -1061455 -969523 -1232398 -1495965 -1366810 -1041949
32513 -1041949 -1052052 -1499653 -1911722 -1885653 -1572091 -1357467 -1288598 -1065868 -530701 97331
32503 97331 510229 631187 544571 284291 -126385 -518176 -679231 -636917 -668901 -960349
32493 -960349 -1357466 -1545271 -1404033 -1102313 -868855 -772340 -753276 -773363 -804629 -691658
32483 -691658 -229055 490358 977507 854906 384097 177873 398978 607920 467166 160447
32473 160447 -82125 -419173 -1004216 -1546139 -1720321 -1714680 -1852202 -1917703 -1456779 -604194
32463 -604194 6420 109260 -21276 -232012 -654576 -1146349 -1264354 -973942 -734627 -683667
32453 -683667 -427804 78248 200260 -379968 -1030231 -1096989 -856156 -880049 -1001576 -691688
32443 -691688 -76422 254132 220121 233460 342898 189130 -220762 -457942 -452981 -622061
32433 -622061 -1078725 -1374794 -1221772 -881887 -621745 -338995 -9657 15269 -468910 -1086985
32423 -1086985 -1333522 -1181728 -948956 -805681 -701280 -573624 -372021 -29207 373253
32414 373253 549441 304934 -215758 -697398 -951437 -975273 -885133 -877703 -1084997 -1369667
32404 -1369667 -1415772 -1097401 -616576 -248651 -125186 -269798 -610351 -909708 -917608 -652735
32394 -652735 -336214 -51151 271025 547899 586874 476823 551196 839455 938079 604221
32384 604221 114943 -172457 -259520 -262607 -102482 221709 357660 15161 -518840 -664881
32374 -664881 -267000 276101 519981 360613 -3190 -254966 -180897 93126 165968 -174998
32364 -174998 -678810 -970550 -979366 -837153 -587100 -287326 -207871 -548796 -1041876 -1180956
32354 -1180956 -842437 -405612 -275530 -533093 -1019244 -1492484 -1693599 -1497056 -1048768
32345 -1048768 -611140 -298322 -96287 -36366 -140521 -283709 -340856 -401392 -616108 -915688
32335 -915688 -1120990 -1237946 -1368840 -1416605 -1189765 -757738 -394929 -200520 -69414 14209
32325 14209 -4271 14501 253868 532291 478086 157619 56300 313736 482068 276066
32315 276066 65275 252294 582246 551320 220315 92439 302411 427581 126505 -429386
32305 -429386 -829073 -818556 -367729 355166 955307 1007895 475937 -177412 -436328 -250633
32295 -250633 -26001 -128675 -483755 -706065 -588415 -331341 -204531 -135781 106396 388914
32285 388914 262764 -351105 -920177 -1001467 -823245 -797164 -790948 -440149 13917 -117132
32275 -117132 -926960 -1682180 -1846598 -1760236 -1966702 -2383519 -2600934 -2575685 -2433787 -1865336
32265 -1865336 -433255 1520363 2927001 3148438 2605459 2032190 1554552 871118 23687
32256 23687 -510287 -465291 -165794 -152571 -607519 -1221769 -1522903 -1269679 -589283 191900
32246 191900 805151 1128074 1123264 839272 467484 230776 150149 46190 -178804 -410132
32236 -410132 -536400 -613847 -698874 -698860 -559080 -442551 -522116 -714894 -827168 -838204 -803900
32225 -803900 -605944 -111600 468684 716253 519362 157378 -149742 -442347 -707744 -747803
32215 -747803 -542600 -409537 -542173 -667754 -471834 -143174 -128665 -463205 -718335 -603755
32205 -603755 -286434 -61067 3986 -16008 -99109 -227592 -286839 -180077 9056 90873
32195 90873 5532 -87170 13059 289480 473446 319721 -107804 -522542 -778939 -990227
32185 -990227 -1234381 -1352625 -1205045 -960253 -900338 -1036251 -1159991 -1212756 -1321079 -1467038
32175 -1467038 -1418628 -1088536 -727996 -614161 -696603 -700615 -495622 -243853 -208976 -455106
32165 -455106 -715300 -614264 -115452 342800 335647 -6323 -202773 -110709 -26866 -51809
32155 -51809 180099 865983 1528134 1576592 1143855 877907 1004520 1095534 805886 357950
32145 357950 112326 53112 -29072 -136593 -171751 -257542 -602177 -1102336 -1389479 -1297880
32135 -1297880 -1047093 -908141 -897296 -879111 -778404 -557888 -140099 456241 965637 1059758
32125 1059758 713871 250196 -39122 -191366 -406380 -689468 -827199 -703037 -465836
32116 -465836 -320281 -285759 -267329 -250954 -274778 -279271 -171861 -15535 45284 42731 119347
32105 119347 151352 -237675 -1072915 -1726216 -1581531 -848160 -302404 -282695 -408099 -351928
32095 -351928 -368134 -766522 -1282284 -1389222 -1011031 -527485 -230672 -148699 -262867 -477188
32085 -477188 -469166 -45655 372971 139167 -671388 -1228053 -1059301 -674476 -748252 -1166039
32075 -1166039 -1351411 -1178334 -989206 -915285 -779207 -617775 -724521 -1091690 -1307285 -1155276
32065 -1155276 -890350 -746561 -590168 -291401 -38270 51149 294109 994535 1829801 2134358
32055 2134358 1728484 1065536 576058 283021 133929 261984 650489 858537 462641
32046 462641 -341082 -909188 -911770 -631519 -460477 -395833 -210734 83366 208450 1501
32036 1501 -392742 -729378 -900179 -925487 -854204 -742233 -629039 -471265 -186031 181299
32026 181299 423650 384755 137033 -125043 -303144 -425458 -512063 -504536 -329875 -2898
32016 -2898 314779 371731 39244 -498411 -859242 -816335 -457270 15815 498341 941868
32006 941868 1260855 1379365 1253375 806701 43000 -714134 -984273 -718825 -447306 -580463
31996 -580463 -855509 -833694 -671812 -870946 -1383445 -1567041 -1094421 -377545 67726 196724
31986 196724 163831 -54595 -433256 -656080 -486800 -158437 -66880 -260619 -519024 -728088
31976 -728088 -849846 -702037 -162464 475598 713365 430655 -1296 -195891 -121455 -16473
31966 -16473 -152193 -664383 -1416717 -2035804 -2246965 -2139866 -1959279 -1745956 -1394629 -941342
31956 -941342 -509619 -65545 442417 760523 543377 -78432 -550320 -628688 -670276 -992572
31946 -992572 -1321883 -1190435 -614053 -28236 270103 268582 -35253 -641983 -1279204 -1509820
31936 -1509820 -1261801 -996528 -1172169 -1692716 -2047548 -1894299 -1354271 -795239 -480957
31927 -480957 -444596 -579108 -758127 -875562 -832573 -567054 -135034 296092 624244 952745
31917 952745 1424825 1903745 1991544 1491858 734805 259334 216468 274525 115606 -182315
31907 -182315 -330114 -201479 118291 515869 896964 1116208 1048130 746204 418772 234349
31897 234349 217839 304308 402799 434754 398238 366359 355385 270098 81288 -37475 94931
31886 94931 396411 601433 561063 328483 40728 -121090 2863 281783 243065 -365382
31876 -365382 -1071181 -1159215 -614309 -109380 -52851 -219061 -423753 -869647 -1484314 -1599704
31866 -1599704 -881204 -59368 -20689 -517575 -572401 17612 427572 90047 -578267 -969180
31856 -969180 -1101463 -1259056 -1348076 -1096012 -575453 -96406 243316 555187 833811 928407
31846 928407 778088 465813 88727 -280034 -563019 -719581 -754589 -642318 -350802 33873
31836 33873 357393 589714 787898 870130 687556 366780 272809 502737 705167 572261
31826 572261 237724 -13357 -157838 -301039 -364688 -217086 26233 110750 -36316 -300849
31816 -300849 -574114 -750280 -692702 -445681 -327088 -533246 -783914 -669073 -249907 24005
31806 24005 -46893 -202195 -170530 -4365 112285 114151 5544 -204538 -384669 -282203
31796 -282203 192532 761191 974395 623119 -35021 -440238 -215274 415837 790679 517739
31786 517739 -94270 -473238 -476238 -376462 -318063 -193987 -41832 -105896 -371606 -436150 -75123
31775 -75123 367187 419577 91082 -223261 -263009 -72756 194633 381141 349823 171566
31765 171566 183458 578482 1013602 949453 376955 -121486 -113061 175364 222562 -163334
31755 -163334 -772620 -1341798 -1725526 -1829030 -1639942 -1351151 -1256343 -1435721 -1635274 -1519710
31745 -1519710 -1007379 -344192 106216 153114 -62526 -176891 69332 585046 1041856 1211957
31735 1211957 1113411 847070 465984 95357 9656 368856 917218 1161112 885754 314163
31725 314163 -293467 -954535 -1702356 -2220977 -2078163 -1319462 -538657 -250247 -397286 -596415
31715 -596415 -655038 -638002 -574921 -385341 -77803 210892 399319 486042 384535 -4940
31705 -4940 -474715 -545511 -26846 672130 1037047 1074273 1143282 1309954 1270025 908307 521481
31694 521481 362767 314968 197680 93488 130720 184939 63041 -186457 -386020 -494421
31684 -494421 -530827 -403760 -79597 220025 259177 103697 -53576 -218692 -451266 -578504
31674 -578504 -434072 -232266 -264102 -328963 23855 715256 1134712 973508 537723 148407
31664 148407 -206898 -485869 -482058 -369064 -720722 -1578188 -2075125 -1529025 -439366 188377
31654 188377 123384 -119175 -253129 -428666 -628101 -593193 -365203 -281156 -392914 -436512
31644 -436512 -392801 -508000 -713765 -633550 -293998 -232033 -672490 -1139231 -1161369 -887346
31634 -887346 -690342 -604537 -516251 -547713 -841636 -1200308 -1297973 -1104231 -844752 -700207
31624 -700207 -733027 -910704 -1028620 -845353 -460462 -276254 -404439 -455442 -168421 123368
31614 123368 14482 -317277 -413997 -242683 -128404 -171313 -223922 -326854 -647080 -1013991
31604 -1013991 -1032372 -718796 -549420 -744314 -944702 -814743 -586178 -692698 -1091701 -1283854
31594 -1283854 -965540 -436835 -291754 -749468 -1343496 -1371742 -707310 -4221 69596 -363911
31584 -363911 -645602 -517825 -390486 -618319 -944149 -903534 -490780 -115434 -33784 -91468
31574 -91468 5709 349075 751718 915968 703124 292588 14349 -7819 54657 28045
31564 28045 -45626 -68433 -93114 -219837 -406780 -531960 -537550 -370276 79839 761821 1289662
31553 1289662 1273573 819213 416662 286443 144749 -233201 -532781 -307104 312123 722096
31543 722096 673248 586535 888071 1373033 1535859 1306630 1066870 1010724 907082 571533
31533 571533 201513 49295 44583 -13259 -94393 -41692 100415 137180 41506 -12109 117485
31522 117485 467711 1037366 1659950 1901762 1445877 610047 138745 368500 896278 1202365
31512 1202365 1275159 1387000 1536352 1462768 1087903 611572 196270 -172949 -502863 -706661
31502 -706661 -761626 -767087 -775476 -712982 -545570 -406593 -464846 -721317 -996271 -1089470 -945485
31491 -945485 -716809 -666591 -932289 -1361303 -1641222 -1606106 -1347726 -1024873 -680308 -313384
31481 -313384 -35941 -20920 -286895 -617653 -743792 -589696 -325597 -188525 -271729 -488350
31471 -488350 -699762 -822625 -819046 -679055 -474184 -350020 -369570 -425207 -418903 -442684 -577373
31460 -577373 -571924 -60375 797763 1260934 890506 215196 72297 437995 474854 -205182
31450 -205182 -930233 -924104 -370465 -31392 -131142 -216826 -9559 220629 211740 108777 91977
31439 91977 18483 -294200 -723438 -1036209 -1190687 -1217611 -1045065 -697606 -446944 -475877
31429 -475877 -572090 -442531 -159283 11448 43525 51924 -73944 -480882 -873226 -745904
31419 -745904 -164632 186472 -79492 -526729 -536411 -80840 453459 856784 1087796 930265
31409 930265 175871 -899407 -1684787 -1905458 -1790877 -1550072 -1102709 -486794 -115714
31400 -115714 -283599 -658649 -655427 -207113 208345 290174 255903 339491 333345 -68586 -706266
31389 -706266 -1098723 -1068395 -869919 -697500 -427618 22975 393876 367161 -16580 -431657
31379 -431657 -638455 -621213 -486797 -403438 -524503 -785940 -873938 -578095 -99067 156751
31369 156751 -352 -456176 -955674 -1163602 -787534 39943 665996 580508 70418 -174950
31359 -174950 3611 183821 175725 260278 496069 448231 -46330 -400452 -60398 620398
31349 620398 839423 440993 9358 -21932 169619 241011 136790 -22746 -177808 -297564
31339 -297564 -307785 -179393 -17400 -34873 -444844 -1237597 -1976861 -2038319 -1274096 -275422
31329 -275422 264216 277575 153814 64861 -129249 -427358 -613379 -654797 -760694 -970406
31319 -970406 -1049094 -883115 -649876 -505327 -413863 -361939 -413847 -480643 -383858 -224940 -282392
31308 -282392 -423311 -107189 766586 1494470 1450152 940922 701315 829928 802774 401880
31298 401880 24268 5431 143185 85396 -161373 -327357 -263869 -54983 118243 112356
31288 112356 -70392 -244071 -215322 -31574 55429 -118188 -492842 -920424 -1267273 -1389335
31278 -1389335 -1217702 -930592 -849638 -1064689 -1308145 -1295426 -1047842 -769550 -546776 -328192
31268 -328192 -113076 25841 92868 175487 248801 108290 -370819 -950518 -1182173 -939472
31258 -939472 -672326 -922651 -1613286 -2083553 -1926851 -1510985 -1427422 -1657680 -1670774 -1260626
31248 -1260626 -842031 -817744 -1035404 -1090194 -891312 -665720 -571071 -558420 -525940 -405380
31238 -405380 -171475 60930 36509 -353302 -841034 -1023612 -802530 -443077 -250208 -323632
31228 -323632 -544268 -621471 -244125 572847 1324203 1444261 922905 285499 -43005 -119428
31218 -119428 -215665 -454512 -805232 -1184441 -1420693 -1334132 -1004976 -778626 -860536 -1090858
31208 -1090858 -1258403 -1407912 -1628639 -1754566 -1554404 -1085284 -602214 -245425 -74293
31199 -74293 -244867 -795121 -1348366 -1437268 -1130278 -954477 -1148549 -1382705 -1328435 -1111686
31189 -1111686 -1003424 -1008800 -1021507 -1097669 -1279096 -1359961 -1129301 -691048 -279061 86040
31179 86040 477022 755999 720644 461083 246423 111981 -123086 -468096 -729908 -869016
31169 -869016 -1034722 -1191098 -1063243 -587718 -106275 65413 8919 -33082 -17448 -659
31159 -659 114854 444605 812688 829236 297878 -568708 -1311848 -1539297 -1182606 -567446
31149 -567446 -154270 -106569 -195338 -196715 -214048 -447437 -806593 -1003040 -955288 -845129 -777604
31138 -777604 -635418 -334426 -12410 153691 177015 181845 183900 77548 -180373 -469534
31128 -469534 -614565 -562942 -432738 -378102 -420166 -445065 -372742 -272553 -280072 -446355 -698505
31117 -698505 -889169 -855699 -529506 -68584 204860 114617 -171484 -356961 -367415 -349018
31107 -349018 -360900 -250863 118136 645322 1063815 1173253 975576 643156 378960 276455
31097 276455 322159 531902 964506 1502637 1760052 1436145 734653 201986 125646 310114
31087 310114 475415 583023 620699 361866 -340683 -1153021 -1496072 -1207079 -705516 -437248
31077 -437248 -392162 -301585 -105761 4872 -73136 -226252 -357758 -528861 -743932 -776051
$$ [...]
##END NTUPLES=NMR SPECTRUM
##END=
