##TITLE=31P_DE-80H_X3
 64 sc D2O
 26.2.2025
##JCAMPDX= 6.0         $$ Bruker NMR JCAMP-DX V2.0
##DATA TYPE= NMR SPECTRUM
##DATA CLASS= NTUPLES
##ORIGIN= UXNMR, Bruker Analytische Messtechnik GmbH
##OWNER= root
$$ XWIN-NMR		Version 3.5
$$ Wed Jun 25 11:27:42 2025 Russian Standard Time (UT+4h)  Yarkov@DPX200
##.OBSERVE FREQUENCY= 81.013821
##.OBSERVE NUCLEUS= ^31P
##.ACQUISITION MODE= SIMULTANEOUS
##.ACQUISITION SCHEME= undefined
##.AVERAGES= 64
##.DIGITISER RES= 17
##SPECTROMETER/DATA SYSTEM= spect
##.PULSE SEQUENCE= zgpg30
##.SOLVENT NAME= DMSO
##.SHIFT REFERENCE= (INTERNAL, DMSO, 0, 198.062)
##AUDIT TRAIL= $$ (NUMBER, WHEN, WHO, WHERE, WHAT)
$$ ##TITLE= Audit trail, XWIN-NMR		Version 3.5
$$ ##JCAMPDX= 5.01
$$ ##ORIGIN= Bruker BioSpin GmbH
$$ ##OWNER= Yarkov
$$ C:/Bruker/XWIN-NMR/data/yarkov2/nmr/P31/2/pdata/1/auditp.txt
$$ ##AUDIT TRAIL=  $$ (NUMBER, WHEN, WHO, WHERE, WHAT)
(   1,<2025-06-25 11:26:56.62 +0400>,<Yarkov>,<DPX200>,
      <created by zg, POWCHK disabled, PULCHK disabled
       configuration hash MD5:
       00 E9 B6 7A A2 85 ED C7 34 08 36 98 17 FE 4E 26
       data hash MD5: 32K
       7C 83 9B 3E 41 5C 37 C7 0A 2C 3D DE 3E 37 2C 8F>)
(   2,<2025-06-25 11:27:08.42 +0400>,<Yarkov>,<DPX200>,
      <Start of raw data processing
       efp BC_mod = 2 LB = 1.5 FT_mod = 6 PKNL = 1 PHC0 = 1674.294 PHC1 = 46.35953 SI = 64K 
       data hash MD5: 64K
       3F C0 2B D4 19 00 73 02 E2 75 9E 10 1A 44 8B 7C>)
(   3,<2025-06-25 11:27:22.78 +0400>,<Yarkov>,<DPX200>,
      <pk PHC0 = 2.6 PHC1 = 0 
       data hash MD5: 64K
       23 49 4F 7D 9C 87 8E 9F B0 1F 87 AC 70 49 F1 24>)
$$ ##END=
$$ 
$$ hash MD5
$$ 4C 9B 2F 4A 91 6A 5B A2 AF 01 6F 76 42 96 A7 52
##$RELAX= 
##$RELAX= 
##$RELAX= 
##$RELAX= 
##$RELAX= 
##$RELAX= 
##$RELAX= 
##$RELAX= 
$$ Bruker specific parameters
$$ --------------------------
##$DU= <C:/Bruker/XWIN-NMR>
##$EXPNO= 2
##$NAME= <P31>
##$PROCNO= 1
##$TYPE= <nmr>
##$USER= <yarkov2>
##$AMP= (0..31)
100 100 100 100 100 100 100 100 100 100 100 100 100 100 100 100 100 100 
100 100 100 100 100 100 100 100 100 100 100 100 100 100 
##$AQSEQ= 0
##$AQ_mod= 1
##$AUNM= <au_zg>
##$AUTOPOS= <>
##$BF1= 81.014009
##$BF2= 200.13
##$BF3= 200.13
##$BF4= 200.13
##$BF5= 200.13
##$BF6= 200.13
##$BF7= 200.13
##$BF8= 200.13
##$BYTORDA= 1
##$CFDGTYP= 0
##$CFRGTYP= 5
##$CHEMSTR= <none>
##$CNST= (0..31)
1 1 145 1 1 1 1 1 1 1 1 1 1 1 1 1 1 1 1 1 1 1 1 1 1 1 1 1 1 1 1 1 
##$CPDPRG= <waltz16>
##$CPDPRG1= <>
##$CPDPRG2= <waltz16>
##$CPDPRG3= <>
##$CPDPRG4= <mlev>
##$CPDPRG5= <mlev>
##$CPDPRG6= <mlev>
##$CPDPRG7= <mlev>
##$CPDPRG8= <mlev>
##$CPDPRGB= <>
##$CPDPRGT= <>
##$D= (0..31)
0 1 0 0 0 0 0 0 0 0.06 0 0.03 2e-05 3e-06 0 0 0.0002 0 0 0 0 0 0 0 0 0 
0 0 0 0 0 0 
##$DATE= 1750836416
##$DBL= (0..7)
120 120 120 11 120 120 24 19 
##$DBP= (0..7)
150 150 150 150 150 150 150 150 
##$DBP07= 0
##$DBPNAM0= <>
##$DBPNAM1= <>
##$DBPNAM2= <>
##$DBPNAM3= <>
##$DBPNAM4= <>
##$DBPNAM5= <>
##$DBPNAM6= <>
##$DBPNAM7= <>
##$DBPOAL= (0..7)
0.5 0.5 0.5 0.5 0.5 0.5 0.5 0.5 
$$ [...]
##$SUBNAM2= <"">
##$SUBNAM3= <"">
##$SUBNAM4= <"">
##$SUBNAM5= <"">
##$SUBNAM6= <"">
##$SUBNAM7= <"">
##$SUBNAM8= <"">
##$SUBNAM9= <"">
##$SW= 400.765351723535
##$SWIBOX= (0..15)
0 1 3 0 0 0 0 0 0 0 0 0 0 0 0 0 
##$SW_h= 32467.5324675325
##$TD= 32768
##$TD0= 1
##$TE= 0
##$TE2= 300
##$TE3= 300
##$TEG= 300
##$TL= (0..7)
0 120 53 12 22 120 120 120 
##$TP= (0..7)
150 150 150 150 150 150 150 150 
##$TP07= 0
##$TPNAME0= <>
##$TPNAME1= <>
##$TPNAME2= <>
##$TPNAME3= <>
##$TPNAME4= <>
##$TPNAME5= <>
##$TPNAME6= <>
##$TPNAME7= <>
##$TPOAL= (0..7)
0.5 0.5 0.5 0.5 0.5 0.5 0.5 0.5 
##$TPOFFS= (0..7)
0 0 0 0 0 0 0 0 
##$TUNHIN= 0
##$TUNHOUT= 0
##$TUNXOUT= 0
##$USERA1= <user>
##$USERA2= <user>
##$USERA3= <user>
##$USERA4= <user>
##$USERA5= <user>
##$V9= 5
##$VALIST= <valist>
##$VCLIST= <CCCCCCCCCCCCCCC>
##$VD= 0
##$VDLIST= <DDDDDDDDDDDDDDD>
##$VPLIST= <PPPPPPPPPPPPPPP>
##$VTLIST= <TTTTTTTTTTTTTTT>
##$WBST= 1024
##$WBSW= 4
##$XGAIN= (0..3)
0 0 0 0 
##$XL= 0
##$YL= 0
##$YMAX_a= 2124
##$YMIN_a= -482
##$ZGOPTNS= <>
##$ZL1= 120
##$ZL2= 120
##$ZL3= 120
##$ZL4= 120
##$ABSF1= 0
##$ABSF2= 0
##$ABSG= 0
##$ABSL= 0
##$ALPHA= 0
##$AQORDER= 0
##$ASSFAC= 0
##$ASSFACI= 0
##$ASSFACX= 0
##$ASSWID= 0
##$AUNMP= <proc_1d>
##$AZFE= 0.1
##$AZFW= 0.5
##$BCFW= 0
##$BC_mod= 2
##$BYTORDP= 0
##$COROFFS= 0
##$CY= -3
##$DATMOD= 1
##$DC= 0
##$DFILT= <>
##$DTYPP= 0
##$F1P= 0
##$F2P= 0
##$FCOR= 1
##$FTSIZE= 65536
##$FT_mod= 6
##$GAMMA= 0
##$GB= 0
##$INTBC= 1
##$INTSCL= 9.790993e-09
##$ISEN= 30
##$LB= 1.5
##$LEV0= 0
##$LPBIN= 0
##$MAXI= 10000
##$MC2= 0
##$MEAN= 0
##$ME_mod= 0
##$MI= 50
##$NCOEF= 0
##$NC_proc= -9
##$NLEV= 6
##$NOISF1= 182.463
##$NOISF2= 159.3651
##$NSP= 0
##$NTH_PI= 0
##$NZP= 0
##$OFFSET= 198.0616
##$PC= 4
##$PHC0= 1676.894
##$PHC1= 46.35953
##$PH_mod= 1
##$PKNL= yes
##$PPARMOD= 0
##$PSCAL= 0
##$PSIGN= 0
##$REVERSE= no
##$SF= 81.0140089999434
##$SI= 65536
##$SIGF1= 159.3651
##$SIGF2= -187.1042
##$SINO= 113.3802
##$SIOLD= 16384
##$SREGLST= <1H.CDCl3>
##$SSB= 0
##$STSI= 65536
##$STSR= 0
##$SW_p= 32467.5324675325
##$SYMM= 0
##$S_DEV= 0
##$TDeff= 32768
##$TDoff= 0
##$TI= <>
##$TILT= no
##$TM1= 0
##$TM2= 0
##$TOPLEV= 0
##$USERP1= <user>
##$USERP2= <user>
##$USERP3= <user>
##$USERP4= <user>
##$USERP5= <user>
##$WDW= 1
##$XDIM= 65536
##$YMAX_p= 310734759
##$YMIN_p= -8137999
$$ End of Bruker specific parameters
$$ ---------------------------------
##NTUPLES= NMR SPECTRUM
##VAR_NAME=  FREQUENCY,     SPECTRUM/REAL,   SPECTRUM/IMAG
##SYMBOL=    X,             R,               I
##VAR_TYPE=  INDEPENDENT,   DEPENDENT,       DEPENDENT
##VAR_FORM=  AFFN,          ASDF,            ASDF
##VAR_DIM=   65536,         65536,           65536
##UNITS=     HZ,            ARBITRARY UNITS, ARBITRARY UNITS
##FACTOR=    0.49542278885378, 1,            1
##FIRST=     16045.7642231865, 0,            0
##LAST=      -16421.768244346, 0,            0
##MIN=       -16421.768244346, -8137999,     0
##MAX=       16045.7642231865, 310734759,    0
$$ Real data points
##PAGE= N=1
##DATA TABLE= (X++(R..R)), XYDATA
$$ [...]
$$ plain form
43014 731533 966392 1162212 1107965 778969 393095 215014 318656 559106 746607 788863
43004 788863 681466 469525 269235 232116 392920 600143 681618 643300 625674 702879
42994 702879 816220 875947 827776 637610 324215 16950 -121716 -60436 84390 199011
42984 199011 258134 270833 258302 303939 496621 769800 913280 819454 616622 477659
42974 477659 405596 323828 279746 389127 608870 734661 658834 506025 459156 540434 623991
42963 623991 605185 501453 417688 447103 584412 725065 776984 761950 752416 724882 576711
42952 576711 315327 118922 126618 245133 265120 122449 -63323 -182246 -241005 -261703
42942 -261703 -188833 39626 385258 721042 923689 949283 867318 819166 873542 920491 796291
$$ packed form
43014G31533K34859J95820n4247l28996l85874j78081J03642K40450J87501M2256
43004G88863j07397k11941k00290l7119J60804K07223Q1475l8318j7626P7205
42994G02879J13341N9727m8171j90166l13395l07265j38666O1280J44826J14621
42984A99011N9123J2699j2531M5637J92682K73179J43480r3826k02832j38963
42974D77659p2063q1768m4082J09381K19743J25791p5827j52809m6869Q1278Q3557
42963F23991j8806j03732q3765K9415J37309J40653N1919j5034r534k7534j48171
42952E76711k61384j96405P696J18515J9987j42671j85772j18923n8759k0698
42942b61703P2870K28459L45632L35784K02647K5594q1965m8152N4376M6949j24200
$$ plain form
42931 796291 520973 294259 224046 204745 141158 128203 259996 403351 377028 273437
42921 273437 352321 629028 822814 759900 586355 491068 451548 399650 429068 629121 852527
42910 852527 873008 700485 539799 486403 457421 398810 364949 375403 359883 288339 233278
42899 233278 266904 383534 527249 616392 576152 451092 426130 588399 729510 586255
42889 586255 248077 79975 212370 369388 297085 107734 38534 85736 91792 42456 45496
42878 45496 100783 104768 39759 -18771 -45284 -54825 3605 176947 368788 444652 451114 546104
42866 546104 719467 783236 670859 550536 568939 650300 645494 543573 430025 345661 297623
42855 297623 326683 452763 605807 700015 732478 733862 673008 499293 254240 63900 20656
$$ packed form
42931G96291k75318k26714p0213j9301o3587j2955J31793J43355k6323j03591
42921B73437P8884K76707J93786o2914j73545r5287l9520n1898K9418K00053K23406
42910H52527K0481j72523j60686n3396k8982n8611l3861J0454j5520p1544n5061
42899B33278L3626J16630J43715Q9143m0240j25060k4962J62269J41111j43255
42889E86255l38178j68102J32395J57018p2303j89351o9200M7202O056m9336L040
42878D5496N5287L985o5009n8530k6513r541N8430J73342J91841P5864O462R4990
42866E46104J73363O3769j12377j20323J8403Q1361m806j01921j13548q4364m8038
42855B97623K9060J26080J53044R4208L2463J384o0854j73715k45053j90340m3244
$$ plain form
42844 20656 105706 206085 192934 42016 -91030 5918 339493 645708 673337 472691
42834 472691 300908 290346 341585 332309 289257 308575 413045 554122 684427 764753 753121
42823 753121 656433 566566 584351 709014 833362 839408 682291 411332 147808 22983
42813 22983 86644 260888 401818 415031 313593 185974 125883 172934 290687 405903
42803 405903 484346 552473 628328 665922 615279 517714 476866 525201 575687 534788 427051
42792 427051 377161 484356 724323 955390 1027666 924895 792485 773718 832923 829281 764005
42781 764005 813495 1050414 1275484 1263931 1075077 941039 913287 834556 660130 577420
42771 577420 722833 961393 1066936 992212 847740 728691 684950 760479 921302 1012632
$$ packed form
42844B0656Q5050J00379j3151j50918j33046R6948L33575L06215K7629k00646
42834D72691j71783j0562N1239r276m3052J9318J04470J41077J30305Q0326j1632
42823G53121r6688q9867J7785J24663J24348O046j57117k70959k63524j24825
42813B2983O3661J74244J40930J3213j01438j27619o0091M7051J17753J15216
42803D05903P8443O8127P5855L7594n0643r7565m0848M8335N0486m0899j07737
42792D27051m9890J07195K39967K31067P2276j02771j32410j8767N9205l642o5276
42781G64005M9490K36919K25070j1553j88854j34038k7752p8731j74426q2710
42771E77420J45413K38560J05543p4724j44472j19049m3741P5529J60823R1330
$$ plain form
42761 1012632 921512 736852 637918 680417 803275 972369 1170815 1298892 1247263 1055815
42751 1055815 860975 706432 548212 418589 414628 527155 651441 770618 944190 1103182
42741 1103182 1076256 878675 752401 814579 877556 759687 576713 539138 625901 675262
42731 675262 671241 700547 712239 580157 377241 337562 522172 740740 844482 886023 921275
42720 921275 858491 624703 331299 147753 118066 201327 371653 550437 550453 263807 -129213
42709 -129213 -292531 -87431 307986 629479 771094 786172 755155 718271 687911 664549
42699 664549 640649 606785 554645 485596 433181 454497 557806 649838 609542 426296 220931
42688 220931 115654 131741 238559 436500 716983 973963 1060086 960676 831174 805076
$$ packed form
42761A012632r1120j84660r8934M2499J22858J69094J98446J28077n1629j91448
42751A055815j94840j54543j58220j29623l961J12527J24286J19177J73572J58992
42741A103182k6926j97581j26274O2178O2977j17869j82974l7575Q6763M9361
42731F75262m021K9306J1692j32082k02916l9679J84610K18568J03742M1541L5252
42720I21275o2784k33788k93404j83546k9687Q3261J70326J78784J6k86646l93020
42709a29213j63318K05100L95417L21493J41615J5078l1017l6884l0360k3362
42699F64549k3900l3864n2140o9049n2415K1316J03309R2032m0296j83246k05365
42688B20931j05277J6087J06818J97941K80483K56980Q6123r9410j29502k6098
$$ plain form
42678 805076 828548 765328 615067 509370 497924 475017 369032 280066 327024 443720 454161
42667 454161 309318 125848 9001 -38078 -28909 51536 175357 269490 327255 416783 533688
42656 533688 562725 458884 356401 398263 543915 649307 657020 595667 479552 358493
42646 358493 394388 691402 1064900 1184367 985287 749352 706849 753257 682185 516781
42636 516781 414452 364270 221992 15271 -28207 185231 446871 516671 421328 352072
42626 352072 364072 336865 205322 77591 82740 203391 327208 408154 499495 638016 766066
42615 766066 801606 747486 678759 629057 554962 445642 403329 527312 735828 812497 673507
42604 673507 501577 532616 760371 952885 949479 835350 788368 843676 888069 841218 744513
$$ packed form
42678H05076K3472o3220j50261j05697j1446k2907j05985q8966M6958J16696J0441
42667D54161j44843j83470j16847m7079R169Q0445J23821R4133N7765Q9528J16905
42656E33688K9037j03841j02483M1862J45652J05392P713o1353j16115j21059
42646C58493L5895K97014L73498J19467j99080k35935m2503M6408p1072j65404
42636E16781j02329n0182j42278k06721m3478K13438K61640O9800r5343o9256
42626C52072J2000k7207j31543j27731N149J20651J23817Q0946R1341J38521J28050
42615G66066L5540n4120o8727m9702p4095j09320m2313J23983K08516P6669j38990
42604F73507j71930L1039K27755J92514l406j14129m6982N5308M4393m6851r6705
$$ plain form
42593 744513 660622 574457 459594 395099 512876 803773 1063656 1110123 1005465 962990
42583 962990 1043947 1070853 885584 578930 370089 339069 398678 481344 604220 744747
42573 744747 803858 760160 748568 888200 1096365 1171889 1034561 797012 613283 541752
42563 541752 567822 675921 839850 979843 1000791 892567 753995 679904 641112 531538
42553 531538 346807 244466 355169 570560 622363 396573 86914 -17648 154710 419365
42543 419365 573832 596706 592598 600758 533290 328207 108518 92942 325697 592041 678178
42532 678178 628222 619181 651507 556339 313061 145306 210742 371545 405783 308015 225899
42521 225899 212961 229300 316023 565500 926317 1209950 1310173 1283778 1212783 1123606 1043829
$$ packed form
42593G44513q3891q6165j14863o4495J17777K90897K59883M6467j04658m2475
42583I62990Q0957K6906j85269l06654k08841l1020N9609Q2666J22876J40527
42573G44747N9111m3698j1592J39632K08165P5524j37328k37549j83729p1531
42563E41752K6070J08099J63929J39993K0948j08224j38572p4091l8792j09574
42553E31538j84731j02341J10703K15391N1803k25790l09659j04562J72358K64655
42543D19365J54467K2874m108Q160o7468k05083k19689j5576K32755K66344Q6137
42532F78178m9956r041L2326r5168k43278j67755O5436J60803L4238r7768q2116
42521B25899j2938J6339Q6723K49477L60817K83633J00223k6395p0995q9177p9777
$$ plain form
42510 1043829 992027 901428 710905 549517 641137 954601 1131866 892519 380381 -21892
42500 -21892 -115136 15391 222025 441699 651566 829379 968545 1035929 935318 627950
42490 627950 280167 156360 323469 562634 627541 510946 393555 396096 472569 529444
42480 529444 559096 616122 707164 761670 714103 575218 406458 260937 179234 201858 322032
42469 322032 440574 442579 336310 257599 313229 467562 599879 618326 500251 293568
42459 293568 124514 141851 383372 714575 933530 918294 676193 324517 52804 12162
42449 12162 166299 313663 329432 320301 449380 671913 774257 658245 460364 367104
42439 367104 413834 507134 571216 619321 709899 855865 966584 904821 645857 350140 208893
$$ packed form
42510A043829n1802r0599j90523j61388R1620L13464J77265k39347n12138m02273
42500b1892r3244J30527K06634K19674K09867J77813J39166O7384j00611l07368
42490F27950l47783j23807J67109K39165O4907j16595j17391K541P6473N6875
42480E29444K9652N7026R1042N4506m7567j38885j68760j45521q1703K2624J20174
42469C22032J18542K005j06269p8711N5630J54333J32317J8447j18075k06683
42459B93568j69054J7337K41521L31203K18955j5236k42101l51676k71713m0642
42449A2162J54137J47364J5769r131J29079K22533J02344j16012j97881r3260
42439C67104M6730R3300O4082M8105R0578J45966J10719o1763k58964k95717j41247
$$ plain form
42428 208893 240131 321499 400982 546338 759634 881411 776341 532197 362836 348224
42418 348224 374568 329852 261334 296067 459951 633913 685583 608686 513199 488250 503080
42407 503080 462352 342179 232738 235304 347512 476231 548243 576122 612591 671537 720536
42396 720536 737383 731533 694048 570410 336730 88310 -15980 78041 255704 370694
42386 370694 408213 468909 612957 766549 791452 637340 427694 377364 580387 877051
42376 877051 987002 792961 441605 155355 25195 17448 77254 143492 146717 97741 118484
42365 118484 277729 452799 481067 406946 429732 617017 824929 922116 936910 929311 866016
42354 866016 718615 572972 522920 522771 462310 358887 366768 578013 878498 1040026 953461
$$ packed form
42428B08893L1238Q1368P9483J45356K13296J21777j05070k44144j69361j4612
42418C48224K6344m4716o8518L4733J63884J73962N1670p6897r5487k4949J4830
42407E03080m0728j20173j09441K566J12208J28719P2012K7879L6469N8946M8999
42396G20536J6847n850l7485j23638k33680k48420j04290R4021J77663J14990
42386C70694L7519O0696J44048J53592K4903j54112k09646n0330K03023K96664
42376H77051J09951j94041l51356k86250j30160p747N9806O6238L225m8976K0743
42365A18484J59245J75070K8268p4121K2786J87285K07912R7187J4794p599o3295
42354H66016j47401j45643n0052j49o0461j03423P881K11245L00485J61528q6565
$$ plain form
42343 953461 761495 729981 953628 1222342 1250702 1020914 797441 793321 941021 1040831
42333 1040831 1016283 930302 839471 752484 689296 669467 655238 595745 517350 483951 471028
42322 471028 372542 159554 -43433 -86955 42744 234349 390505 501597 585387 615545
42312 615545 558434 456680 405269 422479 411356 307028 207222 261890 452875 592064 558783
42301 558783 441315 399406 469742 564317 589250 493346 254345 -91821 -417180 -565066
42291 -565066 -469849 -205940 67221 209207 197742 154512 233043 442619 606924 529907
42281 529907 197004 -191406 -373948 -243341 41517 179527 30388 -225133 -304894 -167418
42271 -167418 -7569 65171 152611 319960 423887 329347 151142 96692 148999 95679 -142845
$$ packed form
42343I53461j91966l1514K23647K68714K8360k29788k23473m120J47700R9810
42333A040831k4548q5981r0831q6987o3188j9829j4229n9493p8395l3399j2923
42322D71028r8486k12988k02987m3522J29699J91605J56156J11092Q3790L0158
42312F15545n7111j01754n1411J7210j1123j04328r9806N4668J90985J39189l3281
42301E58783j17468m1909P0336R4575K4933r5904k39001l46166l25359j47886
42291e65066R5217K63909K73161J41986j1465m3230P8531K09576J64305p7017
42281E29907l32903l88410j82542J30607K84858J38010j49139k55521p9761J37476
42271a67418J59849P2740Q7440J67349J03927r4540j78205n4450N2307n3320k38524
$$ plain form
42260 -142845 -379089 -386176 -150435 148015 343228 426572 493552 575530 582402 467980 381557
42249 381557 503174 744960 818589 646514 480626 505059 565640 482992 399332 526834
42239 526834 716057 622422 241587 -60173 -60136 87475 185499 267686 426127 598650 661424
42228 661424 572968 340643 4090 -280697 -316180 -106194 126257 221440 221269 189713 106422
42217 106422 13497 48880 223496 361663 366183 334571 312701 193360 17119 90811 551891
42206 551891 1042239 1116856 815647 525239 411321 333460 245646 303443 536733 733128
42196 733128 737477 629439 523709 403124 233953 68991 -44705 -118612 -136481 -59167
42186 -59167 59584 126962 203552 448137 821446 1054803 1007418 858203 814968 811642 663792
$$ packed form
42260a42845k36244p087K35741K98450J95213Q3344O6980Q1978O872j14422q6423
42249C81557J21617K41786P3629j72075j65888K4433O0581q2648q3660J27502
42239E26834J89223r3635l80835l01760L7J47611R8024Q2187J58441J72523O2774
42228F61424q8456k32325l36553k84787l5483K09986K32451R5183j71l1556q3291
42217A06422r2925L5383J74616J38167M520l1612k1870j19341j76241P3692M61080
42206E51891M90348P4617l01209k90408j13918p7861q7814N7797K33290J96395
42196G33128M349j08038j05730j20585j69171j64962j13696p3907j7869P7314
42186e9167J18751O7378P6590K44585L73309K33357m7385j49215m3235l326j47850
$$ plain form
42175 663792 393450 205864 202650 285249 329317 327261 346826 429603 543638 599290 524352
42164 524352 348717 190772 143690 199139 272631 262262 119318 -60835 -68276 174340 437642
42153 437642 436685 237918 181964 362558 461256 237520 -87797 -171607 -53200 -13742 -69776
42142 -69776 33719 343708 560299 467297 226207 105132 129715 164475 174070 213456 255035
42131 255035 215589 131374 156155 365944 659788 872315 919923 827703 675968 548143
42121 548143 492343 496804 503616 461562 375612 307159 320604 430172 608761 832816 1069144
42110 1069144 1213383 1127734 808254 453867 271318 239432 166870 -32832 -238907 -301001
42100 -301001 -195623 27873 330385 637713 813809 781073 617423 460146 360834 295571
$$ packed form
42175F63792k70342j87586l214Q2599M4068k056J9565Q2777J14035N5652p4938
42164E24352j75635j57945m7082N5449P3492j0369j42944j80153p441K42616K63302
42153D37642r57j98767n5954J80594R8698k23736l25317q3810J18407L9458n6034
42142f9776J03495L09989K16591r3002k41090j21075K4583L4760R595L9386M1579
42131B55035l9446q4215K4781K09789K93844K12527M7608r2220j51735j27825
42121E48143n5800M461O812m2054q5950o8453J3445J09568J78589K24055K36328
42110A069144J44239q5649l19480l54387j82549l1886p2562j99702k06075o2094
42100c01001J05378K23496L02512L07328J76096l2736j63650j57277r9312o5263
$$ plain form
42090 295571 252650 226479 178309 98767 75507 204367 451129 683033 815811 847919 783683
42079 783683 639143 520632 568243 774576 954974 956310 824813 705176 628369 478818
42069 478818 168156 -209044 -423753 -334361 -61596 104148 11515 -182221 -214973 -36205
42059 -36205 190137 349698 472935 559941 519142 377130 360956 599965 873511 857702
42049 857702 552835 258663 161841 178004 219023 361519 631500 830792 776242 602274
42039 602274 619843 904164 1201003 1256565 1083305 850138 656043 519612 493332 635731
42029 635731 882548 1074621 1144252 1168596 1190277 1100750 810747 453146 258624 252667 245455
42018 245455 143951 87787 190468 325392 324063 253497 304086 484238 630636 675056 686580
$$ packed form
42090B95571m2921k6171m8170p9542k3260J28860K46762K31904J32778L2108o4236
42079G83683j44540j18511M7611K06333J80398J336j31497j19637p6807j49551
42069D78818l10662l77200k14709Q9392K72765J65744r2633j93736l2752J78768
42059c6205K26342J59561J23237Q7006m0799j42012j6174K39009K73546j5809
42049H57702l04867k94172r6822J6163M1019J42496K69981J99292n4550j73968
42039F02274J7569K84321K96839N5562j73260k33167j94095j36431k6280J42399
42029F35731K46817J92073O9631K4344K1681q9527k90003l57601j94522n957p212
42018B45455j01504n6164J02681J34924j329p0566N0589J80152J46398M4420J1524
$$ plain form
42007 686580 665429 527851 326756 253773 342588 384264 246360 77383 59460 144918 203404
41996 203404 260215 390769 519920 547704 565168 709871 892931 928638 881478 994840
41986 994840 1269823 1414084 1283568 1091960 1040341 984463 676578 173385 -218425 -317158
41976 -317158 -197489 -5697 175964 304637 384028 507993 760338 1046995 1150486 996830
41966 996830 767782 686520 770284 871347 904398 927537 1004656 1096781 1141194 1155871 1177585
41955 1177585 1153960 1024930 893417 948881 1169886 1271433 1065242 727478 547101 534520
41945 534520 493348 387167 362618 429672 415405 293270 271715 434045 555377 455271
41935 455271 299940 328748 471403 504264 451126 530343 765780 947499 983523 1013289 1108162
$$ packed form
42007F86580k1151j37578k01095p2983Q8815M1676j37904j68977j7923Q5458N8486
41996B03404N6811J30554J29151K7784J7464J44703J83060L5707m7160J13362
41986I94840K74983J44261j30516j91608n1619n5878l07885n03193l91810r8733
41976c17158J19669J91792J81661J28673P9391J23965K52345K86657J03491j53656
41966I96830k29048q1262Q3764J01063L3051K3139P7119R2125M4413J4677K1714
41955A177585k3625j29030j31513N5464K21005J01547k06191l37764j80377j2581
41945E34520m1172j06181k4549O7054j4267j22135k1555J62330J21332j00106
41935D55271j55331K8808J42655L2861n3138P9217K35437J81719L6024K9766R4873
$$ plain form
41924 1108162 1102194 843813 452740 200082 223029 436495 649754 716557 640811 569948
41914 569948 623877 733702 735503 601883 454154 357853 269983 207493 277408 463926 563348
41903 563348 452262 282157 273315 424575 564438 597840 556423 474758 371247 315420 372426
41892 372426 491370 558158 538765 473694 378694 276998 282155 477919 715767 711427 398868
41881 398868 41326 -84334 13854 147982 231714 324093 460541 582526 633703 630329 623717
41870 623717 646637 688819 684717 564114 377281 317447 509571 796721 869418 638432 357815
41859 357815 312288 486278 637877 620677 506148 419218 383101 348645 283140 191969 109645
41848 109645 91868 167494 287646 371782 403732 423347 434460 408653 383544 451082 618602
$$ packed form
41924A108162n968k58381l91073k52658K2947K13466K13259O6803p5746p0863
41914E69948N3929J09825J801j33620j47729r6301q7870o2490O9915J86518R9422
41903E63348j11086j70105q842J51260J39863L3402m1417q1665j03511n5827N7006
41892C72426J18944O6788j9393o5071r5000j01696N157J95764K37848m340l12559
41881C98868l57542j25660R8188J34128Q3732R2379J36448J21985N1177l374o612
41870F23717K2920M2182m102j20603j86833n9834J92124K87150P2697k30986k80617
41859C57815m5527J73990J51599j7200j14529q6930l6117l4456o5505r1171q2324
41848A09645j7777P5626J20152Q4136L1950J9615J1113k5807k5109O7538J67520
$$ plain form
41837 618602 784188 883492 940863 925912 713399 298441 -81579 -190655 -60739 137398
41827 137398 377026 717669 1042734 1122557 951169 772645 717397 646603 445958 242258
41817 242258 188340 233019 273686 360910 547425 676205 560890 301791 185106 292318
41807 292318 425043 419960 332625 272093 237458 188603 142036 129779 164055 275266 473137
41796 473137 648260 649277 499479 391832 408346 403789 271716 168579 300450 580276
41786 580276 696296 507427 195502 -9355 -99928 -198524 -300223 -255705 -7949 280921
41776 280921 421538 452244 577444 845057 1030698 936389 684667 552123 576093 535758
41766 535758 332316 167228 253223 526973 767857 853631 774933 556145 332039 355367
$$ packed form
41837F18602J65586R9304N7371j4951k12513m14958l80020j09076J29916J98137
41827A37398K39628L40643L25065P9823j71388j78524n5248p0794k00645k03700
41817B42258n3918M4679M0667Q7224J86515J28780j15315k59099j16685J07212
41807B92318J32725n083q7335o0532l4635m8855m6567j2257L4276J11211J97871
41796D73137J75123J017j49798j07647J6514m557j32073j03137J31871K79826
41786E80276J16020j88869l11925k04857r0573r8596j01699M4518K47756K88870
41776B80921J40617L0706J25200K67613J85641r4309k51722j32544K3970m0335
41766E35758k03442j65088Q5995K73750K40884Q5774p8698k18788k24106K3328
$$ plain form
41756 355367 697535 1032830 975395 594377 332705 409853 587080 595732 510682 531031 621689
41745 621689 611563 518527 535415 732545 964280 1064863 995539 810970 609600 505542
41735 505542 526501 548160 446821 303026 323856 565306 869857 1093140 1243152 1349874
41725 1349874 1348204 1187860 956915 791281 720657 682883 633141 562272 460626 345039
41715 345039 279764 291782 303692 237040 153770 194002 370199 519633 499822 362060 271975
41704 271975 294507 334873 311040 312645 491992 793748 917843 658629 211478 -9396
41694 -9396 153212 463507 643828 664096 606098 462301 252407 167888 346153 586849
41684 586849 557924 256397 409 -43028 -34045 -101812 -123546 -25440 -21370 -286579 -585555
$$ packed form
41756C55367L42168L35295n7435l81018k61672P7148J77227Q652q5050K0349R0658
41745F21689j0126r3036J6888J97130K31735J00583o9324j84569k01370j04058
41735E05542K0959K1659j01339j43795K0830K41450L04551K23283J50012J06722
41725A349874j670j60344k30945j65634p0624l7774m9742p0869j01646j15587
41715C45039o5275J2018J1910o6652q3270M0232J76197J49434j9811j37762r0085
41704B71975K2532M0366k3833J605J79347L01756J24095k59214m47151k20874
41694i396J62608L10295J80321K0268n7998j43797k09894q4519J78265K40696
41684E86849k8925l01527k55988m3437Q983o7767k1734R8106M070k65209k98976
$$ plain form
41673 -585555 -536618 -158594 147906 146239 10661 -3207 129132 303865 472795 592605
41663 592605 572146 424766 338455 433868 550280 433972 75393 -293705 -490506 -511396
41653 -511396 -402951 -182279 82808 265615 323711 353852 446940 571714 655429 694497
41643 694497 715056 697016 623709 557247 572316 639631 661786 617104 586421 628305 700722
41632 700722 730884 706474 668707 658423 697741 788961 899392 970235 968605 920879 882931
41621 882931 887815 916142 890289 712713 370099 7373 -174692 -132073 -21202 19759 57244
41610 57244 236620 521008 686493 594876 367063 239172 316083 508773 650386 622113
41600 622113 419828 165106 24999 62310 173961 213196 149006 62374 16647 2329 7561
$$ packed form
41673e85555M8937L78024L06500j667j35578j3868J32339J74733J68930J19810
41663E92605k0459j47380q6311R5413J16412j16308l58579l69098j96801k0890
41653e11396J08445K20672K65087J82807N8096L0141R3088J24774Q3715L9068
41643F94497K0559j8040p3307o6462J5069O7315K2155m4682l0683M1884P2417
41632G00722L0162k4410l7767j0284L9318R1220J10431P0843j630m7726l7948
41621H82931M884K8327k5853j77576l42614l62726j82065M2619J10871M0961L7485
41610E7244J79376K84388J65485r1617k27813j27891P6911J92690J41613k8273
41600F22113k02285k54722j40107L7311J11651L9235o4190q6632m5727j4318N232
$$ plain form
41589 7561 70129 226691 452281 683836 879573 1027306 1112411 1109549 1007172 826898 623316
41578 623316 473075 447430 567092 777827 983444 1105190 1104147 969862 736371 518600
41568 518600 469642 637735 883689 1004150 942269 825338 794574 867681 985099 1103162
41558 1103162 1185171 1177478 1082303 1008198 1055500 1176154 1232483 1171911 1052546 920341 776373
41547 776373 662988 651914 714502 724115 637551 559538 559978 540384 381717 140382 -14562
41536 -14562 -7072 102132 231375 334963 375759 345790 309896 347314 450073 540167 575165
41525 575165 580655 599310 662587 782192 913256 970606 949247 970891 1115541 1259467 1204532
41514 1204532 944357 674194 541185 513570 510640 530793 603074 710361 810686 870161
$$ packed form
41589G561O2568J56562K25590K31555J95737J47733Q5105k862j02377j80274k03582
41578F23316j50241k5645J19662K10735K05617J21746j043j34285k33491k17771
41568E18600m8958J68093K45954J20461o1881j16931l0764P3107J17418J18063
41558A103162Q2009p693r5175p4105M7302J20654N6329o0572j19365j32205j43968
41547G76373j13385j1074O2588R613q6564p8013M40j9594j58667k41335j54944
41536a4562P490J09204J29243J03588M0796k9969l5894L7418J02759R0094L4998
41525E75165N490J8655O3277J19605J31064N7350k1359K1644J44650J43926n4935
41514A204532k60175k70163j33009k7615k930K0153P2281J07287J00325N9475
$$ plain form
41504 870161 860551 800829 797124 933353 1111813 1125902 924419 682353 565306 548553 528146
41493 528146 478937 410362 279983 69631 -122873 -172006 -59211 147242 379071 565711
41483 565711 625622 549226 434481 374702 378110 439481 568215 670546 563829 252443 42794
41472 42794 180464 475835 525449 249887 -39164 -95682 1546 92367 177451 298445 384817
41461 384817 376963 360575 432457 541197 594580 627801 722829 832160 829834 709987 614551
41450 614551 661146 808624 880622 702190 287605 -70936 -21778 444558 919486 1022464
41440 1022464 821479 660193 668095 658169 477017 222776 69152 64857 181916 400891
41430 400891 655948 829476 899829 981873 1129072 1217032 1142943 1027399 1056671 1192011
$$ packed form
41504H70161r610n9722l705J36229J78460J4089k01483k42066j17047j6753k0407
41493E28146m9209o8575j30379k10352j92504m9133J12795K06453K31829J86640
41483E65711N9911p6396j14745n9779L408O1371J28734J02331j06717l11386k09649
41472D2794J37670K95371M9614k75562k89051n6518R7228R0821Q5084J20994Q6372
41461C84817p854j6388P1882J08740N3383L3221R5028J09331k326j19847r5436
41450F14551M6595J47478P1998j78432m14585l58541M9158M66336M74928J02978
41440A022464k00985j61286P902r926j81152k54241j53624m295J17059K18975
41430D00891K55057J73528P0353Q2044J47199Q7960p4089j15544K9272J35340
$$ plain form
41420 1192011 1211777 1026905 788704 657176 608218 535195 432987 391750 458959 578624
41410 578624 650620 615300 496151 374173 298743 227741 99572 -40173 -56150 103814
41400 103814 314593 396627 291711 85008 -92505 -135271 4283 271341 515543 614431
41390 614431 589023 545505 521577 466043 367466 307618 343748 409006 395821 299350 210783
41379 210783 184423 177854 132234 57329 10650 26830 96352 188690 259617 247087 106869
41368 106869 -124504 -321348 -349101 -161949 168937 501470 695580 686152 533457 394489
41358 394489 395567 512689 600848 552554 403572 272471 227488 239463 249684 256709 330411
41347 330411 535011 823792 1026423 992090 761024 545356 507229 597148 653187 618495
$$ packed form
41420A192011J9766j84872k38201j31528m8958p3023j02208m1237O7209J19665
41410E78624P1996l5320j19149j21978p5430p1002j28169j39745j5977J59964
41400A03814K10779Q2034j04916k06703j77513m2766J39554K67058K44202R8888
41390F14431k5408m3518k3928n5534r8577n9848L6130O5258j3185r6471q8567
41379B10783k6360o569m5620p4905m6679J6180O9522R2338P0927j2530j40218
41368A06869k31373j96844k7753J87152L30886L32533J94110r428j52695j38968
41358C94489J078J17122Q8159m8294j48982j31101m4983J1975J0221P025P3702
41347C30411K04600K88781K02631l4333k31066k15668l8127Q9919N6039l4692
$$ plain form
41337 618495 591757 668196 792883 802036 598435 277230 64210 96437 265381 333272 216686
41326 216686 70827 50299 96882 73098 12871 66197 224512 297924 207186 112964 151972
41315 151972 199051 52728 -228757 -358391 -182635 134648 329779 331865 272029 269656 299884
41304 299884 273723 183554 119656 154800 267710 405195 561899 728581 801200 658080
41294 658080 348234 92788 40053 110113 157083 190629 309496 468535 477188 265337 24718
41283 24718 2564 220383 483201 635290 705322 772293 782603 610987 295989 90815
41273 90815 193594 489168 664903 562734 315772 148592 162834 330833 559010 699312
41263 699312 628067 404400 248082 269730 327880 258072 126085 102094 179794 215612 199634
$$ packed form
41337F18495k6738P6439J24687R153k03601l21205k13020L2227J68944O7891j16586
41326B16686j45859k0528M6583k3784o0227N3326J58315P3412r0738r4222L9008
41315A51972M7079j46323k81485j29634J75756L17283J95131K086n9836k373L0228
41304B99884k6161r0169o3898L5144J12910J37485J56704J66682P2619j43120
41294F58080l09846k55446n2735P0060M6970L3546J18867J59039Q653k11851k40619
41283B4718k2154K17819K62818J52089P0032O6971J0310j71616l14998k05174
41273I0815J02779K95574J75735j02169k46962j67180J4242J67999K28177J40302
41263F99312p1245k23667j56318K1648N8150o9808j31987k3991P7700L5818j5978
$$ plain form
41252 199634 271278 449729 554528 468722 317762 283732 359300 396719 324893 215173 173507
41241 173507 244881 392179 506874 470184 265499 21651 -92995 -13099 197439 428967
41231 428967 611007 738673 838578 899741 845331 610315 251759 -61839 -194340 -155232
41221 -155232 -63467 -20854 -24480 11629 143156 300488 345812 249442 154893 214712 408350
41210 408350 587949 659606 643283 597573 574381 609244 660277 595748 349437 50089 -120759
41199 -120759 -155824 -169695 -169355 -56906 159342 356306 504207 670460 792512 693631 401826
41188 401826 200854 235156 307390 241840 206034 416142 707014 708203 368947 17370 -86386
41177 -86386 -2945 90164 121979 101669 62089 90250 260862 487089 570720 449420 283252
$$ packed form
41252A99634P1644J78451J04799q5806j50960l4030P5568L7419p1826j09720m1666
41241A73507P1374J47298J14695l6690k04685k43848j14646P9896K10538K31528
41231D28967J82040J27666R9905O1163n4410k35016l58556l13598j32501L9108
41221a55232R1765M2613l626L6109J31527J57332M5324r6370r4549N9819J93638
41210D08350J79599P1657j6323m5710k3192L4863N1033o4529k46311k99348j70848
41199a20759l5065j3871L40J12449K16248J96964J47901J66253J22052r8881k91805
41188D01826k00972L4302P2234o5550l5806K10108K90872J189l39256l51577j03756
41177h6386Q3441R3109L1815k0310l9580K8161J70612K26227Q3631j21300j66168
$$ plain form
41166 283252 263619 436346 719277 975299 1061886 940672 755209 674196 656319 525611
41156 525611 290563 192706 369395 653840 821369 873630 936893 1011941 1002357 916529 864977
41145 864977 878448 878338 833548 817749 876985 936990 893624 744266 591274 540309 610252
41134 610252 719284 751786 664193 536510 502141 615376 797878 925184 956439 956927 987148
41123 987148 1005272 924649 750526 586128 487770 399362 282186 225255 332727 552309
41113 552309 718021 739710 662658 571473 534419 608494 772922 869370 746772 480994 316229
41102 316229 357488 455231 440505 334196 245549 190775 123468 59464 58757 127855 221325 302302
41090 302302 346552 341088 332294 411490 591423 757006 798047 732286 645109 576969 525474
$$ packed form
41166B83252j9633J72727K82931K56022Q6587j21214j85463q1013j7877j30708
41156E25611k35048r7857J76689K84445J67529N2261O3263P5048r584q5828n1552
41145H64977J3471j10m4790j5799N9236O0005m3366j49358j52992n0965O9943
41134F10252J09032L2502q7593j27683l4369J13235J82502J27306L1255M88L0221
41123I87148J8124q0623j74123j64398r8358q8408j17176n6931J07472K19582
41113E52309J65712K1689p7052r1185l7054P4075J64428R6448j22598k65778j64765
41102C16229M1259R7743j4726j06309q8647n4774o7307o4004p07O9098R3470Q0977
41090C02302M4250n464q794P9196J79933J65583M1041o5761q7177o8140n1495
$$ plain form
41079 525474 480737 397501 218734 -2532 -100039 671 170000 264260 321316 441295
41069 441295 579747 629062 631753 723293 898220 1019889 1047011 1057686 1041060 870009 533224
41058 533224 208365 27537 -60993 -107893 -16364 274037 589580 685930 549318 384833
41048 384833 341182 385924 438232 485981 539142 563513 508827 361333 154069 -42583 -148035
41037 -148035 -127899 -11695 174734 448673 778199 1000665 953505 697971 502107 547967
41027 547967 729964 798721 643508 371597 161665 113176 203732 309775 282632 91294
41017 91294 -99033 -70006 197601 478923 550848 428045 309081 338547 481927 599772
41007 599772 578724 407071 182853 40001 17454 19301 -43197 -106024 -36243 156841 305657
$$ packed form
41079E25474m4737q3236j78767k21266r7507J00710J69329R4260N7056J19979
41069D41295J38452M9315K691R1540J74927J21669K7122J0675j6626j71051l36785
41058E33224l24859j80828q8530m6900R1529K90401L15543R6350j36612j64485
41048C84833m3651M4742N2308M7749N3161K4371n4686j47494k07264j96652j05452
41037a48035K0136J16204J86429K73939L29526K22466m7160k55534j95864M5860
41027E47967J81997O8757j55213k71911k09932m8489R0556J06043k7143j91338
41017I1294j90327K9027K67607K81322P1925j22803j18964K9466J43380J17845
41007E99772k1048j71653k24218j42852k2547J847o2498o2827O9781J93084J48816
$$ plain form
40996 305657 297138 194203 108608 64668 55451 125996 291529 441012 441061 309176 189534
40985 189534 182400 284648 460550 656182 762248 696547 543720 489552 574775 632320 534947
40974 534947 391333 387818 514113 583942 506342 401177 413470 520725 592390 570804 506661
40963 506661 447770 391693 361065 427678 594372 716639 643301 424252 279931 342882 519903
40952 519903 651634 713103 773571 832663 816241 711446 592077 502378 414340 320854 275370
40941 275370 295350 306350 242618 147737 112768 152346 203732 224104 223862 207382 145815 41701
40929 41701 -12601 105824 409593 740916 895033 816552 640525 523637 483607 445237
40919 445237 388259 364279 388578 411531 412544 442253 542035 681956 801724 857564 816497
$$ packed form
40996C05657q519j02935q5595m3940r217P0545J65533J49483M9j31885j19642
40985A89534p134J02248J75902J95632J06066o5701j52827n4168Q5223N7545r7373
40974E34947j43614l515J26295O9829p7600j05165J2293J07255P1665k1586o4143
40963E06661n8891n6077l0628O6613J66694J22267p3338k19049j44321O2951J77021
40952E19903J31731O1469O0468N9092j6422j04795j19369q9699q8038r3486m5484
40941B75370J9980J1000o3732r4881l4969L9578N1386K0372k42j6480o1567j04114
40929D1701n4302J18425L03769L31323J54117p8481j76027j16888m0030l8370
40919D45237n6978k3980K4299K2953J013K9709R9782J39921J19768N5840m1067
$$ plain form
40908 816497 674575 500303 383397 315891 211157 71926 26740 129798 236981 193824
40898 193824 63319 33793 156276 318391 446421 568740 668241 640596 468891 311440
40888 311440 320869 457190 566124 577661 537805 491417 434264 373400 351733 389253 443568
40877 443568 453268 409936 377898 429650 543979 591297 474977 279689 199113 295060 415568
40866 415568 398686 269709 166360 156704 233454 410395 678218 894538 873719 611737
40856 611737 307293 139803 133580 244576 431057 590245 580575 409355 282785 358012
40846 358012 540061 639075 635427 646422 699100 699771 603224 461384 313501 172907 116789
40835 116789 222987 388863 385458 170729 2118 123060 445772 679384 704501 668664
$$ packed form
40908H16497j41922j74272j16906o7506j04734j39231m5186J03058J07183m3157
40898A93824j30505k9526J22483J62115J28030J22319R9501k7645j71705j57451
40888C11440R429J36321J08934J1537l9856m6388n7153o0864k1667L7520N4315
40877D43568R700m3332l2038N1752J14329M7318j16320j95288q0576R5947J20508
40866D15568j6882j28977j03349r656P6750J76941K67823K16320k0819k61982
40856F11737l04444j67490o223J10996J86481J59188r670j71220j26570P5227
40846C58012J82049R9014l648J0995N2678O71r6547j41840j47883j40594n6118
40835A16789J06198J65876l405k14729j68611J20942L22712K33612K5117l5837
$$ plain form
40825 668664 717834 780250 693372 472342 337806 442564 643953 651654 402974 166649
40815 166649 200344 420152 545637 487911 407411 422185 476662 526026 628390 768762 795334
40804 795334 658803 537992 571199 618507 481981 242666 159574 295416 457183 495158
40794 495158 469377 498835 604918 745976 889973 1010238 1078999 1076723 970236 735279
40784 735279 463161 347284 444186 543536 436093 225174 168543 271699 289616 136035
40774 136035 28034 145187 371852 503193 533704 598431 743196 882789 921242 830656
40764 830656 667752 552753 556291 589988 513533 362508 332804 504562 724773 812582 741968
40753 741968 577279 385342 269368 322732 471384 519998 422756 331112 308788 230853 80610
$$ packed form
40825F68664M9170O2416q6878k21030j34536J04758K01389P701k48680k36325
40815A66649L3695K19808J25485n7726q0500J4774N4477M9364J02364J40372K6572
40804G95334j36531j20811L3207M7308j36526k39315q3092J35842J61767L7975
40794D95158k5781K9458J06083J41058J43997J20265O8761k276j06487k34957
40784G35279k72118j15877R6902R9350j07443k10919n6631J03156J7917j53581
40774A36035j08001J17153K26665J31341L0511O4727J44765J39593L8453r0586
40764H30656j62904j14999L538L3697p6455j51025k9704J71758K20211Q7809p0614
40753G41968j64689j91937j15974N3364J48652M8614r7242r1644k2324p7935j50243
$$ plain form
40742 80610 83867 345588 585661 502451 226167 119207 248731 366282 342078 303721 347242
40731 347242 400172 416604 466028 568776 645719 683617 765853 893757 958524 940482 960916
40720 960916 1076422 1180982 1168356 1040998 814516 484971 157848 40868 211168 517859
40710 517859 789684 1000737 1152090 1149825 938399 649946 479166 458323 455921 359717 187348
40699 187348 48399 42023 155350 250752 218363 140443 204823 446098 694964 808870 814323
40688 814323 779672 707926 635480 673967 827439 902264 752866 522571 478211 658630 837413
40677 837413 812375 605121 380481 276862 326722 462581 574004 588278 504461 368572
40667 368572 263963 293539 456391 548949 356620 -8391 -150984 115062 500912 624538
$$ packed form
40742H0610L257K61721K40073q3210k76284j06960J29524J17551k4204l8357M3521
40731C47242N2930J6432M9424J02748P6943L7898Q2236J27904O4767j8042K0434
40720I60916J15506J04560j2626j27358k26482l29545l27123j16980J70300L06691
40710E17859K71825K11053J51353k265k11426k88453j70780k0843k402r6204j72369
40699A87348j38949o376J13327R5402l2389p7920O4380K41275K48866J13906N453
40688H14323l4651p1746p2446L8487J53472P4825j49398k30295m4360J80419J78783
40677H37413k5038k07254k24640j03619M9860J35859J11423J4274q3817j35889
40667C68572j04609K9576J62852R2558j92329l65011j42593K66046L85850J23626
$$ plain form
40657 624538 487194 360192 345878 327966 281950 327412 454818 479542 344405 234833
40647 234833 291245 405304 417145 339436 255609 153864 19355 -32442 107628 340217
40637 340217 452168 378468 235909 127848 56415 25877 95900 287001 518774 688635
40627 688635 768186 802981 855338 954281 1066861 1121585 1093867 1052425 1075520 1138128 1139343
40616 1139343 1033874 878335 751600 689633 695205 742597 770152 745803 747368 880356 1087103
40605 1087103 1154650 988621 773318 742712 872684 949476 895017 840394 865937 862275 732618
40594 732618 574209 533470 594500 649133 689770 776427 865473 838915 694258 553284 475045
40583 475045 408719 353128 401781 566006 696622 675111 572932 526248 551074 584991 617319
$$ packed form
40657F24538j37344j27002j4314j7912m6016M5462J27406K4724j35137j09572
40647B34833N6412J14059J1841p7709q3827j01745j34509n1797J40070K32589
40637C40217J11951p3700j42559j08061p1433l0538P0023J91101K31773J69861
40627F88635P9551L4795N2357R8943J12580N4724k7718m1442K3095O2608J215
40616A139343j05469j55539j26735o1967N572M7392K7555k4349J565J32988K06747
40605A087103O7547j66029k15303l0606J29972P6792n4459n4623K5543l662j29657
40594G32618j58409m0739O1030N4633M0637Q6657Q9046k6558j44657j40974p8239
40583D75045o6326n5591M8653J64225J30616k1511j02179m6684K4826L3917L2328
$$ plain form
40572 617319 650697 606871 419345 184253 70073 80999 52505 -94517 -230370 -201767
40562 -201767 -27611 166018 317055 440220 531805 573592 611228 717946 860150 894298
40552 894298 750009 543007 426497 377318 239841 -15059 -194924 -117973 139783 327350
40542 327350 314152 206807 177170 264033 366889 370139 245756 74107 -24544 -9424 43840
40531 43840 64724 102394 237986 422951 525625 526764 530241 568072 555590 494128 551583
40520 551583 826998 1152274 1250059 1014758 557867 85119 -172327 -43201 393112 776118
40510 776118 796756 528628 296818 277481 382204 475295 500739 405907 156637 -118872
40500 -118872 -183827 21074 276022 349914 263030 197775 232073 256552 126624 -157637 -415339
$$ packed form
40572F17319L3378m3826j87526k35092j14180J0926k8494j47022j35853K8603
40562b01767J74156J93629J51037J23165R1585M1787L7636J06718J42204L4148
40552H94298j44289k07002j16510m9179j37477k54900j79865P6951K57756J87567
40542C27350j3198j07345k9637Q6863J02856L250j24383j71649r8651J5120N3264
40531D3840K0884L7670J35592J84965J02674J139L477L7831j2482o1462N7455
40520E51583K75415L25276R7785k35301m56891m72748k57446J29126M36313L83006
40510G76118K0638k68128k31810j9337J04723R3091K5444r4832k49270k75509
40500a18872o4955K04901K54948P3892q6884o5255L4298K4479j29928k84261k57702
$$ plain form
40489 -415339 -433003 -187412 104166 221466 196191 237152 432169 651640 749484 729025
40479 729025 681656 675125 734490 831813 869790 773380 608887 508392 485355 459201 446406
40468 446406 541421 691170 708001 575585 514130 622070 681002 502485 274279 318122
40458 318122 626529 894721 947643 886472 828914 746332 604276 471710 414048 404996 399364
40447 399364 390736 362415 283464 190842 185609 309632 495465 658386 768199 817419 794091
40436 794091 710649 606065 508796 436968 415507 441063 465309 477148 544358 674780 697891
40425 697891 438313 -2608 -295729 -249864 -5102 173448 175361 73501 -14373 -27472
40415 -27472 1464 -25425 -138572 -197238 -29208 309506 543048 483615 209521 -94526
$$ packed form
40489d15339j7664K45591K91578J17300k5275M0961J95017K19471R7844k0459
40479G29025m7369o531N9365R7323L7977r6410j64493j00495k3037k6154j2795
40468D46406R5015J49749J6831j32416o1455J07940N8932j78517k28206M3843
40458C18122L08407K68192N2922o1171n7558q2582j42056j32566n7662r052n632
40447C99364q628k8321p8951r2622n233J24023J85833J62921J09813M9220k3328
40436G94091q3442j04584r7269p1828k1461K5556K4246J1839O7210J30422K3111
40425F97891k59578m40921k93121M5865K44762J78550J913j01860q7874j3099
40415b7472K8936k6889j13147n8666J68030L38714K33542n9433k74094l04047
$$ plain form
40405 -94526 -315939 -369881 -166617 228779 542565 575609 456916 448552 569873 604531 450078
40394 450078 264226 237997 386918 615071 841596 986124 942697 681080 337890 127631
40384 127631 157510 350592 537558 608733 583327 539156 502727 461419 470964 632858 903493
40373 903493 1049785 928651 725067 740548 988354 1189079 1160279 1000216 846570 677462
40363 677462 460831 305261 301514 354898 342362 322580 413251 555538 600996 570460 608122
40352 608122 696659 646423 411671 215006 264500 492822 671106 670371 528667 361290 288758
40341 288758 368967 523045 600202 572551 575704 695440 824104 820734 711689 616879 560979
40330 560979 488646 405487 365961 357813 329970 313647 393670 576125 797512 1033411 1261281
$$ packed form
40405i4526k21413n3942K03264L95396L13786L3044j18693q364J21321L4658j54453
40394D50078j85852k6229J48921K28153K26525J44528m3427k61617l43190k10259
40384A27631K9879J93082J86966P1175k5406m4171l6429m1308R545J61894K70635
40373I03493J46292j21134k03584J5481K47806K00725k8800j60063j53646j69108
40363F77462k16631j55570l747N3384j2536j9782R0671J42287M5458l0536L7662
40352F08122Q8537n0236k34752j96665M9494K28322J78284p35j41704j67377p2532
40341B88758Q0209J54078P7157k7651L153J19736J28664l370j09045r4810n5900
40330E60979p2333q3159l9526q148k7843j6323Q0023J82455K21387K35899K27870
$$ plain form
40319 1261281 1344424 1135653 727455 423870 383656 432132 327283 95505 -25964 85713
40309 85713 300276 410176 356314 265230 302928 501375 731626 867065 939890 1058929
40299 1058929 1192417 1163194 901642 576324 386652 327229 266565 180546 174488 303796
40289 303796 490816 619147 625749 508188 323892 184638 181365 300330 445733 524752
40279 524752 479299 291803 31829 -147606 -144770 -12221 142347 299347 470569 564794
40269 564794 469842 259575 154669 238866 353284 323493 159871 -31761 -203108 -327414
40259 -327414 -326965 -169818 31039 147760 226619 416157 718489 942235 935987 773010 651904
40248 651904 672591 765525 817355 815878 851228 981541 1128857 1152745 1028388 888948 852935
$$ packed form
40319A261281Q3143k08771m08198l03585m0214M8476j04849k31778j21469J11677
40309H5713K14563J09900n3862r1084L7698J98447K30251J35439P2825J19039
40299A058929J33488k9223k61552l25318j89672n9423o0664q6019o058J29308
40289C03796J87020J28331O602j17561j84296j39254l273J18965J45403P9019
40279E24752m5453j87496k59974j79435K836J32549J54568J57000J71222R4225
40269E64794r4952k10267j04906Q4197J14418k9791j63622j91632j71347j24306
40259c27414M49J57147K00857J16721P8859J89538L02332K23746o248j62977j21106
40248F51904K0687R2934N1830j477L5350J30313J47316K3888j24357j39440l6013
$$ plain form
40237 852935 865217 775934 548469 320122 263497 437505 756529 1048393 1162969 1098295
40227 1098295 1018439 1081041 1252812 1365506 1335760 1223999 1076504 855495 590357 460735
40217 460735 600290 893639 1100117 1137178 1112639 1102784 1047630 892783 710386 619981 664676
40206 664676 804444 964427 1063995 1072705 1061956 1119717 1193337 1122151 865600 578846 396480
40195 396480 274089 151167 136083 354317 688968 865234 777297 565495 376639 222831
40185 222831 98375 57141 106887 168340 205976 269057 340075 291532 93871 -68605 -22217
40174 -22217 152228 232193 133871 -49569 -219454 -335093 -352527 -254622 -130371 -85912 -78865
40163 -78865 21282 197769 262540 123867 -49663 -26469 202673 430080 484090 393151
$$ packed form
40237H52935J2282q9283k27465k28347n6625J74008L19024K91864J14576o4674
40227A098295p9856O2602J71771J12694k9746j11761j47495k21009k65138j29622
40217D60735J39555K93349K06478L7061k4539r855n5154j54847j82397r0405M4695
40206F64676J39768J59983R9568Q710j0749N7761P3620p1186k56551k86754j82366
40195C96480j22391j22922j5084K18234L34651J76266q7937k11802j88856j53808
40185B22831j24456m1234M9746O1453L7636O3081P1018m8543j97661j62476M6388
40174b2217J74445P9965r8322j83440j69885j15639j7434R7905J24251M4459P047
40163g8865J00147J76487O4771j38673j73530K3194K29142K27407N4010r0939
$$ plain form
40153 393151 303720 303938 359085 390529 369682 313500 224235 99314 3945 51035 258798
40142 258798 494512 630356 699059 802267 906537 856826 605459 314437 174799 194130
40132 194130 224332 163899 73479 84586 219308 330201 249482 -9248 -256793 -354008 -348881
40121 -348881 -329032 -234192 51558 464681 780032 886571 906712 984630 1075329 1035099 840316
40110 840316 608079 430420 283812 111909 -65176 -150488 -56880 212987 553852 818411
40100 818411 912017 856494 769277 756339 802698 792837 677652 582702 662563 862960 960849
40089 960849 880728 821433 961205 1167804 1170415 946052 745862 751097 875364 927649 821473
40078 821473 588624 320488 144097 148535 293286 471523 659336 883187 1055391 1024098
$$ packed form
40153C93151q9431K18N5147L1444k0847n6182q9265j24921r5369M7090K07763
40142B58798K35714J35844O8703J03208J04270m9711k51367k91022j39638J9331
40132A94130L0202o0433r0420J1107J34722J10893q0719k58730k47545r7215N127
40121c48881J9849R4840K85750M13123L15351J06539K0141P7918R0699m0230j94783
40110H40316k32237j77659j46608j71903j77085q5312R3608K69867L40865K64559
40100H18411R3606n5523q7217j2938M6359r861j15185r4950P9861K00397R7889
40089I60849q0121n9295J39772K06599K611k24363k00190N235J24267N2285j06176
40078H21473k32849k68136j76391M438J44751J78237J87813K23851J72204l1293
$$ plain form
40068 1024098 827659 706840 767846 807453 611789 285355 109410 166700 288833 327028
40058 327028 292108 226147 106618 -59815 -158874 -66714 209674 531067 744570 788841
40048 788841 710156 602628 533603 512556 506947 471621 388997 317637 374680 607023 887834
40037 887834 1011537 900536 657586 417793 235108 129508 141318 271043 425485 495755
40027 495755 474628 458859 535576 673151 734608 639978 514127 568696 781671 840220 551538
40016 551538 180777 147223 457045 720844 725938 671599 762470 899261 946460 1017304 1243787
40005 1243787 1477510 1493536 1343210 1233928 1173284 1018385 812021 774760 958107 1161101
39995 1161101 1230975 1231436 1262199 1304403 1315249 1321879 1355882 1420366 1563199 1850563 2234050
$$ packed form
40068A024098j96439j20819O1006L9607j95664l26434j75945N7290J22133L8195
40058C27028l4920o5961j19529j66433r9059R2160K76388L21393K13503M4271
40048G88841p8685j07528o9025k1047n609l5326q2624p1360N7043K32343K80811
40037H87834J23703j11001k42950k39793j82685j05600J1810J29725J54442P0270
40027D95755k1127j5769P6717J37575O1457r4630j25851N4569K12975N8549k88682
40016E51538l70761l3554L09822K63799N094n4339R0871J36791M7199P0844K26483
40005A243787K33723J6026j50326j09282o0644j54899k06364l7261J83347K02994
39995A161101O9874M61L0763M2204J0846O630L4003O4484J42833K87364L83487
$$ plain form
39984 2234050 2602661 3026498 3759774 4846763 5849328 6175891 5674909 4744748 3842272
39975 3842272 3063088 2304317 1659582 1390538 1516362 1702836 1689507 1615251 1717662 1883962
39965 1883962 1796053 1443840 1163754 1147464 1229146 1239499 1260620 1384767 1497469 1489626 1453260
39954 1453260 1467893 1406985 1177425 961836 983418 1181865 1351438 1457131 1581574 1694789
39944 1694789 1721558 1721722 1762729 1722686 1467196 1128189 966025 1039653 1236067 1510737 1838912
39933 1838912 2032021 1894844 1518221 1166247 934655 764924 711198 904105 1283923 1628547
39923 1628547 1823813 1894968 1845174 1698823 1625153 1773478 2058631 2326171 2606811 2968140
39913 2968140 3271260 3354445 3302245 3250030 3118236 2860578 2746489 3015091 3470768 3822804
$$ packed form
39984B234050L68611M23837P33276J086989J002565L26563n00982r30161r02476
39975C842272p79184p58771o44735k69044J25824J86474j3329p4256J02411J66300
39965A883962q7909l52213k80086j6290Q1682J0353K1121J24147J12702p843l6366
39954A453260J4633o0908k29560k15589K1582J98447J69573J05693J24443J13215
39944A694789K6769J64M1007m0043k55490l39007j62164P3628J96414K74670L28175
39933A838912J93109j37177l76623l51974k31592j69731n3726J92907L79818L44624
39923A628547J95266P1155m9794j46351p3670J48325K85153K67540K80640L61329
39913B968140L03120Q3185n2200n2215j31794k57658j14089K68602M55677L52036
$$ plain form
39903 3822804 4167297 4682900 5159493 5386412 5703613 6516478 7542430 8263691 8872074
39894 8872074 9986023 11711202 13867709 16834998 21067409 25941214 30231809 33615859
39886 33615859 36602663 39431835 42649286 48399875 59200693 76046954 100656571 138690521
39878 138690521 194419436 258370480 305083131 310734759 274304126 217870714 166063270
39871 166063270 128782445 103039085 84316579 71276422 62857578 56722870 51274954
39864 51274954 46388815 41777066 36641885 31151816 26516730 23244108 20626313 18140486
39856 18140486 16105017 14692180 13428391 12047573 10920004 10264506 9700046 8924289
39848 8924289 8185375 7751505 7450304 7018862 6463776 5862982 5224097 4697184 4515097
$$ packed form
39903C822804L44493N15603M76593K26919L17201Q12865J025952P21261O08383
39894H872074J113949J725179K156507K967289M232411M873805M290595L384050
39886C3615859K986804K829172L217451N750589J0800818J6846261K4609617L8033950
39878A38690521N5728915O3951044M6712651N651628l6430633n6433412n1807444
39871A66063270l7280825k5743360j8722506j3040157q418844o134708n447916
39864E1274954m886139m611749n135181n490069m635086l272622k617795k485827
39856A8140486k035469j412837j263789j380818j127569o55498n64460p75757
39848H924289p38914m33870l01201m31442n55086o00794o38885n26913j82087
$$ plain form
39839 4515097 4575357 4474339 4088975 3746103 3694386 3778125 3749118 3539892 3123331 2478288
39829 2478288 1826225 1541200 1671843 1871316 1921691 1981268 2168271 2266797 2068186 1704122
39819 1704122 1407704 1194666 1007609 946187 1098794 1304231 1318350 1129744 945474 947594
39809 947594 1176781 1542583 1837346 1857946 1624126 1371989 1254289 1186278 1074017 1017793
39799 1017793 1131049 1289535 1253450 989951 719382 650543 778392 943365 1008604 959652
39789 959652 872012 815565 815666 901867 1118462 1430777 1698133 1833253 1916224 2031540 2073410
39778 2073410 1888433 1568778 1402987 1533500 1861241 2314678 2990602 3917022 4828007
39769 4828007 5305850 5100549 4290951 3238010 2398219 2037161 2046075 2109451 2058019 1948410
$$ packed form
39839D515097O0260j01018l85364l42872n1717Q3739k9007k09226m16561o45043
39829B478288o52063k85025J30643J99473N0375N9577J87003R8526j98611l64064
39819A704122k96418k13038j87057o1422J52607K05437J4119j88606j84270K120
39809I47594K29187L65802K94763K0600k33820k52137j17700o8011j12261n6224
39799A017793J13256J58486l6085k63499k70569o8839J27849J64973O5239m8952
39789I59652q7640n6447J01Q6201K16595L12315K67356J35120Q2971J15316M1870
39778B073410j84977l19655j65791J30513L27741M53437O75924R26420R10985
39769D828007M77843k05301q09598j052941q39791l61058Q914O3376n1432j09609
$$ plain form
39759 1948410 1821852 1587919 1216015 867017 718918 770947 908487 1060135 1205289 1312750
39749 1312750 1351963 1311428 1179983 989907 875625 953330 1117344 1112354 864428 586174
39739 586174 479282 489077 454298 355394 290931 322952 462420 700364 939324 1007061 873041
39728 873041 755927 871888 1146355 1309496 1214927 936505 619087 381998 319611 432756
39718 432756 566444 555508 435778 384586 447425 464756 317684 126878 117930 346843 643743
39707 643743 816424 840452 820293 809420 748251 602785 481116 518712 687163 836263
39697 836263 921377 1049890 1263156 1415232 1358354 1139837 911677 734664 583618 465143
39687 465143 394876 310651 151426 -3002 -16518 78678 92272 -47304 -166051 -87280 99737
$$ packed form
39759A948410j26558k33933l71904l48998j48099N2029J37540J51648J45154J07461
39749A312750L9213m0535j31445j90076j14282P7705J64014m990k47926k78254
39739E86174j06892R795l4779r8904o4463L2021J39468K37944K38960O7737j34020
39728H73041j17114J15961K74467J63141r4569k78422l17418k37089o2387J13145
39718D32756J33688j0936j19730n1192O2839J7331j47072j90806q948K28913K96900
39707F43743J72681K4028k0159j0873o1169j45466j21669L7596J68451J49100
39697H36263Q5114J28513K13266J52076n6878k18517k28160j77013j51046j18475
39687D65143p0267q4225j59225j54428j3516R5196J3594j39576j18747P8771J87017
$$ plain form
39676 99737 152151 28877 -13807 248345 675976 894565 746975 477346 393631 475034
39666 475034 469835 313149 225479 351729 512043 458578 247252 161308 305268 460427
39656 460427 383471 108213 -139238 -243980 -300891 -412291 -501999 -420866 -195329 -43750
39646 -43750 -98877 -215607 -150032 133053 438489 580410 524310 328469 92891 -38403
39636 -38403 19668 162660 209407 162205 190767 330104 400304 309707 223093 279918 336027
39625 336027 192001 -57250 -137369 7665 161036 166635 117398 177895 372061 598871
39615 598871 761401 840892 890198 946815 928228 696891 299752 25359 81716 313085
39605 313085 415699 359630 372770 534271 644989 566577 459219 544107 777435 909117
$$ packed form
39676I9737N2414j23274m2684K62152M27631K18589j47590k69629q3715Q1403
39666D75034n199j56686q7670J26250J60314n3465k11326q5944J43960J55159
39656D60427p6956k75258k47451j04742n6911j11400q9708Q1133K25537J51579
39646d3750n5127j16730O5575K83085L05436J41921n6100j95841k35578j31294
39636c8403N8071J42992M6747m7202K8562J39337P0200r0597q6614N6825N6109
39625C36027j44026k49251q0119J45034J53371N599m9237O0497J94166K26810
39615E98871J62530P9491M9306N6617j8587k31337l97139k74393N6357K31369
39605C13085J02614n6069J3140J61501J10718p8412j07358Q4888K33328J31682
$$ plain form
39595 909117 794428 538162 366118 415844 616323 738726 609821 290254 -7710 -158165
39585 -158165 -182913 -101787 115701 406152 582125 550652 447123 438229 485598 437310 291727
39574 291727 219539 324346 502316 574357 481598 313556 195485 192171 296314 453347
39564 453347 569249 529460 290522 -11684 -117809 99527 459811 645083 540517 315907
39554 315907 176873 158532 198071 280846 422788 587124 712833 784054 802728 736983 568283
39543 568283 358153 203493 145657 165882 231968 300328 318587 293217 318864 464230 646408
39532 646408 695016 548140 330945 227795 304588 453269 490820 334779 109269 48576
39522 48576 256756 584903 778887 718320 479291 215429 39280 -23034 -41407 -126512
$$ packed form
39595I09117j14689k56266j72044M9726K00479J22403j28905l19567k97964j50455
39585a58165k4748Q1126K17488K90451J75973l1473j03529q894M7369m8288j45583
39574B91727p2188J04807J77970P2041r2759j68042j18071l314J04143J57033
39564D53347J15902l9789k38938l02206j06125K17336L60284J85272j04566k24610
39554C15907j39034j8341L9539Q2775J41942J64336J25709P1221J8674o5745j68700
39543E68283k10130j54660n7836K0225O6086O8360J8259k5370K5647J45366J82178
39532F46408M8608j46876k17195j03150P6793J48681L7551j56041k25510o0693
39522D8576K08180L28147J93984o0567k39029k63862j76149o2314j8373q5105
$$ plain form
39512 -126512 -293352 -403844 -324276 -112002 55562 118984 173947 259021 260703 106712 -73870
39501 -73870 -100881 27024 169868 251530 301177 336304 350738 404164 565692 745289 741986
39490 741986 528585 345620 407137 626911 761038 727259 631853 549340 462929 411998 501566
39479 501566 703445 805300 660010 386250 224184 263834 407347 540017 633268 696958
39469 696958 717176 660207 512201 322935 207767 250549 391582 490621 529304 642892
39459 642892 881224 1057040 966600 687437 498239 528503 642930 677781 633483 583615
39449 583615 531861 451443 379853 379239 446044 532443 624189 726669 788768 714692 484006
39438 484006 230441 153188 319610 570050 669000 567297 458664 535545 748118 879547
$$ packed form
39512a26512j66840j10492P9568K12274J67564O3422N4963Q5074J682j53991j80582
39501g3870k7011J27905J42844Q1662M9647L5127J4434N3426J61528J79597l303
39490G41986k13401j82965O1517K19774J34127l3779r5406q2513q6411n0931Q9568
39479E01566K01879J01855j45290k73760j62066L9650J43513J32670R3251O3690
39469F96958K0218n6969j48006j89266j15168M2782J41033R9039L8683J13588
39459F42892K38332J75816r0440k79163j89198L0264J14427L4851m4298m9868
39449E83615n1754q0418p1590o14O6805Q6399R1746J02480O2099p4076k30686
39438D84006k53565p7253J66422K50440R8950j01703j08633P6881K12573J31429
$$ plain form
39428 879547 819440 667768 579828 606625 704118 810727 874014 861163 789793 723321 716227
39417 716227 780706 895168 1005209 1029151 919093 721606 538270 433445 416216 478987
39407 478987 587054 655036 616763 515424 454128 464719 493003 493550 459224 383055 289774
39396 289774 281706 431934 637322 709772 628108 566190 640977 764581 789937 678101 474648
39385 474648 249090 111618 154095 304032 368800 298961 264023 376866 507202 507179 467656
39374 467656 558075 720420 743405 591626 440256 380577 304147 145436 66557 273095
39364 273095 717939 1097075 1145587 896112 622668 527410 520498 371147 49127 -214134
39354 -214134 -240258 -129053 -70384 -73341 -38504 12446 -15856 -67332 28348 284036 506620
$$ packed form
39428H79547o0107j51672q7940K6797R7493J06609O3287j2851p1370o6472p094
39417G16227O4479J14462J10041K3942j10058j97487j83336j04825j7229O2771
39407D78987J08067O7982l8273j01339o1296J0591K8284N47l4326p6169r3281
39396B89774q068J50228K05388P2450q1664o1918P4787J23604K5356j11836k03453
39385D74648k25558j37472M2477J49937O4768o9839l4938J12843J30336k3l9523
39374D67656R0419J62345K2985j51779j51370n9679p6430j58711p8879K06538
39364B73095M44844L79136M8512k49475k73444r5258o912j49351l22020k63261
39354b14134k6124J11205N8669k957L4837N0950k8302n1476R5680K55688K22584
$$ plain form
39343 506620 555096 487499 411152 341133 264796 208074 171399 122007 110774 266913 596331
39332 596331 907084 1034435 1037131 1063352 1114161 1067683 879961 637336 440369 342861 378139
39321 378139 532524 696505 744540 679005 618052 633364 676449 673690 609358 490628 318580
39310 318580 145611 87978 203908 396101 505992 485083 413168 374391 395228 488597 650043
39299 650043 784827 751803 550710 374115 375005 452784 389608 152654 -75247 -143671 -66335
39288 -66335 90642 282869 418642 399822 312891 402828 732535 1029045 1029794 835514 709583
39277 709583 646415 418714 22457 -229484 -142374 81070 148027 84660 150968 441251
39267 441251 754243 848722 695841 459014 311718 308520 392775 498421 632231 836298
$$ packed form
39343E06620M8476o7597p6347p0019p6337n6722l6675m9392j1233J56139L29418
39332E96331L10753J27351K696K6221N0809m6478j87722k42625j96967r7508L5278
39321C78139J54385J63981M8035o5535o0953J5312M3085k759o4332j18730j72048
39310C18580j72969n7633J15930J92193J09891k0909p1915l8777K0837R3369J61446
39299F50043J34784l3024k01093j76595Q90P7779o3176k36954k27901o8424P7336
39288f6335J56977J92227J35773j8820q6931Q9937L29707K96510P49j94280j25931
39277G09583o3168k27701l96257k51941Q7110K23444O6957o3367O6308K90283
39267D41251L12992R4479j52881k36827j47296l198Q4255J05646J33810K04067
$$ plain form
39257 836298 1080285 1251736 1283157 1236384 1210691 1204526 1135957 994263 898853 960883 1113245
39246 1113245 1142267 917937 551332 265128 128435 9026 -190846 -353576 -283969 25404
39236 25404 353930 463082 296249 4777 -169064 -77651 196243 421494 481901 489052
39226 489052 569805 648957 575772 385586 263050 278349 328916 326518 265983 112386 -178317
39215 -178317 -487001 -579097 -406252 -191612 -126535 -147034 -116962 -63948 -77728 -101721 -6081
39204 -6081 198317 377005 465213 511111 554363 583389 597861 604009 551410 372044 97327
39193 97327 -130966 -184876 -57614 140697 271211 277248 227428 216587 228963 174914 68988
39182 68988 54388 194364 351865 372517 307165 345668 571739 866793 1025172 910450
$$ packed form
39257H36298K43987J71451L1421m6773k5693o165o8569j41694r5410O2030J52362
39246A113245K9022k24330l66605k86204j36693j19409j99872j62730O9607L09373
39236B5404L28526J09152j66833k91472j73841R1413K73894K25251O0407P151
39226D89052Q0753P9152p3185j90186j22536J5299N0567k398o0535j53597k90703
39215a78317l08684r2096J72845K14640O5077k0499L0072N3014j3780k3993R5640
39204f081K04398J78688Q8208M5898M3252K9026J4472O148n2599j79366k74717
39193I7327k28293n3910J27262J98311J30514O037m9820j0841J2376n4049j05926
39182F8988j4600J39976J57501K0652o5352L8503K26071K95054J58379j14722
$$ plain form
39172 910450 551573 145993 -79966 -63187 85538 262114 448814 593889 579359 400095
39162 400095 222171 146315 66976 -90755 -165797 -5416 221432 220160 10392 -105528
39152 -105528 693 132812 117658 43469 48769 84611 28977 -98724 -167160 -95237 100019
39141 100019 343514 528912 579257 530518 490891 494663 473937 386116 277973 216778 255612
39130 255612 452229 783682 1042324 987561 644541 297977 149061 148710 213446 381570
39120 381570 635460 781723 693143 511941 417004 328572 75081 -247080 -346144 -141310
39110 -141310 150100 346337 485367 619958 661808 560054 463815 542601 741735 867751
39100 867751 859972 833347 873006 924558 913660 865521 845956 845140 784801 624537 423306 302605
$$ packed form
39172I10450l58877m05580k25959J6779J48725J76576J86700J45075j4530j79264
39162D00095j77924p5856p9339j57731p5042J60381K26848j272k09768j15920
39152a05528J06221J32119j5154p4189N300L5842n5634j27701o8436P1923J95256
39141A00019K43495J85398N0345m8739l9627L772k0726q7821j08143o1195L8834
39130B55612J96617L31453K58642n4763l43020l46564j48916l51O4736J68124
39120C81570K53890J46263q8580j81202r4937q8432k53491l22161r9064K04834
39110a41310K91410J96237J39030J34591M1850j01754r6239P8786J99134J26016
39100H67751p779k6625L9659N1552j0898m8139j9565q16o0339j60264k01231j20701
$$ plain form
39088 302605 364132 615445 939840 1156621 1162365 1025879 914581 921624 996380 1043732 1037594
39077 1037594 1010858 981300 930234 827940 650184 401751 152570 10380 22603 143799
39067 143799 319493 526701 692578 686193 493683 305066 286800 344589 283428 144719
39057 144719 164192 395550 613077 651687 619434 660028 709438 650682 548769 542121 610078
39046 610078 632947 601063 583382 557048 462695 389150 499174 766914 973879 995277 926512
39035 926512 887503 865749 824211 821126 917854 1055721 1114199 1034524 828971 538115 243777
39024 243777 59484 31387 86542 136733 189118 289280 397470 415497 344615 340880 562080
39013 562080 975334 1354256 1481900 1343962 1109029 943019 886598 895874 913008 864404
$$ packed form
39088C02605O1527K51313L24395K16781N744j36486j11298P043P4756M7352o138
39077A037594k6736k9558n1066j02294j77756k48433k49181j42190J2223J21196
39067A43799J75694K07208J65877o385j92510j88617j8266N7789o1161j38709
39057A44719J9473K31358K17527L8610l2253M0594M9410n8756j01913o648O7957
39046F10078K2869l1884j7681k6334r4353p3545J10024K67740K06965K1398o8765
39035I26512l9009k1754m1538l085R6728J37867N8478p9675k05553k90856k94338
39024B43777j84293k8097N5155N0191N2385J00162J08190J8027p0882l735K21200
39013E62080M13254L78922J27644j37938k34933j66010n6421R276J7134m8604
$$ plain form
39003 864404 684787 418823 218656 145069 55519 -171981 -378206 -287599 77537 372458
38993 372458 377769 255041 242837 308159 289456 223231 273323 404177 386433 147599 -101308
38982 -101308 -149423 -18193 162099 340894 505459 587039 546167 470957 466181 499844 471775
38971 471775 385979 335369 344311 351145 349622 434264 669606 982224 1204504 1186695 894550
38960 894550 472684 177254 130539 157209 7355 -252722 -266588 111451 539501 594590
38950 594590 322200 142132 259393 436524 403071 240629 199933 299060 321954 172225
38940 172225 26992 84348 288889 410674 350461 262030 338376 543294 649474 552065
38930 552065 432206 506907 684934 642811 270395 -129445 -197116 48369 283730 321544
$$ packed form
39003H64404j79617k65964k00167p3587q9550k27500k06225R0607L65136K94921
38993C72458N311j22728j2204O5322j8703o6225N0092J30854j7744k38834k48907
38982a01308m8115J31230J80292J78795J64565Q1580m0872p5210m776L3663k8069
38971D71775q5796n0610Q942O834j523Q4642K35342L12618K22280j7809k92145
38960H94550m21866k95430m6715K6670j49854k60077j3866L78039M28050N5089
38950E94590k72390j80068J17261J77131l3453j62442m0696R9127K2894j49729
38940A72225j45233N7356K04541J21785o0213q8431P6346K04918J06180r7409
38930E52065j19859P4701J78027m2123l72416l99840o7671K45485K35361L7814
$$ plain form
38920 321544 290362 372608 550079 697905 800736 947637 1171006 1402621 1560254 1578685
38910 1578685 1381301 947753 429809 76218 -23254 -23653 -77401 -102424 69673 382825
38900 382825 581865 560538 496271 557646 644185 561030 340835 218010 327922 584755
38890 584755 832823 970553 938460 747497 541421 478123 504970 393702 59571 -283714
38880 -283714 -362152 -126308 263853 616132 789887 735383 568830 509810 625435 725665
38870 725665 634035 465584 477373 709313 951236 1043009 1032718 1022807 1019074 983129 911971
38859 911971 802589 624419 385729 168928 54281 45808 96279 170069 261119 363756
38849 363756 426888 350463 90613 -214694 -327104 -185593 -444 36491 26329 183569
$$ packed form
38920C21544l1182Q2246J77471J47826J02831J46901K23369K31615J57633J8431
38910A578685j97384m33548n17944l53591r9472l99n3748k5023J72097L13152
38900C82825J99040k1327o4267O1375Q6539q3155k20195j22825J09912K56833
38890E84755K48068J37730l2093j90963k06076o3298K6847j11268l34131l43285
38880b83714p8438K35844L90161L52279J73755n4504j66553n9020J15625J00230
38870G25665r1630j68451J1789K31940K41923R1773j0291r911l733l5945p1158
38859I11971j09382j78170k38690k16801j14647q473N0471P3790R1050J02637
38849C63756O3132p6425k59850l05307j12410J41511J85149L6935j0162J57240
$$ plain form
38839 183569 465100 600795 484607 307121 243731 219148 92244 -87850 -153854 -52602
38829 -52602 123650 286690 435893 620668 873710 1145046 1280769 1142244 783255 430180
38819 430180 249211 220790 277826 440857 723345 999755 1089631 942468 668294 420257
38809 420257 291305 269206 248427 149367 56080 141963 418629 679930 762796 728335 688047
38798 688047 606038 434500 315119 428300 701291 878296 860934 777662 717700 616226
38788 616226 456773 380200 477859 624638 647986 567194 541425 637688 760105 786041 692262
38777 692262 553886 464912 446590 412920 265468 49114 -40134 142306 504731 784693
38767 784693 795888 592972 408114 436768 666260 906199 997218 966319 941935 959701 939931
$$ packed form
38839A83569K81531J35695j16188j77486o3390k4583j26904j80094o6004J01252
38829e2602J76252J63040J49203J84775K53042K71336J35723j38525l58989l53075
38819D30180j80969k8421N7036J63031K82488K76410Q9876j47163k74174k48037
38809D20257j28952k2099k0779r9060r3287Q5883K76666K61301Q2866l4461m0288
38798F88047q2009j71538j19381J13181K72991J77005j7362q3272n9962j01474
38788F16226j59453p6573R7659J46779K3348q0792k5769R6263J22417K5936r3779
38777F92262j38376q8974j8322l3670j47452k16354q9248J82440L62425K79962
38767G84693J1195k02916j84858K8654K29492K39939R1019l0899k4384J7766j9770
$$ plain form
38756 939931 840211 713973 595238 447105 282754 219707 318024 459852 506098 493629
38746 493629 535356 583636 475346 214555 26324 66781 233024 351125 412619 490155
38736 490155 527892 403276 172929 80825 275318 630943 894533 916917 708032 374377
38726 374377 77247 -30359 74865 252638 339323 285085 118978 -135782 -423208 -601672
38716 -601672 -559626 -369740 -213430 -146543 -44530 202498 542981 848198 1052895 1160009
38706 1160009 1176686 1109395 986837 843654 698833 557593 401642 192322 -50860 -188843
38696 -188843 -82118 210988 463502 547849 564750 646084 752767 776459 743482 772526 875712
38685 875712 945218 931214 903843 913790 898472 779466 589175 448601 444098 551443 665885
$$ packed form
38756I39931r9720j26238j18735j48133j64351o3047R8317J41828M6246j2469
38746D93629M1727M8280j08290k60791j88231M0457J66243J18101O1494P7536
38736D90155L7737j24616k30347r2104J94493L55625K63590K2384k08885l33655
38726C74377k97130j07606J05224J77773Q6685n4238j66107k54760k87426j78464
38716f01672M2046J89886J56310O6887J02013K47028L40483L05217K04697J07114
38706A160009J6677o7291j22558j43183j44821j41240j55951k09320k43182j37983
38696a88843J06725K93106K52514Q4347J6901Q1334J06683K3692l2977K9044J03186
38685H75712O9506j4004k7371R947j5318j19006j90291j40574m503J07345J14442
$$ plain form
38674 665885 695605 633242 536111 444933 354949 269272 225316 240286 282697 335152 432655
38663 432655 592758 759857 873720 946501 1015738 1069495 1080718 1069259 1061820 1031959 946955
38652 946955 832696 727755 623341 518636 475094 528487 603913 613623 582014 571408 554672
38641 554672 493049 468227 560024 636062 480106 148203 -24796 139910 409515 444932
38631 444932 222616 6815 -6422 132104 255718 253613 117093 -72785 -176750 -92764
38621 -92764 134959 332265 355419 233678 133744 178725 329848 474308 588063 724854
38611 724854 855828 856230 706282 567399 556443 577340 519409 486785 622186 806135 795507
38600 795507 615926 524280 571897 524591 301303 163998 288617 431829 287905 -22588
$$ packed form
38674F65885K9720o2363r7131r1178q9984q5677m3956J4970M2411N2455R7503
38663D32655J60103J67099J13863P2781O9237N3757J1223j1459p439k9861q5004
38652I46955j14259j04941j04414j04705m3542N3393P5426R710l1609j0606j6736
38641E54672o1623k4822R1797P6038j55956l31903j72999J64706K69605L5417
38631D44932k22316k15801j3237J38526J23614k105j36520j89878j03965Q3986
38621i2764K27723J97306K3154j21741r9934M4981J51123J44460J13755J36791
38611G24854J30974M02j49948j38883j0956K0897n7931l2624J35401J83949j0628
38600G95507j79581r1646M7617m7306k23288j37305J24619J43212j43924l10493
$$ plain form
38590 -22588 -114067 130242 471865 705819 849826 932141 858753 601315 344687 308118
38580 308118 481013 625542 530942 232610 -22577 -34081 136202 245787 161152 -18609
38570 -18609 -139802 -172057 -145765 -40589 145585 304157 322104 234603 170592 193164 279882
38559 279882 399761 518447 590148 630665 720978 850302 860039 663391 414878 315018 344454
38548 344454 358034 347521 409529 519862 560357 539076 567293 632263 615976 545619 590855
38537 590855 769148 883410 833651 780251 880440 1033661 1024216 798170 480571 207887
38527 207887 40975 -27274 -53619 -80768 -62615 72081 276753 417787 454332 452257 410236
38516 410236 247512 12103 -89220 31904 198268 207161 74492 -69909 -177318 -230545
$$ packed form
38590b2588r1479K44309L41623K33954J44007Q2315p3388k57438k56628l6569
38580C08118J72895J44529r4600k98332k55187j1504J70283J09585q4635j79761
38570a8609j21193l2255K6292J05176J86174J58572J7947q7501o4011K2572Q6718
38559B79882J19879J18686P1701M0517R0313J29324R737j96648k48513r9860K9436
38548C44454J3580j0513O2008J10333M0495k1281K8217O4970j6287p0357M5236
38537E90855J78293J14262m9759n3400J00189J53221r445k26046l17599k72684
38527B07887j66912o8249k6345k7149J8153J34696K04672J41034L6545k075m2021
38516D10236j62724k35409j01323J21124J66364Q893j32669j44401j07409n3227
$$ plain form
38506 -230545 -143351 107689 342087 353025 188441 100641 231079 465067 584465 468591
38496 468591 171265 -108175 -155344 73369 410756 670285 821889 926751 992367 993283
38486 993283 961402 937226 879172 734196 563672 492014 551400 666087 763699 817993 812257
38475 812257 748623 676315 640820 625207 591196 537046 468802 373961 271812 214310 189705
38464 189705 129783 75338 196758 539625 882139 988080 885720 745191 609002 438162
38454 438162 307661 313030 350832 243585 50624 6585 164569 353137 486576 642143
38444 642143 798890 800046 664688 642824 816961 923082 761581 541850 571867 794722
38434 794722 914162 857003 813922 869520 881455 759401 621976 590608 604421 545867 432527
$$ packed form
38506b30545Q7194K51040K34398J0938j64584q7800J30438K33988J19398j15874
38496D68591k97326k79440m7169K28713L37387K59529J51604J04862O5616R16
38486I93283l1881k4176n8054j44976j70524p1658N9386J14687R7612N4294n736
38475H12257o3634p2308l5495j5613l4011n4150o8244r4841j02149n7502k4605
38464A89705n9922n4445J21420L42867L42514J05941j02360j40529j36189j70840
38454D38162j30501N369L7802j07247j92961m4039J57984J88568J33439J55567
38444F42143J56747J156j35358k1864J74137J06121j61501k19731L0017K22855
38434G94722J19440n7159m3081N5598J1935j22054j37425l1368J3813n8554j13340
$$ plain form
38423 432527 374905 403588 429540 363894 225074 119509 133040 251968 396148 510227
38413 510227 583804 594729 507911 358365 267474 326432 501930 682787 768870 701181 490613
38402 490613 257802 156600 202961 264028 266455 300699 436375 562017 542553 434507 384921
38391 384921 393644 357027 295680 330611 436931 434366 271810 131848 173007 333595 486548
38380 486548 629798 791142 876944 783392 581798 433256 369955 320999 315337 461790 704345
38369 704345 798490 633399 423017 427777 587749 614649 413749 221254 281439 552067
38359 552067 817727 959214 985587 908739 759214 674882 779907 959924 937321 631460
38349 631460 286073 148365 169366 155257 92051 135439 334540 557897 701754 802918
$$ packed form
38423D32527n7622K8683K5952o5646j38820j05565J3531J18928J44180J14079
38413E10227P3577J0925q6818j49546r0891N8958J75498J80857Q6083o7689k10568
38402D90613k32811j01202M6361O1067K427L4244J35676J25642j9464j08046m9586
38391C84921Q723l6617o1347L4931J06320k565j62556j39962M1159J60588J52953
38380D86548J43250J61344Q5802r3552k01594j48542o3301m8956n662J46453K42555
38369G04345R4145j65091k10382M760J59972K6900k00900j92495O0185K70628
38359E52067K65660J41487K6373p6848j49525q4332J05025J80017k2603l05861
38349F31460l45387j37708K1001j4109o3206M3388J99101K23357J43857J01164
$$ plain form
38339 802918 894870 894874 730255 496082 386184 483569 677388 790108 763251 709012 766416
38328 766416 907588 941809 757466 497822 399811 493120 586056 551299 476544 472390 473081
38317 473081 355380 171847 110461 231875 383480 415863 380475 432471 593512 712532
38307 712532 670782 541479 485921 533264 547295 418496 210458 75359 86783 211328
38297 211328 385370 535669 566099 436573 258501 211518 341068 522841 650329 760143
38287 760143 924008 1113593 1255218 1348298 1429865 1463362 1374052 1192284 1057386 1046217
38277 1046217 1079652 1052621 989148 979979 998483 902360 661941 473394 525095 707990 717010
38266 717010 448043 124021 -33625 -72465 -115006 -80890 161586 479410 608237 584012
$$ packed form
38339H02918R1952Mj64619k34173j09898R7385J93819J12720k6857n4239N7404
38328G66416J41172L4221j84343k59644r8011R3309R2936l4757p4755m154O91
38317D73081j17701j83533o1386J21414J51605L2383l5388N1996J61041J19020
38307G12532m1750j29303n5558M7343J4031j28799k08038j35099J1424J24545
38297B11328J74042J50299L0430j29526j78072m6983J29550J81773J27488J09814
38287G60143J63865J89585J41625R3080Q1567L3497q9310j81768j34898j1169
38277A046217L3435k7031o3473r169J8504r6123k40419j88547N1701J82895R020
38266G17010k68967l24022j57646l8840m2541L4116K42476L17824J28827k4225
$$ plain form
38256 584012 724146 1101140 1344613 1145396 703551 431771 397995 350701 194432 125357
38246 125357 282356 527316 656209 650356 628062 662478 717857 696659 529246 286430 180471
38235 180471 342567 614256 693593 491857 207237 37718 -15856 -21645 35709 186781
38225 186781 380895 548297 662706 681817 549626 341357 278138 477067 776618 921313
38215 921313 837595 621356 350547 55928 -184833 -277992 -221705 -73664 149642 425028
38205 425028 626734 633073 511316 437074 420569 279462 -63334 -404423 -477794 -251075
38195 -251075 88534 372672 575625 733416 837473 837994 726224 596463 607186 846693
38185 846693 1234815 1587825 1778582 1803434 1715795 1562283 1389779 1248237 1155231 1086855
$$ packed form
38256E84012J40134L76994K43473j99217m41845k71780l3776m7294j56269o9075
38246A25357J56999K44960J28893n853k2294L4416N5379k1198j67413k42816j05959
38235A80471J62096K71689P9337k01736k84620j69519n3574n789N7354J51072
38225A86781J94114J67402J14409J9111j32191k08269o3219J98929K99551J44695
38215I21313q3718k16239k70809k94619k40761r3159N6287J48041K23306K75386
38205D25028K01706O339j21757p4242j6505j41107l42796l41089p3371K26719
38195b51075L39609K84138K02953J57791J04057N21j11770j29761J0723K39507
38185H46693L88122L53010J90757K4852q7639j53512j72504j41542r3006o8376
$$ plain form
38175 1086855 1004227 858611 605847 292484 102941 208121 547843 862893 969226 904019
38165 904019 785861 670970 605918 665556 813806 849097 646520 372078 287074 397500
38155 397500 486664 467443 481893 615314 733196 714359 667381 752057 900127 894236 675978
38144 675978 412586 268650 254803 310859 397671 462301 435141 341637 335059 528653 838129
38133 838129 1068852 1132359 1098120 1039612 919451 675822 378633 226530 355112 666147
38123 666147 892915 864469 682101 588741 673669 774656 696217 452984 231971 160153
38113 160153 196960 244316 267114 275238 264865 238533 242280 318238 427512 467671 377366 202454
38101 202454 55322 21368 100544 221808 305926 316556 259693 157438 43363 -33418 -36465
$$ packed form
38175A086855q2628j45616k52764l13363j89543J05180L39722L15050J06333o5207
38165I04019j18158j14891o5052N9638J48250L5291k02577k74442q5004J10426
38155C97500Q9164j9221J4450J33421J17882j8837m6978Q4676J48070n891k18258
38144F75978k63392j43936j3847N6056Q6812O4630k7160r3504o578J93594L09476
38133H38129K30723O3507l4239n8508j20161k43629k97189j52103J28582L11035
38123F66147K26768k8446j82368r3360Q4928J00987p8439k43233k21013p1818
38113A60153L6807M7356K2798Q124j0373k6332L747P5958J09274M0159r0305j74912
38101B02454j47132l3954P9176J21264Q4118J0630n6863j02255j14075p6781l047
$$ plain form
38090 -36465 28741 146972 340782 627034 925974 1094045 1080117 972946 847164 657303
38080 657303 382700 194584 309798 671566 935544 849211 535820 306812 276047 289076
38070 289076 203269 88798 95819 221748 314765 287655 234538 301232 495996 680517 718595
38059 718595 577352 305196 -3202 -206587 -183051 31696 235242 271174 206866 207866
38049 207866 275548 239222 17687 -242193 -343509 -254368 -73813 128788 337489 501744
38039 501744 543907 473778 423059 524897 774808 1022171 1097870 964638 752230 631727
38029 631727 655666 745388 819086 867044 890536 852827 749412 664724 679966 754435 771753
38018 771753 691148 588220 549409 583654 641583 669055 626278 493311 285042 58242 -101193
$$ packed form
38090c6465O5206J18231J93810K86252K98940J68071j3928j07171j25782j89861
38080F57303k74603j88116J15214L61768K63978q6333l13391k29008l0765J3029
38070B89076q5807j14471P021J25929R3017k7110n3117O6694J94764J84521L8078
38059G18595j41243k72156l08398k03385K3536K14747K03546L5932o4308J000
38049B07866O7682l6326k21535k59880j01316Q9141J80555K02601K08701J64255
38039E01744M2163p0129n0719J01838K49911K47363P5699j33232k12408j20503
38029F31727K3939Q9722P3698M7958K3492l7709j03415q4688J5242P4469J7318
38018G71753q0605j02928l8811L4245N7929K7472m2777j32967k08269k26800j59435
$$ plain form
38007 -101193 -112995 38729 268071 442826 498356 470822 417378 361628 334252 387319 512065
37996 512065 601640 558291 396936 203487 58683 49790 251273 587088 797081 682614
37986 682614 347315 69521 -20796 -445 62062 194769 389609 558988 665158 744206
37976 744206 773252 683604 552806 590684 835570 1042496 1009550 859576 827848 895172 839470
37965 839470 592836 343773 279475 382005 505042 540627 488564 437939 478876 577570 586335
37954 586335 452991 340156 410590 570392 602464 510312 507804 647684 695221 473944 145272
37943 145272 -3116 92511 293000 514293 766758 983190 1013150 829627 596586 468549
37933 468549 427619 386859 363716 444401 609492 706621 634996 495622 491732 683141 894789
$$ packed form
38007a01193j1802J51724K29342J74755N5530k7534n3444n5750k7376N3067J24746
37996E12065Q9575m3349j61355j93449j44804q893K01483L35815K09993j14467
37986F82614l35299k77794r0317K0351O2507J32707J94840J69379J06170P9048
37976G44206K9046q9648j30798L7878K44886K06926l2946j49974l1728O7324n5702
37965H39470k46634k49063o4298J02530J23037L5585n2063n0625M0937R8694Q765
37954E86335j33344j12835P0434J59802L2072r2152k508J39880M7537k21277l28672
37943A45272j48388R5627K00489K21293K52465K16432K9960j83523k33041j28037
37933D68549m0930m0760k3143Q0685J65091R7129p1625j39374l890J91409K11648
$$ plain form
37922 894789 905824 702281 484267 414217 424752 338994 148496 67342 260329 589190
37912 589190 731233 545511 222596 37941 56543 159039 264613 383838 492746 533797
37902 533797 567946 746411 1048691 1214761 1070789 781076 603501 515671 317295 40243
37892 40243 -27981 223486 525424 573797 385459 176533 57039 14860 69597 238978
37882 238978 415483 458910 380735 281700 152386 -71380 -264943 -156202 300486 767371
37872 767371 878492 650433 405564 352497 391315 331221 166712 70143 169152 405915
37862 405915 624146 753578 863267 1022344 1155334 1100743 815834 460375 244927 239308
37852 239308 363704 516423 641737 693935 621687 425597 190490 19689 -55583 -82953
$$ packed form
37922H94789J1035k03543k18014p0050J0535q5758j90498q1154J92987L28861
37912E89190J42043j85722l22915j84655J8602J02496J05574J19225J08908M1051
37902E33797L4149J78465L02280J66070j43972k89713j77575q7830j98376k77052
37892D0243o8224K51467L01938M8373j88338k08926j19494m2179N4737J69381
37882B38978J76505M3427p8175r9035j29314k23766j93563J08741M56688M66885
37872G67371J11121k28059k44869n3067L8818o0094j64509r6569R9009K36763
37862D05915K18231J29432J09689J59077J32990n4591k84909l55459k15448n619
37852B39308J24396J52719J25314N2198p2248j96090k35107j70801p5272k7370
$$ plain form
37842 -82953 -111967 -124521 -44867 176466 482327 730807 832147 857929 957452 1144017 1236129
37831 1236129 1085884 817122 714146 861165 1023300 963242 767891 724488 921759 1134579
37821 1134579 1128223 940118 790936 812472 943929 1029477 938304 644366 276998 55614
37811 55614 83002 223079 266586 192114 155622 227994 281976 198823 68358 64549 176049
37800 176049 198597 20967 -187914 -161123 134409 441547 516075 416121 411290 625405 873893
37789 873893 901600 696108 470230 379119 377043 361582 334111 351123 404684 443504 466853
37778 466853 508249 551135 553335 551654 643269 828524 951243 856596 568964 265220 103491
37767 103491 117654 233493 320886 262702 61770 -122657 -132635 -16445 21346 -96356 -202542
$$ packed form
37842h2953k9014j2554P9654K21333L05861K48480J01340K5782R9523J86565R2112
37831A236129j50245k68762j02976J47019J62135o0058j95351m3403J97271K12820
37821A134579o356j88105j49182K1536J31457Q5548r1173k93938l67368k21384
37811E5614K7388J40077M3507p4472l6492P2372N3982q3153j30465l809J11500
37800A76049K2548j77630k08881K6791K95532L07138P4528r9954m831K14115K48488
37789H73893K7707k05492k25878r1111k076j5461k7471J7012N3561L8820K3349
37778D66853M1396M2886K200j681R1615J85255J22719r4647k87632l03744j61729
37767A03491J4163J15839Q7393n8184k00932j84427r978J16190L7791j17702j06186
$$ plain form
37756 -202542 -127191 61437 183200 219445 279620 338040 224007 -86509 -377885 -491711
37746 -491711 -534029 -645982 -730325 -602740 -307090 -57343 81181 224132 393897 454793
37736 454793 374400 326282 424029 531638 470832 278529 120654 64946 84287 188023 383934
37725 383934 565936 601430 511019 428519 401990 365124 292815 246786 254884 271684 287354
37714 287354 365081 530186 707416 801820 776419 644937 470000 369545 425669 574195
37704 574195 681088 728145 797880 868238 796492 576843 441322 569903 825930 937495
37694 937495 856423 768224 793032 852807 838837 758344 678552 639726 661282 741017 817162
37683 817162 820240 793939 868584 1060697 1187107 1067860 774337 586708 694541 989243
$$ packed form
37756b02542P5351J88628J21763L6245O0175N8420j14033l10516k91376j13826
37746d91711m2318j11953q4343J27585K95650K49747J38524J42951J69765O0896
37736D54793q0393m8118R7747J07609o0806j92303j57875n5708J9341J03736J95911
37725C83934J82002L5494r0411q2500k6529l6866p2309m6029Q098J6800J5670
37714B87354P7727J65105J77230R4404k5401j31482j74937j00455N6124J48526
37704E74195J06893M7057O9735P0358p1746k19649j35521J28581K56027J11565
37694I37495q1072q8199K4808N9775j3970q0493p9792l8826K1556P9735P6145
37683H17162L078k6301P4645J92113J26410j19247k93523j87629J07833K94702
$$ plain form
37673 989243 1175970 1071921 769355 500033 372701 299774 185258 99946 197915 499720
37663 499720 840205 1023976 972195 733372 427644 187475 86151 100144 166739 258728
37653 258728 360041 409241 348304 210481 84841 14097 615 68193 210142 320582
37643 320582 320379 322949 500669 789458 931103 849347 761491 822673 882659 752823 522414
37632 522414 406127 420119 431579 430367 516330 661565 703418 573559 368642 207651 163110
37621 163110 285673 526531 684461 624679 512342 613038 884296 1007754 839077 574268
37611 574268 426525 399735 463866 683422 1022156 1249343 1221259 1075122 968153 800405
37601 800405 408399 -99164 -426849 -442607 -251374 20811 327719 614076 790043 807525
$$ packed form
37673I89243J86727j04049l02566k69322j27332p2927j14516q5312R7969L01805
37663D99720L40485J83771n1781k38823l05728k40169j01324J3993O6595R1989
37653B58728J01313M9200o0937j37823j25640p0744j3482O7578J41949J10440
37643C20582k03K570J77720K88789J41645q1756q7856O1182N9986j29836k30409
37632E22414j16287J3992J1460j212Q5963J45235M1853j29859k04917j60991m4541
37621A63110J22563K40858J57930n9782j12337J00696K71258J23458j68677k64809
37611E74268j47743k6790O4131K19556L38734K27187k8084j46137j06969j67748
37601H00405l92006n07563l27685j5758J91233K72185L06908K86357J75967J7482
$$ plain form
37591 807525 680809 471357 311236 332986 473609 476308 230889 -17576 15065 245800
37581 245800 365983 309073 307724 490533 679883 652205 404061 96263 -107708 -102781 96982
37570 96982 299569 275757 20519 -229492 -263642 -71561 246274 589751 858701 995862
37560 995862 1072475 1198793 1327484 1295382 1082354 856690 723225 610887 473601 407423
37550 407423 461983 510009 438365 331012 326787 408105 462659 464121 467594 491410 501865 463347
37538 463347 350154 186224 101069 220880 461192 578207 485445 349550 299674 249048
37528 249048 126385 65612 180452 334557 346412 265462 222387 157181 -39231 -223934
37518 -223934 -132693 228701 572318 680726 559601 300460 34843 -31355 183288 420458
$$ packed form
37591H07525j26716k09452j60121K1750J40623K699k45419k48465L2641K30735
37581B45800J20183n6910j349J82809J89350k7678k48144l07798k03971M927J99763
37570I6982K02587k3812k55238k50011l4150J92081L17835L43477K68950J37161
37560I95862P6613J26318J28691l2102k13028k25664j33465j12338j37286o6178
37550D07423N4560M8026p1644j07353m225Q1318N4554J462L473K3816J0455l8518
37538D63347j13193j63930q5155J19811K40312J17015r2762j35895m9876n0626
37528B49048j22663o0773J14840J54105J1855q0950m3075o5206j96412j84703
37518b23934R1241L61394L43617J08408j21125k59141k65617o6198K14643K37170
$$ plain form
37508 420458 343337 10105 -202104 -153341 -89223 -167712 -189956 33962 350103 503564
37498 503564 484126 414884 298226 108978 -17331 59584 235848 296431 235997 246028 422440
37487 422440 668266 866211 986044 1023655 969030 849936 726366 653989 696765 892450
37477 892450 1123262 1132383 815323 418792 283126 427634 560205 485770 333733 345584
37467 345584 573485 849241 971062 880816 707566 648792 774272 968982 1097196 1143642
37457 1143642 1123383 971328 681806 477766 618064 1026684 1321242 1272037 1052899 946950
37447 946950 972326 940756 768539 559214 419960 337817 238776 76687 -130271 -275138
37437 -275138 -197639 153516 587228 801210 689594 445140 306537 279653 196089 -1094
$$ packed form
37508D20458p7121l33232k12209M8763O4118p8489k2244K23918L16141J53461
37498E03564j9438o9242j16658j89248j26309P6915J76264O0583o0434J0031J76412
37487D22440K45826J97945J19833L7611n4625j19094j23570p2377M2776J95685
37477H92450K30812R121l17060l96531j35666J44508J32571p4435j52037J1851
37467C45584K27901K75756J21821r0246j73250n8774J25480J94710J28214M6446
37457A143642k0259j52055k89522k04040J40298M08620K94558m9205k19138j05949
37447I46950K5376l1570j72217k09325j39254q2143r9041j62089k06958j44867
37437b75138P7499L51155M33712K13982j11616k44454j38603k6884q3564j97183
$$ plain form
37427 -1094 -160059 -135727 5954 77079 -4152 -165828 -321100 -440791 -487125 -391163 -145816
37416 -145816 153727 408861 596838 718355 744251 673819 584166 554706 584597 635886 707649
37405 707649 811682 922908 1005803 1039207 975694 760353 455811 252832 253843 325081 282184
37394 282184 153698 124152 267226 482242 661112 766216 764706 648508 519693 493433
37384 493433 500529 350698 26539 -247877 -287924 -152473 -9147 58876 40466 -66511
37374 -66511 -211585 -294795 -289531 -257404 -194750 -18170 220771 288270 75232 -201343 -271149
37363 -271149 -158176 -70631 -51636 39006 244322 427898 475611 409284 296133 197691 205155
37352 205155 367900 576701 662444 615119 559540 523745 413671 235579 140408 180686 214672
$$ packed form
37427a094j58965K4332J41681P1125q1231j61676j55272j19691m6334R5962K45347
37416a45816K99543K55134J87977J21517K5896p0432q9653k9460K9891N1289P1763
37405G07649J04033J11226Q2895L3404o3513k15341l04542k02979J011P1238m2897
37394B82184j28486k9546J43074K15016J78870J05104j510j16198j28815k6260
37384D93433P096j49831l24159k74416m0047J35451J43326O8023j8410j06977
37374f6511j45074q3210N264L2127O2654J76580K38941O7499k13038k76575o9806
37363b71149J12973Q7545J8995R0642K05316J83576M7713o6327j13151r8442P464
37352B05155J62745K08801Q5743m7325n5579l5795j10074j78092r5171M0278L3986
$$ plain form
37341 214672 151535 113967 222280 369671 381124 287213 256673 319151 337952 241012 111939
37330 111939 34973 -3519 -14926 63174 259348 471055 568063 563338 601533 770542 983898
37319 983898 1086752 1045579 970022 938481 879112 694255 455912 365573 507168 740678
37309 740678 881454 894454 850787 778681 656444 512013 433493 480295 633202 815667
37299 815667 928990 909609 804122 744656 796210 883665 931198 988668 1106158 1160352 982105
37288 982105 644499 435199 488990 612497 567227 386564 279475 319826 395671 430805
37278 430805 492615 646912 824164 895119 816839 648849 464608 302011 186984 154721
37268 154721 226773 381411 562544 720414 839119 923430 965803 935156 803196 589901
$$ packed form
37341B14672o3137l7568J08313J47391J1453r3911l0540O2478J8801r6940j29073
37330A11939p6966l8492j1407P8100J96174K11707R7008m725L8195J69009K13356
37319I83898J02854m1173p5557l1541n9369j84857k38343r0339J41595K33510
37309G40678J40776J3000m3667p2106j22237j44431p8520M6802J52907J82465
37299H15667J13323j9381j05487n9466N1554Q7455M7533N7470J17490N4194j78247
37288I82105l37606k09300N3791J23507m5270j80663j07089M0351P5845L5134
37278D30805O1810J54297J77252P0955p8280j67990j84241j62597j15027l2263
37268A54721P2052J54638J81133J57870J18705Q4311M2373l0647j31960k13295
$$ plain form
37258 589901 388446 320913 424212 580916 628809 570514 601392 857495 1196264 1337744
37248 1337744 1200812 978298 871739 881312 902770 905075 916487 916053 848971 724067 621076
37237 621076 611233 703398 830974 865145 707189 419958 210152 226895 430378 691800
37227 691800 929152 1084525 1084080 934672 774490 707745 666226 555981 444107 436711 459022
37216 459022 364564 212923 211185 395459 611037 815697 1125520 1490362 1613531 1350297
37206 1350297 948754 709560 615025 506128 426475 509517 655881 637372 479704 445495
37196 445495 617740 769654 716574 562945 492174 500527 474270 398058 349342 363060 412453
37185 412453 477314 553510 633639 729265 865182 1011069 1075912 1014668 885843 760758 634268
$$ packed form
37258E89901k01455o7533J03299J56704M7893n8295L0878K56103L38769J41480
37248A337744j36932k22514j06559R573K1458K305J1412m34o7082j24904j02991
37237F21076r843R2165J27576L4171j57956k87231k09806J6743K03483K61422
37227F91800K37352J55373m45j49408j60182o6745m1519j10245j11874p396K2311
37216D59022r4458j51641j738J84274K15578K04660L09823L64842J23169k63234
37206A350297m01543k39194r4535j08897p9653Q3042J46364j8509j57668l4209
37196D45495J72245J51914n3080j53629p0771Q353k6257p6212m8716J3718M9393
37185D12453O4861P6196Q0129R5626J35917J45887O4843o1244j28825j25085j26490
$$ plain form
37174 634268 477974 330305 265418 287992 306656 221729 40929 -84096 23997 352020
37164 352020 626816 563407 195431 -140728 -183887 -11631 123948 119726 85251 148613 311379
37153 311379 487730 603965 641026 621389 572984 505666 438501 438192 569350 783873 923286
37142 923286 879081 703849 515670 345688 153985 -38552 -132076 -81322 18875 25730
37132 25730 -93170 -219801 -200769 5955 290626 481663 475415 307519 134933 134949 351935
37121 351935 612748 659702 426967 132472 26442 108244 192304 198919 229883 360705 519582
37110 519582 623654 701780 806891 908377 946255 909564 801076 616073 422528 364101
37100 364101 497671 711287 882930 1020479 1141152 1125148 858620 471426 252677 315338
$$ packed form
37174F34268j56294j47669o4887K2574J8664q4927j80800j25025J08093L28023
37164C52020K74796o3409l67976l36159m3159J72256J35579m222l4475O3362J62766
37153C11379J76351J16235L7061j9637m8405o7318o7165l09J31158K14523J39413
37142I23286m4205j75232j88179j69982j91703j92537r3524N0754J00197O855
37132B5730j18900j26631J9032K06724K84671J91037o248j67896j72586J6K16986
37121C51935K60813M6954k32735k94495j06030Q1802Q4060O615L0964J30822J58877
37110E19582J04072P8126J05111J01486L7878l6691j08488j85003j93545n8427
37100C64101J33570K13616J71643J37549J20673j6004k66528l87194k18749O2661
$$ plain form
37090 315338 487266 568712 568700 615728 729064 789809 729263 658034 744987 980830 1141229
37079 1141229 1043675 782665 602134 566608 519299 391385 355045 542487 771406 749014
37069 749014 479148 265931 314765 500381 570374 447581 267298 197633 287614 458585
37059 458585 600766 668058 672994 615188 482791 326776 236052 208366 159174 107383 208404
37048 208404 505144 789403 851106 744959 657652 634206 618612 643545 748253 797131 642342
37037 642342 420333 409573 597139 667655 462830 182137 55077 71844 139009 254109
37027 254109 385967 396514 247853 128175 225677 508492 834273 1116921 1270248 1174147
37017 1174147 868509 635670 706506 980339 1183607 1203872 1122045 1017704 901593 771826
$$ packed form
37090C15338J71928Q1446j2M7028J13336O0745o0546p1229Q6953K35843J60399
37079A141229r7554k61010j80531l5526m7309j27914l6340J87442K28919k2392
37069G49014k69866k13217M8834J85616O9993j22793j80283o9665Q9981J70971
37059D58585J42181O7292M936n7806j32397j56015r0724k7686m9192n1791J01021
37048B08404K96740K84259O1703j06147q7307k3446j5594K4933J04708M8878j54789
37037F42342k22009j0760J87566P0516k04825k80693j27060J6767O7165J15100
37027B54109J31858J0547j48661j19678R7502K82815L25781K82648J53327r6101
37017A174147l05638k32839P0836K73833K03268K0265q1827j04341j16111j29767
$$ plain form
37007 771826 614119 424783 324075 509790 964947 1356234 1400298 1216847 1136387 1264830
36997 1264830 1437531 1510055 1468975 1309313 1029885 742146 591208 563547 526075 437968
36987 437968 375239 377789 425227 521485 641098 647799 459253 248984 270870 503221 685729
36976 685729 700174 676417 702903 688780 588666 534346 631351 801307 920461 951593 864395
36965 864395 614125 300999 161708 268738 405915 390665 357748 533480 850605 1010682
36955 1010682 886923 668825 595645 694197 815436 831696 757688 720888 821210 1002336
36945 1002336 1099232 1044208 960151 979925 1032340 917338 587103 247916 138174 265651
36935 265651 425212 452505 383752 338272 325751 276349 228471 323937 564035 734544 696488
$$ packed form
37007G71826j57707j89336j00708J85715M55157L91287M4064j83451q0460J28443
36997A264830J72701P2524m1080j59662k79428k87739j50938k7661l7472q8107
36987D37968o2729K550M7438R6258J19613O701j88546k10269K1886K32351J82508
36976F85729J4445k3757K6486j4123j00114n4320R7005J69956J19154L1132q7198
36965H64395k50270l13126j39291J07030J37177j5250l2917J75732L17125J60077
36955A010682j23759k18098p3180R8552J21239J6260p4008l6800J00322J81126
36945A002336R6896n5024q4057J9774N2415j15002l30235l39187j09742J27477
36935B65651J59561K7293o8753m5480j2521m9402m7878R5466K40098J70509l8056
$$ plain form
36924 696488 607145 670451 781577 662210 302530 1794 -56193 -11554 -36664 -78154 -22052
36913 -22052 83170 134601 163397 251144 359202 392440 361878 354162 391252 421988 403592
36902 403592 315337 152145 -32509 -149041 -185651 -209642 -219119 -122025 85166 273493 391188
36891 391188 537972 720707 740197 503430 267399 329344 593806 707633 556659 360521
36881 360521 290153 260111 159053 62789 104414 269862 428724 495627 490005 475439 482671
36870 482671 488392 473151 479067 534978 531104 315104 -31354 -186085 20922 368545 552069
36859 552069 563318 562688 540551 388274 198702 174957 274542 261178 122773 120203 352210
36848 352210 568098 530521 315763 124929 17844 -25101 30085 191256 372554 518028
$$ packed form
36924F96488q9343O3306J11126j19367l59680l00736n7987M4639k5110m1490N6102
36913b2052J05222N1431K8796Q7747J08058L3238l0562p716L7090L0736j8396
36902D03592q8255j63192j84654j16532l6610k3991r477R7094K07191J88327J17695
36891C91188J46784J82735J9490k36767k36031O1945K64462J13827j50974j96138
36881C60521p0368l0042j01058r6264M1625J65448J58862O6903n622j4566P232
36870D82671N721j5241N916N5911l874k16000l46458j54731K07007L47623J83524
36859E52069J1249o30k2137j52277j89572k3745R9585j3364j38405k570K32007
36848C52210K15888l7577k14758j90834j07085m2945N5186J61171J81298J45474
$$ plain form
36838 518028 645860 690471 499742 109734 -184097 -193748 -90119 -98979 -127665 50384 356096
36827 356096 446103 195541 -102981 -96838 224705 569293 689826 604953 490689 426815
36817 426815 332060 176158 142001 421745 891873 1192296 1161954 999655 928053 912608
36807 912608 836301 749123 760154 826085 833673 788124 757483 735878 719643 802249 1018201
36796 1018201 1203699 1195663 1055092 899409 657000 254732 -64116 50341 532342 904365
36786 904365 864012 603959 476139 586585 819992 1035544 1111360 985492 784289 751167
36776 751167 930139 1074319 986807 792092 722159 775144 764732 616528 438446 341365
36766 341365 338722 402431 497368 570597 598477 629011 702428 757150 694142 519780 361036
$$ packed form
36838E18028J27832M4611j90729l90008k93831r651J03629q860k8686J78049L05712
36827C56096R0007k50562k98522O143L21543L44588J20533q4873j14264o3874
36817D26815r4755j55902l4157K79744M70128L00423l0342j62299p1602j5445
36807I12608p6307q7178J1031O5931P588m5549l0641k1605j6235Q2606K15952
36796A018201J85498q036j40571j55683k42409m02268l18848J14457M82001L72023
36786I04365m0353k60053j27820J10446K33407K15552P5816j25868k01203l3122
36776G51167J78972J44180q7512j94715o9933N2985j0412j48204j78082r7081
36766C41365k643O3709R4937P3229K7880L0534P3417N4722o3008j74362j58744
$$ plain form
36755 361036 349416 526025 824026 1100077 1223293 1180460 1062868 934356 788185 665952
36745 665952 702852 953463 1252405 1372776 1285276 1146806 1058934 962882 783707 564710
$$ packed form
36755C61036j1620J76609K98001K76051J23216m2833j17592j28512j46171j22233
36745F65952L6900K50611K98942J20371q7500j38470q7872r6052j79175k18997
$$ [...]
##END NTUPLES=NMR SPECTRUM
##END=
