##TITLE=31P_DE-80H_X3
 64 sc D2O
 26.2.2025
##JCAMPDX= 6.0         $$ Bruker NMR JCAMP-DX V2.0
##DATA TYPE= NMR SPECTRUM
##DATA CLASS= NTUPLES
##ORIGIN= UXNMR, Bruker Analytische Messtechnik GmbH
##OWNER= root
$$ XWIN-NMR		Version 3.5
$$ Tue Jun 24 09:48:22 2025 Russian Standard Time (UT+4h)  Yarkov@DPX200
##.OBSERVE FREQUENCY= 81.013821
##.OBSERVE NUCLEUS= ^31P
##.ACQUISITION MODE= SIMULTANEOUS
##.ACQUISITION SCHEME= undefined
##.AVERAGES= 64
##.DIGITISER RES= 17
##SPECTROMETER/DATA SYSTEM= spect
##.PULSE SEQUENCE= zgpg30
##.SOLVENT NAME= DMSO
##.SHIFT REFERENCE= (INTERNAL, DMSO, 0, 198.062)
##AUDIT TRAIL= $$ (NUMBER, WHEN, WHO, WHERE, WHAT)
$$ ##TITLE= Audit trail, XWIN-NMR		Version 3.5
$$ ##JCAMPDX= 5.01
$$ ##ORIGIN= Bruker BioSpin GmbH
$$ ##OWNER= Yarkov
$$ C:/Bruker/XWIN-NMR/data/yarkov2/nmr/P31/2/pdata/1/auditp.txt
$$ ##AUDIT TRAIL=  $$ (NUMBER, WHEN, WHO, WHERE, WHAT)
(   1,<2025-06-23 12:29:39.17 +0400>,<Yarkov>,<DPX200>,
      <created by zg, POWCHK disabled, PULCHK disabled
       configuration hash MD5:
       00 E9 B6 7A A2 85 ED C7 34 08 36 98 17 FE 4E 26
       data hash MD5: 32K
       57 CA 06 47 57 D5 76 50 53 65 A1 7B 0E 15 B6 59>)
(   2,<2025-06-23 12:30:00.98 +0400>,<Yarkov>,<DPX200>,
      <Start of raw data processing
       efp BC_mod = 2 LB = 1.5 FT_mod = 6 PKNL = 1 PHC0 = 1679.797 PHC1 = 45.35953 SI = 64K 
       data hash MD5: 64K
       B4 91 FC 5E 66 C1 08 CB 96 25 F6 0C 4A 2D E8 AB>)
$$ ##END=
$$ 
$$ hash MD5
$$ 5A 35 CE AD 90 77 6D E5 63 7D 97 1E 6B BC 03 07
##$RELAX= 
##$RELAX= 
##$RELAX= 
##$RELAX= 
##$RELAX= 
##$RELAX= 
##$RELAX= 
##$RELAX= 
$$ Bruker specific parameters
$$ --------------------------
##$DU= <C:/Bruker/XWIN-NMR>
##$EXPNO= 2
##$NAME= <P31>
##$PROCNO= 1
##$TYPE= <nmr>
##$USER= <yarkov2>
##$AMP= (0..31)
100 100 100 100 100 100 100 100 100 100 100 100 100 100 100 100 100 100 
100 100 100 100 100 100 100 100 100 100 100 100 100 100 
##$AQSEQ= 0
##$AQ_mod= 1
##$AUNM= <au_zg>
##$AUTOPOS= <>
##$BF1= 81.014009
##$BF2= 200.13
##$BF3= 200.13
##$BF4= 200.13
##$BF5= 200.13
##$BF6= 200.13
##$BF7= 200.13
##$BF8= 200.13
##$BYTORDA= 1
##$CFDGTYP= 0
##$CFRGTYP= 5
##$CHEMSTR= <none>
##$CNST= (0..31)
1 1 145 1 1 1 1 1 1 1 1 1 1 1 1 1 1 1 1 1 1 1 1 1 1 1 1 1 1 1 1 1 
##$CPDPRG= <waltz16>
##$CPDPRG1= <>
##$CPDPRG2= <waltz16>
##$CPDPRG3= <>
##$CPDPRG4= <mlev>
##$CPDPRG5= <mlev>
##$CPDPRG6= <mlev>
##$CPDPRG7= <mlev>
##$CPDPRG8= <mlev>
##$CPDPRGB= <>
##$CPDPRGT= <>
##$D= (0..31)
0 1 0 0 0 0 0 0 0 0.06 0 0.03 2e-05 3e-06 0 0 0.0002 0 0 0 0 0 0 0 0 0 
0 0 0 0 0 0 
##$DATE= 1750667378
##$DBL= (0..7)
120 120 120 11 120 120 24 19 
##$DBP= (0..7)
150 150 150 150 150 150 150 150 
##$DBP07= 0
##$DBPNAM0= <>
##$DBPNAM1= <>
##$DBPNAM2= <>
##$DBPNAM3= <>
##$DBPNAM4= <>
##$DBPNAM5= <>
##$DBPNAM6= <>
##$DBPNAM7= <>
##$DBPOAL= (0..7)
0.5 0.5 0.5 0.5 0.5 0.5 0.5 0.5 
##$DBPOFFS= (0..7)
0 0 0 0 0 0 0 0 
##$DE= 6
##$DECBNUC= <off>
##$DECIM= 4
##$DECNUC= <off>
##$DECSTAT= 4
##$DIGMOD= 1
##$DIGTYP= 9
##$DL= (0..7)
0 0 52 120 120 21 21 25 
$$ [...]
##$SUBNAM2= <"">
##$SUBNAM3= <"">
##$SUBNAM4= <"">
##$SUBNAM5= <"">
##$SUBNAM6= <"">
##$SUBNAM7= <"">
##$SUBNAM8= <"">
##$SUBNAM9= <"">
##$SW= 400.765351723535
##$SWIBOX= (0..15)
0 1 3 0 0 0 0 0 0 0 0 0 0 0 0 0 
##$SW_h= 32467.5324675325
##$TD= 32768
##$TD0= 1
##$TE= 0
##$TE2= 300
##$TE3= 300
##$TEG= 300
##$TL= (0..7)
0 120 53 12 22 120 120 120 
##$TP= (0..7)
150 150 150 150 150 150 150 150 
##$TP07= 0
##$TPNAME0= <>
##$TPNAME1= <>
##$TPNAME2= <>
##$TPNAME3= <>
##$TPNAME4= <>
##$TPNAME5= <>
##$TPNAME6= <>
##$TPNAME7= <>
##$TPOAL= (0..7)
0.5 0.5 0.5 0.5 0.5 0.5 0.5 0.5 
##$TPOFFS= (0..7)
0 0 0 0 0 0 0 0 
##$TUNHIN= 0
##$TUNHOUT= 0
##$TUNXOUT= 0
##$USERA1= <user>
##$USERA2= <user>
##$USERA3= <user>
##$USERA4= <user>
##$USERA5= <user>
##$V9= 5
##$VALIST= <valist>
##$VCLIST= <CCCCCCCCCCCCCCC>
##$VD= 0
##$VDLIST= <DDDDDDDDDDDDDDD>
##$VPLIST= <PPPPPPPPPPPPPPP>
##$VTLIST= <TTTTTTTTTTTTTTT>
##$WBST= 1024
##$WBSW= 4
##$XGAIN= (0..3)
0 0 0 0 
##$XL= 0
##$YL= 0
##$YMAX_a= 249
##$YMIN_a= -953
##$ZGOPTNS= <>
##$ZL1= 120
##$ZL2= 120
##$ZL3= 120
##$ZL4= 120
##$ABSF1= 0
##$ABSF2= 0
##$ABSG= 0
##$ABSL= 0
##$ALPHA= 0
##$AQORDER= 0
##$ASSFAC= 0
##$ASSFACI= 0
##$ASSFACX= 0
##$ASSWID= 0
##$AUNMP= <proc_1d>
##$AZFE= 0.1
##$AZFW= 0.5
##$BCFW= 0
##$BC_mod= 2
##$BYTORDP= 0
##$COROFFS= 0
##$CY= -3
##$DATMOD= 1
##$DC= 0
##$DFILT= <>
##$DTYPP= 0
##$F1P= 0
##$F2P= 0
##$FCOR= 1
##$FTSIZE= 65536
##$FT_mod= 6
##$GAMMA= 0
##$GB= 0
##$INTBC= 1
##$INTSCL= 9.790993e-09
##$ISEN= 30
##$LB= 1.5
##$LEV0= 0
##$LPBIN= 0
##$MAXI= 10000
##$MC2= 0
##$MEAN= 0
##$ME_mod= 0
##$MI= 50
##$NCOEF= 0
##$NC_proc= -12
##$NLEV= 6
##$NOISF1= 182.463
##$NOISF2= 159.3651
##$NSP= 0
##$NTH_PI= 0
##$NZP= 0
##$OFFSET= 198.0616
##$PC= 4
##$PHC0= 1679.797
##$PHC1= 45.35953
##$PH_mod= 1
##$PKNL= yes
##$PPARMOD= 0
##$PSCAL= 0
##$PSIGN= 0
##$REVERSE= no
##$SF= 81.0140089999434
##$SI= 65536
##$SIGF1= 159.3651
##$SIGF2= -187.1042
##$SINO= 113.3802
##$SIOLD= 16384
##$SREGLST= <1H.CDCl3>
##$SSB= 0
##$STSI= 65536
##$STSR= 0
##$SW_p= 32467.5324675325
##$SYMM= 0
##$S_DEV= 0
##$TDeff= 32768
##$TDoff= 0
##$TI= <>
##$TILT= no
##$TM1= 0
##$TM2= 0
##$TOPLEV= 0
##$USERP1= <user>
##$USERP2= <user>
##$USERP3= <user>
##$USERP4= <user>
##$USERP5= <user>
##$WDW= 1
##$XDIM= 65536
##$YMAX_p= 527186934
##$YMIN_p= -76108558
$$ End of Bruker specific parameters
$$ ---------------------------------
##NTUPLES= NMR SPECTRUM
##VAR_NAME=  FREQUENCY,     SPECTRUM/REAL,   SPECTRUM/IMAG
##SYMBOL=    X,             R,               I
##VAR_TYPE=  INDEPENDENT,   DEPENDENT,       DEPENDENT
##VAR_FORM=  AFFN,          ASDF,            ASDF
##VAR_DIM=   65536,         65536,           65536
##UNITS=     HZ,            ARBITRARY UNITS, ARBITRARY UNITS
##FACTOR=    0.49542278885378, 1,            1
##FIRST=     16045.7642231865, 0,            0
##LAST=      -16421.768244346, 0,            0
##MIN=       -16421.768244346, -76108558,    0
##MAX=       16045.7642231865, 527186934,    0
$$ Real data points
##PAGE= N=1
##DATA TABLE= (X++(R..R)), XYDATA
$$ [...]
42489a01859r58373k212643k361510j120635P54550J830984J338898k7985r33951
42480c792524q52633l39797N6874N52031J392828J875620R89463r23994k102511
42471c144643j426032K04216J161545J056860O01656J92946k36739l76146J66796
42462a799541Q14583N04193o85228j536107j453279j028988o47580J34412J340067
42453d357468K020255J682984J117373R59147N56657o87834j846123j631827l81877
42444b568713M29031K45532k06609l10479j05248L76079J101115J389473M74541
42435H24722j103178j779663r95878M2765J02297m71065n18520K35627J010058
42426b652835J097222M68629n40983j498363j843400j175159K32187J508168J948664
$$ y = [-101859, -1060232, -3272875, -5634385, -6755020, -6000470, -4169486, -2830588, -2858573, -3792524, -4645157, -4984954, -4928080, -4376049, -2983221, -1107601, -118138, -1042132, -3144643, -4570675, -4366459, -3204914, -2148054, -1546398, -1353452, -1590191, -1966337, -1799541, -984958, -480765, -1165993, -2702100, -4155379, -5184367, -5831947, -5697535, -4357468, -2337213, -654229, 463144, 1422291, 1978948, 1291114, -555009, -2186836, -2568713, -2139682, -1894150, -2100759, -2411238, -2516486, -2140407, -1039292, 350181, 824722, -278456, -2058119, -3053997, -3011232, -2908935, -3380000, -3898520, -3662893, -2652835, -1555613, -1086984, -1627967, -3126330, -4969730, -6144889, -5912702, -4404534, -2455870]
42417b455870J538776P07789j17266n84885m53355L5290Q1305p59991j643218
42408c651425j174425O58148K091678J706074K11996p49349r70463j549561k619403
42399f046730k761576j168518Q54223J374687O9537j709499k460819j541667O10920
42390a2779442K519998K578238P95055q18693m50568J311334K295001J379402
42382c169675n90906k181284k579355j582945M00989K093376K147022P47837l57915
42373e072856j7244P95267L57559j284281k155851q71959J476287K554799J536552
42364b681727j49458q22894m41146l8766p6336k43563m23242p36169p98140j09815
42354f521256P87120P87482K3861j96342L91217M82287l41792m19817J304192
$$ y = [-2455870, -917094, -209305, -326571, -911456, -1364811, -1329521, -1248216, -2008207, -3651425, -4825850, -4167702, -2076024, -369950, -157954, -907303, -1877766, -3427327, -6046730, -8808306, -9976824, -9122601, -7747914, -7678377, -9387876, -11848695, -13390362, -12779442, -10259444, -7681206, -6886151, -7704844, -8155412, -6844078, -4549077, -3169675, -3760581, -5941865, -8521220, -10104165, -9703176, -7609800, -5462778, -4714941, -5072856, -5090100, -4294833, -3937274, -5221555, -7377406, -8249365, -6773078, -4218279, -2681727, -2831185, -3654079, -4095225, -4133991, -4210327, -4453890, -4877132, -5613301, -6411441, -6521256, -5734136, -4946654, -4922793, -5119135, -4727918, -4245631, -4587423, -5007240, -3703048]
42345c703048K952516K075786o42409k265812j718208p18454o11574o32059K0887
42336e242375M87921j32989r74939o25512P54567J829301K012281J783474J390181
42327A281910M15858j174915k369867j982224n3379J857759J987754J39462j994744
42318a892386k587121j631042o96466p97570j158082l92784J546315L101987K774501
42309a732648P96141j046039j314883m06233K25114M7947j58909J00431K54690
42300c234389q072J10658J036044J612135P61571n69494q00635l37191q00209
42291b229582k002889j975795k07066J399041J466550R55244J004582R10395k73071
42282i52591j620078j549186k33548P88458Q34625N15667L36915J41159j80372
$$ y = [-3703048, -750532, 1325254, 682845, -1582967, -3301175, -4019629, -4631203, -5263262, -5242375, -4754454, -4887443, -5862382, -6487894, -5733327, -3904026, -1891745, -108271, 1281910, 1697768, 522853, -1847014, -3829238, -3882617, -2024858, -37104, 102358, -1892386, -4479507, -6110549, -6807015, -7604585, -8762667, -9155451, -7609136, -4507149, -1732648, -936507, -1982546, -3297429, -3703662, -3478548, -3430601, -3589510, -3489079, -3234389, -3242461, -3131803, -2095759, -483624, 277947, -291547, -1092182, -1429373, -2229582, -4232471, -6208266, -6415332, -5016291, -3549741, -2594497, -1589915, -679520, -952591, -2572669, -4121855, -4355403, -3566945, -2732320, -2216653, -1879738, -1738579, -1918951]
42273a918951m23221n12911n64404n96744n91135n51830k62606M69145J099957
42264c852700P35202l68263p24125K77098J268371Q98890o7245N0160J224288
42255e58324J745257O57616j065697j871091j306205k70505o0963j033636j982255
42246e745803j378222N21978J727954J164978Q8573j6018L61946L1070n80070
42237c823614k12690Q10136R49557j1598o78735l30186K32194K87436K7446m51079
42227c201133j341385j915274q09591J716453L294266K263894j01347j262796
42219a356913n32802N57643N77306j45601k68270P19261J735172J342724l51463
42210B277057j672322j628982j316559k075157l046463k190189N21598K737089
$$ y = [-1918951, -2342172, -2855083, -3419487, -4016231, -4607366, -5159196, -5421802, -4952657, -3852700, -3117498, -3485761, -4209886, -3932788, -2664417, -1765527, -1832772, -1782612, -558324, 1186933, 1844549, 778852, -1092239, -2398444, -2668949, -2729912, -3763548, -5745803, -7124025, -6602047, -4874093, -3709115, -3620542, -3636560, -3274614, -3243544, -3823614, -4036304, -3226168, -2276611, -2288209, -2966944, -3297130, -3064936, -2777500, -2750054, -3201133, -4542518, -6457792, -7267383, -5550930, -2256664, 7230, -94117, -1356913, -1889715, -1332072, -754766, -900367, -1168637, -449376, 1285796, 2628520, 2277057, 604735, -1024247, -2340806, -4415963, -7462426, -9652615, -9131017, -6393928]
42202f393928K824748J673687Q42502M75064o5298p59043j140145j050559m09527
42193d002499Q78131K107220J920205J51943j433481j248127P9515P65812K41201
42184e40080n97310r03956n78858J39739Q01299P56470j50583j189818j648375
42175c911472j651064j506564r56291J24932J017230J123654R79186J228109J293657
42166b258623L83393p36719n29258R70538K152236K200356J926126J940269J505262
42157G553580p3917k031404k962522k409817j019800L21703R84416P15180j81039
42148H96380r85430j173617p72747k04987q5497q69835k058671k081205r857K665711
42138d679755L226312J034997j510762j955247o52064K16942l68534j378479j405420
$$ y = [-6393928, -3569180, -1895493, -1052991, -577927, -643225, -1402268, -2542413, -3592972, -4002499, -3124368, -1017148, 903057, 1055000, -378481, -1626608, -1547093, -781281, -540080, -1137390, -2041346, -2620204, -2480465, -1679166, -922696, -1073279, -2263097, -3911472, -5562536, -7069100, -8025391, -7900459, -6883229, -5759575, -4780389, -3552280, -2258623, -1875230, -2611949, -3141207, -2170669, -18433, 2181923, 4108049, 6048318, 7553580, 7479663, 5448259, 2485737, 75920, -943880, -622177, 362239, 1077419, 896380, -89050, -1262667, -2035414, -2240401, -2325898, -3195733, -5254404, -7335609, -7345466, -4679755, -1453443, -418446, -1929208, -3884455, -4536519, -4319577, -4688111, -6066590, -7472010]
42129g472010j76689J497590K478614K022821M19218j031047j152869r3474Q84927
42120b622919P47149l57004j264055p78068J122659K840662K490079Q5707k206069
42111E8141k549799j461552n57695j19272P23545J849568J965311P86702k54898
42102D40051j67185J70977k97518r37976n84575L24929L63035n53080j054818
42093b296160n50841o448r4092K0052J190105K584165K527986O19672j833651
42084B160788l246797k983391j438642L59164J288544R36208Q659m18832p7011
42075c411310L99967M57115K25772R8621J52100J92931Q4801j77627n42034q84293
42065c403957j027186q75651m71578J05797P96051J489704J987078K060337J563305
$$ y = [-7472010, -7648699, -6151109, -3672495, -1649674, -1230456, -2261503, -3414372, -3507846, -2622919, -1875770, -2232774, -3496829, -4274897, -3152238, -311576, 2178503, 2264210, 58141, -2491658, -3953210, -4510905, -4630177, -3906632, -2057064, -91753, 694949, 440051, 272866, 443843, 146325, -791651, -1376226, -1051297, -688262, -1241342, -2296160, -2847001, -2853449, -2947541, -2927489, -1737384, 846781, 3374767, 3994439, 2160788, -1086009, -4069400, -5508042, -5148878, -3860334, -2924126, -2915467, -3334299, -3411310, -3011343, -2554228, -2328456, -2229835, -2077735, -1884804, -1800003, -1977630, -2519664, -3403957, -4431143, -5306794, -5778372, -5672575, -4876524, -3386820, -1399742, 660595, 2223900]
42056B223900N69561n42731j267224j374233j115561r53324j093456j270777r64142
42047e787987L3433J133425J343917N33467m6140P34820K036131J827119k43464
42038A564721k004946j525646L87670J512906J109659J56509n86019j101447j037457
42029a524050R6823J494843J500174j0994j171102p12141L37459M12007l29797
42020I3222o02633p151O83005P55856J70793p10568j323084j210962o48663m24062
42010c224247n78153j51225J214837K340117K059140Q93695J27682r9311o10759
42001A971776j618592k500941k795848k377182j084692P18369J730384J148396
41993d808330Q2316J07546Q25892O06010m44795l51582J458413K782881J574794
$$ y = [2223900, 2793461, 2250730, 983506, -390727, -1506288, -2459612, -3553068, -4823845, -5787987, -5754554, -4621129, -3277212, -2743745, -2789885, -2055065, -18934, 1808185, 1564721, -440225, -1965871, -1578201, -65295, 1044364, 1200873, 614854, -486593, -1524050, -1427227, 67616, 1567790, 1556796, 385694, -326447, 11012, 423019, 93222, -509411, -516562, 166443, 922299, 1093092, 382524, -940560, -2151522, -2800185, -3224247, -3802400, -3953625, -2738788, -398671, 1660469, 2554164, 2681846, 2582535, 1971776, 353184, -2147757, -4943605, -7320787, -8405479, -7687110, -5956726, -4808330, -4726014, -4618468, -3792576, -3186566, -3631361, -3982943, -2524530, 258351, 1833145]
41984A833145j282206l316608l436978k362011j010433K17132J020698J206744
41976g130517J005153P43948M46549J36292K7453O689l88509r75624p50998N69533
41966f310031J683091J343735J68644l07521J78068O00588M35392J30076p6557
41957b154515m62494q14548l71133Q40629J656553J271726K79538k55917p5837
41948h5998L58243N84747L42458l63499r78138p52426J93273P41977J71343r28105
41938g16125j623964j835553j855269j380636o7520J367100J778593J242721R29807
41929b160846J226514J151701M6298j233997j515292q88697l05419j83888k39566
41920d103192k64926k40617M1760O59118J056435O44729k43385p43494o40437
$$ y = [1833145, 550939, -2765669, -6202647, -8564658, -9575091, -9357959, -8337261, -7130517, -6125364, -5381416, -4934867, -4798575, -4771122, -4764433, -5152942, -6128566, -6879564, -6310031, -4626940, -3283205, -3114561, -3422082, -3244014, -2643426, -2208034, -2077958, -2154515, -2617009, -3431557, -3802690, -2962061, -1305508, -33782, 245756, -10161, -85998, 272245, 856992, 1199450, 835951, -142187, -894613, -701340, 40637, 211980, -716125, -2340089, -4175642, -6030911, -7411547, -7479067, -6111967, -4333374, -3090653, -2160846, -934332, 217369, 263667, -970330, -2485622, -3374319, -3679738, -3863626, -4103192, -4368118, -4608735, -4566975, -3907857, -2851422, -2206693, -2450078, -3193572, -3834009]
41911c834009l54008N3897Q20823J447713R10140p55671k118668k090937j122234
41902g042954k07384L67514P18188P34094M93336N08646Q21616O39615l51605
41893c318934j158191q70898n9696K46858J41030K12718J80364m32205r56722
41884f015676n10893L09731L93401K23039R97405K021481J425215m18844r16931
41875b492072N55405J238607p04860k914175k133842R01241K499535J123928j020599
41866b946832j404466n4652J370398J771702J202577K66169m14167n12247j19216
41857h40734M63655Q72322O55160k88868j140868r07707L4480K89274k99381k80069
41847a442736P43047R51195p00954k155603j122233J121157J510307o6425q52849
$$ y = [-3834009, -4188017, -4134120, -3313297, -1865584, -955444, -1711115, -3829783, -5920720, -7042954, -7250338, -6882824, -6164636, -5430542, -4937206, -4428560, -3606944, -2967329, -3318934, -4477125, -5348023, -5407719, -5160861, -5019831, -4807113, -4626749, -5058954, -6015676, -6526569, -6216838, -5823437, -5600398, -4602993, -2581512, -1156297, -1575141, -2492072, -1936667, -698060, -1402920, -4317095, -6450937, -5549696, -3050161, -1926233, -2946832, -4351298, -4405950, -3035552, -1263850, -61273, 204896, -209271, -721518, -840734, -377079, 495243, 1150403, 861535, -279333, -1187040, -1152560, -863286, -1162667, -1442736, -699689, 251506, -449448, -2605051, -3727284, -2606127, -1095820, -1162245, -2015094]
41838b015094J41723Q08904j30337r01790J92219J854758J858788L25311r35810
41829A198672j219791j315666j764033k168494j939439q39384Q01262J900893
41821e345980J446551L1723m38942P59112K118433K134607J292420P21509J96583
41812B916016r87541k167313k099047j017152k59189k16404k02777m8456k10087
41803d291950l98854L01768J774842K695270K263800R68624m90396j808920k455195
41794a441011j784006k24263P70369M60277m13769r41548j065881q62688K8332
41785e474188J476906K324842J744059N14438L6510N12492R93968R37241P65747
41776C832015Q73989R12880M24301l03404n16709n4614L18220r8643r00614j088366
$$ y = [-2015094, -1873371, -1064467, -1194804, -2096594, -1904375, -49617, 1809171, 2134482, 1198672, -21119, -1336785, -3100818, -5269312, -7208751, -8048135, -7246873, -5345980, -3899429, -3867706, -4306648, -3547536, -1429103, 705504, 1997924, 2719433, 2916016, 1928475, -238838, -2337885, -3355037, -3614226, -3830630, -4033407, -4081863, -4291950, -4690804, -4389036, -2614194, 81076, 2344876, 3313500, 2823104, 1014184, -1441011, -3225017, -3449280, -2678911, -2218634, -2632403, -3573951, -4639832, -5502520, -5474188, -3997282, -1672440, 71619, 586057, 622567, 1135059, 2129027, 3066268, 3832015, 4706004, 5618884, 6043185, 5739781, 5223072, 5168458, 5486678, 5388035, 4487421, 3399055]
41766C399055o02572n53237j519569k454568k105580q34570J28632P39687J916570
41757a886152L356192L350245J363457p51865j125067k83257m2892q86690j750922
41748A343049j863485j451125q27405l585P32683Q54594L90189p9067l02641n10355
41738a717148o19370j44229Q26470J357434Q75283P3888r605N05768M65949o63600
41728I50840j841548j547736L27824K127229K144669M38282j405912k135652j921189
41719b863193j554759j249552o86462J83481R75942J361474J258083O59111k67720
41710b183595r58167q16021N0428P61339N45064l82108r21765j84846J413469
41701b676202K298419J323741q16499k210113j792028k43142J207780K039973
$$ y = [3399055, 2796483, 2243246, 723677, -1730891, -3836471, -4671041, -4542409, -3802722, -1886152, 1470040, 4820285, 6183742, 5431877, 4306810, 4023553, 3980661, 3093971, 1343049, -520436, -1971561, -2798966, -2802551, -2069868, -1215274, -825085, -904152, -1206793, -1717148, -2336518, -2480747, -1654277, -296843, 578440, 652328, 642723, 1148491, 1614440, 950840, -890708, -2438444, -2110620, 16609, 2161278, 2599560, 1193648, -942004, -2863193, -4417952, -5667504, -6353966, -6170485, -5194543, -3833069, -2574986, -1915875, -2183595, -3141762, -3957783, -3907355, -3146016, -2600952, -2983060, -3904825, -4089671, -2676202, -377783, 945958, 129459, -2080654, -3872682, -4115824, -2908044, -868071]
41693h68071K177253J459832J62266p23678o75042n17159j121577j835850j471980
41684c414006l83073m640m94756n55924J86741M44399m28474j093631l14229J015677
41674e041916J310060O98404M61975Q06532Q32659L41275L3994l6042o57841j836682
41664c087582k324533j284594N79221J998230K368179J672205J79369j256861
41656a156366j521135n14621O15818J036668J115610J153548M48618j189461k091082
41647b102403p07664J598126J872039j95508j577885l15671J503739Q82089j537542
41638e80680k432630o88579J227303J104493j08565l49622L82183N30009l39883
41629a255971j054059p11503L02178J112399J128352J36556j363602k013998q63688
$$ y = [-868071, 1309182, 2769014, 2931280, 2207602, 1532560, 1015401, -106176, -1942026, -3414006, -3797079, -3801719, -4296475, -4852399, -4665658, -4221259, -4649733, -5743364, -6057593, -5041916, -3731856, -3033452, -2571477, -1764945, -932286, -591011, -557017, -593059, -1250900, -3087582, -5412115, -6696709, -6117488, -4119258, -1751079, -78874, 100495, -1156366, -2677501, -3192122, -2576304, -1539636, -424026, 729522, 1178140, -11321, -2102403, -2810067, -1211941, 660098, 464590, -1113295, -1428966, 74773, 956862, -580680, -3013310, -3701889, -2474586, -1370093, -1478658, -1828280, -1446097, -916088, -1255971, -2310030, -3021533, -2719355, -1606956, -478604, -342048, -1705650, -3719648, -4583336]
41620d583336J169992K125534J353197p449r45185j611645k077500j604803j39806
41611f321001P47011j66005j606729j206962J185226L070420K429496J36799j300578
41602c032323o90489P85581J204386J14706j058539q31634L90770P73795m54751
41593b798498j831157j592226m8360R59021N49445l40901m64060M18131J745160
41584c403445K711615K485769Q30955j226783k173371j703915q90532n21667k41472
41575d132846L48398P98450O55136L25980L61462N53782M83771L69864O02951
41566C66948R06526P15120O3560m95018n11345K30186J563186K396274J251655
41557F487092j664997l780293k927179k75957J064805R1000j240972j290004q44702
$$ y = [-4583336, -3413344, -1287810, 65387, 57938, -887247, -2498892, -4576392, -6181195, -6321001, -5573990, -5739995, -7346724, -8553686, -7368460, -4298040, -1868544, -1731745, -3032323, -3722812, -2937231, -1732845, -1618139, -2676678, -3508312, -3117542, -2343747, -2798498, -4629655, -6221881, -6270241, -5311220, -4761775, -5102676, -5566736, -5148605, -3403445, -691830, 1793939, 2624894, 1398111, -775260, -2479175, -3369707, -3891374, -4132846, -3784448, -2985998, -2330862, -2004882, -1643420, -1089638, -605867, -236003, 366948, 1273474, 1988594, 2052154, 1557136, 1045791, 1275977, 2839163, 5235437, 6487092, 4822095, 1041802, -1885377, -2161334, -1096529, -1005529, -2246501, -3536505, -4381207]
41548d381207j164156j708986j252657m5435P53172J092908J818594K718676K459452
41539B90361P20060r93590j243330l65023L39256L06386r5441m56296n99727l29480
41529b426824L03052O24281j3449j148181j446684l11433J217832J570324M26980
41520a204102j010168j509169j148315q55735q50479k46526J398880K775393K114312
41511e35909k25222j707550p72113J080214J452726L90559j02648N20412M99178
41502E99647j183634k824031k325794k03777J251078J072873M03988M81748J145349
41493a582553J382529M88783j270749k570586k017532N8281J458474P39012p74604
41484d088945r03238K27119P26599J13481k59767J01125J25535l74857l9309J240110
$$ y = [-4381207, -5545363, -7254349, -8507006, -8552441, -7799269, -6706361, -4887767, -2169091, 290361, 1010421, 16831, -1226499, -1591522, -1252266, -945880, -1041321, -1497617, -2097344, -2426824, -2123772, -1499491, -1512940, -2661121, -4107805, -4419238, -3201406, -1631082, -1204102, -2214270, -3723439, -4871754, -5727489, -6577968, -6824494, -5425614, -2650221, -535909, -761131, -2468681, -3240794, -2160580, -707854, -317295, -419943, 100469, 599647, -583987, -3408018, -5733812, -5937589, -4686511, -3613638, -3209650, -2727902, -1582553, -200024, 288759, -981990, -3552576, -5570108, -5511827, -4053353, -3314341, -4088945, -4992183, -4765064, -4038465, -3924984, -4184751, -4083626, -3958091, -4332948, -4372257, -3132147]
41474c132147J275454r96767l111529k238890P12133K420115J589853j73961j244836
41465d900575j443388r19242K50852J251993J145702M11676K67491N49898R2547
41456c293046q43398o64909O87893J200903o8905j358524q86179O00293J354199
41447c271673J187406R28188N95173j30499n49614P7932P94996Q7916j480150
41438a760325j705431k3273J434631P24356j391529k696164k194243n19381J458548
41429f672811L125876L627809K329668M5860j329299j015657l15973o38652j364639
41420b207818r16392M93972Q58913n77446j907282j170339R10484K145620J862290
41411e07998J040604J22816j306765k674894k330380m1202K024132J864903R3693
$$ y = [-3132147, -1856693, -2853460, -5964989, -8203879, -7491746, -5071631, -3481778, -3655739, -4900575, -6343963, -7263205, -7012353, -5760360, -4614658, -4202982, -3935491, -3385593, -3293046, -4136444, -4801353, -4113460, -2912557, -2981462, -4339986, -5226165, -4625872, -3271673, -2084267, -1156079, -560906, -691405, -1241019, -1163087, -368091, -280175, -1760325, -3465756, -3489029, -2054398, -1330042, -2721571, -5417735, -7611978, -8131359, -6672811, -3546935, 80874, 2410542, 2456402, 1127103, 111446, -204527, -843179, -2207818, -3124210, -2630238, -1771325, -2348771, -4256053, -5426392, -4515908, -2370288, -507998, 532606, 655422, -651343, -3326237, -5656617, -5697819, -3673687, -1808784, -1715091]
41402a715091j203625j154851n36910j44666O1058K80053K92641j74349q84067
41393e179807j120550l62857R84486J791178J495157Q67581Q92163J303474J176279
41384A847104N82858L42668K85248o03278k075272k417941j015617N17087O91981
41375a845162J46665J78035O46310O50007J63159l24435q25191j269000r12238
41366c391850L75260J260602P54966j84672l14958j81084p86321j385008p68258
41357d621323K06348j52642j231235q98378P90424J520147O03185N7708R69790
41348b755976J499766l0198k272382k864670j715299m75481J48766P62568J537856
41339f165050J703482Q15772l95795o63640N06996K026814J990966q4323k162557
$$ y = [-1715091, -2918716, -4073567, -4610477, -4755143, -4694085, -4414032, -4121391, -4295740, -5179807, -6300357, -6663214, -5678728, -3887550, -2392393, -1524812, -632649, 670825, 1847104, 2429962, 2772630, 3057878, 2454600, 379328, -2038613, -3054230, -2537143, -1845162, -1698497, -1520462, -874152, -224145, -60986, -385421, -1210612, -2479612, -3391850, -3016590, -1755988, -1001022, -1185694, -1500652, -1681736, -2468057, -3853065, -4621323, -4414975, -4567617, -5798852, -6697230, -5906806, -4386659, -3783474, -3725766, -2755976, -1256210, -1286408, -3558790, -6423460, -8138759, -8614240, -8465474, -7702906, -6165050, -4461568, -3645796, -4041591, -4705231, -4198235, -2171421, -180455, -264778, -2427335]
41330b427335j949187K3440J082790J24415j199192j301750o71937k77906J36655
41321f460007R93389J681719J654305J400492J239398N38769p28906j166472o0654
41312i07967J127290Q98944j6890j77628J37091j32654o54784n23911k34468o70393
41302a155370r93989J22558J805007J982249P01661r3050N5547l59568j667652
41293C97393k129531r60670K17055M4708o00693n62350l78894p90984r25752K65422
41283e424296J890295K149349P87546r25983k083511k629451k386957j003001
41275i626009J087054K634700K728123J511327j30441j196824j123670j67787
41267d283527Q46020J326200J237217O94973j51163p73759n87405J35394M11060
$$ y = [-2427335, -4376522, -4353082, -3270292, -3145877, -4345069, -5646819, -6318756, -6596662, -6460007, -5466618, -3784899, -2130594, -730102, 509296, 1048065, 319159, -847313, -907967, 219323, 1118267, 1101377, 923749, 1060840, 928186, 273402, -250509, -484977, -1155370, -2149359, -2026801, -221794, 1760455, 2462116, 2369066, 2424613, 2065045, 397393, -1732138, -2692808, -2475753, -2431045, -3031738, -3594088, -3972982, -4763966, -5689718, -5424296, -3534001, -1384652, -597106, -1523089, -3606600, -6236051, -8623008, -9626009, -8538955, -5904255, -3176132, -1664805, -1795246, -2992070, -4115740, -4283527, -3437507, -2111307, -874090, -179117, -330280, -1104039, -1691444, -1556050, -1144990]
41258a144990j35695q68536j243184j348472j095965q6769J196259J390457K92571
41249c044324l85668N77210J942011J846637N88621j19283O5613nn96697o91201
41239A82914j3025K90401l33030p69718q3255P98388L33011j423342k861759k762685
41229f642100j477558l05675j18982n47662m46572O54563J778963J696222O23003
41220d785798j37637j12103k7310j49578K83910J362973J722585O08239n23544
41211a758263q397J326174J297667k69142j329938p85426J96863N21987P97659
41202a0816J557527J654794O6376j941269k298272j058897l6467P552j10122q0009
41192b249603n78142j320055p58817J333139K775800J777404n69412j973569j913768
$$ y = [-1144990, -1280685, -2149221, -3392405, -4740877, -5836842, -5923611, -4727352, -3336895, -3044324, -3429992, -2852782, -910771, 935866, 1524487, 1405204, 1470817, 1470812, 874115, 182914, 169889, 460290, 127260, -642458, -725713, 72675, 405686, -1017656, -3879415, -6642100, -8119658, -8425333, -8544315, -9091977, -9538549, -8883986, -7105023, -5408801, -4785798, -4923435, -5035538, -5062848, -5212426, -4928516, -3565543, -1842958, -1234719, -1758263, -1766660, -440486, 857181, 588039, -741899, -1527325, -1330462, -808475, -10816, 1546711, 3201505, 3267881, 1326612, -971660, -2030557, -2067024, -2059472, -2169594, -2249603, -2827745, -4147800, -4906617, -3573478, -797678, 979726, 410314, -1563255, -3477023]
41183c477023j364047o52724M44458J122357K32361j489311j892282m38238J059929
41174f454520J235359Q94450J084637J165541K10659r22144o17312R95804K120216
41165b87310J699120M38158o17962j342685j997171k329272j835095o05210N54199
41156f323228Q92030M73321M6337Q7046K16768p1324l61109K49377J595609K235710
41146i59463J246769m91895j385860r23919J46323Q41785N53652p23252k046096
41137c741956k024399n14448P56192K44431j234929j568977k43003J176752J426288
41128e724049J006149R07716J120704J084668P44987M08096Q8662l47762p14440
41119a425269o76422k32470K31571K22285n16596j566236j804262m60512J633600
$$ y = [-3477023, -4841070, -5493794, -5049336, -3926979, -3694618, -5183929, -7076211, -7514449, -6454520, -5219161, -4324711, -3240074, -2074533, -1863874, -2786018, -3403330, -2407526, -287310, 1411810, 1849968, 1232006, -110679, -2107850, -4437122, -6272217, -6877427, -6323228, -5431198, -4957877, -4911540, -4824494, -4607726, -4679050, -5040159, -4790782, -3195173, -959463, 287306, -204589, -1590449, -2514368, -2368045, -1526260, -972608, -1695860, -3741956, -5766355, -6280803, -5524611, -5280180, -6515109, -8084086, -8327089, -7150337, -5724049, -4717900, -3810184, -2689480, -1604812, -859825, -451729, -363067, -710829, -1425269, -2101691, -2334161, -2102590, -1880305, -2396901, -3963137, -5767399, -6227911, -4594311]
41110d594311K529995J316332o95904j416719l35625J009138Q44384q56825k308220
41101d507755j828084K55304J922570J800216O59628J57428O69820J199244J035863
41092A364234M61336p9711m35863l38285L92011J087895P82553k75237q10097
41083B148836n08652m99081j325543j848221j024527M82338J494959J901809J857791
41074B679709O89960j732055l516780k668226n8561J496122J018127K28981M32799
41065a429924O60588k11234j286002j009777L43999J001621J09860j271445j541002
41056d633316k47037J575520K386580J540893j23212j247174j428646j306459
41048c482851j295848j017105j58773Q65337J486367J589377J244320M77030l47058
$$ y = [-4594311, -2064316, -747984, -1443888, -2860607, -3196232, -2187094, -1342710, -2199535, -4507755, -6335839, -6080535, -4157965, -2357749, -1698121, -1540693, -870873, 328371, 1364234, 1825570, 1745859, 1309996, 971711, 1363722, 2451617, 3234170, 2958933, 2148836, 1640184, 1141103, -184440, -2032661, -3057188, -2574850, -1079891, 821918, 2679709, 3369669, 1637614, -1879166, -4547392, -4605953, -3109831, -2091704, -1862723, -1429924, -769336, -980570, -2266572, -3276349, -2932350, -1930729, -1820869, -3092314, -4633316, -4880353, -3304833, -918253, 622640, 499428, -747746, -2176392, -3482851, -4778699, -5795804, -5954577, -5089240, -3602873, -2013496, -769176, -292146, -639204]
41039f39204n55136L6386R15605J658797K151286J881457K16712k053890k769146
41030H42867j063164J084625J292967q3058q11771j73080L50099l33364j474788
41021c68667k032857k078762j936453j219945K92222J691751J880945J065679
41013b706087M92739Q52531J509335J330812L2842j354284j497851l80072N23852
41004a196183J78529m67633J47137J705462K301604J208637k23206q19098j118080
40995A717169j868902k484994k152294j277676n79647K10732J381741J967189
40987c086682J063155l02911l59795P93248J496926J161050P36934O15744J1300
40978B128969j197712j829378j282163n27307m56992n94856k67543J79900K30678
$$ y = [-639204, -1194340, -1157954, -242349, 1416448, 3567734, 5449191, 5665903, 3612013, 842867, -220297, 864328, 2157295, 2074237, 1262466, 1089386, 1439485, 1106121, -368667, -2401524, -4480286, -6416739, -7636684, -7344462, -5652711, -3771766, -2706087, -2213348, -1360817, 148518, 1479330, 1512172, 157888, -1339963, -1720035, -1196183, -1017654, -1485287, -1338150, 367312, 2668916, 3877553, 3654347, 2835249, 1717169, -151733, -2636727, -4789021, -6066697, -6646344, -6435612, -5053871, -3086682, -2023527, -2326438, -2686233, -1892985, -396059, 764991, 1501925, 2117669, 2128969, 931257, -898121, -2180284, -2707591, -3164583, -3759439, -4026982, -3847082, -3616404]
40969c616404J54169K03811j22282j050236j684065j222508k44426K35109K87886
40960g058946O16416J188737J396648J133032P47448L08018k40235n86670n20556
40951c016108m35630o13821n58626J31007Q15112O58666j23392p52838r93131
40942d888761q66434q9658J065351J237376k25225j673409j047750J187171K754868
40933b546471K719518J975164R98752n52450j979976j738996j7117J112387P72979
40924G43790L21306N43134K25347j242268k193703j337714n5897q5805o79690
40915c761500k64892N95137L67406m91875m00029K78525k13419j670443j895133
40906g456223k89311J090291P56809j94214l01934q951l73378r77181o31657O40769
$$ y = [-3616404, -3462235, -3258424, -3380706, -4430942, -6115007, -7337515, -7581941, -7346832, -7058946, -6442530, -5253793, -3857145, -2724113, -1976665, -1668647, -1908882, -2495552, -3016108, -3451738, -4065559, -4624185, -4493178, -3678066, -3019400, -3142792, -3895630, -4888761, -5755195, -5844853, -4779502, -3542126, -3767351, -5440760, -6488510, -5301339, -2546471, 173047, 2148211, 3146963, 2594513, 614537, -1124459, -1141576, -29189, 743790, 1065096, 1608230, 1833577, 591309, -1602394, -2940108, -2996005, -3081810, -3761500, -4026392, -3431255, -3063849, -3555724, -3955753, -3677228, -3890647, -5561090, -7456223, -7745534, -6655243, -5898434, -6092648, -6394582, -6403533, -6776911, -7754092, -8385749, -7744980]
40896g744980J620759J515246O70709j03351l12990l8899K27906J16316k28101
40887d277385m93649p03434q81012n68865N24357J641562J690405P37222j46068
40878b476867m02288l46063j77032J55395K05767m64768j033272k44139J296462
40869c486805J423122m23879k118158j852381n41911J8218j06654L16648J342924
40860e428876J877599J423150L69211r20924k024589k077346q85149J13104m64365
40851h018185j645723j171726J180449L029283K523397N83551o53416m68380K57099
40842d383651P30434J053883J439671J447844N05916r64006j551484n02774R79083
40833a245084R65747o68014k019124j730830n55254K39876O37546J012538Q68489
$$ y = [-7744980, -6124221, -4608975, -3938266, -4041617, -4354607, -4393506, -4165600, -4049284, -4277385, -4771034, -5474468, -6355480, -6924345, -6399988, -4758426, -3068021, -2330799, -2476867, -2879155, -3225218, -3402250, -3246855, -3041088, -3505856, -4539128, -4783267, -3486805, -2063683, -2487562, -4605720, -6458101, -7000012, -6981794, -7088448, -6771800, -5428876, -3551277, -2128127, -1758916, -2679840, -4704429, -6781775, -7666924, -7553820, -8018185, -9663908, -10835634, -9655185, -6625902, -4102505, -3518954, -4172370, -4640750, -4383651, -3653217, -2599334, -1159663, 288181, 794097, -169909, -1721393, -2224167, -1245084, -279337, -947351, -2966475, -4697305, -5252559, -5012683, -4375137, -3362599, -2494110]
40824b494110n4482n13890N61378J919431J540123j41654p76004K53487J040751
40815A335030L62602n84931m54368K45132M91875M19570M24924L6657j007625
40806A268866j697885j069993K95391J213232J447683J253490L69720j204995
40798A875509k271643j751380m05263J91538k7884J87746J113285J518132O52402
40789A082442n75447r28723m18028K6494j26890n49808o65481l71221j01939j81128
40779b809729k71465J38512P64030P37528m8602o68327n83465l40376k86365K06046
40769c162213J255011J458894r7503j780563j281786R27540K100759J144306r6299
40760D68146P1580Q77717Q55770J86285r2199K2021j25242l38809R8950R34533
$$ y = [-2494110, -2548592, -3062482, -2501104, -581673, 958450, 816796, 40792, 294279, 1335030, 1697632, 1112701, 658333, 903465, 1395340, 1814910, 2239834, 2276491, 1268866, -429019, -1499012, -1203621, 9611, 1457294, 2710784, 3080504, 1875509, -396134, -2147514, -2552777, -2361239, -2389123, -2201377, -1088092, 430040, 1082442, 506995, -421728, -839756, -813262, -940152, -1489960, -2155441, -2526662, -2628601, -2809729, -3081194, -2942682, -2178652, -1441124, -1489726, -2158053, -2741518, -3081894, -3368259, -3162213, -1907202, -448308, -545811, -2326374, -3608160, -2680620, -579861, 564445, 468146, 539726, 1417443, 2273213, 2459498, 2367299, 2389320, 2264078, 1925269, 2024219, 2958752]
40750B958752J019046j36930j741450k667007k453717j498061p05855p14475j055427
40741f995124n23619J107501K333490J723811J6311p04724K13375J246737R90275
40732e91967N9787j5290R62636J685869J195598N3225n36096k19962K66607J56493
40722C016900m43981p98875m75213K23494P68779J055079J233699J046933q0854
40713E545961j943191l032353j955629N87291K138119J300573n23625j050309
40705A066837j23997M72510o7804n61058j40136J78627o17128j499080r07992
40696b199221N93031J052712J19767o16080k65846K60045J26269k60565n53908
40687a743796j174778j844406j153207J102706K679293J673799n47633j090276
$$ y = [2958752, 3977798, 3840868, 2099418, -567589, -3021306, -4519367, -5225222, -5939697, -6995124, -7518743, -6411242, -4077752, -2353941, -2337630, -3042354, -2828979, -1582242, -591967, -532180, -547470, 415166, 2101035, 3296633, 3349858, 2813762, 2593800, 2860407, 3016900, 2572919, 1774044, 1298831, 1522325, 2291104, 3346183, 4579882, 5626815, 5545961, 3602770, 570417, -1385212, -797921, 1340198, 2640771, 2117146, 1066837, 942840, 1415350, 1347546, 786488, 646352, 824979, 207851, -1291229, -2199221, -1606190, -553478, -433711, -1049791, -1315637, -1055592, -929323, -1189888, -1743796, -2918574, -4762980, -5916187, -4813481, -2134188, -460389, -1008022, -2098298]
40679b098298M83154J852089J362740j52307j148840j278814j025094p31783n69457
40670c306610n46058k35889O16767J160511L08062j277897j552349P028J401082
40661c425353R84758j11724J12981J336808J507215J34129r82230n07209O27192
40652c23433Q22113j7176p39731o12493M3898M81249K83945k25856j87575P21175
40642B46116J420726N44437j356399j923769n8625K264223K468203P89785l68121
40633D026576j6583L81534l90099j436311j384353m26996L43933N79561M97293
40624B174555j19099j466885k717641k653060j181632O13833J717614J779062
40616a853253R58628O9465L24791J786645K537249Q48711k043841l029509j200974
$$ y = [-2098298, -1615144, 236945, 1599685, 1447378, 298538, -980276, -2005370, -2737153, -3306610, -3852668, -4088557, -3471790, -2311279, -2003217, -3281114, -4833463, -4826435, -3425353, -2440595, -2552319, -2439338, -1102530, 404685, 538814, -443416, -950625, -323433, 498680, 481504, -258227, -870720, -826822, -345573, -61628, -287484, -475059, 246116, 1666842, 2211279, 854880, -1068889, -1127514, 1136709, 3604912, 4394697, 4026576, 4009993, 4391527, 4001428, 2565117, 1180764, 753768, 1097701, 1677262, 2174555, 2055456, 588571, -2129070, -4782130, -5963762, -5349929, -3632315, -1853253, -894625, -825160, -500369, 1286276, 3823525, 4672236, 2628395, -401114, -1602088]
40607a602088Q64963O10574j217904j923370m79726J500205K010231Q02397p05828
40598a40546j065342k04565P10022Q61563Q27242J422284J984842J098731j002026
40589D492205k280728j628932l31164m9306o36884r15766n20284O5707L94121
40580a411031Q6092j021988j950863j102786J215691K307474O54267j512294j225530
40571c960968R05235J873726Q68866j93333m07220r86163k131666j871102N80345
40562e322280K762969K165051k23448j480654p27899L86890N56898L00698N04154
40553a077621Q81532N01845o92637j478062p04118J045992J823504Q38907k06940
40544I32402N30111K056017J724110p35983k501440j539132P59595J844632J212172
$$ y = [-1602088, -737125, -126551, -1344455, -3267825, -3747551, -2247346, -237115, 565282, -140546, -1205888, -1410453, -700431, 161132, 988374, 2410658, 4395500, 5494231, 4492205, 2211477, 582545, 251381, 202075, -434809, -1350575, -1870859, -1805152, -1411031, -1324939, -2346927, -4297790, -5400576, -4184885, -1877411, -1223144, -2735438, -3960968, -3055733, -1182007, -313141, -506474, -913694, -1899857, -4031523, -5902625, -5322280, -2559311, -394260, -617708, -2098362, -2826261, -2439371, -1882473, -1581775, -1077621, -196089, 305756, -386881, -1864943, -2569061, -1523069, 300435, 1139342, 932402, 1462513, 3518530, 5242640, 4506657, 2005217, 466085, 1225680, 3070312, 4282484]
40535D282484N2784q88445j578758j797805j425735j006371q88927m74210O64168
40526c060815J697122J698456J131764R87999J104470N81757o42947j801655k416935
40517g20784k377594j448523J89048J427044J376724N70700L3612k14755o34145
40508a798673q80677l96411L01838L29965l3954Q7730N37330M85110J7827r2661
40498a442576J74067L24204N46239J119156J208032O7481j122979p66840K60653
40489C67437k34147j862192j832574M78988K163864J169896p17512r83425m5444
40480a495109K97093Q9910M89431J192420J018273J69540l08144o46684j767103
40471i60373l022685k708672p57301J027920J555146J515838J658533J655534
$$ y = [4282484, 4335268, 3446823, 1868065, 70260, -1355475, -2361846, -3250773, -3724983, -3060815, -1363693, 334763, 1466527, 2454526, 3558996, 4140753, 3497806, 1696151, -720784, -3098378, -4546901, -4357853, -2930809, -1554085, -983385, -949773, -1164528, -1798673, -2679350, -3075761, -2773923, -2443958, -2477912, -2390182, -1852852, -1367742, -1349915, -1442576, -1268509, -944305, -398066, 721090, 1929122, 1996603, 873624, 106784, 367437, 133290, -1728902, -3561476, -3082488, -918624, 251272, -466240, -1449665, -1495109, -1198016, -1108106, -618675, 573745, 1592018, 1761558, 1453414, 806730, -960373, -3983058, -6691730, -7449031, -6421111, -4865965, -3350127, -1691594, -36060]
40463c6060J149281N46730K31738M2822r4201J1268J17899l03464j014393j178319
40453e26699q16480q85849j524228j549125m25980N23604j2976j194134j084596
40444g496463N90107K078168J980903Q60307J42545K65371M97763J81895m66646
40435a366050q21173p03427m87664m28776k71447K15358O24385L89125j84025
40426c033694r2297Q56731J424578N09314j113597j530375j22116J619602J950919
40417D69065P82271o98133j589203j736719j110655K91388J893392K685679K189672
40408C176757Q39456o40669j689754j753684n21535J337425K425059K114870J186889
40399F474814M90553k40469j471692k529909k343150j141652k29970j97188n02860
$$ y = [-36060, 1113221, 1659951, 1891689, 1934511, 1840310, 1851578, 1969477, 1666013, 651620, -526699, -1343179, -2229028, -3753256, -5302381, -5728361, -5204757, -5217733, -6411867, -7496463, -6906356, -4828188, -2847285, -1986978, -1844433, -1579062, -1081299, -899404, -1366050, -2187223, -2890650, -3378314, -3807090, -4078537, -3863179, -3238794, -2849669, -3033694, -3125991, -2269260, -844682, -335368, -1448965, -2979340, -3101456, -1481854, 469065, 1251336, 553203, -1036000, -2772719, -3883374, -3591986, -1698594, 987085, 3176757, 4016213, 3375544, 1685790, -67894, -589429, 747996, 3173055, 5287925, 6474814, 6965367, 6724898, 5253206, 2723297, 380147, -761505, -991475, -1188663, -1691523]
40390a691523p88201j286429j673442q68360J263971K974784K355509l82356k984524
40381c080571l318961j229959J398718K309701J091591k59056L20658K168204
40373e99675K597450N69600j810527k214172j088206m66534q76781j097277m94487
40364e480609J01219m9852n06970m87425Q4701O91450Q27201L89033j22268L0910
40354d522610P83568J024591J10497r05399o11181O30262J245655R31365R02693
40345d10559J456620J152591o62346k149594j344136P84351J425985k29389j956495
40336a932972j575157L42547J564931J070722q1847l44072O77252K100882K692577
40327D514863J798355k11682k194705l094228k702650j588524m25805L87016O21435
$$ y = [-1691523, -2479724, -3766153, -5439595, -6307955, -5043984, -2069200, 286309, -96047, -3080571, -6399532, -7629491, -6230773, -3921072, -2829481, -3088537, -2767879, -599675, 1997775, 2567375, 756848, -1457324, -2545530, -3012064, -3888845, -4986122, -5480609, -5379390, -5429242, -5936212, -6423637, -6338936, -5647486, -4820285, -4431252, -4553520, -4522610, -3739042, -2714451, -2603954, -3509353, -4120534, -3490272, -2244617, -1313252, -410559, 1046061, 2198652, 1536306, -613288, -1957424, -1173073, 252912, 23523, -1932972, -3508129, -3165582, -1600651, -529929, -611776, -955848, -278596, 1822286, 4514863, 6313218, 6101536, 3906831, 812603, -1890047, -3478571, -3904376, -3517360, -2895925]
40318b895925K34986l87854o40433l75572n1670l087K6137L54722Q32843J186330
40308a719523J381270J243243L93050q23932j168387k39923M60219m06121j635816
40299b515920j104668O27108P77237j279170k726829j511003O66706J326591R71190
40290d768758J422310K098940J016933j278962j987195l95057R61885K77508r11500
40281c563896m20080J240245J893287Q43240o63080j472959j585721j380783r32492
40272f042239k58067L96003P44318P54831P12605R42798J305357J136810Q6704
40263b20880j129395j347757l22958R90260J500666R09771l03627j345318j623202
40254b892440j171192m18856N67077J961695L036607K321134j57282j998309j319331
$$ y = [-2895925, -2660939, -3048793, -3689226, -4064798, -4116468, -4119555, -4093418, -3738696, -2905853, -1719523, -338253, 904990, 1298040, 474108, -694279, -934202, -473983, -880104, -2515920, -3620588, -2993480, -2216243, -3495413, -6222242, -7733245, -7066539, -5739948, -4768758, -3346448, -1247508, -230575, -1509537, -3496732, -3891789, -2929904, -2652396, -3563896, -3983976, -2743731, -850444, -7204, -670284, -2143243, -3728964, -5109747, -6042239, -6300306, -5904303, -5159985, -4405154, -3692549, -2749751, -1444394, -307584, -220880, -1350275, -2698032, -3020990, -2030730, -530064, 379707, 76080, -1269238, -2892440, -4063632, -4482488, -3915411, -1953716, 1082891, 3404025, 3246743, 1248434, -70897]
40245g0897M22683M09609j385944k303455j095937N03266P41283Q9182l29053
40236c019263n51473q90745q41136n4576Q07416J121719J082718Q08301J4563
40227a522476q26429n98543M51067N62803p32870j505198l39736J434524J878125
40218a198733J091954J70785p58992j643034j331010N55799K029732J287844l95422
40209a91077o85759J07067j6340j070581j288672m50645m9411l13453L8400R81430
40199b939041R60239j84399p75449k59149M4927l01281j02983P01732L94869j261059
40189c721594j966882o43013M89076m46452j769860j101714P05711J281264P71910
40180f401554J157471K521002L029890K242097J557926J299114N5556k421236
$$ y = [-70897, 351786, 761395, -624549, -2928004, -4023941, -3520675, -2779392, -2690210, -3019263, -3570736, -4461481, -5302617, -5357193, -4549777, -3428058, -2345340, -1537039, -1522476, -2348905, -2947448, -2496381, -1933578, -2666448, -4171646, -4511382, -3076858, -1198733, -106779, 64006, -694986, -2338020, -3669030, -3113231, -1083499, 204345, -191077, -876836, -769769, -786109, -1856690, -3145362, -3596007, -3645418, -3958871, -3920471, -2939041, -1978802, -2163201, -2938650, -3197799, -3152872, -3454153, -3557136, -2855404, -2460535, -3721594, -5688476, -6331489, -5842413, -6288865, -8058725, -9160439, -8454728, -7173464, -6401554, -5244083, -2723081, 306809, 2548906, 4106832, 5405946, 5461502, 3040266]
40172C040266l997021k923183k07968J846144K313608J920381J545258J360517
40164D898002J005607N8759j344837k221939j648850r7105Q49301L56301p79450
40155A075789j396408j353125j157366q80519j98227P54342J279791R74745K71749
40146f29229j10255r2128k84284r63011j338487m52103J203970J839352O58907
40137a67268p96506n76069R40862J555359M25027p91355n28709L38681k7346j458314
40127a085638j896603m30851J305286J400072K19293l69011K51256P70620J37023
40118C01447p98902n84585N96735J063968n0769j589174j869779p87084K21415
40109c496728J12866m70775r0566J577424L109778K801471O04544j744462k583123
$$ y = [3040266, -956755, -3879938, -4087906, -2241762, 71846, 1992227, 3537485, 4898002, 5903609, 5962368, 4617531, 2395592, 746742, 649637, 1498938, 1855239, 1075789, -320619, -1673744, -2831110, -3711629, -3909856, -3155514, -1875723, -900978, -629229, -739484, -831612, -1115896, -2078907, -3417394, -3869497, -2665527, -826175, -167268, -963774, -1539843, -598981, 956378, 1381405, 590050, 61341, 400022, 372676, -1085638, -2982241, -3413092, -2107806, -707734, -488441, -857452, -606196, 164424, 301447, -497455, -1082040, -485305, 578663, 527894, -1061280, -2931059, -3718143, -3496728, -3383862, -3854637, -3945203, -2367779, 741999, 3543470, 4148014, 2403552, -179571]
40100a79571j898060q42247k37705j34991l98765p82857n49576Q61505K512811
40091a649456K456162K45562j982409j970500k33414P56950m3131j127259r02460
40082d449955J39433M93034j37265p63965p23815k59758K94420Q60558J127102
40073c420211P30986J45092L73524J330487J543621J95473j496991j972746j556678
40064d127443j600452j972383j197409R11476K607529K675106J852795J065962
40056B15181o2447j789687k877470k177372m65042Q47320J763484K756335K852273
40047A062575R17504j710333k328454o31505R02355O78185j72683j91062L08650
40038a164768M67443L49714J09445o67470j668905j454970L97182K122703K047902
$$ y = [-179571, -2077631, -2919878, -3157583, -3292574, -3691339, -4474196, -5023772, -4162267, -1649456, 806706, 1052268, -930141, -2900641, -3134055, -2377105, -2420236, -3547495, -4449955, -4310522, -3817488, -3954753, -4718718, -5442533, -5702291, -5407871, -4547313, -3420211, -2689225, -2544133, -2170609, -840122, 703499, 898972, -598019, -2570765, -4127443, -5727895, -7700278, -8897687, -7986211, -5378682, -2703576, -850781, 215181, 152734, -1636953, -4514423, -6691795, -7156837, -6309517, -4546033, -1789698, 1062575, 1980079, 269746, -2058708, -2690213, -1787858, -1109673, -1282356, -1473418, -1164768, -697325, -347611, -238166, -905636, -2574541, -4029511, -3632329, -1509626, 538276]
40029E38276Q12562K4552q9811k60794m91971l57840j50722k71932k32010L64982
40019a14708O60199j60322j201515j101776k36973M2102k10011J90474J210578
40010i21952J475694N54942l50278k51754N04097J142006J244884O15534m23310
40001C589863p33355K80970J257298M33483j532692k177166p66543P97513J030566
39992B179937P29098R43507J102986N11190J03927J052118K605074K918371J544028
39983A3690236j66518q76741n28858K3416m8308q55082j671649j729070j179302
39974F658124p58142n71839j01069N78707P27318K83428K467o4687p49773j863451
39964D141083j789978j3252J534531J072673m02104p44069J68923P76958N91248
$$ y = [538276, 1350838, 1375390, 1285579, 1024785, 532814, 174974, 24252, -247680, -479690, -114708, 545491, 385169, -816346, -1918122, -2155095, -2112993, -2323004, -2132530, -921952, 553742, 1108684, 758406, 506652, 1010749, 2152755, 3397639, 4013173, 3589863, 2856508, 3137478, 4394776, 4828259, 3295567, 1118401, 351858, 1149371, 2179937, 2909035, 3852542, 4955528, 5466718, 5570645, 6622763, 9227837, 12146208, 13690236, 13523718, 12646977, 12118119, 12141535, 12093227, 11238145, 9566496, 7837426, 6658124, 5899982, 5328143, 5227074, 5805781, 6533099, 6816527, 6818994, 6754307, 6004534, 4141083, 2351105, 2337853, 3872384, 4945057, 4542953, 3798884, 3967807, 4744765, 5336013]
39955E336013N11556O62278L5292j382512j960367o99440J101669J367232k52978
39946D718743k092362k327999p30030J257477K043258J556166J118282J471966
39938G015501J617410L43453j664922k386781j011723J125189K260530J971762
39930I270419J070202N17279O86288J115761Q84029k49463j181493o75090Q61222
39921A2299154J761960J388058R50307J598754K678589K712628J498901K71305
39913B5159656k9599K46214L66734M29686J120378K499659L672376L884760L467838
39904D0817702L210601L182391K974441K934555M020517O103101P572588P416706
39896G8232602O774443P436364R526814J1798256J3631957J5405195J7164095
$$ y = [5336013, 5847569, 6509847, 6545139, 5162627, 3202260, 2502820, 3604489, 4971721, 4718743, 2626381, 298382, -431648, 825829, 2869087, 4425253, 5543535, 7015501, 8632911, 8976364, 7311442, 4924661, 3912938, 5038127, 7298657, 9270419, 10340621, 10857900, 11544188, 12659949, 13543978, 13294515, 12113022, 11437932, 12299154, 14061114, 15449172, 16399479, 17998233, 20676822, 23389450, 24888351, 25159656, 25130057, 25376271, 25743005, 26172691, 27293069, 29792728, 33465104, 37349864, 40817702, 44028303, 47210694, 50185135, 53119690, 57140207, 63243308, 70815896, 78232602, 85007045, 92443409, 101970223, 113768479, 127400436, 142805631, 159969726]
39889A59969726J8361392J9059116K0267163K2839358K6822468L1848527L7208015
39882C36375765M1503311M3150809M1235233L5084764K3534817O302235j3700411
39875E13486523l1071811m1809789m5756935m5120185m1953122l7543817l2774197
39868B37456667k8005093k3309895j9285781j6726340j5268916j3706997j2000356
39861A09153289j1301193j1370497j0047535o619152l735158l990319o111846
39854E5977589o811754n332124l704068l188747l052650k697499k507260k337548
39846B6345939j408282j32088O037j082818j706731j088439n02707r52476j627893
39837A7850542j662002j585720j854428j655047n58289K21123k55927r17919n40954
$$ y = [159969726, 178331118, 197390234, 217657397, 240496755, 267319223, 299167750, 336375765, 377879076, 421029885, 462265118, 497349882, 520884699, 527186934, 513486523, 482414712, 440604923, 394847988, 349727803, 307774681, 270230864, 237456667, 209451574, 186141679, 166855898, 150129558, 134860642, 121153645, 109153289, 97852096, 86481599, 76434064, 69814912, 66079754, 62089435, 55977589, 49165835, 43833711, 40129643, 36940896, 33888246, 31190747, 28683487, 26345939, 24937657, 24805569, 24811606, 23728788, 22022057, 20933618, 20430911, 19478435, 17850542, 16188540, 14602820, 12748392, 11093345, 10535056, 10756179, 10500252, 9582333, 9041379]
39828I041379k29p42051k108843k309653j285252m27071J2975R02100J821895
39819D905250J141833j122795k712246k112775l72485P79694R59525N14081m17086
39810A562996j197644o05630J272011K347873J144165r57853j573568n65975K14130
39801A640505j01625m87357p0307N57845N60292J83993J73960N60268O79261J29887
39791C826722o90352r77776m09435L40869K26945q48680j734181j420610l08641
39782a995139M60841N51002N84894J005004J586537K041930K339189K316954J665545
39773A0556757N06984n23506r79672r95183q62249o33236l02130n2911j34185
39764F580669o08275j236933j563778j315899q28407o97737q37481m57282O51934
$$ y = [9041379, 9041150, 8299099, 6190256, 3880603, 2595351, 2168280, 2181255, 3083355, 4905250, 6047083, 4924288, 2212042, 99267, -273218, 506476, 1466001, 1980082, 1562996, 365352, -240278, 1031733, 3379606, 4523771, 3565918, 1992350, 1426375, 1640505, 1538880, 1051523, 981216, 1539061, 2099353, 2283346, 2457306, 3017574, 3696835, 3826722, 3136370, 2158594, 1749159, 2090028, 2316973, 1468293, -265888, -1686498, -1995139, -1534298, -983296, -398402, 606602, 2193139, 4235069, 6574258, 8891212, 10556757, 11063741, 10540235, 9560563, 8565380, 7703131, 7069895, 6767765, 6714854, 6580669, 5972394, 4735461, 3171683, 1855784, 1027377, 329640, -507841, -965123, -313189]
39755c13189J533837J398823P76694M53035P7815q69091j443650l80322J377972
39746B611924J370351p82142k473197j700092K19160Q07917j48379r72081r01781
39737a968320p35827j029487j234156p40015K96689J273222J569260Q07153n92540
39728b354021j355917o36649Q61902J773612J745804J378274Q71238j18892j354005
39719H11346j895411j315694j43083J014544J864074J856042M07666j787474k741349
39710a929339j388071P82316J278629m04722k222183k103707l18155J141510J110001
39701d053721M28516M35598J046954J120762L91758q7987L22623P85341L34212
39692G24056n82903q64474m28667n6966J0505J76870M11952K44005k17637l88178
$$ y = [-313189, 1220648, 2619471, 3396165, 3849200, 3927015, 3057924, 1614274, 1233952, 2611924, 3982275, 3200133, 726936, -973156, -753996, 53921, -94458, -1066539, -1968320, -2704147, -3733634, -4967790, -5707805, -5411116, -4137894, -2568634, -1761481, -2354021, -3709938, -4346587, -3484685, -1711073, 34731, 1413005, 2284243, 2165351, 811346, -1084065, -2399759, -2542842, -1528298, 335776, 2191818, 2599484, 812010, -1929339, -3317410, -2535094, -1256465, -1661187, -3883370, -5987077, -6305232, -5163722, -4053721, -3625205, -3189607, -2142653, -1021891, -630133, -718120, -395497, 389844, 724056, 141153, -723321, -1151988, -1208954, -1198449, -1021579, -609627, -365622, -583259, -971437]
39682i71437l88045r44715j906705k062413r18895L93157O28378P96m03835q4525
39672f658239O72818J464591J948546J749605Q00137m21451j308816j515121q58706
39663d126636N27345J734426J562512l1930j614546j911827j162101l51047J48990
39654e224814M87719N96675M19255L59514O37427O90330J31947k29559N08812
39645a622694J621528J526131K00582o64358k11892L78252o4644q00400m61532
39636i9027P04026J241984O75019q5164l91302o00137r45423r16518l29310N184
39626g40668n19933j221655j169193o99371p82635j270323j082848r6446N56603
39617g026469M06237M79477J471622K309376J687732J81277n26938p1889L04714
$$ y = [-971437, -1359482, -2304197, -4210902, -6273315, -7192210, -6799053, -6170675, -6169879, -6573714, -6658239, -5985421, -4520830, -2572284, -822679, -22542, -443993, -1752809, -3267930, -4126636, -3599291, -1864865, -302353, -334283, -1948829, -3860656, -5022757, -5373804, -5224814, -4737095, -4140420, -3721165, -3361651, -2724224, -2033894, -1901947, -2131506, -1622694, -1166, 1524965, 1725547, 1061189, 849297, 1227549, 1162905, 362505, -99027, 604999, 1846983, 2522002, 2436838, 2045536, 1445399, 499976, -416542, -745852, -740668, -1260601, -2482256, -3651449, -4350820, -5133455, -6403778, -7486626, -7583072, -7026469, -6620232, -6140755, -4669133, -2359757, -672025, -490748, -1017686, -1089575, -784861]
39608g84861j99910q86451p90217j4958N66110L67173l91564q79418m34357N32655
39598b915798Q03832J4942o30612j73451M04101k67560j331250o44351J708181
39589c031966L015571J661439p19348j777378j395319q31824m28823K32519Q76415
39580b398714P93369M2354p23283j089159p38778O13335K217849K330787M75080
39571A522840j427533j577835q06512q61545j347895o42054Q65696J068906l55883
39562c561815j295204n23787O33428P96216N81702R49272J224390K83425j420952
39553b333325k417701k072672p94639R01225K438552K853617J588207n27130j881864
39544b245730j652403l70053P98151R63987P6894j006811j260995n53523L01373
$$ y = [-784861, -984771, -1871222, -2661439, -2676397, -2110287, -1743114, -2134678, -3014096, -3448453, -2915798, -2111966, -2097024, -2727636, -2901087, -2496986, -2764546, -4095796, -4740147, -3031966, -16395, 1645044, 925696, -851682, -2247001, -3078825, -3507648, -3275129, -2398714, -1605345, -1562991, -2286274, -3375433, -4114211, -3500876, -1283027, 1047760, 1522840, 95307, -1482528, -2289040, -3150585, -4498480, -5140534, -4274838, -3205932, -3561815, -4857019, -5380806, -4747378, -3951162, -3369460, -2420188, -1195798, -912373, -2333325, -4751026, -6823698, -7618337, -6717112, -4278560, -1424943, 163264, -363866, -2245730, -3898133, -4268186, -3470035, -2506048, -2429154, -3435965, -4696960, -5250483, -4949110]
39535d949110O25267N31586M07743L31368J87122j44005p53717j286631p46999
39526e797376J274466L240792K891367J95537k242010k341739q43761L04869M82773
39517b835082J88978m32965j323276j594830n59131P47280O30683q01140j678147
39508g657630r14174N78082J395886J200392M67593k70303n09310O5268J034378
39499d609818J456502R79816K56391O877J69144K30280k5128l67761m66927k55820
39489b626444r9895m52322j103199j152906k30277P32292P63697M79811J227785
39480b461458K691378K840807P76105j739958k538375j763538j090428r86404
39472d271871l65860J138494K189586J631252K00111n37501k38934J88279J80326
$$ y = [-4949110, -4323843, -3792257, -3384514, -3053146, -2866024, -3010029, -3763746, -5050377, -5797376, -4522910, -1282118, 1609249, 1804786, -437224, -2778963, -3622724, -3317855, -2835082, -2646104, -3079069, -4402345, -5997175, -6556306, -5809026, -5178343, -5979483, -7657630, -8571804, -7993722, -6597836, -5397444, -4929851, -5200154, -5709464, -5644196, -4609818, -3153316, -2173500, -1917109, -1910232, -1741088, -1510808, -1535936, -1903697, -2370624, -2626444, -2726339, -3178661, -4281860, -5434766, -5665043, -4932751, -4169054, -3689243, -2461458, 229920, 3070727, 3846832, 2106874, -431501, -2195039, -3285467, -4271871, -4637731, -3499237, -1309651, 321601, 521712, -15789, -254723, -66444, 113882]
39463A13882O4317Q7738k6854k88458j61469L94343M57331n14050j558180j399658
39453b831058k68472N82926Q18910J102630J316263L45863j830998l342228k693200
39444f799364p64459M87973M25025k38024q93189j239376p06977Q44687K217404
39435f666300K088530R48259M49406R57119J231013N94015j69194m26151o64573
39426a657876j207315j344819o18599J76057K42229J00742O31945J532097J774908
39417c70631J123652K61165k21737k30746O483j32347j291848k893171k992162
39408f741342n50039K655658L753835K243493L71040n975N12988L92594n81406
39399B050846j473121j744745j598036j214443o16210j47623k56532o85371n47219
$$ y = [113882, 178199, 265937, 239083, -49375, -210844, 183499, 640830, 126780, -1431400, -2831058, -3099530, -2516604, -1697694, -595064, 721199, 1067062, -763936, -4106164, -6799364, -7563823, -7075850, -6650825, -6888849, -7782038, -9021414, -9728391, -8883704, -6666300, -4577770, -3629511, -3180105, -2222986, -991973, -397958, -567152, -993303, -1657876, -2865191, -4210010, -4828609, -4652552, -4410323, -4309581, -3677636, -2145539, -370631, 753021, 1014186, 792449, 561703, 568186, 435839, -856009, -3749180, -6741342, -7291381, -4635723, -881888, 1361605, 1732645, 1726670, 2239658, 2632252, 2050846, 577725, -1167020, -2765056, -3979499, -4595709, -4743332, -4999864, -5685235, -6232454]
39390f232454M83860J511340J400767K48937o47987m18547K93786L37084k03411
39381c226625j29832Q97429J517149M72750j493253k555446k177145j389383q67084
39372h951440j17417J091016J838797J409679N37584L08074N37853L45059j70196
39363c170991m9374Q83433J692665J752391J439131J148359O12853l35316j153098
39354B820053j333185j153115j100235j061711o95305j98554n6793k48098k58378
39345c285321K14369R33179J337123Q89275l71243j370350p76903J186915K429130
39336A186174J384520q49987j912867j290526o22999j003092j576384j239866
39328e925027k59682N53827J037846J150829M13356r91747j558154k98791J430910
$$ y = [-6232454, -5748594, -4237254, -2836487, -2587550, -3235537, -3654084, -3360298, -3023214, -3226625, -3356457, -2459028, -941879, -469129, -1962382, -4517828, -6694973, -8084356, -8951440, -9068857, -7977841, -6139044, -4729365, -4191781, -3883707, -3345854, -3000795, -3170991, -3220365, -2336932, -644267, 1108124, 2547255, 3695614, 4308467, 3973151, 2820053, 1486868, 333753, -766482, -1828193, -2523498, -2722052, -2778845, -3026943, -3285321, -3070952, -2137773, -800650, 88625, -282618, -1652968, -2429871, -1242956, 1186174, 2570694, 1720707, -192160, -1482686, -2105685, -3108777, -4685161, -5925027, -6184709, -5630882, -4593036, -3442207, -3028851, -4020598, -5578752, -5877543, -4446633]
39319d446633J482900p5732j087498l72957R34653J407300J120283P63428L11440
39310C7184l93599p13663o5177Q67686R25384J73355l13698k54027n32336j506377
39300a775268k107868j381109p9117L42409q8954N7665J249005K006309J027247
39291g49681p20077j225051k35743N59862Q9187q27689j141948j104914j286285
39282f642339j245749l95154O10280O96100J45892K03138J061037J566522J039428
39273b960845K13610N8983N94749J188363J290109O75493l35933q25746k09642
39264c10859P76720R20813L10057J19539N65499N02403n08121j227088p04401
39255D44562R2429k03910j197923j412719n08326M89982Q57040Q48823P60245
$$ y = [-4446633, -2963733, -3039465, -4126963, -4499920, -3565267, -2157967, -1037684, -274256, 37184, -356415, -1070078, -1135255, -267569, 657815, 831170, 517472, 263445, -268891, -1775268, -3883136, -5264245, -5343362, -5000953, -5089907, -5032242, -3783237, -1776928, -749681, -1469758, -2694809, -2930552, -2370690, -2281503, -3109192, -4251140, -5356054, -6642339, -7888088, -8283242, -7672962, -6976862, -6830970, -6627832, -5566795, -4000273, -2960845, -2747235, -2688252, -2093503, -905140, 384969, 1060462, 724529, -101217, -310859, 465861, 1386674, 1696731, 1816270, 2381769, 2884172, 2376051, 1148963, 444562, 536991, 333081, -864842, -2277561, -2785887, -2295905, -1438865, -590042, 170203]
39246A70203L20722p09073j860201k109426p67411J475180K581739J179495j361194
39237a079966k126435l90045J375824J123580J41216O82015K145256J979905k84917
39228C566433k370568k580287j597328o78331p6342J98827j57507q21641q47819
39219e364563j59571L43283N00520J060611J744934J151120o09657j290791J89809
39210b434305J799082J387904j47504o90431l20909n34563j213826j025243j77124
39201c356919n5536l68637N03081K093001J761369j029276l124732k020955M80267
39192e118337J094552j90440p52670K34916Q31294j53443j213572o78209O52784
39183e293125Q17383l96324j313414p96903M49979J116432Q52989K08011l45465
$$ y = [170203, 490925, -218148, -2078349, -4187775, -4955186, -3480006, -898267, 281228, -1079966, -3206401, -3596446, -2220622, -1097042, -955826, -273811, 1871445, 3851350, 3566433, 1195865, -1384422, -2981750, -3660081, -3736423, -3537596, -3695103, -4516744, -5364563, -5524134, -5180851, -4680331, -3619720, -1874786, -723666, -1333323, -2624114, -2434305, -635223, 752681, 605177, -85254, -406163, -940726, -2154552, -3179795, -3356919, -3412455, -3781092, -3278011, -1185010, 576359, -452917, -3577649, -5598604, -5118337, -4023785, -4214225, -4966895, -4731979, -3900685, -4054128, -5267700, -5945909, -5293125, -4475742, -4872066, -6185480, -6982383, -6532404, -5415972, -4562983, -4354972, -4700437]
39174d700437p23112q36126m46885N22200J799024K867828L105226K061949N3979
39165C703646j680703k049015j383923j006045j381470j560174q32932L5111O3995
39156f091510k86573N4243Q03659O71398m11495r70050k75536M89772J49509n73510
39146f440093j87467J317080K530735K552251J767090Q61727P6960m72272o01039
39137A404972m67901n68216r79124j060242l19241O56317O14235q64102k571556
39128d154858k815118j392046J20520M24148K06563R15828K316455K688582J507806
39119a82120K80529Q6114n1624j138427k061022j272256L92389P32857m25593
39110c639153j093807l93703L00802K2365j94886N50975J218993O54347k47536
$$ y = [-4700437, -5423549, -6259675, -6706560, -6184360, -4385336, -1517508, 1587718, 3649667, 3703646, 2022943, -26072, -1409995, -2416040, -3797510, -5357684, -6190616, -6155505, -6091510, -6378083, -6323840, -5520181, -4848783, -5260278, -6230328, -6505864, -6016092, -5866583, -6440093, -6627560, -5310480, -2779745, -227494, 1539596, 2401323, 2478283, 2006011, 1404972, 937071, 368855, -610269, -1670511, -1989752, -1333435, -719200, -1583302, -4154858, -6969976, -8362022, -8241502, -7817354, -7610791, -6694963, -4378508, -1689926, -182120, 98409, 184523, 132899, -1005528, -3066550, -4338806, -3946417, -3213560, -3639153, -4732960, -5126663, -4825861, -4803496, -4998382, -4447407, -3228414, -2574067, -2821603]
39101b821603L7968J053638R77436o33260k324699k749196j800964L8653K066031
39092f155996L087509K210008J96713j088207q71430j16016J89416K01171K65183
39083b081649J85q37744j441085r07812K98734P45705j72357j438172j496368
39074g330563J37539K331508L279440K138195j51956j786216j799849o76734N15055
39065c343581J087746R19254L25930r8990l0775J13522k20611o75810l47726O52127
39055a618914R83381p4499j444868j650506o97736K26617L66731j47800r72988
39046e030582j710889j707487o91402M99453P68933L19194M12235J457739K300503
39037c382303J815410M55198l69385l0768P29990Q16965L128r45969j287785j227400
$$ y = [-2821603, -2783635, -1729997, -752561, -1385821, -3710520, -6459716, -8260680, -8222027, -6155996, -3068487, -858479, -661766, -1749973, -2621403, -2737419, -2548003, -2346832, -2081649, -2081464, -2919208, -4360293, -5268105, -4969371, -4223666, -4396023, -5834195, -7330563, -7193024, -4861516, -1582076, 556119, 404163, -1382053, -3181902, -3858636, -3343581, -2255835, -1336581, -1010651, -1109641, -1140416, -1026894, -1247505, -1923315, -2271041, -1618914, -635533, -710032, -2154900, -3805406, -4503142, -4276525, -3909794, -4057594, -5030582, -6741471, -8448958, -9140360, -8640907, -7871974, -7552780, -7140545, -5682806, -3382303, -1566893, -1111695, -1481080, -1511848, -781858, 35107, 38235, -907734, -2195519, -3422919]
39027c422919j438008j676442p11098J760899L901058L598135J226740p57725
39019B480640r76889n02111p55676j492974j690880j245975o59681J16546J257218
39010c469782K006853J368080k79115j374437j066089j4731P21650P35048J28703
39001a243820p66292j306534r63756j20469K55256n1753k69902p230J08070k86285
38991d652715l25625P86226K181874K225261P71847n99598o58314J97784R17780
38982H44520J033123N04067o79674j995723k244968r02757P89671J117024J27621
38973a407096m88019J36591Q47820K97933j018396j538074q79502j50817j13285
38964d312845k23834J22303M19804p2739r17353r74725j30435M69303J30996l44245
$$ y = [-3422919, -4860927, -6537369, -7248467, -5487568, -1586510, 2011625, 3238365, 2480640, 1503751, 1001640, 245964, -1247010, -2937890, -4183865, -4843546, -4727000, -3469782, -1462929, -94849, -373964, -1748401, -2814490, -2829221, -2107571, -1372523, -1243820, -2010112, -3316646, -4280402, -4400871, -4145615, -4197368, -4467270, -4474500, -4366430, -4652715, -4978340, -4192114, -2010240, 215021, 986868, 387270, -271044, -73260, 844520, 1877643, 2381710, 1702036, -293687, -2538655, -3441412, -2651741, -1534717, -1407096, -1895115, -1758524, -910704, -612771, -1631167, -3169241, -4048743, -4199560, -4312845, -4536679, -4414376, -3994572, -4067311, -4984664, -5959389, -6089824, -5620521, -5489525, -5833770]
38954e833770P4914J008009J180186L17594m75708l87346J0420j23120m63880
38945d692701j02022Q52018J298898Q06128K33326L64951P72793O22323k3099
38936A32615m13154k37336J35530K89567L0291p13679j605160j770765p37128
38927d889219O37989R94634K03977n58580m71176J43175P51583J212196J160259
38918h15162P1719j433339j643304j09877J228228N99885r53972j176234l1602
38909d263658N67558J31632K16548J288962J498955k08904j951610j673125l29296
38900d722938j02347o96201o0970J739282K266787O66419p99728k80530Q18800
38891a171426J64440j919645l088487k278344n55601Q58212J718486K025419J646512
$$ y = [-5833770, -5758856, -4750847, -3570661, -3253067, -3728775, -4116121, -4105701, -4228821, -4692701, -4794723, -3942705, -2643807, -1837679, -1604353, -1239402, -466609, 155714, 132615, -280539, -517875, -382345, -92778, -62487, -776166, -2381326, -4152091, -4889219, -4251230, -3256596, -3052619, -3611199, -4082375, -3939200, -3187617, -1975421, -815162, -743443, -2176782, -3820086, -3929963, -2701735, -2101850, -3055822, -4232056, -4263658, -3696100, -3564468, -3347920, -2058958, -560003, -768907, -2720517, -4393642, -4722938, -4825285, -5521486, -5582456, -3843174, -1576387, -909968, -1709696, -1990226, -1171426, -1006986, -2926631, -6015118, -8293462, -8849063, -7990851, -6272365, -4246946, -2600434]
38882b600434Q69802K67140j06985n11725o52559o3710P54369P72771K7818m65455
38872a708968m54522o69392j068938n59415Q45027J283209l30522k354750k559645
38863g577916j082417L63124J206760J986959K305455J173169o18444q05080J050653
38854a997737K551534J712906m25275j556132j084531p3807O43864Q92987N20822
38845A184631k43577l70508O83437J708122J084793r15850k477193k625523j934866
38836c906534j042849P222Q51859P84049M1158k47331J57746K42489l25714m34753
38826c872658M59780J116897N51781j41234L34390R78973j1876j972459k387896
38817d944302p13481Q43692Q34644M96524J106957J581012M51370j333775j678433
$$ y = [-2600434, -1730632, -1463492, -1570477, -2082202, -2734761, -2798471, -2044102, -1271331, -1243513, -1708968, -2163490, -2832882, -3901820, -4461235, -3616208, -2332999, -2663521, -5018271, -7577916, -8660333, -8297209, -7090449, -5103490, -2798035, -1624866, -2243310, -3048390, -1997737, 553797, 2266703, 1841428, 285296, -799235, -873042, -229178, 663809, 1184631, 941054, 570546, 1253983, 2962105, 4046898, 3131048, 653855, -1971668, -3906534, -4949383, -4942161, -4090302, -3306253, -3265095, -3512426, -3354680, -3112191, -3437905, -3872658, -3412878, -2295981, -1744200, -1885434, -1551044, -572071, -583947, -2556406, -4944302, -5657783, -4814091, -3979447, -3482923, -2375966, -794954, -343584, -1677359, -3355792]
38808c355792m93924M87260N70968O72374J067781P02288o69590j461899m38439
38799b918973J330379J860652Q31286l09578l49676N18788J291463J141792n5013
38790C341120j562352k190726j352046K57872J285369R80645k64588j396917j551340
38781b452963o82377M51463J072283J131793J035937Q53809L63455k99603q01197
38772F72600j257321j760296j464495M08761K571238K533553J28610j787200j313708
38763a268258j63557n74867j563816q80374P80270Q16588o74102r06000P54654
38754c679462J556333N2738j353605m65186R87373K36716k019430k870806j626541
38745i181870j67377M04682P66069J245531J175785N52578K23799J27761o81592
$$ y = [-3355792, -3849716, -3362456, -2791488, -2119114, -1051333, -349045, -1018635, -2480534, -2918973, -1588594, 272058, 1103344, 793766, 444090, 962878, 2254341, 3396133, 3341120, 1778768, -411958, -1764004, -1506132, -220763, 759882, 495294, -901623, -2452963, -3135340, -2683877, -1611594, -479801, 556136, 1409945, 1773400, 1473797, 672600, -584721, -2345017, -3809512, -3400751, -829513, 1704040, 1832650, 45450, -1268258, -1431815, -2006682, -3570498, -4450872, -3670602, -2854014, -3528116, -4434116, -3679462, -2123129, -2070391, -3423996, -3889182, -2901809, -2665093, -4684523, -7555329, -9181870, -9349247, -8944565, -8178496, -6932965, -5757180, -5204602, -4980803, -4853042, -5534634]
38736e534634j831915j468835Q51629K867109K444714M29739p22659l05442J68926
38727c101368m18012j181142p38202N65215Q95316n91122k310123k011525L08915
38718h582048K289295K228797J083159O50444Q66767L63453q67409j174815J89546
38709b952811J769893J824345M47257r37277j367719r11619r9783M35591J62031
38700a630092q08067j552817j259000k31468M11185N2834o77037n87320O86269
38691e595513K097725K224817R11810n09886q40512l61397j62347o22731j165864
38682d023898j134177k80597J199079K443817K261865N81473r38292q18447K12919
38673d96258M09117k50778k39364P05482R60405k70427j478647j070361L84340
$$ y = [-5534634, -7366549, -8835384, -7983755, -5116646, -2671932, -2242193, -2964852, -3270294, -3101368, -3519380, -4700522, -5438724, -4873509, -3978193, -4569315, -6879438, -8890963, -8582048, -6292753, -4063956, -2980797, -2330353, -1463586, -1100133, -1967542, -3142357, -2952811, -1182918, 641427, 1088684, 151407, -1216312, -2127931, -2227714, -1792123, -1630092, -2438159, -3990976, -5249976, -5481444, -5070259, -5017425, -5694462, -6281782, -5595513, -3497788, -1272971, -361161, -871047, -1711559, -2072956, -2235303, -2858034, -4023898, -5158075, -5438672, -4239593, -1795776, 466089, 1047562, 109270, -709177, -496258, -87141, -337919, -577283, 128199, 1088604, 818177, -660470, -1730831, -1346491]
38664a346491J215763Q42274j45498j106749j534167r65251L05675J130259R14870
38655f89315L59212J38710r5712n88692n93245K28272O93253j74364j310350j116957
38645c149188K3215N02807J22757M3396M52016L03271n69291j005698n37881j57329
38635c971925n40032r66748o09181L36188J313089K059997K172354J205852k90763
38626G08831j003119o21722k52651n89334r40989o95318m11079o00584o75846
38617e081811j29912L53653Q3648l74062k93716j48988n32855o53418M95277K138231
38607d143953K594531J706770O82732j31436j362600k555401k203004l74618P58193
38598e028786O1444o82865N28032K747728L361598J708197l58312j196955j046772
$$ y = [-1346491, -130728, 711546, 566048, -540701, -2074868, -3040119, -2734444, -1604185, -689315, -330103, -191393, -287105, -875797, -1469042, -1240770, -547517, -721881, -2032231, -3149188, -3125973, -2623166, -2500409, -2457013, -2004997, -1701726, -2271017, -3276715, -3814596, -3971925, -4511957, -5478705, -6087886, -5751698, -4438609, -2378612, -206258, 999594, 708831, -294288, -916010, -1168661, -1757995, -2698984, -3394302, -3805381, -4405965, -5081811, -5211723, -4858070, -4774422, -5148484, -5442200, -5591188, -6124043, -6777461, -6282184, -4143953, -1549422, 157348, 840080, 708644, -653956, -3209357, -5412361, -5786979, -5028786, -4967342, -5650207, -5122175, -2374447, 987151, 2695348, 2337036, 1140081, 93309]
38589I3309r16982j178228j572802j660928j009419L05423J316836J083257j3064
38580c552598p44544p47820o81097o85470r3889R62047J179392J42581o58905
38571d880303p5985O78742j26935j773322j942901k64435J035049L68553j110166
38562h091703j443234n10983L34000L70013J28308L09102R23040J401455J131812
38553e448190N8644j073102j427956j097196q47464q12393k73777R93162K085782
38544g842490K188125J590253R43304L54652j07837Q3630R98035J594467J031823
38535H33962J5227k51980R2533m87o46100r86315q35569r35252j408104j297038
38525e419123j04476J269749J675927R94013j89214j390179k162723j917067n38243
$$ y = [93309, -823673, -2001901, -3574703, -5235631, -6245050, -5939627, -4622791, -3539534, -3552598, -4297142, -5044962, -5726059, -6411529, -6505418, -5543371, -4363979, -4221398, -4880303, -4956288, -4277546, -4404481, -6177803, -8120704, -8385139, -7350090, -6981537, -8091703, -9534937, -10045920, -9711920, -9341907, -9213599, -8904497, -7981457, -6580002, -5448190, -5389546, -6462648, -7890604, -8987800, -9835264, -10647657, -10921434, -9928272, -7842490, -5654365, -4064112, -3120808, -2766156, -2873993, -2790363, -1792328, -197861, 833962, 849189, 597209, 689742, 689255, 43155, -943160, -1778729, -2713981, -4122085, -5419123, -5523599, -4253850, -2577923, -1583910, -1773124, -3163303, -5326026, -7243093, -7781336]
38516g781336J133129K003796J785696J056950M77526K25697O7582k37816n84567
38507a853343n93928j64242K22483P2996l59803l39668L34763J034157J134286
38498e12299P51857M35951L76626J86672m93926j268014j138625K37482J621035
38489A96759J260374q83321k763054k606195r32965M51827P65385O01447N30104
38480c379639N17049N77656R38236J442028J556403J037856O7986j085272k002054
38471c29751k083015j263111l48134L1357K17796N21236K95858q04122j529654
38462e291540n92450J114257J610398O88348j97456n23865j065316j816665j825334
38453g899623j220150j110770j244739k62590J306269J131818r29525j864199
$$ y = [-7781336, -6648207, -4644411, -2858715, -1801765, -1324239, -1098542, -1030960, -1268776, -1853343, -2447271, -2611513, -2389030, -2316034, -2675837, -3015505, -2680742, -1646585, -512299, 239558, 675509, 1052135, 1238807, 744881, -523133, -1661758, -1424276, 196759, 1457133, 573812, -2189242, -4795437, -5728402, -5276575, -4511190, -3909743, -3379639, -2862590, -2284934, -1346698, 95330, 1651733, 2689589, 2757575, 1672303, -329751, -2412766, -3675877, -4024011, -3992654, -3774858, -3253622, -2957764, -3761886, -5291540, -5883990, -4769733, -3159335, -2470987, -2668443, -3192308, -4257624, -6074289, -7899623, -9119773, -10230543, -11475282, -11737872, -10431603, -9299785, -10229310, -12093509]
38445a2093509r840K218437K050400L22410n43909k80261R3966R19738K732765
38436d589803L893917K492748k19353j217597j9634J093217P98654P475m54742
38427A784882q82141j274957j146427q72970j200927j469531m41601J224984J634610
38418b644078P32083K70653O18245K57419j104588j642446m61094R56412J346641
38409a670753J368653J620960J272655o137q98785o75367n69765j419421j916085
38400b894045r34278K74208J93866k97238M09828J642162J455168j58353j317219
38391a625901j100453l77481J8595K38952N33874P30265O25983J01436q29512
38382a684242j517661j089455k4240r36j175830j295879Q87147L073453K531497
$$ y = [-12093509, -12103349, -9884912, -7834512, -7512102, -8056011, -8336272, -8242306, -7322568, -4589803, -695886, 1796862, 1577509, 359912, 340278, 1433495, 2232149, 2239624, 1784882, 902741, -372216, -1518643, -2391613, -3592540, -5062071, -5503672, -4278688, -2644078, -1911995, -1641342, -1023097, -765678, -1870266, -3512712, -3973806, -3017394, -1670753, -302100, 1318860, 2591515, 2585378, 1686593, 1011226, 441461, -977960, -2894045, -3828323, -3554115, -3360249, -3657487, -3247659, -1605497, -150329, -308682, -1625901, -2726354, -3103835, -3085240, -2846288, -2312414, -1582149, -956166, -854730, -1684242, -3201903, -4291358, -4315598, -4316534, -5492364, -6788243, -5901096, -2827643, -296146]
38373b96146K49470p96227l63566o34201j743553j369376P86305J771369l375
38364b399300k054161j623455L35578J126712K63544q10607j383118j523352o98136
38355h766295J221136K378945Q89215j916638k605582j87121K600049K992253
38347c394038J244742o94581j684626j487374K2111K212932L285099K105746m9496
38338A560515j025105o87764p30944j661950j846227k51475J510919J308422l55802
38329b179411j044591P5012J168247N37536j056841j713903r20791K53353P67972
38320d113417M23433m08209r06124j21116J786233L007613J979785l67856j548603
38311b68261p38486L32755P8181p89881o90395L33748P97986l7562j309687j816636
$$ y = [-296146, -46676, -842903, -1206469, -1840670, -3584223, -4953599, -4167294, -2395925, -2399300, -4453461, -6076916, -5741338, -4614626, -4351082, -5161689, -6544807, -8068159, -8766295, -7545159, -5166214, -4276999, -6193637, -8799219, -8986340, -6386291, -3394038, -2149296, -2843877, -4528503, -6015877, -5993766, -3780834, -495735, 1610011, 1560515, 535410, -152354, -883298, -2545248, -4391475, -4642950, -3132031, -1823609, -2179411, -3224002, -3148990, -1980743, -1443207, -2500048, -4213951, -5134742, -4881389, -4113417, -3689984, -4098193, -5004317, -5125433, -3339200, -331587, 1648198, 1280342, -268261, -1006747, -673992, -595811, -1385692, -2076087, -1742339, -944353, -981915, -2291602, -4108238]
38301d108238j294406l38182L40396M05014J8256l53404l79635j20591J78706
38292e652084L80620M85237N83727Q09878J068131Q81216j180q60603o03054O83559
38282b224553J562796J114671J99526J38702P85414Q93489P2712o81496m57144
38273A404117M27791R84733O89035j77892r58838j230505j143393j109564j092644
38264b207160n88311M44608J175610R28844J28645l77886m43146l87475k25711
38255a551982L2011o7248n37440l38033J005249J903786O96272j356860j427928
38246a642173N14294J383060k90236k077629j559558P3143M48162r8960L09187
38237b940710J558514J977544J333172O73657p8784j584877k699126j667335M60589
$$ y = [-4108238, -5402644, -5740826, -5400430, -4995416, -4977160, -5330564, -5710199, -5830790, -5652084, -5271464, -4786227, -4202500, -3392622, -2324491, -1443275, -1444455, -2305058, -2908112, -2224553, -661757, 452914, 652440, 791142, 1576556, 2470045, 2542757, 1861261, 1404117, 1831908, 2816641, 3505676, 3327784, 2368946, 1138441, -4952, -1114516, -2207160, -2795471, -2350863, -1175253, -246409, -117764, -495650, -938796, -1326271, -1551982, -1519971, -1587219, -2124659, -2462692, -1457443, 446343, 1142615, -214245, -1642173, -1127879, 255181, -35055, -2112684, -3672242, -3599099, -3150937, -3249897, -2940710, -1382196, 595348, 1928520, 2602177, 2523393, 938516, -1760610, -3427945, -2967356]
38228b967356P98630p74631j307561K48840J250548l4947j398826m79298J256671
38219c407930J066071o52976j413190o49681J37672K41752J00176m58808j770922
38210f807836k654308j631970M57982J365626P23759K19380O66121J219754J508939
38201d932553K164771K893869K266677N3067k097340k866248k488406j428165
38193f434328L03065J999656K264369Q71459q56259j938487k423264k018964j21978
38184h354731K277330K927742J441807K0372Q6862L61041m69168j377786j031961
38175d118492k69553n04247j126333o13891P85498J468463Q92532r2022p52845
38166d330890r21992n25662J64294M76264L99290O74998J097730L38776j470325
$$ y = [-2967356, -2168726, -2943357, -4250918, -4002078, -2751530, -2786477, -4185303, -4664601, -3407930, -2341859, -2994835, -4408025, -5057706, -4920034, -4678282, -4578106, -5036914, -6807836, -9462144, -11094114, -10636132, -9270506, -8546747, -8327367, -7661246, -6441492, -4932553, -2767782, 126087, 2392764, 2445831, 348491, -2517757, -5006163, -6434328, -6131263, -4131607, -1867238, -995779, -1852038, -3790525, -6213789, -8232753, -8354731, -6077401, -3149659, -1707852, -1687480, -1600618, -1239577, -1708745, -3086531, -4118492, -4388045, -4892292, -6018625, -6632516, -5847018, -4378555, -3486023, -3578045, -4330890, -5252882, -5778544, -5614250, -5137986, -4738696, -4063698, -2965968, -2627192, -4097517]
38157d097517k016989l35085J084124J129j778648j251629Q29219J359193J48724
38148f057479j25499J081505J264415n29088j969889j496634o82815r24919q22869
38139a0263272R97918K935047K744727J078119K39590N85452N12547n71105j396113
38130c137090r22331K95377J063568R09966L12404O8796M24640O98167J52002
38121a34501p65013q18402K26157J168360J061352L84938R0007L58141P79229
38112B350268R64399O10639k54413q83794n92923j2956l64513j367894j390609
38103i41796k8607J141218J006506L60635K8906n81095j756002k078852n41793
38094c390880J284036J163049n94955j725105j206568q2161N27735N41604K30962
$$ y = [-4097517, -6114506, -6449591, -5365467, -5364338, -7142986, -8394615, -7565396, -6206203, -6057479, -6182978, -5101473, -3837058, -4366146, -6336035, -7832669, -8515484, -9440403, -10263272, -9265354, -6330307, -3585580, -2507461, -2267871, -1682419, -1169872, -1740977, -3137090, -4059421, -3764044, -2700476, -1790510, -1478106, -1409310, -984670, -286503, -134501, -899514, -1717916, -1491759, -323399, 737953, 1122891, 1212898, 1571039, 2350268, 3314667, 3925306, 3670893, 2787099, 2194176, 2181220, 1816707, 448813, -941796, -970403, 170815, 1177321, 1537956, 1566862, 985767, -770235, -2849087, -3390880, -2106844, -943795, -1538750, -3263855, -4470423, -4552584, -4024849, -3483245, -3252283]
38085c252283j04978R9758R68201J451069N51774r97651j569547q60567N0321
38076c663903N22485P08120L49949r76479k338602k046838k62648P74014o5302
38067f999204j044175k05852J637488K216885J249103O52601J433490K191514
38059A131850J381262l26899j121041p37326o60382j658862k465062j576128N16645
38050e515943J873849J512938L49883j81315L37782J222441J504134P52959m64723
38041A392005j037787o53125l43549j042024k066701k044996r54062J8028M00312
38032f331899P53138J091666O38981n50489j281645r62458k08017N94814J631573
38023d624336K214519J075727j116268j745751K911J554633P50777q41520o01575
$$ y = [-3252283, -3357261, -3257503, -2289302, -838233, -286459, -1284110, -2853657, -3714224, -3663903, -3141418, -2433298, -2083349, -3059828, -5398430, -7445268, -7707916, -6933902, -6999204, -8043379, -8249231, -6611743, -4394858, -3145755, -2493154, -1059664, 1131850, 2513112, 2186213, 1065172, 327846, -332536, -1991398, -4456460, -6032588, -5515943, -3642094, -2129156, -1779273, -1960588, -1622806, -400365, 1103769, 1856728, 1392005, 354218, -298907, -642456, -1684480, -3751181, -5796177, -6750239, -6732211, -6331899, -5578761, -4487095, -3848114, -4398603, -5680248, -6642706, -6850723, -6255909, -4624336, -2409817, -1334090, -2450358, -4196109, -4193198, -2638565, -1887788, -2729308, -3330883]
38014c330883R25801J151556k89753j158032j78383J376474J772568O90107j055448
38005i5993k262524j950270m37841N36818q9671j119907q21415N81685J544332
37996d114786J461914P97758j07023p65997j99998J343335J589370o67881k948888
37987c612196k203765N23818J574506J22950j123518m69786Q10308J307113J204407
37978a866163P26336l29173j086713l49472Q71360M60704j007051q80984Q16909
37969b644247J042494r64915k052826m76868J069942R4517j564799j111435O73983
37960e934154J390589J101759J286150J610674Q49057m20251q22424o30002p38420
37951b307022n94950M06781R52335j62718j413000o76933J215856J803319P92621
$$ y = [-3330883, -2405082, -1253526, -1543279, -2701311, -2879694, -1503220, 269348, 959455, -95993, -2358517, -4308787, -4746628, -4209810, -4299481, -5419388, -6240803, -5659118, -4114786, -2652872, -1855114, -1962137, -2728134, -2928132, -1584797, 4573, -663308, -3612196, -5815961, -5292143, -3717637, -3594687, -4718205, -5187991, -4377683, -3070570, -1866163, -1139827, -1469000, -2555713, -2905185, -2033825, -1573121, -2580172, -3461156, -2644247, -1601753, -2566668, -4619494, -5096362, -4026420, -3931903, -5496702, -6608137, -5934154, -4543565, -3441806, -2155656, -544982, 304075, -116176, -938600, -1568602, -2307022, -2901972, -2495191, -1542856, -1705574, -3118574, -3795507, -2579651, -776332, 16289]
37942A6289j51405m11987n16191k08898Q08181J160543l23487j945881j353612
37933b926448M81998P89762k84226k21252R60374M75143k049383l205376r87247
37924f966655K080606K782056J420710L05613K29702L79486K09959k09190o78670
37915d46383p28228l2946N78928q3531j500256j884883j013186n82925j237522
37906f930932j457898l02811R16157Q80391K64767K29057O07756Q17024R87709
37897c988780J090345N25272l94739k98073Q38753J070364m29230j682988r57567
37888d226643M66950N62691j77217m8179P16333O52837l1509J46538J125249J297427
37878D84477K30156p53554p90313l74719J11220R77691J993607K150086J164749
$$ y = [16289, -135116, -547103, -1063294, -1272192, -464011, 696532, 373045, -1572836, -2926448, -2444450, -1654688, -1938914, -2160166, -1199792, -724649, -2774032, -5979408, -6966655, -4886049, -2103993, -683283, -377670, -147968, 231518, 441477, 232287, -446383, -1174611, -1207557, -628629, -712160, -2212416, -4097299, -5110485, -5693410, -6930932, -8388830, -8691641, -7775484, -6895093, -6630326, -6401269, -5793513, -4976489, -3988780, -2898435, -2373163, -2767902, -3065975, -2227222, -1156858, -1586088, -3269076, -4226643, -3759693, -3197002, -3374219, -3422398, -2706065, -2053228, -2084737, -1938199, -812950, 484477, 714633, -38921, -829234, -1203953, -1092733, -115042, 1878565, 4028651, 5193400]
37869E193400L53n46340p32056r96608j185694j071313q82809q87555r28349o71100
37859b708071o5176M84582L20267p43980j740397j288278N34838J865523J291644
37850b049048l88397j483017j588637j328581p93695K28379J024550O66774k16177
37841e927849m2453J243142J882417Q55036p20501j292401p58634K252M37662
37832d321329M33817l3861o04366m92575N70422J780249K151624J579226O36719
37823A699926j87293o22965n12562j51121l38016j405879k387971j890165P2102
37814e723944J703714J319476o60959k102519j552232K52697J527819J558651
37806c677297J032435O11865K07452k01057r7495O26216J096344O13959k30063
$$ y = [5193400, 5193753, 4647413, 3915357, 2918749, 1733055, 661742, -221067, -1108622, -2036971, -2708071, -2773247, -2288665, -1968398, -2712378, -4452775, -5741053, -5206215, -3340692, -2049048, -2437445, -3920462, -5509099, -6837680, -7631375, -7402996, -6378446, -5711672, -5927849, -5970302, -4727160, -2844743, -1989707, -2710208, -4002609, -4761243, -4758991, -4321329, -3887512, -3921373, -4525739, -5018314, -4447892, -2667643, -516019, 1063207, 1699926, 1512633, 889668, 377106, 225985, -112031, -1517910, -3905881, -5796046, -5723944, -4020230, -2700754, -3361713, -5464232, -7016464, -6763767, -5235948, -3677297, -2644862, -2032997, -1825545, -2026602, -2124097, -1497881, -401537, 212422, -17641]
37797a7641m36624p9018N6721p5039J72208P06067M93671q35459k065355j693246
37787c773715K37895K095399K364703J173344O0551K10473J061359J069801j47830
37778D351980j181930p57036M70950Q71523O7595q25673r52560o06419l02141
37769A136289m344L49636L78491j23733n68480j43036J104771K105444J824382
37760F059420M81695m30531L29054K218373L423253L050749K112145J934287K402860
37751B1581305K484429J735232L62748j509246l449594m172317k870171q83528
37743A3278858m99894j994556l315899k932353j500060l01692L84535O04293m7179
37734C676053j320642j622028R9587K435580K892092R02573j666960k811150k149119
$$ y = [-17641, -454265, -533283, -476562, -551601, -379393, 326674, 820345, -15114, -2080469, -3773715, -3535820, -1440421, 924282, 2097626, 2158177, 2368650, 3430009, 4499810, 4351980, 3170050, 2413014, 2883964, 3755487, 3823082, 2997409, 2044849, 1438430, 1136289, 1131945, 1481581, 1860072, 1736339, 1167859, 1024823, 2129594, 4235038, 6059420, 6541115, 6110584, 6439638, 8658011, 12081264, 15132013, 17244158, 19178445, 21581305, 24065734, 25800966, 26163714, 24654468, 21204874, 17032557, 14162386, 13278858, 12778964, 10784408, 7468509, 4536156, 3036096, 2734404, 3118939, 3723232, 3676053, 2355411, 733383, 832970, 3268550, 6160642, 7063215, 5396255, 2585105, 435986]
37725D35986n91660O45535O79078l54571j073594k35894J429010J747462r1187
37716B590165k200338k264380m56406R52373N88688n87264r95939m65380J21532
37707b716949M22480Q80907J615250J989832J446610J78472j135514j801114j378226
37698d98252j26607Q21430N13931m79742o44203L55436J144443O71921l44717
37689A413640p60211p02150q55294r60276l71787M87934O39534J43841j73509
37680a138278k96198q57070j563737j374159l67306J28484l62045p03906m3209
37671f577424Q86821J025271L70139n65502j523871j993342j128057Q53360K236528
37662f416077J884347Q60349Q00857J466136J345010K15741m99581n180O55177
$$ y = [435986, -155674, 489861, 1168939, 814368, -259226, -495120, 933890, 2681352, 2590165, 389827, -1874553, -2330959, -1378586, -789898, -1377162, -2373101, -2838481, -2716949, -2294469, -1413562, 201688, 2191520, 3638130, 3816602, 2681088, 879974, -498252, -624859, 196571, 710502, 230760, -413443, -58007, 1086436, 1758357, 1413640, 653429, -48721, -904015, -1864291, -2236078, -1748144, -1108610, -964769, -1138278, -1434476, -2291546, -3855283, -5229442, -5596748, -5468264, -5830309, -6534215, -6577424, -5690603, -4665332, -4295193, -4860695, -6384566, -8377908, -9505965, -8652605, -6416077, -4531730, -3671381, -2870524, -1404388, -59378, 156363, -343218, -348398, 306779]
37653C06779J83774j113585j761956r99722L57302R21910L08156n01132l98524
37644b696998M80566J008791N83747j86050m36186o7434M81267Q68410Q15208
37635H51321R080j331611k192920j759836m99413L47720K59232j39026j06441
37626d561894L10517N75306M36157Q1985k90343o68577q63263l18834J183447
37617d115499K661105K501174L59883k040013k662636j369594K54230Q88017M73312
37608c050021m36397j286844j531216r64307r5176N47629J247865K308424K826983
37599d33060J665094m72545j513998p86664K35899K88450j90156m24030n08871
37590b139881n15663K4180Q66074Q33571j92564o62938J55802P57407j47662j376079
$$ y = [306779, 490553, -623032, -2384988, -3384710, -3027408, -2105498, -1797342, -2298474, -2696998, -2216432, -1207641, -623894, -809944, -1246130, -1313564, -832297, 36113, 851321, 860401, -471210, -2664130, -4423966, -4923379, -4575659, -4316427, -4455453, -4561894, -4251377, -3676071, -3239914, -3157929, -3448272, -4116849, -4980112, -5298946, -4115499, -1454394, 1046780, 1406663, -633350, -3295986, -4665580, -4411350, -3523333, -3050021, -3486418, -4773262, -6304478, -7268785, -7363961, -6816332, -5568467, -3260043, -433060, 1232034, 759489, -754509, -1541173, -1305274, -1016824, -1206980, -1631010, -2139881, -2655544, -2631364, -1765290, -931719, -1124283, -1787221, -1631419, -874012, -1021674, -2397753]
37580b397753j181810j135O27549O90494J163918J764358J392500K73074l37823
37571A993372j84050K5112J74644M83662K83159r93354k148997j660966l12827
37562b340245j18621r79816r54686K04454N33040o94699j657834r99807K08146
37553f800068N72230L59640K63538J02139r2978N01828J772033K068012O42067
37544f11559r06787r70660k03471m5017m43849o22798p92215j381253j638434
37535g616043p40056N59917J041023R82462J337264J678398Q45937p58660j388702
37526d058460m23385R64850J648969J588623R31730m48764k100030k866003k224699
37517f987169j001613k87798j75740P8390R72432K069169K303181J088616p93643
$$ y = [-2397753, -3579563, -3580698, -2953149, -2262655, -1098737, 665621, 2058121, 2331195, 1993372, 1809322, 1834434, 2009078, 2492740, 2775899, 1782545, -366452, -2027418, -2340245, -2458866, -3438682, -4393368, -4188914, -3655874, -4350573, -6008407, -7008214, -6800068, -6227838, -5868198, -5604660, -5502521, -5595499, -5093671, -3321638, -1253626, -611559, -1518346, -2489006, -2692477, -2737494, -3181343, -3804141, -4596356, -5977609, -7616043, -8356099, -7796182, -6755159, -5772697, -4435433, -2757035, -1911098, -2669758, -4058460, -4481845, -3516995, -1868026, -279403, 652327, 203563, -1896467, -4762470, -6987169, -7988782, -8276580, -8452320, -8373930, -7401498, -5332329, -3029148, -1940532, -2734175]
37508b734175j797036j308890k56411K35667J10213r7301j82236r4573L56367
37499e768375Q62044M96905q45412j713635r16397O29606J120278L25119n42298
37490f352165q79967j030544q58941K35129J760591K245248J320058K83619J08278
37481c168694K23143j07180m85843l31446n8255k67725m92358J70529J535840
37472b981989K382720J931044N83943p51111j497474j516374q95904O0986Q12119
37463a872040Q77286L48778l8540L21061J052075J147108L02034o31068q17959
37454F88735m76891k90610m09501o40122r72383j164279n18323R25327J693422
37445a164625P04777p97837p81311M72752P55627n43511j500632q66578k8843
$$ y = [-2734175, -4531211, -5840101, -6096512, -5860845, -5750632, -5847933, -6030169, -6124742, -5768375, -4906331, -4409426, -5254838, -6968473, -7884870, -7255264, -6134986, -5809867, -6352165, -7232132, -8262676, -9121617, -8886488, -7125897, -4880649, -3560591, -3276972, -3168694, -2945551, -3052731, -3538574, -3870020, -3928275, -4196000, -4688358, -4517829, -2981989, -599269, 1331775, 1915718, 1164607, -332867, -1849241, -2745145, -2684159, -1872040, -994754, -645976, -684516, -363455, 688620, 1835728, 2137762, 1506694, 688735, 211844, -78766, -488267, -1128389, -2100772, -3265051, -3783374, -2858047, -1164625, -459848, -1257685, -2038996, -1566244, -810617, -1354128, -2854760, -3721338, -3750181]
37436c750181n21463j456163j152321P4550O82947M96909N12697P11684J61044
37427d240297q71184r60184Q1016P41824K46569l31216j30024N7899m72088p35775
37417f613460K26664J252350O02328j088379j502120j06768J203509J240938J117451
37408c667487J792713K093889Q06332q50148r25571R1622J34381r25793j180314
37399b630376j91522J21185j026931j516194K70894K417277K141722K9061j021568
37390a406452k73416K04376o95874j433399o12219Q09349J274676Q76961N37084
37381g18914K46780m43797j052128o67337N72798J559174J518189N38436p99906
37372G53295j646054j202115M13263J950694K286219J518107L43452r74465k263267
$$ y = [-3750181, -4271644, -5727807, -6880128, -6805578, -6122631, -5625722, -5113025, -4401341, -4240297, -5111481, -6071665, -5990649, -5248825, -5002256, -5333472, -5463496, -5405597, -5877685, -6613460, -6386796, -5134446, -4532118, -5620497, -7122617, -7229385, -6025876, -4784938, -3667487, -1874774, 219115, 1025447, 175299, -750272, -658650, -524269, -1450062, -2630376, -2821898, -2700713, -3727644, -5243838, -4972944, -2555667, -413945, -384884, -1406452, -1679868, -1475492, -2171366, -3604765, -4216984, -3407635, -2132959, -1255998, -718914, -472134, -915931, -1968059, -2635396, -2062598, -503424, 1014765, 1553201, 753295, -892759, -2094874, -1681611, 269083, 2555302, 4073409, 4416861, 3442396, 1179129]
37363A179129k770963j945577n38889J25672j91688o65486q44821r92563j081888
37354g727074o46379J74682N18605Q0511m01940l10377Q2321L98011P89279J235698
37344e806663J113269K44559l97861J781O84098L27267q45268j199751O973J584665
37334d286931K018447J210294J10049o60417j144370j431107j348218o86242N54573
37325e663922J940733K518918J505933n27352j710983q01720J234282K231331
37317G27220J236484p01724j931438j646165j07715J653829K278865J130975p85338
37308A854993j711814j231688o91205j163871j892572j453279K25461J857369
37300d206606K405439J904440R30075r797o13739q66365r90422j069727r49023
$$ y = [1179129, -1591834, -3537411, -4076300, -3950628, -4142316, -4807802, -5652623, -6645186, -7727074, -8373453, -8198771, -7680166, -7599655, -8001595, -8311972, -8229651, -7831640, -7042361, -5806663, -4693394, -4448835, -4846696, -4844915, -4160817, -3833550, -4678818, -5878569, -5871596, -4286931, -2268484, -1058190, -948141, -1608558, -2752928, -4184035, -5532253, -6218495, -5663922, -3723189, -1204271, 301662, -225690, -1936673, -2738393, -1504111, 727220, 1963704, 1261980, -669458, -2315623, -2423338, -769509, 1509356, 2640331, 1854993, 143179, -1088509, -1779714, -2943585, -4836157, -6289436, -6063975, -4206606, -1801167, 103273, 1033348, 1023551, 409812, -456553, -1446975, -2516702, -3465725]
37291c465725p21912q43834j355287j494189o44451P20664J594199J574485R51904
37282c684146J08821n77417o49421j1470Q49615J498459J923726J977598J298899
37273B734664K81718J6754N31178M07766p93764j334193j48467P83536o32193
37264A846999k657908j904814J183814K664416J118039m52090J29820P84240q25930
37255A886586k971213k495368K42373K087178J574278k005j228189j797971j531027
$$ y = [-3465725, -4187637, -5031471, -6386758, -7880947, -8525398, -7804734, -6210535, -4636050, -3684146, -3575325, -4152742, -4802163, -4813633, -3964018, -2465559, -541833, 1435765, 2734664, 3016382, 3033136, 3564314, 3972080, 3178316, 1844123, 1695656, 2479192, 1846999, -810909, -2715723, -1531909, 1132507, 2250546, 1798456, 1928276, 2712516, 1886586, -1084627, -3579995, -3337622, -1250444, 323834, 321829, -906360, -2704331, -4235358]
$$ [...]
##END NTUPLES=NMR SPECTRUM
##END=
