##TITLE=31P_DE-80H_X3
 64 sc D2O
 26.2.2025
##JCAMPDX= 6.0         $$ Bruker NMR JCAMP-DX V2.0
##DATA TYPE= NMR SPECTRUM
##DATA CLASS= NTUPLES
##ORIGIN= UXNMR, Bruker Analytische Messtechnik GmbH
##OWNER= root
$$ XWIN-NMR		Version 3.5
$$ Mon Jun 23 12:20:20 2025 Russian Standard Time (UT+4h)  Yarkov@DPX200
##.OBSERVE FREQUENCY= 81.013821
##.OBSERVE NUCLEUS= ^31P
##.ACQUISITION MODE= SIMULTANEOUS
##.ACQUISITION SCHEME= undefined
##.AVERAGES= 64
##.DIGITISER RES= 17
##SPECTROMETER/DATA SYSTEM= spect
##.PULSE SEQUENCE= zgpg30
##.SOLVENT NAME= DMSO
##.SHIFT REFERENCE= (INTERNAL, DMSO, 0, 198.062)
##AUDIT TRAIL= $$ (NUMBER, WHEN, WHO, WHERE, WHAT)
$$ ##TITLE= Audit trail, XWIN-NMR		Version 3.5
$$ ##JCAMPDX= 5.01
$$ ##ORIGIN= Bruker BioSpin GmbH
$$ ##OWNER= Yarkov
$$ C:/Bruker/XWIN-NMR/data/yarkov2/nmr/P31/2/pdata/1/auditp.txt
$$ ##AUDIT TRAIL=  $$ (NUMBER, WHEN, WHO, WHERE, WHAT)
(   1,<2025-06-23 12:19:21.29 +0400>,<Yarkov>,<DPX200>,
      <created by zg, POWCHK disabled, PULCHK disabled
       configuration hash MD5:
       00 E9 B6 7A A2 85 ED C7 34 08 36 98 17 FE 4E 26
       data hash MD5: 32K
       8A 43 F8 EC E6 4A 79 64 14 77 59 A9 87 05 D1 77>)
(   2,<2025-06-23 12:19:46.85 +0400>,<Yarkov>,<DPX200>,
      <Start of raw data processing
       efp BC_mod = 2 LB = 1.5 FT_mod = 6 PKNL = 1 PHC0 = 1679.797 PHC1 = 45.35953 SI = 64K 
       data hash MD5: 64K
       4C 24 C9 B7 F5 EA B1 91 37 42 CF 9A 24 06 DE 3F>)
(   3,<2025-06-23 12:19:57.12 +0400>,<Yarkov>,<DPX200>,
      <abs ABSG = 5 
       data hash MD5: 64K
       BB EE FD 0A 0B 42 BD A9 60 25 C6 65 46 8F 24 E0>)
$$ ##END=
$$ 
$$ hash MD5
$$ E8 F8 2E BD 90 E3 91 B8 C6 6B C4 3B 3B 21 F4 97
##$RELAX= 
##$RELAX= 
##$RELAX= 
##$RELAX= 
##$RELAX= 
##$RELAX= 
##$RELAX= 
##$RELAX= 
$$ Bruker specific parameters
$$ --------------------------
##$DU= <C:/Bruker/XWIN-NMR>
##$EXPNO= 2
##$NAME= <P31>
##$PROCNO= 1
##$TYPE= <nmr>
##$USER= <yarkov2>
##$AMP= (0..31)
100 100 100 100 100 100 100 100 100 100 100 100 100 100 100 100 100 100 
100 100 100 100 100 100 100 100 100 100 100 100 100 100 
##$AQSEQ= 0
##$AQ_mod= 1
##$AUNM= <au_zg>
##$AUTOPOS= <>
##$BF1= 81.014009
##$BF2= 200.13
##$BF3= 200.13
##$BF4= 200.13
##$BF5= 200.13
##$BF6= 200.13
##$BF7= 200.13
##$BF8= 200.13
##$BYTORDA= 1
##$CFDGTYP= 0
##$CFRGTYP= 5
##$CHEMSTR= <none>
##$CNST= (0..31)
1 1 145 1 1 1 1 1 1 1 1 1 1 1 1 1 1 1 1 1 1 1 1 1 1 1 1 1 1 1 1 1 
##$CPDPRG= <waltz16>
##$CPDPRG1= <>
##$CPDPRG2= <waltz16>
##$CPDPRG3= <>
##$CPDPRG4= <mlev>
##$CPDPRG5= <mlev>
##$CPDPRG6= <mlev>
##$CPDPRG7= <mlev>
##$CPDPRG8= <mlev>
##$CPDPRGB= <>
##$CPDPRGT= <>
##$D= (0..31)
0 1 0 0 0 0 0 0 0 0.06 0 0.03 2e-05 3e-06 0 0 0.0002 0 0 0 0 0 0 0 0 0 
0 0 0 0 0 0 
##$DATE= 1750666760
##$DBL= (0..7)
120 120 120 11 120 120 24 19 
##$DBP= (0..7)
150 150 150 150 150 150 150 150 
##$DBP07= 0
##$DBPNAM0= <>
##$DBPNAM1= <>
##$DBPNAM2= <>
##$DBPNAM3= <>
##$DBPNAM4= <>
##$DBPNAM5= <>
##$DBPNAM6= <>
##$DBPNAM7= <>
##$DBPOAL= (0..7)
0.5 0.5 0.5 0.5 0.5 0.5 0.5 0.5 
$$ [...]
##$SUBNAM3= <"">
##$SUBNAM4= <"">
##$SUBNAM5= <"">
##$SUBNAM6= <"">
##$SUBNAM7= <"">
##$SUBNAM8= <"">
##$SUBNAM9= <"">
##$SW= 400.765351723535
##$SWIBOX= (0..15)
0 1 3 0 0 0 0 0 0 0 0 0 0 0 0 0 
##$SW_h= 32467.5324675325
##$TD= 32768
##$TD0= 1
##$TE= 0
##$TE2= 300
##$TE3= 300
##$TEG= 300
##$TL= (0..7)
0 120 53 12 22 120 120 120 
##$TP= (0..7)
150 150 150 150 150 150 150 150 
##$TP07= 0
##$TPNAME0= <>
##$TPNAME1= <>
##$TPNAME2= <>
##$TPNAME3= <>
##$TPNAME4= <>
##$TPNAME5= <>
##$TPNAME6= <>
##$TPNAME7= <>
##$TPOAL= (0..7)
0.5 0.5 0.5 0.5 0.5 0.5 0.5 0.5 
##$TPOFFS= (0..7)
0 0 0 0 0 0 0 0 
##$TUNHIN= 0
##$TUNHOUT= 0
##$TUNXOUT= 0
##$USERA1= <user>
##$USERA2= <user>
##$USERA3= <user>
##$USERA4= <user>
##$USERA5= <user>
##$V9= 5
##$VALIST= <valist>
##$VCLIST= <CCCCCCCCCCCCCCC>
##$VD= 0
##$VDLIST= <DDDDDDDDDDDDDDD>
##$VPLIST= <PPPPPPPPPPPPPPP>
##$VTLIST= <TTTTTTTTTTTTTTT>
##$WBST= 1024
##$WBSW= 4
##$XGAIN= (0..3)
0 0 0 0 
##$XL= 0
##$YL= 0
##$YMAX_a= 1860
##$YMIN_a= -133
##$ZGOPTNS= <>
##$ZL1= 120
##$ZL2= 120
##$ZL3= 120
##$ZL4= 120
##$ABSF1= 198.0616
##$ABSF2= -202.7028
##$ABSG= 5
##$ABSL= 3
##$ALPHA= 0
##$AQORDER= 0
##$ASSFAC= 0
##$ASSFACI= 0
##$ASSFACX= 0
##$ASSWID= 0
##$AUNMP= <proc_1d>
##$AZFE= 0.1
##$AZFW= 0.5
##$BCFW= 0
##$BC_mod= 2
##$BYTORDP= 0
##$COROFFS= 0
##$CY= -3
##$DATMOD= 1
##$DC= 0
##$DFILT= <>
##$DTYPP= 0
##$F1P= 0
##$F2P= 0
##$FCOR= 1
##$FTSIZE= 65536
##$FT_mod= 6
##$GAMMA= 0
##$GB= 0
##$INTBC= 1
##$INTSCL= 9.790993e-09
##$ISEN= 30
##$LB= 1.5
##$LEV0= 0
##$LPBIN= 0
##$MAXI= 10000
##$MC2= 0
##$MEAN= 0
##$ME_mod= 0
##$MI= 50
##$NCOEF= 0
##$NC_proc= -12
##$NLEV= 6
##$NOISF1= 182.463
##$NOISF2= 159.3651
##$NSP= 0
##$NTH_PI= 0
##$NZP= 0
##$OFFSET= 198.0616
##$PC= 4
##$PHC0= 1679.797
##$PHC1= 45.35953
##$PH_mod= 1
##$PKNL= yes
##$PPARMOD= 0
##$PSCAL= 0
##$PSIGN= 0
##$REVERSE= no
##$SF= 81.0140089999434
##$SI= 65536
##$SIGF1= 159.3651
##$SIGF2= -187.1042
##$SINO= 113.3802
##$SIOLD= 16384
##$SREGLST= <1H.CDCl3>
##$SSB= 0
##$STSI= 65536
##$STSR= 0
##$SW_p= 32467.5324675325
##$SYMM= 0
##$S_DEV= 0
##$TDeff= 32768
##$TDoff= 0
##$TI= <>
##$TILT= no
##$TM1= 0
##$TM2= 0
##$TOPLEV= 0
##$USERP1= <user>
##$USERP2= <user>
##$USERP3= <user>
##$USERP4= <user>
##$USERP5= <user>
##$WDW= 1
##$XDIM= 65536
##$YMAX_p= 356921318
##$YMIN_p= -71829812
$$ End of Bruker specific parameters
$$ ---------------------------------
##NTUPLES= NMR SPECTRUM
##VAR_NAME=  FREQUENCY,     SPECTRUM/REAL,   SPECTRUM/IMAG
##SYMBOL=    X,             R,               I
##VAR_TYPE=  INDEPENDENT,   DEPENDENT,       DEPENDENT
##VAR_FORM=  AFFN,          ASDF,            ASDF
##VAR_DIM=   65536,         65536,           65536
##UNITS=     HZ,            ARBITRARY UNITS, ARBITRARY UNITS
##FACTOR=    0.49542278885378, 1,            1
##FIRST=     16045.7642231865, 0,            0
##LAST=      -16421.768244346, 0,            0
##MIN=       -16421.768244346, -71829812,    0
##MAX=       16045.7642231865, 356921318,    0
$$ Real data points
##PAGE= N=1
##DATA TABLE= (X++(R..R)), XYDATA
$$ [...]
44700 -1907136 -930130 -380071 -158451 358699 1327755 1826102 863332 -1112612 -2440101
44691 -2440101 -2125997 -898234 -87337 67518 538691 2070363 3996654 4738017 3527030
44682 3527030 1388808 10246 -227014 -401560 -1194849 -1890020 -1761317 -1450490 -1938141
44673 -1938141 -2843979 -2988014 -2294396 -1879904 -2285415 -2728798 -2273213 -900106 691704
44664 691704 1709141 1769774 1404182 1760815 3076436 3896797 2785372 321391 -1776422
44655 -1776422 -2992079 -3964975 -4489876 -3483517 -1129064 730160 838515 -248571 -1469887
44646 -1469887 -2255736 -2010854 -456839 1028093 388425 -2039810 -3468540 -2637406 -1661842
44637 -1661842 -2496232 -3787413 -3287977 -1476921 -270874 390123 1826337 3429456 3240017
44628 3240017 1465906 497303 1134577 1525295 539698 -355069 239333 1317755 1396322
44619 1396322 1114982 2063813 3946895 4676106 3027782 -37050 -2589550 -3355626 -2251615
44610 -2251615 -176782 1551991 2065331 1516822 791082 705814 1425007 2369304 2703786
44601 2703786 2196480 1509941 1316896 1390349 1160759 927694 1634587 3405061 5181593
44592 5181593 6019397 5950742 5370877 4446214 3488843 3063721 3192835 3129926 2435951 1663005
44582 1663005 1481668 1750796 1979893 2090736 2109229 1693029 713311 -109133 97929 1243616
44572 1243616 2414708 2840330 2191988 340836 -2415714 -5056072 -6471033 -6402688 -5312947
44563 -5312947 -3557104 -1320817 774593 1785968 1377778 201612 -770664 -1004283 -580413
44554 -580413 -33894 36956 -393239 -609254 -73172 603833 216064 -1458140 -3241536
44545 -3241536 -3918723 -3481910 -2750645 -2241477 -1837149 -1289425 -623351 -108759 -43882 -455986
44535 -455986 -882455 -656962 385627 1671022 2551895 2999558 3343542 3506113 2942642
44526 2942642 1419985 -484412 -1876107 -2394971 -2397177 -2346847 -2198366 -1464460 130129
44517 130129 2144755 3672836 4131047 3707923 2969825 2219439 1515738 1171099 1626880
44508 1626880 2560465 2684719 1139817 -1133310 -2248526 -1689194 -864397 -966561 -1279129
44499 -1279129 -569360 591986 393926 -1409231 -2809028 -2218175 -531955 437710 526477
44490 526477 829920 1360708 829619 -1029539 -2451093 -1794684 241741 1562031 1332726
44481 1332726 737974 1221084 2820978 4385779 4812333 3846131 2116052 675091 255083
44472 255083 761253 1622963 2596837 3839651 5144094 5712328 5130752 4143733 3813372
44463 3813372 4058723 3699035 2045584 -122184 -1414674 -1244258 -128450 1026673 1611199
44454 1611199 1568509 1321741 1281610 1222729 440483 -1216777 -2862252 -3539241 -3332796 -3008425
44444 -3008425 -2895621 -2818158 -2859951 -3293902 -3770561 -3537751 -2678789 -2204066 -2545958 -2911229
44434 -2911229 -2706753 -2647986 -3531107 -4681175 -4827578 -4072751 -3651561 -3859156 -3649278
44425 -3649278 -2579200 -1764120 -2135476 -2837407 -2433861 -1048878 -109519 -189969 -283948
44416 -283948 558023 1785984 2064135 917672 -869114 -2282982 -3022368 -3352692 -3356198
44407 -3356198 -2647451 -926160 1385391 3394835 4684603 5630412 6548472 6962332 6276970
44398 6276970 4933230 4093430 4047054 3707219 2169464 189818 -611190 215946 1431495
44389 1431495 1655397 814308 -155806 -516561 -241961 343605 943576 1346087 1504464
44380 1504464 1690721 2298906 3259678 3786617 3068649 1373430 175455 753324 2649794
44371 2649794 3994426 3620740 2467766 2407525 3927661 5612835 5928958 4860066 3521348
44362 3521348 2727428 2431742 2257218 2051875 1980407 2385332 3449101 4706162 5060421
44353 5060421 3711730 1105763 -1280677 -2105567 -1037344 1202336 3249271 3764881
44345 3764881 2337660 -100071 -2101651 -3049494 -3390451 -3606967 -3518951 -2820261 -1821991
44336 -1821991 -1269049 -1651884 -2944181 -4708472 -6120411 -6183442 -4476767 -1784515 302680
44327 302680 577354 -910468 -2931100 -3933632 -3193158 -1481329 -431028 -887048 -2030606
44318 -2030606 -2489284 -2070628 -1768636 -2098219 -2251224 -1322916 238476 1066808 465131
44309 465131 -1092312 -2871220 -4501142 -5565119 -5402024 -3947669 -2379159 -2206096 -3685110
44300 -3685110 -5576135 -6516736 -6241222 -5347267 -4311520 -3127795 -1787496 -729568 -577495
44291 -577495 -1391448 -2281850 -2009007 -169198 2295257 3948727 4143215 3283140 2041960
44282 2041960 753957 -459853 -1469796 -2221932 -2725630 -2887709 -2743444 -2877748 -4005590
44273 -4005590 -5844304 -6970486 -6296741 -4348049 -2628330 -2015779 -2215310 -2510874 -2551481
44264 -2551481 -2502428 -2765808 -3459606 -4064866 -3937721 -3256382 -2814533 -2645069 -1800780 -132004
44254 -132004 783298 -319222 -2190761 -2464845 -956053 62405 -963232 -2894168 -3630474
44245 -3630474 -2714508 -1600842 -1992307 -4165755 -6355315 -5964308 -2372242 1678097 2841699
44236 2841699 1232049 69236 1186018 2988914 3535705 3303242 3424708 3235280 1714114
44227 1714114 -44212 -191543 792869 673446 -1193232 -3161895 -3881247 -3615100 -2830352
44218 -2830352 -1325325 758331 2572184 3758078 4819350 5910986 6392411 5942226
44210 5942226 5067602 4204184 3298342 2474170 2078959 1912961 1477744 1063993 1422179
44201 1422179 2335166 2877758 3115971 3899805 4775887 4064996 1647928 -322358 -524519
44192 -524519 -384424 -1513258 -3006029 -3085485 -2007949 -1281970 -1013401 -177065 1104785
44183 1104785 1698842 1562307 1643535 1772518 732774 -1308874 -2427265 -1591696 -1270
44174 -1270 910892 1187346 1187389 316722 -1738411 -3665584 -3972776 -3162582 -3018902 -4059255
44164 -4059255 -5109915 -5357723 -5365597 -5629537 -5411236 -3920935 -1850076 -583021 -190839
44155 -190839 607834 2346200 3814783 3803505 2957339 2880972 3846693 4522187 3883082 2283714
44145 2283714 503943 -1101336 -2093113 -1774266 -367510 496549 -510942 -2693775 -4176528
44136 -4176528 -4065532 -2949730 -1664085 -514330 443115 1205849 1871921 2289732 1919433
44127 1919433 698518 -333133 -124365 971450 1796712 2128032 2725167 3762876 4413278
44118 4413278 4161983 3481825 2928054 2511618 2264499 2509769 3180025 3644999 3570735 3256344
44108 3256344 2890252 2277763 1570265 1371143 1712932 1776959 1103196 280101 -72463 -204041
44098 -204041 -515215 -671443 -120710 1077612 2538888 4069796 5278387 5311528 3812619
44089 3812619 1755387 544069 475039 683340 436430 -39358 31129 971959 1961196
44080 1961196 1507205 -767347 -2969216 -2685225 -130077 1798822 1299686 75773 688364
44071 688364 2672612 3156071 951966 -1811755 -2449991 -748466 1321075 2041248 1479865
44062 1479865 886498 940672 852727 -378148 -1989468 -1914918 289872 2363388 2338813
44053 2338813 1361666 1798076 3518928 4307105 3550836 3035243 3771524 4436505 3837087
44044 3837087 2860843 2764952 3246640 3614937 4420082 6269119 8058847 8113755 6513852
44035 6513852 4760885 3516183 2171438 556053 -390059 -17719 941711 1198122 364103
44026 364103 -716558 -947819 -195740 561552 494575 41486 102629 425643 54717 -588624
44016 -588624 155535 2269949 3210337 1445791 -841640 -680421 1370277 2428745 2054427
44007 2054427 2686363 5122139 6723761 5417717 2931855 2181756 3283005 4244622 4316917
43998 4316917 4354531 4490531 3750770 2100634 987767 1274221 1965613 1679390 452057
43989 452057 -587221 -736117 -314751 -89951 -537771 -1461232 -2060169 -1584366 -170082
43980 -170082 1093765 1136562 -58374 -1440164 -1912491 -1409008 -943824 -1464461 -2678257
43971 -2678257 -3310310 -2620451 -1293078 -571561 -852495 -1478793 -1612066 -894068 450220
43962 450220 1600484 1418937 -564066 -3322846 -4993942 -4544061 -2502142 -82646 1912912
43953 1912912 3216491 3701559 3345370 2443117 1561853 1222523 1578140 2266021 2655305
43944 2655305 2478447 2141017 2102758 2065859 1270409 -352040 -1850208 -2308288 -1821656
43935 -1821656 -1194267 -1076743 -1668957 -2810189 -3924893 -4240142 -3581085 -2721768 -2433617
43926 -2433617 -2393091 -1650817 -101378 1221221 1476964 1042250 895436 1450698 2353727
43917 2353727 3034464 3033702 2108444 570033 -603642 -540439 573734 1711381 2209634
43908 2209634 2313786 2398834 2193287 1222709 -258560 -1289566 -1132074 168499 2087759
43899 2087759 4042654 5417871 5652818 4702119 3257204 2179341 1718156 1483585 1115588
43890 1115588 680994 340494 -69891 -820558 -1701171 -1960642 -1053781 618730 1940468
43881 1940468 2138327 1470984 752849 389771 194527 87612 494159 1734227 3286737
43872 3286737 4109187 3714584 2614926 1618962 995190 524327 126422 62061 498531
43863 498531 1166290 1594471 1544193 1095085 468484 -31869 -32951 617578 1524726 2024936
43853 2024936 1954566 1857204 2162026 2413248 1762231 188299 -1204084 -1261750 75688
43844 75688 1773335 2584469 1889666 24248 -1949400 -2929585 -2455814 -775621 1574943
43835 1574943 3930228 5326029 4831706 2535520 -61357 -1179912 -436654 811379
43827 811379 911543 -321596 -1380932 -769696 1083721 2076993 972695 -837147 -959211
43818 -959211 898398 2684646 3005529 2899443 3831450 5240199 5465020 4320437 3181238
43809 3181238 2796910 2482696 1478122 -194810 -2309332 -4572089 -5961316 -5232464 -2575896
43800 -2575896 279500 2036125 2856037 3080544 2296053 510899 -909052 -630835 993647
43791 993647 2546483 3122814 2493688 586739 -2072336 -4095776 -4634313 -4537052 -4933838
43782 -4933838 -5207728 -3827157 -935456 1418184 1748116 556778 -846595 -1730452 -1952762
43773 -1952762 -1788364 -2014324 -3035127 -3719937 -2430369 439083 2448219 2358241 1920078
43764 1920078 3313920 6081021 8046067 8343492 7850766 7141654 5809842 3870134 2262638
43755 2262638 1545611 1236496 841527 516214 303809 -240480 -1071700 -1241836 -261813
43746 -261813 852285 816655 -137505 -714300 -506010 -397806 -933974 -1307487 -458221 1503647
43736 1503647 3530206 4831247 5251194 4777998 3407474 1538832 -59462 -896062 -1046277
43727 -1046277 -684795 250901 1624224 2659214 2493206 1274769 360696 1107223 3448173
43718 3448173 5808985 6516577 5278115 3245952 1752399 1203647 1178338 1168816 901244
43709 901244 255207 -576739 -934747 -291057 879859 1361710 566509 -764924 -1435274
43700 -1435274 -940931 413406 1935284 2681203 1811226 -440138 -2435125 -2528005 -793431
43691 -793431 1140441 1934990 1730896 1510282 1768169 2022110 1479153 106358 -1069134
43682 -1069134 -1027397 -59482 603314 540630 574106 994320 533898 -1752561 -4449038 -5167455
43672 -5167455 -3658680 -2033007 -1908060 -2775616 -3367052 -3242458 -2640029 -1957742 -1772089
43663 -1772089 -2244064 -2230960 -305627 2934545 5011825 4643091 3244243 2621886 2719241
43654 2719241 2714575 2768445 3142126 2879075 1202679 -630177 -706262 873923 2408426
43645 2408426 3154768 3684298 4090013 3830236 3279034 3437749 3896740 3027467 672002
43636 672002 -1203937 -1243173 -388103 13917 186211 905334 1930493 2773912 3911769
43627 3911769 5775801 7326500 7091740 5193915 3084507 1582118 348948 -893669
43619 -893669 -1780684 -1971173 -1552195 -801755 -234565 -642104 -2232934 -3921162 -4409466
43610 -4409466 -3877362 -3587673 -3836006 -3466620 -1732262 461680 1724935 1700574 818214
43601 818214 -568804 -1943260 -2277890 -1087489 513706 940881 213197 -236343 119103
43592 119103 58929 -1425504 -3527536 -4832497 -5135975 -4925656 -3849444 -1226298 2207209
43583 2207209 4651186 5485957 5723514 5970687 5567943 4399643 3832625 4573033 5025524
43574 5025524 3543243 1359540 1251241 3633014 5957781 6100441 4546726 2877562
43566 2877562 1798930 1369362 1710585 2533627 2978065 2728973 2431922 2410818 2041954
43557 2041954 1132486 731653 1473745 2122797 1142330 -938377 -2168055 -1852500 -1163950
43548 -1163950 -1080591 -1073389 -270994 1043254 1736323 1194719 -50713 -921412 -822786 -94419
43538 -94419 593738 1166530 2063337 3260518 4102523 4396801 4860052 5903979 6772390
43529 6772390 6675064 6017597 5475017 4527983 2277478 -638775 -2406869 -2300187 -1241055
43520 -1241055 -61691 1273767 2346668 1814771 -725366 -3529223 -4513226 -3600089 -2271666
43511 -2271666 -1424719 -855295 -525392 -987456 -2265656 -3276244 -2924972 -1354016 284846
43502 284846 1020661 730113 -141424 -1113795 -1902525 -2451788 -3005378 -4033620 -5723754
43493 -5723754 -7410818 -7858965 -6450753 -3890708 -1344335 882316 3168021 5157384
43485 5157384 5467425 3395718 343011 -1324360 -793108 456801 542113 -774854 -2250010
43476 -2250010 -2875093 -2764414 -2408600 -1799904 -732363 489464 1283494 1559853 1593648
43467 1593648 1203450 -56079 -1627544 -1884592 -139368 1958197 2083000 30278 -2137595
43458 -2137595 -2601676 -1388307 539849 2500176 3880897 3889139 2557128 1388547 1888613
43449 1888613 3596131 4515248 3584114 1887568 1113423 1512896 2006963 1934264 1867823
43440 1867823 2526154 3523708 3783617 2958690 1786571 953638 241404 -844466 -2100986
43431 -2100986 -2810152 -2588385 -1556574 18697 1633118 2380373 1729204 454584 -41053
43422 -41053 508779 949495 437503 -405176 -588905 -251868 -282868 -930532 -1660422 -2222946
43412 -2222946 -3009399 -4169544 -4968140 -4371618 -2090300 1091310 3887840 5398158 5599801
43403 5599801 5057417 4153549 2736066 613408 -1806925 -3647237 -4300710 -3860236 -2853995
43394 -2853995 -1795138 -1057310 -950097 -1600724 -2660879 -3332780 -3001973 -1947436 -1237153
43385 -1237153 -1749751 -3336156 -4947881 -5438359 -4313419 -2119661 -236751 184381 -603698
43376 -603698 -1219874 -886445 -328301 -496970 -1118745 -1364306 -1392666 -2083901 -3475638 -4609508
43366 -4609508 -4852289 -4271863 -2841782 -619099 1278388 1485389 555058 644369 2336777
43357 2336777 3500282 2450796 610913 351150 1450596 1745160 591697 -452414
43349 -452414 -261563 525704 1074105 1545550 2179010 2523230 2216122 1534340 712249 -355263
43339 -355263 -1378581 -1651692 -1196991 -932297 -1164815 -875884 837243 3428467 5683454
43330 5683454 7090819 7755547 7666616 6832215 5570771 3944152 1490429 -1710308 -4329223
43321 -4329223 -5106296 -4411552 -3510301 -2722842 -1499290 -28601 663706 353075 -19834
43312 -19834 -21464 -440106 -1647379 -2522500 -2119152 -1419687 -2022381 -3678865 -4687026 -4483798
43302 -4483798 -4167979 -4304106 -4013311 -2956118 -2492112 -3526413 -4528542 -3473874 -997028
43293 -997028 318076 -476910 -1767250 -2151181 -2142601 -2465812 -2530661 -1788925 -1161321 -1687224
43283 -1687224 -2755225 -3075510 -2632304 -2290474 -2160007 -1873006 -1969502 -3310695 -5246770
43274 -5246770 -5969995 -4797804 -2695895 -485418 1856795 3788137 3825507 1512543 -1436871
43265 -1436871 -2897016 -2356820 -503633 2126053 5039104 7158196 7530369 6363695
43257 6363695 4549374 2588577 822662 206015 1648454 4562831 7002095 7507194
43249 7507194 6287223 4463019 2687142 796290 -1443352 -3575676 -4626350 -4145881
43241 -4145881 -2892651 -2070518 -1942059 -1733847 -924141 109549 930843 1710520 2604208
43232 2604208 3209878 3223618 2989866 2827438 2527970 2209733 2836517 4839601 6837521
43223 6837521 6963387 5192151 3229146 2294040 2136865 2079937 1786986 987410 -285795
43214 -285795 -1007383 -1031 2170812 3426394 2811135 1683255 1529107 1861051 1411964
43205 1411964 371118 -69740 170616 26378 -679597 -683687 768163 2568994 3077992
43196 3077992 2073303 647664 -334258 -811118 -718356 449060 2797582 5227073 6162485
43187 6162485 5216667 3673851 3011209 3276216 3426162 3034986 2812790 3196212 3300983
43178 3300983 2077534 79002 -876662 160324 2236310 3748718 4017073 3273616 1802019
43169 1802019 -176902 -2014491 -2773134 -2065135 -445598 1158711 2233408 2846427 3256498
43160 3256498 3547236 3650339 3588192 3484926 3253908 2516764 1129184 -402145 -1504569
43151 -1504569 -2427614 -3832155 -5399214 -5801273 -4590843 -3171033 -2920254 -3124798 -2133366
43142 -2133366 -93888 1180408 1110776 1225862 2469682 3431742 2553593 710758 -69097
43133 -69097 444885 822063 529704 425628 743247 494116 -671305 -1654597 -1691362 -1560375
43123 -1560375 -2100912 -2675988 -2231835 -1104264 -623539 -1334388 -2568190 -3532571 -4013319
43114 -4013319 -4131431 -4052195 -3869311 -3384062 -2238122 -602119 709849 1300499 1888071
43105 1888071 3288681 5070637 5961699 5382067 3884401 2251513 878097 -36375 -406509
43096 -406509 -447571 -393709 -27771 962081 2197162 2839085 2701888 2480876 2645305 2725192
43086 2725192 2115211 1110449 552877 628514 629036 69999 -418616 209999 1923617 3342026
43076 3342026 3237900 1950357 886779 862066 1448972 1813340 1561932 799082 22439
43067 22439 10237 1084443 2383766 2691014 2163243 2257752 3535787 4596832 3929409
43058 3929409 1934563 220598 -416002 -384741 -257065 -272731 -487634 -642514 -326815
43049 -326815 116595 -385912 -1907967 -2789511 -1861516 -531629 -1060872 -3315749 -4958917
43040 -4958917 -4607906 -3062617 -1454983 11078 1227123 1809795 2084805 2994438 4479013
43031 4479013 5233588 4551893 3154685 1784554 398338 -697204 -449384 1274553 2892926
43022 2892926 3001634 2067327 1337791 1038746 597124 -196848 -1195117 -2388341 -3643163
43013 -3643163 -4581876 -5233741 -5980163 -6481291 -5868240 -4552367 -4334199 -5750366 -6854331
43004 -6854331 -6004140 -4452157 -4414755 -5656861 -5983061 -4490479 -2391474 -921864 -250382
42995 -250382 -340361 -1153022 -1875075 -1457234 -135560 827921 978234 986137 1131581 859655
42985 859655 59587 -516777 -459667 -209818 -51421 360916 1153256 1859901 2174556 2191337
42975 2191337 1711660 252299 -2004494 -4115420 -5430031 -5988847 -5886631 -5168078 -4347008
42966 -4347008 -3997775 -3799824 -3041021 -2011420 -1645908 -1814166 -1477121 -715077 -904478
42957 -904478 -2371235 -3558127 -3317206 -2441873 -1952553 -1415643 -186343 1134692 1980513
42948 1980513 3284724 5900151 8474738 8828357 6954339 4803805 3342095 1718598
42940 1718598 -509641 -2167188 -2128408 -889639 228812 520245 -12486 -1113108 -2183456
42931 -2183456 -2410220 -1636057 -717613 -570321 -1191135 -1930278 -2341683 -2456722 -2558316
42922 -2558316 -2920275 -3404297 -3165499 -1350395 1505015 3332010 2488880 -334643 -2810054
42913 -2810054 -3528346 -3254966 -3498736 -4435569 -4751015 -3342004 -695602 1545817 2184917
42904 2184917 1504421 751281 670725 697498 -175780 -1778966 -2555335 -1413685 613473
42895 613473 1368158 191467 -1334230 -1520396 -502834 584040 1483194 2779854 4405410
42886 4405410 5323345 4725358 2718001 -90356 -2793349 -4075966 -3059622 -575976
42878 -575976 1352874 1732093 1532685 2105563 3554176 5170010 6582869 7709239 8182857
42869 8182857 7652494 6339642 4760349 3239911 2093526 1716450 1911352 1647320 193896
42860 193896 -1843263 -3212677 -3378559 -2631337 -1336903 119644 982909 668875 -336705
42851 -336705 -854360 -364002 570728 1223748 1466841 1537409 1590282 1672353 1779316 1776822
42841 1776822 1521774 1167763 1119948 1520791 1862706 1306830 -397407 -2285968 -2859984
42832 -2859984 -1740855 -276224 84461 -368178 -287480 520472 936033 679474 1018101
42823 1018101 2610089 4093653 3955359 2676140 1756518 1556766 1494276 1559692 2022860
42814 2022860 2187952 1182948 -239011 -412181 701387 1376636 809795 270512 916978
42805 916978 1903421 1669785 161173 -1277820 -1709280 -1420441 -1111707 -889755 -191374
42796 -191374 1412874 3401627 4552276 4201081 2850606 1202594 -726175 -2816774
42788 -2816774 -3957846 -3202192 -1441941 -577460 -1097939 -1745900 -1529054 -713433 234942
42779 234942 1239296 1887853 1562762 723712 730283 1923883 3190291 3837561 4388524
42770 4388524 4899935 4203993 1927330 -203252 -449839 629991 1292805 1068025 734947
42761 734947 661820 621090 678987 868915 411463 -1386058 -3738129 -5133081 -5238318 -4868370
42751 -4868370 -4304559 -2988497 -941743 739550 1154413 549775 -230883 -628357 -576866
42742 -576866 -343935 -214163 -40742 620865 1605046 1938253 1173706 330959 660688 1963118
42732 1963118 3055872 3468408 3675976 4070316 4795816 6217049 8276065 9625913 8815035
42723 8815035 6384865 4489200 4282314 4927033 5332645 5440875 5324092 4410716 2491769
42714 2491769 532206 -412305 -444278 -295075 -177222 93027 314294 41002 -643148
42705 -643148 -1049642 -614754 466437 1256857 820107 -714180 -1964504 -1713121 -397634
42696 -397634 478091 287501 -293038 -799134 -1682834 -3026980 -3711078 -2759098 -785727
42687 -785727 781813 1380641 1374305 954261 10005 -1090254 -1572314 -1238712 -686703 -415673
42677 -415673 -325907 -297773 -700784 -1925790 -3691507 -5178837 -5759669 -5353271 -4172656
42668 -4172656 -2475758 -658196 761581 1584492 2173567 2838410 3086335 2074149 -89352
42659 -89352 -2116687 -2907079 -2585534 -1900492 -1305939 -1109400 -1680744 -2685525 -2846090
42650 -2846090 -1531959 -12213 96860 -834921 -1119056 -498019 -537926 -2066911 -3852175
42641 -3852175 -4417634 -3803294 -2804333 -1713667 -709110 -420481 -1041733 -1578926 -967308
42632 -967308 475060 1420038 997339 -557151 -2227133 -2852887 -2093695 -1071681 -1279818
42623 -1279818 -2582135 -3341304 -2894040 -2500620 -3046586 -3332949 -2059544 -276374 -15092
42614 -15092 -1155662 -1592687 -371379 1154276 1566878 1226475 1232069 1680734 1799386 1249665
42604 1249665 591444 523546 989199 1206517 721372 211639 608135 1424041 1013592 -1050853
42594 -1050853 -3048226 -3488052 -3309573 -4320870 -6273239 -7219469 -6448633 -5304353 -5004253
42585 -5004253 -5282069 -5585512 -6137731 -7053586 -7478786 -6535089 -4637326 -3215668 -3263027
42576 -3263027 -4356416 -4992571 -4026498 -2004295 -693352 -939585 -1630347 -1386085 -422770
42567 -422770 304660 964425 2359629 4128956 5131469 5365725 5739035 6009992 4891868
42558 4891868 2455735 512588 61634 137573 -163890 -326665 56335 176363 -411933
42549 -411933 -683126 85258 848977 524405 -130718 11165 205576 -1041833 -3239758
42540 -3239758 -4167278 -2735726 -99532 2085562 3245578 3637655 3588781 3267067 2636705
42531 2636705 1569997 252126 -870742 -1769896 -2784623 -3617807 -3421970 -2413540 -2091714
42522 -2091714 -2937368 -3309374 -1956043 -208925 106314 -346929 177386 1043960 -37475
42513 -37475 -2996453 -4907848 -4003257 -1709231 73302 1354546 2582703 2981344 2003625
42504 2003625 817003 604044 599838 -475003 -2010749 -2350449 -1453142 -968428 -1830387
42495 -1830387 -3235364 -3981568 -3593541 -2157058 -238376 981397 668685 -361829 -388849
42486 -388849 879388 1776762 972842 -726631 -1686759 -1779996 -2273853 -3586222 -4288058
42477 -4288058 -2784371 632579 3981488 5614930 5542826 4776212 3901665 2668467 788870
42468 788870 -1260715 -2386822 -1779066 292239 2496680 3351533 2280193 -139509 -2824384
42459 -2824384 -4841389 -5529166 -4586699 -2467758 -358358 744081 858823 688383 752166
42450 752166 1197718 2044406 2984018 3232949 2329206 908356 -96821 -867246 -2320398
42441 -2320398 -4319883 -5469707 -5117882 -4420552 -4617815 -5167595 -4667702 -3076850 -1805945
42432 -1805945 -1674529 -1827030 -962526 1046000 3097807 4007181 3425869 1915178 381591
42423 381591 -618441 -1130858 -1445693 -1700180 -1983109 -2577558 -3712648 -5080230 -5877693
42414 -5877693 -5385742 -3402153 -297417 2996013 5136283 5099155 3138465 807701 -337493
42405 -337493 -39239 831834 1515493 1936035 2077914 1566337 387570 -560126 -500627 -74490
42395 -74490 -535361 -1669305 -1825989 -489894 554374 -312788 -2015918 -2203358 -527042
42386 -527042 1168880 1654095 1512429 1418582 1091884 650055 1340377 3749113 6405322
42377 6405322 7375889 6510811 5096412 4037819 3504646 3707610 4676869 5569712 5495199
42368 5495199 4985755 5445375 6955393 7745587 6360296 3585717 1576111 1391016 1923060
42359 1923060 1280210 -1005221 -3318850 -3632977 -1726350 623305 1663141 1287357 426840
42350 426840 -352426 -899886 -747908 515373 2147238 2546769 1093427 -870251 -1377421
42341 -1377421 12261 1693418 1679655 -270171 -2308369 -2467241 -858611 530087 227318
42332 227318 -1218361 -2372102 -2714900 -2619589 -2160301 -953915 934385 2729585 3687504
42323 3687504 3661014 3015784 2348130 2039045 1683060 342915 -2070847 -4080116 -4041406
42314 -4041406 -2032586 362867 1925077 2683768 3076966 3040452 2085310 -108720 -3067368
42305 -3067368 -5269385 -5143619 -2928960 -865855 -692117 -1662116 -2108719 -2086618 -2808373
42296 -2808373 -4039101 -4176080 -2999113 -2251443 -2918590 -3794411 -3553327 -2506703 -1265080
42287 -1265080 683744 3625661 6123654 6494063 5053710 3542725 2903089 2810323 2763193
42278 2763193 2390718 1237069 -504734 -1563131 -1177018 -578110 -1402049 -3037860 -3322546
42269 -3322546 -1832803 -605644 -1121679 -2318967 -2527573 -1943476 -1886895 -2532816 -2804521
42260 -2804521 -2133125 -1037795 -7626 1052210 2038336 2330033 1807885 1463225 2203699
42251 2203699 3395103 3421481 1675360 -767614 -2601710 -3603248 -4063198 -3736287 -2259214
42242 -2259214 -180597 1459291 2484616 3553993 4730419 5108804 4193872 2745250
42234 2745250 1756881 1303765 888562 302267 -344382 -878273 -929143 -141030 1075347
42225 1075347 1676884 1307482 725958 466881 76420 -570982 -306399 1718744 4209787
42216 4209787 4983449 3701499 1998994 1092577 655751 98497 -431625 -702542 -948055
42207 -948055 -1282693 -1343733 -855968 78282 1342023 2674300 3154650 1867229 -627960
42198 -627960 -2519837 -2917663 -2835171 -3400626 -4061990 -3545060 -1942853 -698150 -702330 -1452034
42188 -1452034 -2175114 -2789072 -3230383 -2612482 -104036 3375152 5383910 4586317 2557299
42179 2557299 1982039 3313716 4465519 3934644 2688870 2172431 1943177 769335 -996950
42170 -996950 -2021204 -2403764 -3436435 -4987938 -5251025 -3633279 -1983896 -1961600 -2751497
42161 -2751497 -2636394 -1606122 -956640 -1072641 -1095673 -535767 27731 -42204 -523968 -622071
42151 -622071 165068 1442400 2111403 1505200 374593 172583 1309307 2946296 4628862
42142 4628862 6866961 9496432 10794940 9443454 6516591 4245363 3395069 3135866
42134 3135866 2970449 3226300 3718910 3469413 2170525 805212 287193 327197 168590
42125 168590 -250169 -516289 -713397 -1444605 -2810260 -3855854 -3534030 -2245361 -1790726
42116 -1790726 -3146599 -4739182 -4126817 -1412338 555439 25760 -1226743 -690028 1020099
42107 1020099 1151237 -939767 -2828155 -2523516 -914534 8738 -226128 -704905 -684897
42098 -684897 31443 1460375 3151589 4004293 3194003 1078096 -1230788 -2824199 -3279418
42089 -3279418 -2638801 -1588618 -1082587 -1241871 -1112899 -62051 1037394 651482 -1560337
42080 -1560337 -4161600 -5135698 -3640520 -985415 143562 -1822164 -5358759 -7141057
42072 -7141057 -5685565 -2897182 -1526499 -2062733 -2939286 -2890745 -1948665 -691781 258189
42063 258189 296872 -473647 -829023 204571 1744914 2001991 749459 -445286 -563840
42054 -563840 -296222 -413160 -375212 512590 1564285 1469134 122523 -1217645 -1394876
42045 -1394876 -355544 1074336 1922507 1854342 1605675 2255151 3751024 4771339 4507864
42036 4507864 3820624 3889949 4522893 4841867 4909718 5220507 5045105 3113922 47380
42027 47380 -1787600 -1516397 -1121033 -2421725 -4164084 -3773817 -1131074 1272389 1732159
42018 1732159 1165247 1238702 2061197 2425304 1478014 -554627 -2836041 -4541556 -5202976
42009 -5202976 -4790130 -3508890 -1632632 349371 1787838 2513019 3083889 3851483 4193067
42000 4193067 3481324 2417458 2262093 2875264 2826701 1637842 589669 824608 1868734
41991 1868734 2703553 3165848 3416916 2996331 1422783 -932362 -3402754 -5744764 -7520693
41982 -7520693 -7693161 -5939818 -3609797 -2169128 -1373255 -269771 719176 414517 -796140
41973 -796140 -1141193 -131833 653554 -67076 -1547319 -2253606 -1675603 -282149 1317876
41964 1317876 2534930 2955901 2898562 3077249 3321160 2484030 91623 -2812774 -5034795
41955 -5034795 -6576387 -7921264 -8740159 -8195080 -6177757 -3612508 -1743442 -1390447 -2451615
41946 -2451615 -3839482 -4346215 -3744889 -2595115 -1167377 480219 1511174 898738 -653229
41937 -653229 -1004362 416239 1467805 308848 -1906525 -2844760 -2295169 -1893860 -2413857
41928 -2413857 -3181230 -3631162 -3638226 -2740107 -923945 103704 -1524714 -4984846 -7460640
41919 -7460640 -7853182 -7666160 -7807562 -6963269 -4334901 -1811811 -1558737 -2871009 -3339659
41910 -3339659 -2195792 -634869 528650 1561442 2330603 1983168 481613 -934783
41902 -934783 -1361585 -1310307 -1694297 -2524883 -3099082 -2909968 -1970372 -650500 539620
41893 539620 1328466 1883179 2218059 1583874 -723630 -3902889 -6045553 -6423167 -6350935
41884 -6350935 -7040506 -7610972 -6494087 -4188396 -2976558 -3804562 -4922233 -4214817 -1757983
41875 -1757983 707646 1921959 1791972 669046 -874586 -1826461 -1389765 74626 1477502
41866 1477502 2263376 2538800 2256810 1353846 623780 1198825 2850986 3914866 3324648
41857 3324648 1691353 -81999 -2028543 -4171147 -5514127 -5180174 -3838636 -2869034
41849 -2869034 -2645336 -2686849 -2895724 -3381874 -3475311 -2300900 -280686 1100683 1040960
41840 1040960 -14262 -1318123 -2191372 -1696099 582568 3302076 4345028 3411864 2359140
41831 2359140 2543284 3142842 2728584 1236221 -461887 -1892376 -2973053 -3556899 -3926382
41822 -3926382 -4991283 -7008132 -8668017 -8403791 -6219691 -3473232 -1292306 55309
41814 55309 721979 1070940 1577521 2205942 2227516 1327936 441593 685778 1835087 2646336
41804 2646336 2336617 948968 -1281840 -3895008 -5840433 -6285719 -5723330 -5250611 -4824845
41795 -4824845 -3396367 -876461 1319298 2212459 2687210 4216074 6858078 9246516
41787 9246516 10056327 8834673 5912521 2395485 18781 333 1730735 3231440 3291691
41778 3291691 2678531 2780612 3548049 3656160 2625317 1660810 1842307 2440147 2065903
41769 2065903 868069 228659 515833 697573 378366 543974 1582935 2184866 1425874
41760 1425874 613390 1446801 3263235 3928007 2987754 2079201 2269877 2777420 2622305
41751 2622305 1946982 1143960 69938 -1114500 -1440884 -340628 1394143 2573890 2908501
41742 2908501 2736221 2118942 995298 -108999 -242506 1064950 3291350 5250063 5959984
41733 5959984 5474254 4787223 4635076 4674926 4301653 3717296 3262634 2227838 -172011
41724 -172011 -2712255 -2810390 129726 3467339 4281212 2456575 -13461 -1706222 -2680216
41715 -2680216 -3505407 -4472020 -5382950 -5516418 -4334139 -2583078 -1737788 -1873963 -1394652
41706 -1394652 286218 1233169 -467111 -3830592 -6259690 -6781688 -6281206 -5294176 -3591738
41697 -3591738 -1620576 -380309 125383 590430 648357 -711826 -2892707 -3876540 -3120234
41688 -3120234 -2337369 -2690558 -3070352 -2214658 -886517 -560404 -1125034 -1295138 -533161
41679 -533161 652609 1767949 2701326 3487061 4399717 5706345 6800520 6473274 4706604
41670 4706604 3117474 2701439 2304376 629484 -1311425 -1470903 163642 1620417 1812654
41661 1812654 1526071 1476494 1225031 540535 204306 566697 560677 -761750 -2543673 -3068638
41651 -3068638 -1947202 -431582 198336 -263419 -1345316 -2551294 -3363303 -3166344 -1682024
41642 -1682024 588825 2664742 3910133 4386289 4308511 3509658 1871890 52475 -967865
41633 -967865 -1150900 -1394357 -1949291 -1802565 -330052 1365553 1859314 1420214 1241031
41624 1241031 1148539 -173305 -2640653 -4260205 -3744393 -2083699 -702900 459704 1845657
41615 1845657 2556797 1428986 -829512 -2242581 -2119915 -1542975 -1320416 -947042 45492
41606 45492 1029731 1276025 1051353 954050 856929 334924 -340714 -508913 -217023 -239986
41596 -239986 -1034111 -2319061 -3684005 -4873988 -5310115 -4154280 -1447190 1355362 2729216
41587 2729216 2671113 2163302 1335676 -613834 -3417931 -5039953 -4009057 -1563922 -156193
41578 -156193 -317759 -473865 340730 1301787 1660706 2065501 3091578 3847529 3322821
41569 3322821 2141160 1586655 1566602 971358 -388770 -1661062 -2496640 -3218730 -3526643
41560 -3526643 -2631931 -933920 -19523 -472038 -1071258 -832055 -476671 -976263 -1876269
41551 -1876269 -2223411 -2107713 -1947548 -1119035 1072868 3518680 4137054 2644325 985544
41542 985544 694277 1167279 1074665 255396 -590524 -1159582 -1545249 -1597000 -1258744 -1230779
41532 -1230779 -2341126 -4238528 -5451060 -4945138 -3160011 -1334289 -210747 343165
41524 343165 717120 972609 994757 1063177 1943256 4094326 6791708 8402261 7811195
41515 7811195 5458353 2805511 992345 273958 502798 1542133 3021561 4141311
41507 4141311 4161355 3038433 1395536 3983 -496027 346234 2384699 4405390 4716844
41498 4716844 2807206 171434 -1109169 -564110 419593 457946 -503754 -1863515 -3336768
41489 -3336768 -4546993 -4477154 -2512796 266146 2016154 2343409 2443560 2921468 2839722
41480 2839722 1508065 -127062 -953626 -1489917 -2774834 -4126457 -3695909 -1178613 1579715
41471 1579715 2925232 2947150 2319849 1089682 -563233 -1619651 -1416879 -706083 -462648
41462 -462648 -434226 -21776 195257 -684642 -2001874 -2200062 -1253827 -707084 -1097426 -1127389
41452 -1127389 -13822 1030873 695725 -445266 -1071226 -1056169 -871394 -70229 1893388
41443 1893388 3913796 4144660 2586069 1148423 1043133 1638164 2121370 2694134 3545806
41434 3545806 4094128 4073815 4193865 4809016 4958468 3699722 1544540 -389615 -1832846
41425 -1832846 -2948620 -3333032 -2722972 -2021475 -2128403 -2217993 -883433 1168152 1527638
41416 1527638 -362221 -1967769 -1080702 1039612 1526530 -20814 -1200941 -382977 1190441
41407 1190441 1452065 297425 -715699 -668544 -61232 491004 1134262 2007871 2539616
41398 2539616 2236802 1663853 1786881 2496574 2581977 1271617 -872602 -2769399 -3844447
41389 -3844447 -3936398 -2889920 -881512 1216125 2388915 2270837 1116629 -592735 -2118536
41380 -2118536 -2603133 -1978739 -1385718 -1852864 -2743381 -2397650 -320919 2148796 3535227
41371 3535227 3777471 3757787 3973054 4166235 3837586 2674121 765235 -1221306 -2266574
41362 -2266574 -1771442 -177201 1212107 1087886 -833410 -3302503 -4348915 -3141159
41354 -3141159 -901976 537362 839327 1081422 1802087 2216602 1591558 375222 -538710
41345 -538710 -884524 -854135 -571199 -274850 -347779 -567838 2138 1659965 3160015 2969231
41335 2969231 1063900 -1223069 -2761645 -3297137 -2955925 -1982041 -825606 287086 1757189
41326 1757189 3841823 5651447 5884974 4679744 3763589 4301983 5297413 4778757 2245596
41317 2245596 -694344 -2099569 -1631427 -526174 42278 84391 210810 518493 677766
41308 677766 848941 1617922 2883402 3685989 3550259 3205865 3412352 3809775 3660422
41299 3660422 3052852 2464390 1682712 245802 -1354463 -2026746 -1575090 -846530 -368786
41290 -368786 220815 1287931 2616393 3878878 4941304 5577855 5602518 5348925 5269138
41281 5269138 5046818 3997316 2425253 1556228 1805272 2058500 1127448 -841677 -2763773
41272 -2763773 -3653191 -2997679 -1036920 920395 1445593 803137 813165 2249316 3493918
41263 3493918 2770961 679484 -823569 -1189893 -1464202 -2110396 -2343639 -1721897 -891232
41254 -891232 -367592 114943 545984 236171 -717085 -759850 1052144 3090201 2837250
41245 2837250 408577 -1191703 147256 2901682 3964425 2557571 705469 121623
41237 121623 277754 94699 110289 1634346 4347145 6137273 5447726 2885135 366205
41228 366205 -619219 105191 1370608 1353137 -815885 -3809622 -5287771 -4644627 -3633763
41219 -3633763 -3723956 -3920868 -2323580 822804 3007382 2384973 -236360 -2592625 -3341092
41210 -3341092 -2812789 -1942641 -1133671 -303038 313987 5483 -1369702 -2551102 -1983873
41201 -1983873 83883 1510957 789012 -1103911 -2075642 -1447282 -157398 1023310 2205835
41192 2205835 3315871 3480033 1952497 -914942 -3860834 -5449546 -4728663 -1968489
41184 -1968489 1061256 2354699 1677949 792018 1273167 2645144 3208975 2251280 630987
41175 630987 -683398 -1737091 -2879694 -3665312 -3327516 -2171115 -1484406 -1689357 -1502833
41166 -1502833 169502 2159953 2206435 79755 -1925020 -1982090 -758371 320998 1358063
41157 1358063 3131407 5007976 5508170 4591046 3682367 3410237 2858491 1334781 -544957
41148 -544957 -2020863 -3160664 -3989742 -3759129 -2011238 328478 1820587 2105508 1989512
41139 1989512 2264765 2985452 3652352 3668276 2826553 1672221 1140943 1605323 2567039
41130 2567039 3443746 4211729 5006130 5553261 5416298 4541935 3278003 2087192 1393894
41121 1393894 1358862 1632969 1713512 1681015 2098204 2989819 3514487 3040455 2072267 1654988
41111 1654988 2180464 3144517 3765681 3512595 2364201 941486 146657 335772 972730
41102 972730 1214482 610915 -718151 -2086755 -2396988 -1011275 1250640 2643411 2371508
41093 2371508 1325791 681170 597040 792140 1439489 2574449 3328586 2877406 1804230
41084 1804230 1471960 2185605 2925211 2869424 2311079 1959632 2039846 2218657 1941254 895808
41074 895808 -376425 -603827 741786 2286042 1993706 -386067 -3008243 -4203200 -4121787
41065 -4121787 -3821702 -3751282 -3864654 -4474656 -5951629 -7751658 -8587988 -7739473 -5746112
41056 -5746112 -3711058 -2279706 -1442665 -1008958 -910504 -1027145 -1001678 -543836 48852
41047 48852 -11632 -1095983 -2474407 -2889184 -1870807 -259710 630276 169502 -1262890
41038 -1262890 -2776539 -3593409 -3422433 -2577179 -1765217 -1546258 -1883707 -2300153 -2462804
41029 -2462804 -2400580 -2067624 -1088575 586651 1988387 1867414 350823 -882537 -587189
41020 -587189 535257 1010843 671565 531361 953906 1196107 794613 201919 -186310
41011 -186310 -485440 -461636 579550 2459559 3788147 3693136 2905672 2378735 1910379
41002 1910379 1121882 709117 1340113 2082703 1485584 -169267 -1201630 -958455 -431284
40993 -431284 -374373 -245742 532740 1404338 1415284 426701 -932357 -2067665 -2801532 -3244218
40983 -3244218 -3517898 -3511061 -2972137 -1932248 -707295 669408 2427644 4139699 4583431
40974 4583431 3144532 668240 -1696581 -3623730 -4850013 -4518540 -2599601 -898893
40966 -898893 -964189 -1782417 -1375016 39005 594198 -12090 -277019 235440 295953 -396473
40956 -396473 -469847 650101 1826279 2494754 3533425 4961918 5250858 4218671 4177890
40947 4177890 6428303 8730349 8283940 5455383 2542272 545153 -656271 -578220 838173
40938 838173 1738193 602253 -911227 -82950 2584708 4049148 3343671 2549160 3059198
40929 3059198 3872488 4264366 5295984 7332424 8379223 6647563 3265845 785295
40921 785295 -50184 -620801 -2106613 -4017492 -4853100 -3595212 -737733 1922473 2893058
40912 2893058 2474699 2199812 2921473 4129270 4946204 4889277 3779473 1924491 337372
40903 337372 -233760 -349393 -872741 -1275556 -437871 1121260 1722347 1341825 1795497
40894 1795497 3496665 4240919 2463319 -182400 -1153383 -534328 -441717 -1839158 -3693294
40885 -3693294 -4798189 -4902754 -4265652 -3359512 -2897513 -3166630 -3493086 -3146633 -2430138
40876 -2430138 -2066293 -1930295 -1340586 -332355 273438 -57840 -1148623 -2563826 -3842971
40867 -3842971 -4494000 -4340605 -3669994 -2654255 -1092617 831104 2192573 2366129 1793842
40858 1793842 1075960 74691 -1252062 -2010219 -1544268 -759100 -921544 -1642408 -1503014
40849 -1503014 -369652 486826 522153 563376 1073720 1299139 713414 33533 56396 494982
40839 494982 756779 1049131 1808995 2555281 2234131 638738 -1101772 -1570910 -438647
40830 -438647 1207791 1930679 1412881 627913 341186 -33207 -1410270 -3279820 -4008632
40821 -4008632 -2906863 -1033075 241215 570689 279194 -407999 -1290702 -2087761 -2878816
40812 -2878816 -3968070 -4859075 -4212676 -1637413 1100075 1700311 18116 -1752002 -1655481
40803 -1655481 -25326 1298205 1214004 293201 -367745 -621091 -1183327 -2294717 -3158291
40794 -3158291 -3070427 -2558500 -2655578 -3268338 -3159690 -1713972 66777 733928 27896
40785 27896 -1056822 -1456606 -968522 -338756 -657978 -2284745 -4190015 -4880829 -4204825
40776 -4204825 -3593546 -4130892 -5136035 -5357135 -4879063 -4791470 -5333546 -5621056 -5290456
40767 -5290456 -5177455 -5832752 -6366259 -5641839 -4010849 -2853996 -2653133 -2567732 -2019778
40758 -2019778 -1630242 -2016021 -2500288 -1986243 -732120 -166243 -856406 -1658716 -1309074
40749 -1309074 -73544 798607 688479 -18669 -738788 -1092712 -776716 152471 981352
40740 981352 1146614 1298654 2610382 4805446 5872359 4414179 1644241 218091 1315626
40731 1315626 3593070 4970235 4736202 3631298 2458549 1310926 95001 -916010
40723 -916010 -1477432 -1834727 -2130319 -1690658 91698 2170582 2425641 418832 -1589037
40714 -1589037 -1358575 558438 1996551 2229888 2176435 2121994 1337838 83637 -95359
40705 -95359 1203936 2260644 1645084 110265 -1048793 -2093806 -3804448 -5424278 -5407960
40696 -5407960 -3719197 -1780744 -346347 1080027 2642738 3339551 2313310 115809
40688 115809 -1719029 -1948863 -486518 1476098 2301877 1469984 240444 223250 1473020
40679 1473020 2645807 2820631 2326418 1804357 1346033 817939 387866 376840 885870
40670 885870 1680085 2253883 2190432 1772561 1918402 3016562 4151496 4118658 2953755
40661 2953755 1777239 1333632 1377256 1313348 769762 -233171 -1016575 -549774 1156805
40652 1156805 2506368 2289961 1645149 2479846 4279154 4485454 2264657 -276638 -1457767
40643 -1457767 -2487987 -5021733 -7904792 -8436043 -6085323 -3034070 -1327080 -1141301
40635 -1141301 -1726859 -2425794 -2582273 -1887844 -1199728 -1799621 -3403731 -4073914 -2743164
40626 -2743164 -801629 -287337 -1225440 -1790937 -794271 960548 1838375 1189336 -183346
40617 -183346 -914556 -240612 1424128 2882666 3265449 2791448 2291519 2109693 1886517
40608 1886517 1441659 1268315 1770807 2485958 2657400 2287511 1921252 1594217 916612
40599 916612 232779 597201 2172334 3698765 4256589 4530027 5296207 5625887 4130341
40590 4130341 1484367 -67175 269535 1041933 1143467 1440275 2867606 4356491 4103454
40581 4103454 2184713 542747 559375 1643371 2239166 1550130 164220 -671570 -319595
40572 -319595 744810 1880469 3323130 5414305 7011071 6122723 2634113 -910584
40564 -910584 -2043337 -786731 1414060 3763267 5854835 6649377 5524982 3652881
40556 3652881 2623109 2226258 1271972 41730 -88165 774833 1012653 218269 -189343
40547 -189343 448197 927145 490446 243169 1073871 1922536 1588574 784103 701031 726488
40537 726488 -475937 -2322886 -2753246 -1165672 812560 1638134 1456827 1054324 486608
40528 486608 -576138 -1900156 -2719305 -2484711 -1434018 -626526 -1200271 -3101282 -4740575
40519 -4740575 -4503817 -2463925 -46895 1686545 2607827 2638891 1487581 -481943 -2118066
40510 -2118066 -2751554 -2934735 -3455906 -4216289 -4606569 -4502375 -4271058 -4076646 -3787227
40501 -3787227 -3510301 -3695682 -4499737 -5264045 -4925186 -3156133 -1056972 -292972 -1229066
40492 -1229066 -2280373 -1667117 422837 2121806 2208829 1284568 530026 253103 65503
40483 65503 -358258 -1259607 -2764719 -4237233 -4440684 -3154297 -1866468 -1838790 -2219761
40474 -2219761 -1447167 63312 444628 -525419 -930780 155119 1120324 552547 -357630
40465 -357630 72807 1013714 580015 -580599 83299 2799129 4601781 3493685 1071891
40456 1071891 -282854 -643491 -1085458 -834551 1534859 4942697 6552963 5658394 4467784
40447 4467784 4669079 5414637 5492223 5437799 6141100 6864722 6250362 4437838 2805676
40438 2805676 2188609 2481876 3369277 4226940 3882135 1852065 -490739 -1321655 -707162
40429 -707162 -179628 -194052 255227 1261438 1180362 -837502 -3031403 -3209311 -1814301
40420 -1814301 -1265381 -2668631 -4662407 -5491243 -4898412 -3705833 -2647638 -2102278 -2134824
40411 -2134824 -2281798 -1911866 -1173691 -895495 -1167659 -930792 334774 1447516 1176676
40402 1176676 339377 756698 2451848 3638246 3640303 3893493 5228565 6012077 4552610
40393 4552610 2051442 1201195 2496119 3901590 3974394 3366194 3071255 3057760 3131791
40384 3131791 3441161 3450587 2098977 -132966 -1008925 365413 1821619 1138646 -606941
40375 -606941 -778777 662605 1159572 -490259 -2517045 -2934681 -1965972 -985719 -606946
40366 -606946 -697675 -1126373 -1646896 -1883269 -1975997 -2374615 -2630830 -1543016 969037 3358371
40356 3358371 4520288 5093080 5777938 5728838 4028952 1710058 587603 688482 560181
40347 560181 -188704 -459983 180504 690978 350366 -192250 -408778 -1102410 -3075028
40338 -3075028 -5467628 -6526266 -5588084 -3503904 -1494144 -306065 -76323 -210836 328747
40329 328747 1857761 3318535 3538985 2848083 2497520 2668051 2256549 808922 -603573
40320 -603573 -964077 -550472 242781 2084271 5242175 7755939 7015446 3185866 -690254
40311 -690254 -2396728 -2701710 -3166435 -3577196 -2905211 -1428800 -123296 1174950 3039184
40302 3039184 4368046 3220571 -48244 -2470898 -1995663 217569 1795221 1994828
40294 1994828 1553359 955675 172533 -572246 -880712 -612275 408037 2372073 4499570
40285 4499570 5092155 3639637 1948316 1880008 2765383 2553887 867307 -853108 -1860201
40276 -1860201 -2776384 -3679520 -3525076 -2104000 -885389 -1022005 -1876575 -2441894 -2919944
40267 -2919944 -3705802 -3867297 -2118257 1168978 4190689 5728326 5882307 4980128 2916842
40258 2916842 -161528 -3352720 -5635947 -6670755 -6740007 -6175609 -5080183 -3574531 -2186862
40249 -2186862 -1752417 -2621410 -4046514 -4824365 -4630696 -4217372 -4132208 -3873054 -2717684
40240 -2717684 -875524 713122 1394507 1178091 432258 -331192 -645547 -507903 -393479
40231 -393479 -520579 -427373 333371 1422139 2075151 1959753 1318848 638364 525579 1413591
40221 1413591 2907878 3943763 4095560 4062065 4198424 3460930 1002891 -1826418 -2627142
40212 -2627142 -958239 1250738 2344308 2494200 2330964 1668415 449527 -336515 139736
40203 139736 1183900 1465250 746245 -189291 -884964 -1539062 -2223334 -2645997 -2668374 -2428328
40193 -2428328 -1973056 -1253451 -430504 186319 403499 101245 -782799 -1915925 -2579328
40184 -2579328 -2408036 -1772688 -1066773 -129269 1079580 1790252 1276773 140242 -141426
40175 -141426 1009305 2549581 2898116 1332144 -1492814 -3924732 -4489043 -3274059 -1904134
40166 -1904134 -1618086 -1885304 -1705784 -1577926 -2739284 -4699254 -5262758 -3479807 -1152849
40157 -1152849 -634005 -2167051 -4170710 -5223577 -4938238 -3690898 -2434921 -2206466 -2951114
40148 -2951114 -3318450 -2366309 -890323 -219954 -321583 -199227 263933 160924 -826731
40139 -826731 -1914330 -2516633 -2981852 -3632287 -4004198 -3652827 -3082422 -3192020 -4075577
40130 -4075577 -4913211 -4965374 -4275250 -3338288 -2364811 -1141152 348447 1483621 1604837
40121 1604837 946990 400838 272116 2151 -605010 -773414 -27435 758601 570106
40112 570106 -100821 10969 948463 1554825 1347011 1041599 1110199 1107203 776985 675406
40102 675406 1204316 1963409 2474683 2677128 2427352 1579176 937443 1881351 4316927
40093 4316927 6121877 5539051 3224659 1050510 -197296 -910024 -1345393 -1490698 -1639779
40084 -1639779 -1847436 -1210923 1074302 4151666 6085498 5879096 4045285 1548711 -708925
40075 -708925 -1672518 -808373 841754 1417570 346485 -1145798 -1743468 -1356234 -571959
40066 -571959 263205 1046788 1680303 2149607 2413448 2205249 1470295 830193 874685 1153593
40056 1153593 766682 -147987 -561864 -247283 -211246 -1151124 -2450714 -3087815 -2745738
40047 -2745738 -1749965 -669156 -165760 -455403 -832318 -583093 -244581 -737512 -1342170
40038 -1342170 -241412 2516448 4390890 3589599 1405419 254212 773714 2031239
40030 2031239 3209005 3660563 2592470 394982 -744547 636643 2982264 3783125
40022 3783125 3085677 2760667 2938037 1879065 -518232 -1841204 -647667 1489055 2631470
40013 2631470 3180211 4384742 5777865 5981352 5084867 4385894 4302209 4235180 4206256 4889082
40003 4889082 5877157 5567606 3460412 1365714 1310961 2891373 3758912 2586596 558069
39994 558069 -401716 -93345 40363 -834609 -1785357 -1532199 -168045 1317733 2666199
39985 2666199 4387068 6265811 7025231 5913256 3748844 1807999 377740 -893445
39977 -893445 -1817916 -1789199 -865670 134371 653714 818009 782096 411375 -90839 79166
39967 79166 1371969 3019860 3736760 3177851 2167708 1481417 972335 121781 -1030407
39958 -1030407 -1878523 -1875379 -852165 928939 2626063 3126652 2171408 927250 683907
39949 683907 1159412 1045966 187450 -29205 1173498 2698616 3271818 3286287 3774163
39940 3774163 4355469 3690436 1694325 -90757 -445628 272172 959760 909555 -29597
39931 -29597 -1494784 -2506120 -2101723 -476523 1016581 1259389 388647 -616199 -926890
39922 -926890 -467188 55898 -152453 -857356 -784284 619899 1933523 1301853 -1054222
39913 -1054222 -2989809 -2956828 -1285208 836547 2332539 2269540 454943 -1690757 -2184157
39904 -2184157 -716766 1350856 3255349 5470186 7864985 9190603 9188430 9472563 11341986
39895 11341986 14273378 17515719 21498168 26509707 31613311 36136654 40697189 45628615
39887 45628615 50304708 55360237 63346123 75722567 92580318 118258898 162766477
39880 162766477 230024675 304150253 354147266 356921318 314886550 250802191 188808042
39873 188808042 141448798 109561839 88346281 72901984 61137659 53225562 48656309
39866 48656309 44999126 40260020 34969761 30595563 27164470 24003310 21591366 20673219
39858 20673219 20263970 18602086 15826863 13820734 13373294 13230132 12208012 10689046
39850 10689046 9515230 8703944 7947158 7435126 7443708 7647381 7406790 6473453 5179338
39841 5179338 4197207 4108750 4779449 5203304 4531837 3282914 2878537 3797690 4810854
39832 4810854 4416344 2599017 763616 220835 1143160 2809403 4349020 5131396 4864760
39823 4864760 3778118 2679231 2405987 2988715 3585251 3415474 2462991 1090060 -473331
39814 -473331 -1762000 -1810580 -154047 2245199 4031517 5123154 6215801 6924386 6013271
39805 6013271 3619677 1525555 656307 -9969 -1207359 -1783828 -586191 1613815 3593098
39796 3593098 5612494 8001958 9113483 7120384 3254409 824661 1119110 2458483
39788 2458483 3276761 3792294 4287185 4115441 3296819 3070399 3809147 4162296 3405605
39779 3405605 2954481 4180705 6206314 7393621 7769085 8293818 8749399 8214768 7039663
39770 7039663 6483036 6577428 6020887 4282548 2397864 1421826 1246340 1234323 1056358
39761 1056358 599306 -157252 -886196 -1124470 -862901 -417247 185100 1045897 1813457
39752 1813457 2103948 2381921 3406832 4762922 5093807 4139962 3401005 4081832 5304595
39743 5304595 5309731 3873691 2512643 2458083 3352334 4101344 4294157 4341630 4580369 4804413
39733 4804413 4765276 4708818 5009019 5444811 5442488 5122695 5317906 6043532 5766492 3256469
39723 3256469 -273241 -2196812 -1639863 -263140 365911 633595 1295914 1524775 89549
39714 89549 -2336977 -3818939 -3920886 -4174777 -5502849 -6644314 -5882020 -3304948 -492369
39705 -492369 1371033 2188528 2190469 1429469 96797 -1238811 -1922819 -1631459 -627621
39696 -627621 236792 49938 -1257853 -2628023 -2780679 -1410710 614779 2106932 2503376
39687 2503376 2189328 2015255 2302335 2328068 1227222 -530069 -1250635 -26774 1988066
39678 1988066 2917747 2232289 754068 -801044 -2159389 -2670141 -1557046 711886 2454563
39669 2454563 2725795 2387768 2683141 3503963 3747863 2851944 1346648 246689 298555
39660 298555 1392099 2409322 2244121 1258369 919281 1620919 1988593 1092934 82379
39651 82379 312339 961328 313739 -1299388 -1983158 -1480292 -1539716 -2695289 -3056557 -1419637
39641 -1419637 485814 492211 -890567 -1842372 -2508009 -4447683 -7184413 -7861849 -5055729
39632 -5055729 -1058727 771872 -214433 -1955527 -2627964 -2331234 -2053352 -2118539 -2075300
39623 -2075300 -1585350 -936265 -720243 -1244034 -2314060 -3424496 -3953526 -3310451 -1384853
39614 -1384853 915424 2043162 1313401 -100038 -233731 1521799 3766453 4648867 3663190
39605 3663190 1797918 398364 174129 890683 1517237 861809 -1339493 -3813393 -4674919
39596 -4674919 -3315080 -1159893 -207967 -979903 -2378826 -3447567 -4430349 -5744593 -6770733
39587 -6770733 -6587486 -5450651 -4453874 -3880920 -3048063 -1794246 -784051 -14527 1462681
39578 1462681 3528737 4193363 2156540 -955922 -2559656 -2510952 -2674204 -3582446 -3727063
39569 -3727063 -2363250 -885718 -573072 -660287 208227 1852767 3097911 3582711 3868407
39560 3868407 4214392 4142611 2960083 317170 -3174186 -5633182 -5309741 -2946384 -1601265
39551 -1601265 -3113622 -5741375 -6496633 -4935255 -3228721 -3152133 -4508223 -6094358 -6744079
39542 -6744079 -5743190 -3708584 -2768218 -4291379 -6678777 -7129234 -5397030 -3733283
39534 -3733283 -3062542 -1747730 1056819 3353804 3193216 1605798 710040 478143 -373248
39525 -373248 -1407074 -947002 815641 1600105 216059 -1922811 -2927921 -2544751 -1651363
39516 -1651363 -984808 -896387 -1275663 -1297427 -257987 1083578 1177579 -4131 -680132
39507 -680132 185913 1423141 1518372 618238 -306042 -1004126 -1400660 -682569 1437711
39498 1437711 3342459 3168842 1434448 249499 135290 -429823 -2110332 -3425379 -3209058
39489 -3209058 -2594146 -3172344 -4396461 -4421486 -2905189 -1403157 -1136065 -1769760 -2585500
39480 -2585500 -3586018 -4842592 -5637200 -5121216 -3557248 -2285395 -2433439 -3895801 -5456152
39471 -5456152 -5686726 -3930488 -827802 2049315 3386341 3167952 2486128 2288541 2509019
39462 2509019 2548076 2293924 2180895 2269232 1924111 854144 25392 770138 2952324
39453 2952324 4696986 4276563 1870794 -820672 -2305218 -2275186 -1294499 -157033 528169
39444 528169 685962 849308 1571735 2733677 3708742 4126526 4057150 3536390 2538836 1526260
39434 1526260 1286743 1828681 2091492 1352446 313908 -76661 -387947 -1968361 -4430310
39425 -4430310 -5394368 -3562583 -899503 -432928 -2421338 -4137412 -3437925 -1162190 459233
39416 459233 550641 -172203 -1091811 -2361056 -3972835 -5174655 -5198257 -4102939 -2568305
39407 -2568305 -1066653 498422 2313694 3922058 4242563 2738839 560071 -160071
39399 -160071 1356274 3319844 3150766 266214 -3503000 -6060531 -6818029 -6353220 -5268550
39390 -5268550 -3896480 -2583187 -1666746 -1277261 -1377234 -1823298 -2290719 -2423013 -2196567
39381 -2196567 -1908511 -1766137 -1755616 -1834858 -1824617 -1204237 354723 2215374 3226900
39372 3226900 3054302 2297033 1186662 -742905 -3214756 -4612631 -3811387 -1810360 -493149
39363 -493149 -379042 -682671 -1002363 -1616901 -2433081 -3019411 -3569449 -4458740 -4866379 -3383378
39353 -3383378 -314795 2124518 2533441 1935355 1944207 2589850 2917962 2626148 1955614
39344 1955614 860580 -495920 -1182237 -737980 -330075 -1227689 -2598335 -2454999 -646046
39335 -646046 798015 515391 -595976 -1113966 -889647 -340248 639184 1896467 2209286
39326 2209286 656458 -1715714 -2883883 -2322219 -1422741 -1504113 -2361518 -2902427 -2445295
39317 -2445295 -1207161 -50962 204675 -262634 -109841 1705971 4304366 5514937 4314438
39308 4314438 1883830 -42643 -1073409 -1837374 -2440484 -2182044 -742915 1078661 2129215
39299 2129215 2119539 1792579 1874439 2111990 1693425 597018 -104467 275324 853562 346587
39289 346587 -941514 -1448441 -621212 442125 860030 1054487 1378055 1152699 127247
39280 127247 -519926 -128497 -276925 -2557581 -5412487 -5573192 -2610694 251782 332232
39271 332232 -1595832 -3348192 -4278857 -4922364 -5273114 -4918644 -3878081 -2132697 629831
39262 629831 3671977 4858635 3155137 406753 -1052399 -1574841 -2967509 -4872595
39254 -4872595 -4947003 -2685675 -529863 -379197 -1100447 -693217 733448 1612273 1392670
39245 1392670 817190 354800 -199980 -750763 -716684 25430 811350 1043169 933271 1223895
39235 1223895 2368719 4048325 5438381 6012170 6013101 5919903 5566752 4222850 1581566
39226 1581566 -1706731 -4505530 -5871761 -5460704 -3852602 -2407420 -2137539 -2705343 -3104619
39217 -3104619 -3115104 -3204098 -3206977 -2421709 -1186917 -907404 -1899245 -2583745 -1781087 -601538
39207 -601538 -787763 -2079321 -2698596 -1968141 -980706 -793187 -1266553 -1827753 -2277718
39198 -2277718 -2539725 -2448846 -2159656 -2212496 -2925668 -4060101 -5116727 -5600782 -5096151
39189 -5096151 -3599428 -1812041 -667166 -478479 -777545 -890788 -463145 352474 958358
39180 958358 858272 393438 493117 1363965 2015184 1608195 669938 270842 557733 915861
39170 915861 1077317 1147641 974307 489376 286859 768751 1070026 74700 -1719689 -2684571
39160 -2684571 -2305901 -1516074 -751292 683000 2861160 4399945 4179894 2746298 1282912
39151 1282912 307959 71620 946153 2391035 2709998 1142208 -737638 -1140967 -794277
39142 -794277 -1795369 -4117045 -5240631 -3652536 -995670 180951 -385839 -907010 -295284
39133 -295284 593282 435204 -866661 -2354322 -3292243 -3786053 -4363575 -5320345 -6361916
39124 -6361916 -6604148 -5145203 -2146732 740963 1726493 836288 -170006 -158758 -8553
39115 -8553 -903946 -2139172 -1984048 -370390 882729 770296 533938 1626046 3378660
39106 3378660 3821269 2271733 56472 -1245097 -1475898 -1638591 -2372030 -3025796 -2450628
39097 -2450628 -710273 563115 137135 -978342 -757999 936625 2115176 1617747 736599
39088 736599 994072 1734291 1382058 145918 -286840 562698 1240466 506617 -1111986
39079 -1111986 -2310173 -2515332 -1933809 -917097 115646 629971 411882 -153957 -547532
39070 -547532 -667625 -720498 -757567 -568119 1742 749264 1210607 1130439 781980 606623
39060 606623 554098 152162 -653995 -1195863 -945283 -324742 -246111 -1090891 -2556931 -4301356
39050 -4301356 -6200600 -7887588 -8392873 -6619121 -2450041 2553017 5976275 6563637
39042 6563637 5219821 3580354 2043138 81034 -1959184 -2851251 -2368827 -1619651 -1090934
39033 -1090934 -17960 1518758 1646819 -715838 -3728096 -4802377 -3926717 -3046167 -2931331
39024 -2931331 -2631824 -1640374 -640531 -108408 187005 303378 272297 1004322 3366334
39015 3366334 6336541 7794800 7300437 6383151 5913915 5107339 3591812 2476430 2436116
39006 2436116 2390553 1143417 -967918 -2915594 -4157580 -4191487 -2431003 439872 2384675
38997 2384675 2437287 1950476 2340371 3004197 2804070 2138444 1788368 960629 -1409159
38988 -1409159 -4184258 -5032330 -3578802 -1586799 -187905 1054392 2253744 2443294
38980 2443294 1289384 -124150 -981350 -1852839 -3362140 -4894377 -5471302 -5015882 -3997028
38971 -3997028 -2619512 -1114532 -120444 42590 -12183 461712 1358949 2127253 2625169
38962 2625169 2830851 2179814 205887 -2283084 -3692363 -3532527 -2979929 -3123833 -3403330
38953 -3403330 -2536116 -562155 1000849 1083388 306725 -19326 537343 1439256 2072227
38944 2072227 2074272 1173340 -548499 -2404152 -3770700 -4847104 -6122670 -7362629 -7918791
38935 -7918791 -7810614 -7544897 -7030305 -5791980 -4221353 -3333662 -3125626 -2510646 -1168481
38926 -1168481 3600 723872 1925786 3696316 4361690 2984277 1287117 1412838 2915541
38917 2915541 3805526 3667814 3692990 4135345 3911314 2763539 1905834 2098018 2530896
38908 2530896 2078442 624065 -1048761 -1792274 -655742 2028400 4333854 4679277 3777403
38899 3777403 3344350 3329875 2223279 -59749 -1676824 -1577907 -785132 -376628 1332
38890 1332 878666 1925061 2999092 4564147 6096823 5787717 3151353 490802 233923
38881 233923 1873353 3035599 2742855 2124236 2417164 3567521 4544974 4187984 2166366
38872 2166366 -269444 -1231457 -521836 -31401 -1055082 -2467261 -2694407 -2159879 -2120312
38863 -2120312 -2129349 -682334 2092152 4326913 4925105 4519622 3902963 3050589 1945161
38854 1945161 1100646 959412 1620765 3084390 4861862 5700068 4891304 3567581 3355625
38845 3355625 3981527 3698683 1972304 109201 -850575 -1169850 -1093236 -293533 742415
38836 742415 455331 -1687556 -4101787 -5032114 -4565877 -3928909 -3821317 -4270830 -5146291
38827 -5146291 -5934643 -5844586 -4908517 -4165195 -4108279 -3962959 -3210230 -2588982 -2539293 -1918897
38817 -1918897 214679 2468752 2528230 301056 -1958989 -2504793 -1585191 -153456 1340748
38808 1340748 2544393 2928065 2522465 2056120 1924751 1745986 1200294 511323 -200263
38799 -200263 -1183766 -2266401 -2648023 -2100113 -1641082 -2205243 -3116852 -2831987 -1105701
38790 -1105701 460474 336985 -1034353 -1749015 -641076 1513459 3051306 3200441 2435032
38781 2435032 1417235 345495 -515133 -418087 1116504 3416577 5074435 5223547 4149847
38772 4149847 2840425 2214012 2506772 2996402 2536649 776004 -1313040 -2427144 -2176471
38763 -2176471 -1046982 357740 1468811 1664469 854275 -161919 -704453 -1190286 -2157842
38754 -2157842 -2818135 -2006495 -411780 -137273 -1683984 -3085346 -2850222 -2152050 -2791078
38745 -2791078 -4258799 -4518443 -3021074 -1264059 -574368 -825709 -1389367 -2046347 -2723600
38736 -2723600 -3380244 -4380307 -6026912 -7524277 -7405636 -5395269 -3019808 -1924972
38728 -1924972 -2250046 -3027813 -3465865 -3307159 -2501526 -1169103 301669 1449133 1882142
38719 1882142 1251412 -430179 -2376101 -3564105 -3872315 -4033926 -4257479 -3704449 -1794305
38710 -1794305 722611 2623090 3547745 3839400 3615613 2801811 1753005 1088872 1041240
38701 1041240 1435354 2019718 2380036 2019515 1120406 679933 1129209 1394658 365378
38692 365378 -1154533 -1275291 261754 1527239 888999 -1023667 -2305047 -1887431 -234091
38683 -234091 1359523 1734047 749506 -444442 -557491 260723 692863 212335 -255140
38674 -255140 -18228 174903 -568034 -1709063 -2035701 -1358980 -414643 440353 1324075
38665 1324075 1950124 1844343 1386848 1514609 2248823 2567335 2044317 1615707 2152731
38656 2152731 3084807 3226718 2501134 1983914 2335862 2947058 2878317 2148760 1625293 1759050
38646 1759050 1907679 1172069 -324937 -1426725 -1306509 -516582 -405718 -1605620 -3328967
38637 -3328967 -4184844 -3582971 -2284024 -1529482 -1653600 -1779737 -1041049 224736 913954
38628 913954 545838 -353811 -1083673 -1257752 -542619 1176966 3183249 4352096 4441556
38619 4441556 4040232 3057171 635573 -2783239 -4856939 -4156167 -2417839 -2313135 -3763564
38610 -3763564 -4354686 -2974078 -991875 199027 781657 1204748 1173891 816850 1289778
38601 1289778 3121580 5094250 5795024 5337837 4629830 3904149 3015031 2291020 1892733
38592 1892733 997792 -1122218 -3645646 -4986630 -4721414 -3644314 -2232266 -300418
38584 -300418 1901401 3507094 4141067 4141900 3468544 1544225 -1269049 -3107378 -2516818
38575 -2516818 -423513 788617 47498 -1418160 -1968669 -1577363 -1428370 -2095881 -3029580
38566 -3029580 -3719577 -4321440 -4727548 -3997420 -1638165 1137291 2559819 2472797 2214059
38557 2214059 2448770 2488811 2011588 1973335 3040124 4322927 4705379 4512513 4731758
38548 4731758 5269042 5188890 4286665 3316579 2893391 3085310 3787685 4569386 4499220 3181766
38538 3181766 1711367 1489907 2264879 2496120 1586661 513751 186130 476351 1139517
38529 1139517 2342999 3704172 4007050 2740641 1065401 388237 644998 871436 923690
38520 923690 1565942 2964108 4035128 3622954 1901692 308184 124439 1179618 2000224
38511 2000224 1339905 -509367 -2090409 -2319418 -1363483 -151912 506078 321340 -454571
38502 -454571 -1222841 -1509913 -1306565 -812101 -117553 501147 371382 -816449 -2271841
38493 -2271841 -2886576 -2588053 -2081248 -1435384 -56361 1845882 2996046 2705463 1724343
38484 1724343 882604 -94989 -1627521 -3008469 -3151863 -2182644 -1344814 -1454141 -2130182
38475 -2130182 -2536273 -2365003 -1960561 -1646512 -1119333 109028 1460594 1253365 -1116451
38466 -1116451 -3548823 -3351368 -841043 979683 576607 -415624 -442707 -631746 -2424301
38457 -2424301 -4567340 -4857845 -3667465 -3170120 -3698572 -3434431 -1582468 574498 1981580
38448 1981580 2893273 3231663 2096139 -312385 -2266829 -2945382 -3465086 -4494410 -4766196
38439 -4766196 -3410890 -2009729 -2366785 -3449554 -2720941 60975 2439725 2544278 944695
38430 944695 -933177 -2511282 -3595427 -3664685 -2647455 -1601667 -1628363 -2435018 -2757651
38421 -2757651 -2102688 -1361190 -1472034 -1997300 -1626271 -54682 1357646 1346386 675077
38412 675077 1325623 3740197 5959687 6035190 4393526 2977992 2726046 2990036 3114554
38403 3114554 3329366 3875912 4267449 3958867 3168299 2514943 2169802 1800431 1167759
38394 1167759 370494 -509346 -1721186 -3618490 -6087028 -8267239 -9005362 -7728706 -4922216
38385 -4922216 -1791276 491996 1400548 1299047 1134229 1495495 1823699 931461 -1455132
38376 -1455132 -4054213 -5256897 -4684804 -3203400 -1789132 -904495 -698265 -1134405 -1902266
38367 -1902266 -2693421 -3590332 -4747477 -5708863 -5595089 -4171548 -2334316 -1261938 -1296832
38358 -1296832 -1870674 -2364510 -2760236 -3370433 -4093559 -4264389 -3469122 -2266009 -1595425
38349 -1595425 -1515127 -1174157 -222460 512564 241182 -588837 -1026432 -1000362 -1094983 -1349368
38339 -1349368 -1289560 -954700 -829530 -775985 -112487 1076284 1746793 1330837 431314 -245496
38329 -245496 -676797 -816530 -180287 1134145 1945448 1410284 196585 -693492 -1509504
38320 -1509504 -2965879 -4459247 -4582132 -3335750 -2385521 -2803227 -3768893 -4007686 -3461938
38311 -3461938 -2872360 -2572021 -2508863 -2812375 -3422352 -3554942 -2492325 -788683 173654
38302 173654 -93307 -654222 -525721 143798 654025 877643 1145241 1328934 809199 -554771
38292 -554771 -1980125 -2520723 -1902093 -384067 1790850 4349486 6567943 7444334 6498683
38283 6498683 4243302 1816907 253982 -46033 504033 995145 863367 531269 891600
38274 891600 2020848 2826585 2341499 1072261 513548 1308554 2366493 2045991 -51255
38265 -51255 -2757153 -4675573 -5465365 -5660500 -5578025 -4940331 -3652785 -2389562 -1891678
38256 -1891678 -1930948 -1614699 -768440 -391962 -1420643 -3457576 -5140880 -5541864 -4859291
38247 -4859291 -3901450 -3228679 -2771312 -2075199 -911702 360275 1217943 1708154 2346728
38238 2346728 3210993 3691158 3428973 2913179 2660202 2383345 1685363 1076586 1312609
38229 1312609 1936270 1614820 97541 -1217504 -1134140 -194638 310991 200243 362302
38220 362302 1127755 1553233 512667 -1990721 -4794408 -6553261 -6591131 -5054428 -2586079
38211 -2586079 5980 1900677 2479292 1758214 568644 -61134 132543 494241 341022
38202 341022 -246219 -696908 -773186 -782089 -995003 -1197894 -1065712 -840741 -1202140 -2248288
38192 -2248288 -3044959 -2786318 -2145316 -2489129 -3614098 -3502669 -1113301 1711378 2461048
38183 2461048 1347131 810575 1929576 3176240 2998592 1815168 725988 -137867 -955061
38174 -955061 -1296735 -1086895 -1305314 -2389223 -2975293 -1782735 84407 470551 -707712
38165 -707712 -1525149 -1097495 -723217 -1671324 -3370141 -4311331 -3614734 -1378805 1381800
38156 1381800 2880334 1900250 -536797 -1941680 -1227258 263809 957798 1017649 1529701
38147 1529701 2913691 4818756 6496542 6686188 4472164 1076076 -694410 6524
38139 6524 509230 -1758441 -5371436 -6722860 -4969279 -2798488 -2373421 -2816993 -2237737
38130 -2237737 -309533 2006819 3772973 4176250 2623535 -189650 -2231792 -2168699 -775205
38121 -775205 472545 1420931 2862244 4759557 6021296 5881454 4615266 2968010 1586830
38112 1586830 888525 773506 533112 -303868 -1113107 -874334 281646 1024601 530632
38103 530632 -497466 -883461 -390376 471187 1480173 2681159 3498875 2877841 717544
38094 717544 -1510717 -2280476 -1867227 -1947375 -3318158 -4773326 -4636816 -2839407 -834401
38085 -834401 244081 576467 821661 1075623 1047764 749351 456852 215926 -105716 -354968
38075 -354968 -226440 27673 -417808 -1819638 -3064271 -2711443 -865097 732604 824998
38066 824998 145799 98773 557384 192025 -1158303 -1922402 -1138604 -62985 -417822
38057 -417822 -1954489 -3017981 -3004020 -2936505 -3788578 -5431391 -7209617 -8426347 -8243448
38048 -8243448 -6305938 -3663437 -1899844 -1024795 609230 3834403 7270730 9054764
38040 9054764 8930766 7872156 6605362 5432024 4684288 4298414 3502309 1895852 378590
38031 378590 125395 1092929 2353598 3353171 3934246 3721872 2576759 1176508 72806
38022 72806 -1249190 -3131935 -4280815 -3284047 -1182970 -431177 -1239275 -1250796 530823
38013 530823 1890692 888289 -852080 -447968 1924550 3380955 2503037 913082 547541
38004 547541 1333477 2192673 2790357 3365434 3889144 4347273 5174534 6534811 7588316
37995 7588316 7232444 5368778 2924458 894037 -135789 145482 1620700 3438752
37987 3438752 4431888 4017551 2452680 347320 -1596324 -2494965 -1737198 134349 1590735
37978 1590735 1694873 1159671 1325056 2388718 3278228 3122428 2165925 1196942 698219
37969 698219 676217 745679 265054 -989194 -2177267 -2213624 -1423386 -1324352 -2226190 -2296779
37959 -2296779 -180393 2479964 2832493 654878 -1466992 -1802210 -1338533 -1423962 -1498850
37950 -1498850 -466186 1106665 1768355 1321824 644152 -7768 -857001 -1125139 412222
37941 412222 3102207 4360745 2747139 -145858 -1768445 -1540778 -637827 256411 1459323
37932 1459323 2798388 3175304 2117008 680459 45973 -126220 -1087533 -3090116 -4947864
37923 -4947864 -5466252 -4539650 -2725424 -552612 1346965 2163419 1688567 763414 241438
37914 241438 -170963 -1244334 -2665255 -3201956 -2503335 -1640593 -1462087 -1442325 -874265
37905 -874265 -324820 -859591 -2290040 -3288494 -3146957 -2461633 -1980918 -1675015 -1312941
37896 -1312941 -1246814 -1956792 -3038469 -3257180 -1866484 329630 1599005 1123388 -86138
37887 -86138 -498837 6256 267601 -163459 -208149 1119753 3251476 4958738 5840132
37878 5840132 5930137 4643535 1562510 -2032223 -3914753 -3351202 -1617736 -20331 1290010
37869 1290010 2290430 2380755 1474799 604944 461096 228554 -1058293 -2691937 -3017089
37860 -3017089 -1680127 -64940 516313 218981 133182 987846 2555242 3932132 4283948
37851 4283948 3548812 2434006 1617724 1121228 577159 -197921 -1093657 -1804965 -1823265
37842 -1823265 -792499 811560 1879682 1968718 1826310 2049734 1886042 322214 -2023508
37833 -2023508 -3247214 -2439094 -669998 462249 415651 -406387 -1471415 -2309970 -2529029
37824 -2529029 -2245986 -2144738 -2574274 -2860989 -2052800 -233273 1403214 1839069 1216636
37815 1216636 407738 -47544 -217159 -124824 633740 2255362 3983646 4578323 3622999
37806 3622999 1915664 427922 -598045 -1255021 -1325130 -673443 112147 259865 -123946
37797 -123946 -270745 -58576 -345478 -1674766 -3202288 -3445800 -2004615 -220954 -328
37788 -328 -1902691 -4400487 -5250367 -3737146 -1293198 263543 619309 668989 897972
37779 897972 951264 638702 385722 491861 776558 1314599 2753538 5283565 7802324
37770 7802324 8880399 8467516 8008404 8710913 10184021 11202703 11593252 12730474 16005647
37761 16005647 21564716 29264445 40067627 54727853 70801685 82762485 86358573
37754 86358573 81927558 72535416 60383375 46794091 34317666 25885728 21724858 19401412
37746 19401412 17269613 15744927 14834585 13024317 9820571 7160040 6675598 7339055
37738 7339055 7440672 7148018 7146127 6367406 3570934 166290 -1157362 -200047 773417
37729 773417 671376 792709 2183321 4021008 5222453 5748349 5635366 4501929 2878386
37720 2878386 2460656 3947675 5712346 5536071 2849756 -1254520 -5147795 -7208968
37712 -7208968 -6488280 -3791649 -1260670 -71656 687413 2215478 4025294 4634018 3487830
37703 3487830 1381437 -432695 -912735 247322 2032074 2753510 2022538 1383532 2269240
37694 2269240 4088423 5169387 4860981 3785658 2696035 2059326 2155215 2557950 2065464
37685 2065464 184342 -1822709 -2444657 -1984011 -1939148 -2750687 -3500411 -3681073 -3890651
37676 -3890651 -4578785 -5204627 -4967333 -3651117 -1624090 382472 1538333 1554159 890919
37667 890919 -155452 -1988139 -4507205 -6161421 -5602813 -3824413 -3037063 -3601102 -3803232
37658 -3803232 -2735863 -1499289 -1069898 -832207 -104771 513706 446091 381196 926685
37649 926685 1212180 335289 -661823 118876 2764982 5399690 6515145 6209768 5184784
37640 5184784 3776385 2271576 1245147 1099565 1639783 2228820 2134700 987590 -615692
37631 -615692 -1227798 62040 2410009 3923634 3556717 1923977 450583 201345 1302943
37622 1302943 2891993 3723083 3368642 2719619 2813619 3380042 3178325 1655229 -400401
37613 -400401 -1824479 -2075847 -1291682 -22625 959590 1159023 867608 840408 1440472
37604 1440472 2444641 3545670 4529500 5075841 5000763 4653450 4439359 4001386 2632801
37595 2632801 561046 -1029286 -1512050 -1544435 -1856371 -2079972 -1472491 -339426 43284
37586 43284 -1079935 -2962035 -3958428 -3047677 -831084 1035662 1578859 1424833 1570046
37577 1570046 1669690 561470 -1581127 -2973673 -2648289 -1910738 -2338405 -3266558 -2668559
37568 -2668559 -113040 2591537 3699222 3174799 1826245 115142 -1479716 -1959032
37560 -1959032 -767885 1123523 2055729 1556241 663904 339785 289316 -274161 -1234970
37551 -1234970 -1597428 -827400 395299 991909 700164 162059 24367 326306 656538
37542 656538 496865 -539083 -2305359 -3880925 -4268620 -3568045 -2934685 -3044662 -3165582
37533 -3165582 -2313185 -849307 -88546 -443353 -813536 -49282 1592863 2833805 2885994
37524 2885994 2217474 1841954 2046124 2055285 1216099 308718 858432 2788862 3775865 2058588
37514 2058588 -744335 -1228919 1389346 4165681 4309175 2583560 1680428 2464582 3464544
37505 3464544 3431955 2635240 1664981 585751 -317927 -309045 562355 978157 -13754 -1508874
37495 -1508874 -1781412 -510264 858324 990533 267094 211465 1558129 3198041 3234401
37486 3234401 1136984 -1389461 -2029378 -305484 1965496 2703533 1656168 330743
37478 330743 222672 1367548 2444794 2121357 381517 -1451604 -2101081 -1556791 -708433
37469 -708433 -179033 -101564 -646732 -1771561 -2537655 -1852498 -107927 1119847 1405127
37460 1405127 2145849 4128405 5846463 5606808 4225047 3909454 5052753 5892514 5129465
37451 5129465 3165792 728644 -1998297 -4504167 -5777781 -5618722 -4900185 -4060768 -2627994
37442 -2627994 -768677 131508 -662106 -1970985 -2273702 -1516014 -462945 610060 1461813
37433 1461813 1252509 -178169 -1248071 -463825 1208227 1430069 -315487 -2212370 -2714000
37424 -2714000 -2054671 -1001620 264711 1438050 1660913 778208 150583 1258700 3902847
37415 3902847 6460800 7636057 7392468 6343612 4780499 2521814 -396131 -3171219
37407 -3171219 -4738947 -4826165 -4031505 -2806386 -1144675 422166 644921 -743934 -2133495
37398 -2133495 -2056298 -1275248 -1382904 -2076468 -1722966 -219651 901909 1290404 2437708
37389 2437708 5016523 7694410 9374120 10488796 11008586 9388009 5217788 1123694
37381 1123694 -41805 1307258 2687099 3052196 2990528 2381573 379680 -2451225 -4212777
37372 -4212777 -4124979 -3211988 -2435082 -1765221 -1230027 -1251393 -1654349 -1761080 -1663517 -1996968
37362 -1996968 -2372501 -1669638 -124025 642357 157548 -121631 702945 1493507 1152905
37353 1152905 512301 709401 1034480 104765 -1687871 -2644043 -2232523 -1486443 -1032758
37344 -1032758 -204186 1569100 3551708 4435531 3828774 2680513 2286179 2840020 3089461
37335 3089461 1883275 -43839 -770374 114214 756278 -279641 -1837810 -1968530 -909918
37326 -909918 -546418 -1339978 -1683125 -496404 1191361 1880620 1554132 1171620 1059465
37317 1059465 655466 -548489 -2397379 -4149401 -4821177 -3782078 -1379103 1158946
37309 1158946 2623181 2625504 1715558 982950 1246902 2137526 2256581 888688 -761206
37300 -761206 -924659 365459 1424800 1439486 1444544 2325258 3229879 2939970 1783400 995283
37290 995283 858916 746388 641554 1320505 2951146 4556417 5164538 4817151 4211428
37281 4211428 3850326 3709074 3370541 2432292 1034702 -168792 -825469 -1235108 -1430889
37272 -1430889 -625445 1378324 2772211 1382371 -2091654 -4098171 -2280073 1725407
37264 1725407 4455056 4482969 2957605 1289805 -35032 -767856 -799773 -944323 -2294968
37255 -2294968 -4303003 -4809650 -2746661 271552 1959852 2052811 1858481 1843733 1194990
37246 1194990 -276300 -1300766 -856157 268854 449495 -752936 -2341859 -3387430
37238 -3387430 -3923843 -4267357 -4245795 -3644973 -3015028 -3313208 -4635028 -5785727 -5423773
37229 -5423773 -3408467 -769086 1421057 2766655 3317682 3171871 2479487 1499107 464673
37220 464673 -382304 -609524 125669 1436726 2326955 2316816 2056388 2327119 2752574 2169329
37210 2169329 242325 -1903862 -2857352 -2349059 -1337332 -903812 -1195908 -1363836 -557034
37201 -557034 990766 2143346 2297210 2160208 2604132 3234209 3014029 2114239 1966187
37192 1966187 3168429 4407878 4155313 2665945 1442968 1199525 1283763 971537 483100
37183 483100 567881 1604923 3246034 4605971 4787938 3581748 1742337 406674 251869
37174 251869 1258672 2948602 4565297 5397897 5392679 5161628 4940984 4012090 1919595
37165 1919595 -174646 -554470 658603 1521891 1079054 738429 1867755 3227733 2434486
37156 2434486 -518803 -2978460 -3063936 -1822831 -1316519 -1890820 -2428680 -2383639 -2180350
37147 -2180350 -1948710 -1204334 104942 1312869 2035042 2481826 2433096 961314 -2047148
37138 -2047148 -4855487 -5387063 -3523633 -1101525 216719 323865 66990 169824 977487
37129 977487 2557094 4562731 6248977 6915497 6337700 4862043 3247332 2176574 1593670
37120 1593670 794613 -415001 -1113411 -590684 92940 -936506 -3760367 -6182848 -6248174
37111 -6248174 -4220141 -1573593 872031 2981817 4440019 5034048 5296951 5766039 5890665
37102 5890665 4712237 2488506 636972 9972 95724 91155 17932 491466 1874096
37093 1874096 3847666 5493466 5832815 4741502 3303986 2791210 3290778 3756057 3288370
37084 3288370 1866934 -20250 -1769761 -2695949 -2424314 -1483719 -964414 -1373255 -2231699
37075 -2231699 -2842996 -2913245 -2341962 -1063703 605662 1965032 2572575 2536552 2037219
37066 2037219 1077478 -71110 -766980 -794785 -849510 -1702078 -3082063 -3858238 -3292937
37057 -3292937 -1772904 -246466 818200 1726995 2814351 3608893 3118859 1134021 -1078301
37048 -1078301 -1807372 -583884 1454541 2801962 2904334 2327270 1921026 1884226 1648836
37039 1648836 862070 306353 1122702 2944454 3786477 2480428 345786 -553387 -52874
37030 -52874 470812 467795 586179 873693 328665 -1488145 -3829090 -6007929 -7840432
37021 -7840432 -8610817 -7364309 -4915389 -3816148 -5163987 -6863560 -6418648 -4273964
37013 -4273964 -2822481 -2939652 -3236914 -2459822 -1049914 -114702 86542 256745 1111809
37004 1111809 2405195 2831527 1360475 -1176556 -2630596 -2059804 -781134 -326973 -431574
36995 -431574 37961 1141113 1999070 2094384 1316022 -527783 -3035147 -4760054 -4701069
36986 -4701069 -3594598 -2530912 -1191121 981220 2776292 2484095 743215 -56121
36978 -56121 803474 1641696 1306659 740900 1051772 1896116 2570995 3084776 3290587 2415790
36968 2415790 392755 -1558431 -2532260 -3032829 -3741736 -4328579 -4268312 -3785512 -3233533
36959 -3233533 -2530727 -1839852 -1689242 -1796042 -1062873 481262 1147017 34182 -1331170
36950 -1331170 -1073188 512029 1887428 2629674 3294082 3804972 3632850 2992870 2363745
36941 2363745 1384974 -243159 -1341161 -468091 1758228 3291840 3482613 3558131 4261065
36932 4261065 4775261 4366608 3505603 2775519 1948114 714733 -743142 -2334091 -4110700
36923 -4110700 -5399291 -5150857 -3693538 -2818736 -3330387 -3730392 -2366659 159966 1964058
36914 1964058 2469155 2673948 3267650 3859542 4024969 3892197 3483171 2482055 1020349
36905 1020349 -113588 -484648 -572184 -821263 -731346 358378 1894751 2455768 1633413
36896 1633413 758399 1187927 2387808 2497606 633989 -2188283 -4509607 -5923465 -6713620
36887 -6713620 -6794894 -5815172 -3948910 -1845799 81775 1779579 3146317 4028846 4410540
36878 4410540 4126372 2792582 712674 -618071 7492 1699835 2325665 1228954 -110565
36869 -110565 -333091 283589 1110884 2472006 4484414 5742814 4760368 2254411 507965
36860 507965 565898 1377484 1715075 1519982 980117 -337405 -2534278 -4477049 -4907188
36851 -4907188 -4039119 -3161791 -2899030 -2735200 -2208758 -1680310 -1606944 -1687607 -1224400 -73307
36841 -73307 1143632 1675866 1249174 110789 -1287159 -2568844 -3459683 -3652317 -2902959
36832 -2902959 -1473212 -261307 -31527 -519261 -802053 -595857 -433999 -230812 1356147
36823 1356147 5076333 9122412 10445842 8265793 5115358 3867317 4655828 5471613
36815 5471613 5026807 3981828 3608297 4210006 5026745 5140789 4290213 3017470 2010722
36806 2010722 1224513 -24615 -1883028 -3389615 -3578376 -2749122 -2037828 -2045310 -2538020
36797 -2538020 -3156728 -3550119 -2987461 -898807 1962843 3749425 3340305 1450154 -292487
36788 -292487 -846547 -198763 1002775 1880505 1932951 1622950 1976832 3306401 4759620
36779 4759620 5410751 5267509 4816877 4147288 3130802 2063379 1392094 969952 261240
36770 261240 -732036 -1382087 -1370703 -1082979 -755570 200038 2343457 4821698 5648664
36761 5648664 3847433 924404 -458401 712993 2885888 3895811 3132769 1426664
36753 1426664 -396462 -1965390 -2831208 -2586652 -1578101 -667447 -167967 253441 568181
36744 568181 194815 -887709 -1682506 -1298133 131658 2025615 4043859 5609326 5562599
36735 5562599 3305196 -19162 -2347638 -2661555 -1616703 -465606 11125 -338431 -1242196
36726 -1242196 -2241260 -3081748 -3835153 -4394016 -4192556 -2959596 -1507315 -1112271 -2132505
36717 -2132505 -3736298 -4881282 -4967876 -3654608 -908268 2437477 4829339 5267692 4257693
36708 4257693 3209792 3041529 3531037 3844593 3465740 2635409 1968686 1688024 1407815
36699 1407815 794771 151780 -14366 228409 421588 531701 855758 1053290 184955
36690 184955 -1774068 -3231060 -2661585 -611413 903044 811185 -190809 -1204862 -2230568
36681 -2230568 -3184746 -3102740 -1529919 28043 -489770 -3009530 -5359111 -6012553 -5437914
36672 -5437914 -4518450 -3216023 -1487707 -23286 1005255 2590603 4949599 6222172
36664 6222172 4916510 2669887 2347836 3856443 4259949 2147754 -543316 -1653771
36656 -1653771 -1453978 -1153127 -822842 -217909 -10219 -654787 -1280064 -1083399 -617313
36647 -617313 -398728 309141 1713066 1991490 -261567 -3189994 -3676274 -1545638 626066
36638 626066 1466442 1950298 2593580 2269798 577563 -933608 -983154 -206980 364826
36629 364826 757674 969194 144811 -1881079 -3669068 -4163639 -4322857 -5322788 -6331740
36620 -6331740 -5800921 -4116086 -3066167 -3061620 -2765635 -1583378 -795206 -1608334 -3335116
36611 -3335116 -4360408 -4180785 -3593780 -3157172 -2359899 -637991 1334330 2126707 1393079
36602 1393079 433957 368341 475786 -589314 -2381246 -2901463 -1313012 1053438 2801258
36593 2801258 4068834 5253289 5599101 4373817 2490364 1557688 1835217 2267825 2015918
36584 2015918 799998 -1709530 -5410138 -8839652 -10069228 -8706595 -6129876 -3781203
36576 -3781203 -2111893 -1034036 -293191 664223 2140454 3350925 3121553 1596401 229120
36567 229120 -232604 -709377 -2178425 -3991544 -4612674 -3535158 -1700760 -235148 574928
36558 574928 1046736 1383342 1490289 1361952 1306374 1537824 1696390 1220146 243200 -433204
36548 -433204 -484891 -524795 -986299 -1260549 -677578 258681 565407 295947 311167 778029
36538 778029 996898 647816 91299 -631929 -1938478 -3543743 -4227946 -3278159 -1424713
36529 -1424713 53005 506130 -27441 -1135696 -2005570 -1771791 -327222 1642261 3489780
36520 3489780 4832252 5069862 3782361 1776037 542377 325402 -3887 -718859 -509021
36511 -509021 1049169 1957244 427051 -2108584 -2664528 -831949 846634 552497 -846093
36502 -846093 -1950135 -2963739 -4535625 -5870989 -5522279 -3542232 -1618018 -1108562 -1723510
36493 -1723510 -2169459 -1580805 -274906 583015 79406 -1491967 -2891330 -3271648 -2971922
36484 -2971922 -2770522 -2769442 -2502670 -1852126 -1169570 -529363 385807 1410786 1659399 768630
36474 768630 -176402 112111 1168922 1200383 -288486 -1469669 -579211 1618332 2920036
36465 2920036 2599677 1762677 1061971 -145854 -1961629 -3012956 -2449907 -1594077 -2212212
36456 -2212212 -3941045 -4850138 -4099608 -2644514 -1543669 -976842 -931655 -1440332 -1809063
36447 -1809063 -882868 1326753 3222321 3410245 2154060 590589 -630989 -1314137 -1206957
36438 -1206957 -471039 -90346 -787263 -1776670 -1556309 72834 1633622 1836105 1139746
36429 1139746 1042743 2179740 3592339 3890038 2844848 1594595 1267133 1725101 2001778
36420 2001778 1744815 1575990 1928873 2297535 2163133 2091517 3058735 4776540 5462361
36411 5462361 3609358 -291374 -3980490 -5305056 -3949103 -1533849 -24873 57735
36403 57735 -199581 330321 1489132 2308860 2386100 2227721 2350093 2562824 2253169 1097666
36393 1097666 -553987 -1848395 -2092317 -1414717 -541017 271334 1599789 3681840 5372153
36384 5372153 5155747 3083607 830765 -256258 -380014 -441123 -844768 -1499429 -2209911
36375 -2209911 -2576269 -2156598 -1260001 -972844 -1785387 -2726371 -2576252 -1539594 -924024
36366 -924024 -1341720 -1951481 -1491240 418373 2927115 4523323 4162933 2305092 642353
36357 642353 371581 995697 1284309 966171 717984 839765 973738 1124793 1920152 3497581
36347 3497581 4877250 4907456 3482873 1634387 716054 1435731 3174117 4292975 3677134
36338 3677134 1938628 557503 74963 -28594 99377 994768 2571782 3747402 3890795
36329 3890795 3642114 3741116 3994488 4012380 4039177 4334560 4531094 4286013 3806893 3162721
36319 3162721 2012189 643421 146587 702010 919236 -30674 -915208 -466685 415056
36310 415056 333506 91813 1326458 3120367 2713167 -309638 -3079882 -3264200 -1600142
36301 -1600142 87795 1235350 1860278 1507396 262603 -643789 -527279 -286752 -644718
36292 -644718 -713691 417433 1977765 2835305 3359347 4385858 5290123 4780665 2970331
36283 2970331 1130926 -24331 -378319 525855 2714189 4561828 4207009 2073232 322234
36274 322234 -131060 -364985 -1165026 -1796115 -1530376 -878149 -634424 -828751 -1129800 -1288955
36264 -1288955 -841286 551905 2119147 2471131 1479614 528166 471368 605807 272539
36255 272539 139531 896224 1742454 1367823 -197041 -1687495 -2041977 -964516 1237876
36246 1237876 3433993 3963825 2337956 260835 -161452 1070443 2297593 2865430 3783870
36237 3783870 5469308 6432539 5249864 2809162 1234707 979458 411357 -1495006 -3359819
36228 -3359819 -3150864 -939248 1266078 2180670 2481900 3135642 3691381 3049842 1166145
36219 1166145 -941895 -2448769 -3141044 -2965568 -2090416 -1209577 -903301 -836662 -397515
36210 -397515 165296 261753 327872 1316162 2786509 2976839 1207002 -1097210 -2366722
36201 -2366722 -2657898 -2746502 -2652347 -2083595 -1462233 -1422831 -1837164 -2180678 -2330484 -2295545
36191 -2295545 -1845997 -1210595 -1398219 -2844855 -4378056 -4597543 -3770363 -3247650 -3433506
36182 -3433506 -3536930 -3102701 -2594916 -2471865 -2664483 -2949224 -2970801 -2045637 70548
36173 70548 2292705 3096951 2331003 1204387 523877 47224 -301456 171273 1772921
36164 1772921 3597388 4499445 4307868 3605321 2866500 2286747 1996827 1953204 1869668 1570393
36154 1570393 1200045 922155 663544 277489 -251653 -770968 -926933 -358507 728648
36145 728648 1429233 1071124 63981 -686997 -870818 -617751 255999 1771733 2826911
36136 2826911 2098047 120250 -827894 557850 3061200 4688257 4943695 4647618 4438552
36127 4438552 4458030 4868044 5551093 5545391 3825646 804142 -1621397 -1822466 -28983
36118 -28983 1897366 2166846 616742 -1291658 -1988572 -1183634 313492 1698125 2556743
36109 2556743 2491031 1234054 -791131 -2723893 -4122408 -4934004 -4822466 -3580434 -2192903
36100 -2192903 -2135702 -3203997 -3385712 -1662883 280932 229832 -1630816 -3206454 -3310689
36091 -3310689 -2667605 -2299453 -2108451 -1307132 391971 2229069 2857397 1556600 -834230
36082 -834230 -2588594 -2852151 -2170365 -1212773 10908 1312942 1969152 2000018 2625341
36073 2625341 4364843 5787351 5475801 4233665 3726829 3743580 2730116 670060 -574085
36064 -574085 92246 1706516 2822840 2845699 1615005 -688572 -2769720 -2883928 -962294
36055 -962294 1124773 1957606 2021472 2282444 2665017 2731037 2700313 2877117 2956416 2703662
36045 2703662 2518044 2630092 2586328 2214919 2212103 3011104 3926654 4215306 4137199 4118685
36035 4118685 3709986 2350426 451444 -1242247 -2673647 -3874709 -4096955 -2754409
36027 -2754409 -724445 511696 706847 732649 967878 978237 621527 322285 248978 167916
36017 167916 66459 58160 -160747 -810110 -1178309 -379243 1097745 1740813 1035700 66883
36007 66883 -80828 507651 1245834 1873573 2277142 2394128 2635951 3510560 4477667 4151606
35997 4151606 2190883 152497 -175231 1301253 3170107 3985664 3157043 1125441 -827913
35988 -827913 -1625524 -1691039 -2453782 -4182337 -5382885 -5014459 -4060623 -3787237 -3637728
35979 -3637728 -2483600 -1057850 -1049166 -2103820 -2036828 -382371 514098 -1036940 -3434323
35970 -3434323 -4133648 -3160391 -2425180 -2515823 -2324095 -1576020 -1557437 -2849926 -4093750
35961 -4093750 -3868676 -2549940 -1370358 -635677 95470 771081 873185 330996 -452422
35952 -452422 -1193007 -1642216 -1356330 -413587 44942 -943923 -2557234 -2899217 -1333626
35943 -1333626 902041 2433973 2971400 2607694 1199820 -884654 -2372861 -2272764 -915958
35934 -915958 694704 1928423 2444848 1915523 609302 -376287 -285159 350934 605457
35925 605457 457637 493716 895587 1533143 2485304 3572043 3953523 3247733 2527235 2993986
35915 2993986 4040085 3930045 2187117 -32883 -1782306 -3050637 -3641655 -2981432 -1492024
35906 -1492024 -684011 -1222502 -2123140 -2458814 -2551400 -2703747 -2136954 -403768 1195274
35897 1195274 1065587 -332157 -886500 586941 3143598 4962709 5059058 3919547 3039754
35888 3039754 3568295 4916138 5186880 3586173 1769535 1888847 3790972 5237400 4648548
35879 4648548 2522623 212897 -1512870 -2401836 -2221456 -1003029 631656 1856066
35871 1856066 2279448 2149458 2079198 2490740 3111799 3181068 2397634 1427975 1160671 1707526
35861 1707526 2446413 2749267 2385499 1632050 1290168 1992623 3087133 3038292 1652015
35852 1652015 966369 2754943 5854181 7422879 6446004 4434372 2889656 1900926 1449846
35843 1449846 2158055 3847142 4851046 3927276 1896346 379685 -269245 -769786 -1349151
35834 -1349151 -1490275 -925082 15697 884478 1318828 977323 -186265 -1752666 -3238810
35825 -3238810 -4319752 -4483678 -3198416 -881612 1058407 1809274 2080183 2712964 3162569
35816 3162569 2397071 661849 -918388 -2084479 -3379625 -4488716 -4206234 -2412460
35808 -2412460 -692140 -271176 -392365 415046 2264334 4059445 5139580 5708220 5845524
35799 5845524 5172694 3718242 2320550 1732963 1776067 1748240 1326354 665857 -97152
35790 -97152 -931196 -1637917 -2054010 -2519047 -3542338 -4896719 -5742927 -5927738 -6293790
35781 -6293790 -7067323 -6866306 -4503975 -1158779 825438 1114580 1559690 2936427 3566231
35772 3566231 2243272 619717 790299 1782157 813703 -2393173 -4978116 -4950669 -3672203
35763 -3672203 -3395262 -4068347 -4005098 -2616777 -898391 311501 1067916 1327124 532680
35754 532680 -1299396 -2914280 -2958650 -1509062 76074 725016 547340 85438 -676178
35745 -676178 -1940610 -3058261 -2805890 -999829 904319 1349780 287943 -1256682 -2587347
35736 -2587347 -3516622 -3726204 -3059179 -2207977 -1968547 -1885484 -854513 855684 1579876
35727 1579876 679981 -419621 -451710 -284187 -1406793 -3307424 -3894026 -2312521 -54520
35718 -54520 833763 -304866 -2624346 -4658922 -5153876 -3918068 -2247612 -1863368 -3037018
35709 -3037018 -4258097 -4080903 -2796961 -1841033 -1952754 -2523037 -2633989 -2166101 -1690977
35700 -1690977 -1630324 -1880312 -2193272 -2528659 -2784330 -2472675 -1205861 444161 1143981
35691 1143981 241903 -1341275 -2117903 -1702965 -997633 -865351 -1213315 -1454502 -1360884
35682 -1360884 -1210900 -1369185 -1870678 -2206008 -1511676 628644 3399515 5136372 4804693
35673 4804693 2902005 656849 -1384720 -3537646 -5881966 -7631610 -7960236 -7114019
35665 -7114019 -6133622 -5442263 -4298977 -2072362 363798 1303764 357479 -855499 -656362
35656 -656362 594422 1083260 -24801 -1600120 -2116816 -1438190 -615093 -444100 -820451
35647 -820451 -1290510 -1644064 -1878336 -1973518 -1932738 -1940049 -2343499 -3394494 -4877808 -6010753
35637 -6010753 -5991390 -4836451 -3437284 -2523822 -1846821 -820360 280033 502903 -327131
35628 -327131 -1162323 -1161614 -842268 -1094446 -1631675 -1458651 -638636 -381472 -1172938 -1979716
35618 -1979716 -1878814 -1479223 -1891671 -3059445 -4097071 -4696299 -5076087 -4961206 -3920692
35609 -3920692 -2583919 -2107420 -2238406 -1344582 1055053 3116217 2971904 1182556 -253492
35600 -253492 -575204 -619300 -927990 -988291 -543826 -436452 -1526664 -3446019 -4985210
35591 -4985210 -5380057 -4819610 -3920005 -3080005 -2360714 -1788957 -1575216 -1873558 -2414650
35582 -2414650 -2733346 -2841058 -3250400 -4154762 -5094717 -5727011 -6275073 -6688052 -6079379
35573 -6079379 -3938430 -1410205 -192148 -291439 -63626 1403234 3113539 3739294 3300030
35564 3300030 2667897 2264464 1989804 1827815 1773568 1567289 1145779 1030734 1694789 2821464
35554 2821464 3683929 3940282 3589175 2583364 1173371 317349 908136 2566679 3829967
35545 3829967 3636862 2224832 646944 -85056 527600 2161732 3654556 3844141 2726464
35536 2726464 1456420 1026013 1269671 1346940 861797 225634 90651 619943 1232251
35527 1232251 1070701 -44617 -1158768 -1080062 152927 1170119 917261 -68563 -544392
35518 -544392 -362032 -583925 -1746708 -2801871 -2297470 -214165 1949060 2809371 2349298
35509 2349298 1553565 1278972 1633108 2069189 1809281 430951 -1638131 -3303317 -3695837
35500 -3695837 -2806781 -1170058 730442 2421448 3184855 2492213 675772 -1375527 -3222555
35491 -3222555 -5030949 -6684683 -7497435 -7153593 -6246463 -5319617 -3973983 -1718603 711950
35482 711950 1904307 1578842 884097 715744 725251 452677 491399 1623726 3326396 4135933
35472 4135933 3368657 1660706 -101131 -1468158 -1973581 -1048742 1048997 2970150 3616153
35463 3616153 3275372 2862778 2614292 2324853 2361110 3309584 4730214 5385955 4920216
35454 4920216 4336951 4473427 4880105 4687208 3805651 2706561 1667232 829724 448586
35445 448586 505694 575331 533085 753937 1099139 566141 -1226177 -2999284 -3305026 -2396263
35435 -2396263 -1478856 -764666 304670 1355882 1266174 -5892 -1284087 -1899929 -2088993
35426 -2088993 -1723686 -425507 899932 683999 -571682 -324996 2181764 4226173 3340104
35417 3340104 904778 -56394 746891 1158262 403481 -37113 643463 1218181 634304
35408 634304 -244214 43138 1706043 3831945 5422587 5872798 5288504 4642392 4822603
35399 4822603 5437465 5474794 5056444 5249162 6039447 6035811 4650989 3041433 2117866 1157702
35389 1157702 -436086 -1364433 -81523 2559872 4056592 3464138 2374649 2579764 4009826
35380 4009826 5331713 5600696 4821593 3512162 2172268 861811 -866996 -3262425
35372 -3262425 -5582486 -6568916 -5866133 -4390880 -3036789 -1669703 57887 1484608
35364 1484608 1480581 135343 -1015473 -778646 374106 1236544 1480663 1601031 1718895
35355 1718895 1486735 1118272 1398186 2324474 2715930 1775130 287263 -417765 -76098
35346 -76098 612857 1047300 869588 -291557 -2143530 -3221958 -2247090 170699 2243204
35337 2243204 3237750 3825201 4318292 3995730 2512663 743013 -318971 -539752 -107008
35328 -107008 996748 2455568 3469897 3737327 3797182 3864965 3160455 1086564 -1566023
35319 -1566023 -3255122 -3114721 -1426853 709342 1888737 1359663 -123788 -1101502 -1261202
35310 -1261202 -1560419 -2345856 -2705486 -2190767 -1690456 -1754149 -1554464 -630659 -93813 -536923
35300 -536923 -197628 2706596 6769001 8808193 8039680 6584555 5959056 5423044 4249376
35291 4249376 3422495 3998459 5281169 5759528 4918645 3284384 1466901 -82624 -956298
35282 -956298 -1076800 -790359 -417383 -62071 151813 199390 419426 1028611 1542068 1383602
35272 1383602 758567 45909 -1202524 -3398357 -5431688 -5643394 -4212407 -2894596 -2277223
35263 -2277223 -1147623 991399 2730050 2931393 2366246 2097710 1769086 710432 -591849
35254 -591849 -1400780 -1933541 -2443864 -2273956 -1123878 -131291 -275471 -767570 -501613
35245 -501613 -9497 -272512 -624944 130228 1257345 950069 -710093 -1865078 -1843296
35236 -1843296 -1765744 -2005755 -1369362 479520 1861985 1462114 224780 -321299 -297852
35227 -297852 -759587 -1788410 -2631185 -3062064 -3400618 -3579706 -3217568 -2414631 -1749338
35218 -1749338 -1671258 -2341735 -3625196 -4723428 -4381666 -2200374 595258 2339693 2594099
35209 2594099 2098255 1499169 903109 471346 618406 1442029 2405601 2738723 2027698
35200 2027698 584918 -565810 -380796 1161361 2912818 3743558 3612018 3164172 2651926
35191 2651926 1738063 154700 -1872701 -3668916 -4272247 -2970438 -216974 2329362
35183 2329362 3358003 3315159 3610458 4617277 5282470 4719618 3324812 2088483 1579446
35174 1579446 1945953 3135054 4505152 4824504 3479577 1468991 466767 902009 1560958
35165 1560958 1169312 -177051 -1343774 -1432675 -421465 1061820 2143490 2122757 1069437
35156 1069437 56068 288509 1765472 3173077 3399629 2770232 2299952 2077259 1256731
35147 1256731 -276598 -1254981 -712108 423822 521200 -247231 61336 2233773 4266874
35138 4266874 3716387 959085 -1229522 -1199281 -148318 45451 -557179 -465277 865089
35129 865089 2326448 2678363 1858761 717228 109009 318805 837222 710691 -371183
35120 -371183 -1473987 -1559590 -1019662 -1111118 -1923519 -2160190 -1254796 -359414 -491816 -948361
35110 -948361 -639306 71585 234510 177190 853048 1807220 1597998 207498 -726628 -388299
35100 -388299 131593 -250947 -1126534 -1732497 -2160564 -2517091 -2200378 -1163852 -747597
35091 -747597 -1859975 -3173421 -2609468 -82486 2635300 4324652 5090514 5023267 3808973
35082 3808973 1895151 568299 416566 889385 1722359 3455236 5882685 7283437 6293980
35073 6293980 3775955 1783436 1198190 1321806 1326633 1022601 377544 -641910 -1594627
35064 -1594627 -1746823 -995631 -46593 509974 758352 904176 751094 119294 -652585
35055 -652585 -1134602 -1523791 -2421817 -3876632 -5047497 -5012980 -3739837 -2105573 -1040552
35046 -1040552 -746390 -716399 -431396 11410 -11278 -919759 -2364082 -3471299 -3579207
$$ [...]
##END NTUPLES=NMR SPECTRUM
##END=
