##TITLE=31P_DE-80H_X3
 64 sc D2O
 26.2.2025
##JCAMPDX= 6.0         $$ Bruker NMR JCAMP-DX V2.0
##DATA TYPE= NMR SPECTRUM
##DATA CLASS= NTUPLES
##ORIGIN= UXNMR, Bruker Analytische Messtechnik GmbH
##OWNER= root
$$ XWIN-NMR		Version 3.5
$$ Fri Jun 20 15:35:47 2025 Russian Standard Time (UT+4h)  Yarkov@DPX200
##.OBSERVE FREQUENCY= 81.013821
##.OBSERVE NUCLEUS= ^31P
##.ACQUISITION MODE= SIMULTANEOUS
##.ACQUISITION SCHEME= undefined
##.AVERAGES= 64
##.DIGITISER RES= 17
##SPECTROMETER/DATA SYSTEM= spect
##.PULSE SEQUENCE= zgpg30
##.SOLVENT NAME= CDCl3
##.SHIFT REFERENCE= (INTERNAL, CDCl3, 0, 198.062)
##AUDIT TRAIL= $$ (NUMBER, WHEN, WHO, WHERE, WHAT)
$$ ##TITLE= Audit trail, XWIN-NMR		Version 3.5
$$ ##JCAMPDX= 5.01
$$ ##ORIGIN= Bruker BioSpin GmbH
$$ ##OWNER= Yarkov
$$ C:/Bruker/XWIN-NMR/data/yarkov2/nmr/P31/2/pdata/1/auditp.txt
$$ ##AUDIT TRAIL=  $$ (NUMBER, WHEN, WHO, WHERE, WHAT)
(   1,<2025-06-20 15:34:57.17 +0400>,<Yarkov>,<DPX200>,
      <created by zg, POWCHK disabled, PULCHK disabled
       configuration hash MD5:
       00 E9 B6 7A A2 85 ED C7 34 08 36 98 17 FE 4E 26
       data hash MD5: 32K
       30 C1 6E 4C 8A 11 7D 57 0D 8C 6C C7 4F F2 A0 40>)
(   2,<2025-06-20 15:35:06.75 +0400>,<Yarkov>,<DPX200>,
      <Start of raw data processing
       efp BC_mod = 2 LB = 1.5 FT_mod = 6 PKNL = 1 PHC0 = 1687.397 PHC1 = 45.35953 SI = 64K 
       data hash MD5: 64K
       3F B6 68 D5 5F C7 37 D1 48 54 EE B8 81 7A C0 ED>)
(   3,<2025-06-20 15:35:24.67 +0400>,<Yarkov>,<DPX200>,
      <pk PHC0 = -7.599999 PHC1 = 0 
       data hash MD5: 64K
       0A FC 7D 94 95 B5 58 31 AD 32 DC D6 2A C4 E5 5C>)
$$ ##END=
$$ 
$$ hash MD5
$$ 64 B5 1F D3 3B 34 58 F9 E4 46 97 34 77 D5 62 77
##$RELAX= 
##$RELAX= 
##$RELAX= 
##$RELAX= 
##$RELAX= 
##$RELAX= 
##$RELAX= 
##$RELAX= 
$$ Bruker specific parameters
$$ --------------------------
##$DU= <C:/Bruker/XWIN-NMR>
##$EXPNO= 2
##$NAME= <P31>
##$PROCNO= 1
##$TYPE= <nmr>
##$USER= <yarkov2>
##$AMP= (0..31)
100 100 100 100 100 100 100 100 100 100 100 100 100 100 100 100 100 100 
100 100 100 100 100 100 100 100 100 100 100 100 100 100 
##$AQSEQ= 0
##$AQ_mod= 1
##$AUNM= <au_zg>
##$AUTOPOS= <>
##$BF1= 81.014009
##$BF2= 200.13
##$BF3= 200.13
##$BF4= 200.13
##$BF5= 200.13
##$BF6= 200.13
##$BF7= 200.13
##$BF8= 200.13
##$BYTORDA= 1
##$CFDGTYP= 0
##$CFRGTYP= 5
##$CHEMSTR= <none>
##$CNST= (0..31)
1 1 145 1 1 1 1 1 1 1 1 1 1 1 1 1 1 1 1 1 1 1 1 1 1 1 1 1 1 1 1 1 
##$CPDPRG= <waltz16>
##$CPDPRG1= <>
##$CPDPRG2= <waltz16>
##$CPDPRG3= <>
##$CPDPRG4= <mlev>
##$CPDPRG5= <mlev>
##$CPDPRG6= <mlev>
##$CPDPRG7= <mlev>
##$CPDPRG8= <mlev>
##$CPDPRGB= <>
##$CPDPRGT= <>
##$D= (0..31)
0 1 0 0 0 0 0 0 0 0.06 0 0.03 2e-05 3e-06 0 0 0.0002 0 0 0 0 0 0 0 0 0 
0 0 0 0 0 0 
##$DATE= 1750419296
##$DBL= (0..7)
120 120 120 11 120 120 24 19 
##$DBP= (0..7)
150 150 150 150 150 150 150 150 
##$DBP07= 0
##$DBPNAM0= <>
##$DBPNAM1= <>
##$DBPNAM2= <>
##$DBPNAM3= <>
##$DBPNAM4= <>
##$DBPNAM5= <>
##$DBPNAM6= <>
##$DBPNAM7= <>
##$DBPOAL= (0..7)
$$ [...]
##$SUBNAM2= <"">
##$SUBNAM3= <"">
##$SUBNAM4= <"">
##$SUBNAM5= <"">
##$SUBNAM6= <"">
##$SUBNAM7= <"">
##$SUBNAM8= <"">
##$SUBNAM9= <"">
##$SW= 400.765351723535
##$SWIBOX= (0..15)
0 1 3 0 0 0 0 0 0 0 0 0 0 0 0 0 
##$SW_h= 32467.5324675325
##$TD= 32768
##$TD0= 1
##$TE= 0
##$TE2= 300
##$TE3= 300
##$TEG= 300
##$TL= (0..7)
0 120 53 12 22 120 120 120 
##$TP= (0..7)
150 150 150 150 150 150 150 150 
##$TP07= 0
##$TPNAME0= <>
##$TPNAME1= <>
##$TPNAME2= <>
##$TPNAME3= <>
##$TPNAME4= <>
##$TPNAME5= <>
##$TPNAME6= <>
##$TPNAME7= <>
##$TPOAL= (0..7)
0.5 0.5 0.5 0.5 0.5 0.5 0.5 0.5 
##$TPOFFS= (0..7)
0 0 0 0 0 0 0 0 
##$TUNHIN= 0
##$TUNHOUT= 0
##$TUNXOUT= 0
##$USERA1= <user>
##$USERA2= <user>
##$USERA3= <user>
##$USERA4= <user>
##$USERA5= <user>
##$V9= 5
##$VALIST= <valist>
##$VCLIST= <CCCCCCCCCCCCCCC>
##$VD= 0
##$VDLIST= <DDDDDDDDDDDDDDD>
##$VPLIST= <PPPPPPPPPPPPPPP>
##$VTLIST= <TTTTTTTTTTTTTTT>
##$WBST= 1024
##$WBSW= 4
##$XGAIN= (0..3)
0 0 0 0 
##$XL= 0
##$YL= 0
##$YMAX_a= 383
##$YMIN_a= -1292
##$ZGOPTNS= <>
##$ZL1= 120
##$ZL2= 120
##$ZL3= 120
##$ZL4= 120
##$ABSF1= 0
##$ABSF2= 0
##$ABSG= 0
##$ABSL= 0
##$ALPHA= 0
##$AQORDER= 0
##$ASSFAC= 0
##$ASSFACI= 0
##$ASSFACX= 0
##$ASSWID= 0
##$AUNMP= <proc_1d>
##$AZFE= 0.1
##$AZFW= 0.5
##$BCFW= 0
##$BC_mod= 2
##$BYTORDP= 0
##$COROFFS= 0
##$CY= -3
##$DATMOD= 1
##$DC= 0
##$DFILT= <>
##$DTYPP= 0
##$F1P= 0
##$F2P= 0
##$FCOR= 1
##$FTSIZE= 65536
##$FT_mod= 6
##$GAMMA= 0
##$GB= 0
##$INTBC= 1
##$INTSCL= 9.790993e-09
##$ISEN= 30
##$LB= 1.5
##$LEV0= 0
##$LPBIN= 0
##$MAXI= 10000
##$MC2= 0
##$MEAN= 0
##$ME_mod= 0
##$MI= 50
##$NCOEF= 0
##$NC_proc= -10
##$NLEV= 6
##$NOISF1= 182.463
##$NOISF2= 159.3651
##$NSP= 0
##$NTH_PI= 0
##$NZP= 0
##$OFFSET= 198.0616
##$PC= 4
##$PHC0= 1679.797
##$PHC1= 45.35953
##$PH_mod= 1
##$PKNL= yes
##$PPARMOD= 0
##$PSCAL= 0
##$PSIGN= 0
##$REVERSE= no
##$SF= 81.0140089999434
##$SI= 65536
##$SIGF1= 159.3651
##$SIGF2= -187.1042
##$SINO= 113.3802
##$SIOLD= 16384
##$SREGLST= <1H.CDCl3>
##$SSB= 0
##$STSI= 65536
##$STSR= 0
##$SW_p= 32467.5324675325
##$SYMM= 0
##$S_DEV= 0
##$TDeff= 32768
##$TDoff= 0
##$TI= <>
##$TILT= no
##$TM1= 0
##$TM2= 0
##$TOPLEV= 0
##$USERP1= <user>
##$USERP2= <user>
##$USERP3= <user>
##$USERP4= <user>
##$USERP5= <user>
##$WDW= 1
##$XDIM= 65536
##$YMAX_p= 439572202
##$YMIN_p= -18238608
$$ End of Bruker specific parameters
$$ ---------------------------------
##NTUPLES= NMR SPECTRUM
##VAR_NAME=  FREQUENCY,     SPECTRUM/REAL,   SPECTRUM/IMAG
##SYMBOL=    X,             R,               I
##VAR_TYPE=  INDEPENDENT,   DEPENDENT,       DEPENDENT
##VAR_FORM=  AFFN,          ASDF,            ASDF
##VAR_DIM=   65536,         65536,           65536
##UNITS=     HZ,            ARBITRARY UNITS, ARBITRARY UNITS
##FACTOR=    0.49542278885378, 1,            1
##FIRST=     16045.7642231865, 0,            0
##LAST=      -16421.768244346, 0,            0
##MIN=       -16421.768244346, -18238608,    0
##MAX=       16045.7642231865, 439572202,    0
$$ Real data points
##PAGE= N=1
##DATA TABLE= (X++(R..R)), XYDATA
$$ [...]
42782D6664q0724N376o0580m08392n59705r7868M94209L68271l71193o60953J0595
42771a314300Q31828Q38017K27638j07428P7616K51577J08764o3698l8769J0094
42761H21339k0457N7867K34442J22386l85619p44023m79302N9767J81371j55321
42751c07550l75844k05104L7701Q8539J02303J81654P2004l31633n84520k49247
42741a571697L89138O29691K75213j79218k54568J1890L16601M62584L63331N726
42731D48691m08572n41761l30815j03455r9773j14333J28202M49456M29214N8324
42721h4822k05357r2866J05027K492k93105l31821K5096L76384K83830j68095
42711c83237m75207l26288O2454K81389K31424J23461P3167l5525k45493l62396
$$ y = [46664, -34060, -28684, -89264, -497656, -1057361, -1155229, -661020, -292749, -663942, -1324895, -1314300, -482472, 355545, 583183, 475755, 553371, 804948, 913712, 850014, 811245, 821339, 800882, 858749, 1093191, 1215577, 829958, 85935, -393367, -333600, -152229, -307550, -683394, -888498, -850797, -762258, -659955, -478301, -406297, -737930, -1322450, -1571697, -1182559, -552868, -277655, -456873, -711441, -699551, -382950, 79634, 442965, 448691, 40119, -501642, -832457, -935912, -1035685, -1150018, -1021816, -572360, -143146, -84822, -290179, -383045, -278018, -275526, -568631, -900452, -875356, -498972, -215142, -383237, -858444, -1184732, -1122278, -840889, -609465, -486004, -412837, -448362, -693855, -1056251]
42701a056251k56039j01659q7997o5827J96288N09524M17238j02216m80475l02326
42691a329740J21222K24623l102q5934J44792K79313j6158m47701m84170q6772
42681a683627K83782L09814J33139M181n4010q1730L6252L58670O17121M66520
42671C90112k4132l99766l72945j27649r340j10014k56208k59139q2271J36749
42661a114603J87114J8412j34737l5220J69936J14656j97396l15879j5594L04285
42651a019026J80030k35717m15306j96103J04354K16046J88187J59084J75112
42642h43339K40424K90888J63507j53161l37699j21852K47236L12181Q1591n5665
42632a75889l5158j72264m54654m07931R7040M88941L15382q2639j58531J0651
$$ y = [-1056251, -1312290, -1413949, -1501946, -1567773, -1371485, -861961, -444723, -546939, -1027414, -1329740, -1208518, -983895, -986997, -1072931, -928139, -648826, -664984, -1112685, -1596855, -1683627, -1399845, -1090031, -956892, -952711, -1006721, -1088451, -1052199, -693529, -76408, 390112, 365980, -33786, -406731, -534380, -543720, -653734, -909942, -1169081, -1251352, -1114603, -927489, -909077, -1043814, -1079034, -909098, -794442, -991838, -1307717, -1323311, -1019026, -838996, -1074713, -1490019, -1686122, -1581768, -1365722, -1177535, -1018451, -843339, -602915, -312027, -148520, -301681, -639380, -761232, -513996, -201815, -120224, -175889, -211047, -383311, -837965, -1245896, -1148856, -659915, -344533, -427172, -585703, -575052]
42622e75052J1957j21943l0638K46321K72483n6896l10403j47117K39960M29480
42612d1848K48060j45447m52249m72740k92233j78468j82673l5447L54220N72767
42602f26058K52039k75718l56437P3837M67923M95855L45515J94525k3544k22546
42592C25391j30415J51563J30987k69910m63783j16051K38514n821n60891o69760
42582a370176k01261K77246L54177J46298r9342k72312k86650j25789J2540l0720
42572a595989n5822J88154M94133M52752J34905q82J29642J29030j43168k93484
42562e60729n7038K70946L29298J76547Q848j81433l53956k49868J38473L07839
42552a71073p8992n60194m43688J93360O23804M89124J46230n952n642j1208K1677
$$ y = [-575052, -563095, -685038, -715676, -469355, -196872, -253768, -564171, -711288, -471328, -41848, 206212, 60765, -391484, -864224, -1156457, -1334925, -1517598, -1553045, -1198825, -626058, -374019, -649737, -1006174, -932337, -464414, 31441, 376956, 571481, 547937, 325391, 194976, 346539, 477526, 207616, -256167, -372218, -133704, -139525, -700416, -1370176, -1571437, -1294191, -940014, -793716, -893058, -1165370, -1452020, -1577809, -1565269, -1595989, -1651811, -1463657, -969524, -516772, -381867, -382749, -253107, -124077, -267245, -560729, -617767, -346821, -17523, 159024, 167872, -13561, -367517, -617385, -478912, -171073, -250065, -810259, -1253947, -1060587, -436783, 52341, 198571, 192619, 186977, 175769, 197446]
42541A97446J26434J41787k5770k14346k75308k89699l27120k35432P8746L53134
42531d70128K56475j10689k88501m5952L30040M14370J63450p1919j3348J94391
42521C58189J94386o1313j92167P8058M32591K94552l71853r23632q25466k83716
42511a300371J16791J61200Q3713O1781J9015p0362m4941J44490K65473J20319
42501d42892j41897k27444j05535j0109p2346j48323n4878J67444L14855K72267
42491d48858J25859N1044J37846L05709L58072J62041j75109l58022k19906M9098
42481a2226J17934m9907j55321j7088J44502M9851j85739k08932L4535K20215
42471f2176J24961r9077k18875k27207k13569j54599j3750J20285J62209J44028
$$ y = [197446, 323880, 465667, 439897, 225551, -49757, -339456, -666576, -902008, -823262, -470128, -213653, -324342, -612843, -658795, -328755, 85615, 249065, 177146, 163798, 358189, 552575, 491262, 299095, 377153, 809744, 1104296, 732443, -191189, -1016655, -1300371, -1183580, -1022380, -938667, -876886, -857871, -928233, -973174, -828684, -563211, -442892, -584789, -812233, -917768, -927877, -1000223, -1148546, -1203424, -1035980, -721125, -448858, -322999, -271955, -134109, 171600, 529672, 691713, 516604, 158582, -61324, -12226, 105708, 55801, -99520, -116608, 27894, 77745, -107994, -316926, -282391, -62176, 62785, -36292, -255167, -482374, -695943, -850542, -864292, -744007, -581798, -437770]
42461d37770O8084j37523l43328j84389L86281P69289L99547l82932o72967k12307
42451g48015K98807K54061n8113n6959J89888J59905k22330m42906j60915L41219
42441d45358N86097M49222J35370j30558k14263o6515J94118K96974R0157k54404
42431F40840m33171l53887j58104L6677K27897L55520K62584m5317k74474j86321
42421G2244L1954J791k65995l47645o0364K06638O8323k43692k34143Q2553K52070
42410d36266J63817K00296M81485N34995N5714m76275m23465O8754L00260K4697
42400D94012l23623l75853k49571j28752N9572L22654L82191Q7733k58938l14808
42390c05383j87279j74795k21601m6979K74144L17142l0259l10852j12873L35219
$$ y = [-437770, -369686, -507209, -850537, -1034926, -648645, 120644, 520191, 137259, -535708, -748015, -449208, -195147, -253260, -310219, -120331, 39574, -182756, -625662, -786577, -445358, 140739, 589961, 725331, 594773, 380510, 313995, 508113, 805087, 895244, 640840, 207669, -146218, -304322, -267645, -39748, 315772, 578356, 533039, 258565, 72244, 104198, 105989, -160006, -507651, -568015, -361377, -293054, -536746, -770889, -688336, -436266, -272449, -72153, 409332, 944327, 1000041, 523766, 100301, 169055, 469315, 494012, 170389, -205464, -455035, -583787, -524215, -201561, 180630, 268363, 9425, -305383, -492662, -667457, -889058, -936037, -661893, -344751, -375010, -685862, -798735, -463516]
42380d63516M58028P5674m17221n69609l33154J2877J84286O9672k31703m30908
42370a645574k52640K28371N63103M24525M6441o5479J77084L44081J39020j79221
42360b20289k37680j30793k14050m67651m79562q4581L49419M10347J39576j27209
42350a062473j90625o4316J84541M23417M09877M3615l65849l55164J14119N58103
42340c04755N51447K07861p2476j60454k51485m36166n33493m38050l44758m05593
42330b187922l77816M6749O53331Q55520N03374J32088J92792M09092K57440j92326
42320B92322l93251j56753J30652J49690L7383P597L189o9522j10675o6636r9301
42309b75305k71228l42028j44425J07090J79763K21805M33688N85098L13989k37766
$$ y = [-463516, -5488, 70186, -347035, -916644, -1249798, -1236921, -1052635, -982963, -1214666, -1645574, -1898214, -1669843, -1106740, -682215, -635774, -701253, -524169, -180088, -41068, -220289, -457969, -588762, -802812, -1270463, -1750025, -1834606, -1485187, -1074840, -935264, -1062473, -1253098, -1317414, -1132873, -709456, -299579, -255964, -621813, -976977, -862858, -304755, 246692, 454553, 382077, 221623, -29862, -466028, -999521, -1437571, -1782329, -2187922, -2565738, -2518989, -1865658, -1010138, -506764, -374676, -181884, 227208, 484648, 292322, -100929, -257682, -127030, 22660, 60043, 67640, 70829, 1307, -109368, -176004, -275305, -546533, -888561, -1032986, -925896, -746133, -524328, -90640, 494458, 808447, 570681]
42299E70681n61572m88603k94476j36715R2099K98872J40807l50694n96479k33744
42289a559824L42160N40651L37261R6798n0916j96909k33096L3174M16355M88935
42279B14589J97332r0198j90704l05351m90464m11472Q3198N23514L67278k12968
42269c15246n12462k07429K89805M34976J87273j03225k07845j99914k16430k44183
42259a094680j74544L4726L02090M87065M91304L31268J34435L0517J3555n4092
42249E01644k49468m40892m30434k31561o4123l8184j9661Q4873J13600o2476
42239h36682k08563j6447L47445L86206J5544k60065r1742K01783J72577n9797
42229c49741p9674R9772R4529j59951k93179j15552J12795J45156P2340K9340
$$ y = [570681, 9109, -479494, -773970, -910685, -818586, -519714, -378907, -729601, -1326080, -1559824, -1217664, -677013, -339752, -242954, -293870, -490779, -723875, -690701, -274346, 214589, 411921, 321723, 131019, -174332, -664796, -1076268, -993070, -469556, -102278, -315246, -827708, -1035137, -745332, -310356, -123083, -226308, -434153, -634067, -850497, -1094680, -1269224, -1234498, -932408, -445343, 45961, 377229, 511664, 542181, 555736, 501644, 252176, -188716, -619150, -850711, -914834, -953018, -972679, -887806, -774206, -836682, -1045245, -1061692, -714247, -328041, -312497, -572562, -664304, -462521, -289944, -349741, -429415, -329643, -235114, -395065, -688244, -803796, -691001, -545845, -473505, -444165]
42219d44165m7949j84942k29381j52721j56531k63110j72440J82111L31081n0453
42209a188500m94670l28873K91756N67421K28401j18913M2059M18019M55729J55697
42199B8126o2316j8784J05745J62421J84050J85276R6952q0619k44887l22427
42189C3537l06079j87014J9511J97192K02379L4145j39161j38543N5042K65259
42179C6268K71317O2750r4074K1170K26954J29029l03353o27081n19941k01618
42169i98579l5695J9230K16360M70712M48778J64999J9527J34121R4419l83342
42159A50530q80904p70991j08509M02488L33608K3319r026J93810J85018j51340
42149f31997m18690l12646n7049j3320r5399Q0004N30926P76819M80392p0144
$$ y = [-444165, -492114, -677056, -906437, -1059158, -1215689, -1478799, -1651239, -1469128, -1138047, -1188500, -1683170, -2012043, -1720287, -1152866, -924465, -1043378, -1001319, -583300, -127571, 28126, -34190, -52974, 52771, 215192, 399242, 584518, 681470, 600851, 355964, 33537, -272542, -459556, -440045, -242853, -40474, -6329, -145490, -284033, -228991, 36268, 307585, 370335, 276261, 297431, 524385, 653414, 350061, -277020, -796961, -998579, -1034274, -1015044, -798684, -327972, 120806, 285805, 305332, 439453, 533872, 150530, -730374, -1501365, -1609874, -1207386, -873778, -850459, -859485, -665675, -480657, -631997, -1050687, -1363333, -1420382, -1433702, -1529101, -1449097, -918171, -141352, 339040, 268896]
42139B68896l26665j40188J67444K60832Q2855k32679m87188m66797j06890L35902
42129f44478M63790J69684k41146m10111k72354k279K24627L16605K38901L1892
42119a24869j90978l32670l61709k72294j03482Q83p1356j57972N0863N09807
42109a053777P01517K87417l28678m57865m5552K98989K02769k6219k4796L7909
42099d08286j34592l42127j75038K55245M02986Q7001k75505l01709p9290J40910
42089h30405K71886K51183j1017l20447k35875K90886O86195N11922Q9564n0288
42079F53604J7229j03383l14620j86680J83086K09608k06756m49213j52867K23818
42069a26174J43031k15211l27344j15740Q3226R3296L7262N0157J62023L41935
$$ y = [268896, -57769, -197957, -30513, 230319, 313174, 80495, -406693, -873490, -980380, -644478, -180688, -11004, -252150, -662261, -934615, -936894, -712267, -395662, -156761, -124869, -315847, -648517, -1010226, -1282520, -1386002, -1385119, -1456475, -1614447, -1563584, -1053777, -352260, -64843, -393521, -851386, -896938, -597949, -395180, -421399, -446195, -408286, -542878, -885005, -1060043, -804798, -401812, -314811, -590316, -892025, -971315, -830405, -558519, -307336, -318353, -638800, -874675, -583789, 102406, 614328, 703892, 653604, 670833, 567450, 252830, 66150, 249236, 458844, 252088, -197125, -349992, -126174, 16857, -198354, -525698, -641438, -558212, -464916, -427654, -377497, -215474, 126461]
42059A26461M39480K53333j48163l88283k59313J338J01415O1974k8058k65199
42049a05015o16294o99041k86478K55075M54571L87076L79839L55795L7410l93016
42039b30078m57707j31754J51143K03773K29746K76578J37616j37227k00542P778
42029a50674J50793P8370Q897K1629q7042k93920k59397M9766K02641R815j65432
42018d34554p5140O324j21810j69730M1031J34141j39669l16360N1993N43985
42008d79789M79016L0329q3360J91578K07958k33359n51775l70784q0071j14578
41998a004835k95399k67843j06039o6875j03012k1993J39124K64674M48955P52461
41988b60782Q62375M33461l03427p02562n19598j90796j69131l20913k27811J51927
$$ y = [126461, 565941, 819274, 671111, 282828, 23515, 24853, 126268, 188242, 160184, -105015, -721309, -1420350, -1706828, -1451753, -997182, -610106, -230267, 125528, 162938, -230078, -687785, -819539, -668396, -464623, -234877, 41701, 179317, 42090, -158452, -150674, 119, 78489, 87386, 109015, 21973, -271947, -531344, -481578, -278937, -269122, -434554, -509694, -503370, -625180, -794910, -753879, -619738, -759407, -1075767, -1023774, -479789, -773, 29556, -53804, 137774, 345732, 112373, -439402, -810186, -890257, -1004835, -1300234, -1568077, -1674116, -1740991, -1844003, -1865996, -1726872, -1462198, -1013243, -260782, 601593, 1035054, 731627, 29065, -490533, -681329, -850460, -1171373, -1399184, -1247257]
41978a247257M57427M68777L35689K26770O6755k22952m66990m44151k01780N0401
41968i77311K24374L02357J55882k58892o12288m90967P084L36606K34277J9847
41958a059031N0377K37835K97250J54786j02582l95690n63033l98504j1683J50102
41948a640173r3764l31965j51284K43277L72532J94337M9887Q8403J79889K67784
41938h21077L78724L78227J42320j00123k8207K16538J87897j55734l68251k13273
41928c82959O703l3552k34012l40749l42473l58922l56111j99913J16661M32166
41918a693161N31371K85895j84907n03741l68252R4030M67671N22799L62568J53452
41908c32275m1319j69932j87371j66160j99831k04020l2457K38687L84294L56763
$$ y = [-1247257, -789830, -321053, 14636, 241406, 308161, 85209, -381781, -825932, -1027712, -977311, -752937, -450580, -294698, -553590, -1165878, -1656845, -1649761, -1313155, -1078878, -1059031, -1008654, -770819, -473569, -318783, -421365, -817055, -1380088, -1778592, -1790275, -1640173, -1733937, -2065902, -2217186, -1973909, -1601377, -1407040, -1357153, -1268750, -1088861, -821077, -442353, -64126, 78194, -21929, -50136, 166402, 354299, 198565, -169686, -382959, -376256, -409808, -643820, -984569, -1327042, -1685964, -2042075, -2241988, -2125327, -1693161, -1161790, -875895, -1060802, -1564543, -1932795, -1838765, -1371094, -848295, -485727, -332275, -373594, -543526, -730897, -897057, -1096888, -1300908, -1333365, -1094678, -710384, -353621]
41898c53621K87497K09319N9735q2398p3212J1954j3352r2567k5631J18661Q4125
41887A30510r2775j13753M7635R4274n5421j47335j01894j48914l14267k90717
41877i92657k7924P0828j74382l44816q4954L01924L32882N5347j47954j62098
41867a173804j22449m0060J37153K65615J72524o0553k54299l76971l94572j61936
41857b009352K41432L91622J11229j37376J01728N25704M97473J3632l38193k94317
41847h96418j90474k85830l57673j36614K56021M99978M49839J91292q4588j96473
41837g50940j13775O711L4535K6299M2760j3537j67362j92191M1068K41555R3822
41826g51055j92395j55344J97661L93600J94815j27789k49279j46765K9279J12546
$$ y = [-353621, -66124, 143195, 202930, 120532, 47320, 59274, 45922, -46645, -72276, 46385, 130510, 37735, -76018, -28383, 65891, 10470, -136865, -238759, -387673, -701940, -992657, -1020581, -949753, -1124135, -1468951, -1553905, -1251981, -919099, -863752, -1011706, -1173804, -1296253, -1336313, -1199160, -933545, -761021, -821574, -1075873, -1452844, -1847416, -2009352, -1767920, -1376298, -1265069, -1402445, -1300717, -775013, -277540, -263908, -602101, -896418, -1086892, -1372722, -1730395, -1867009, -1610988, -1111010, -661171, -469879, -554467, -750940, -864715, -858004, -823469, -797170, -754410, -767947, -935309, -1127500, -1086432, -844877, -751055, -943450, -1098794, -901133, -507533, -312718, -440507, -689786, -836551, -807272, -694726]
41816f94726m6080l84577n19536j83443L03898M10335J54222K631O3525k2866
41806i16617l25186l99977n1657K77730K11769L1137J62521M75166N17655J78488
41796A61029k71862n75614n98071k74708K18682M47432K00161j81006k49417m5358
41786a168732P3757M800n5922n63J13166K70504M44342M30506J01442k48532k00527
41775b35759J74293M00612L10124K17694K81892J69962l56742r05477r04900l86068
41765a234369R2255J96455R8454K1154p8819k48753l15236j51447P4885J59127
41755a386294J63471K11700J89798j4554j51228P3486M04510K90313k25533m35794
41745h80125PN13808M77606R2750o7357M441j05506l92526m17069p0958K51172
$$ y = [-694726, -740806, -1125383, -1644919, -1828362, -1524464, -1114129, -959907, -957276, -893751, -916617, -1241803, -1641780, -1693437, -1415707, -1203938, -1172801, -1010280, -535114, -17459, 161029, -110833, -686447, -1284518, -1559226, -1340544, -893112, -692951, -873957, -1123374, -1168732, -1094975, -1090175, -1146097, -1146660, -1033494, -762990, -318648, 111858, 213300, -35232, -235759, -61466, 339146, 649270, 866964, 1148856, 1318818, 962076, 56599, -848301, -1234369, -1142114, -945659, -847205, -826051, -904870, -1153623, -1468859, -1620306, -1545421, -1386294, -1222823, -1011123, -821325, -835879, -987107, -913621, -509111, -218798, -444331, -880125, -880118, -366310, 111296, 204046, 136689, 141130, 35624, -356902, -773971, -844929, -593757]
41734e93757K92905K24830K23423K41246K75130L99488M43640J03821m99858q28063
41724B82805o26588k06138R6757K80737L72339K62657M1694p507M0217k43777
41714B93196q15078r42922k49860N93503P49119L13538n4737j87275l78629n91118
41704a270263m54831J2081L56546L83285L22730K78794O3178l24374n42639l82650
41694a558143j9015L02788M83325M36512J28643j86746j63028J21839K17113l6795
41684b73507k83970k22563j0220Q6761R5176J51298K07846J73786J18174J04662
41674A47443K5775j69250k64806n4093K93087L91001J28994k03470k97835j80357
41664a83511j14717k16826k79942o7979K76827L33678j1492l38264k69811k9463
$$ y = [-593757, -300852, -76022, 147401, 388647, 663777, 1063265, 1506905, 1610726, 1110868, 282805, -343783, -549921, -453164, -172427, 199912, 462569, 504263, 496756, 536973, 293196, -521882, -1464804, -1714664, -1121161, -372042, -58504, -113241, -300516, -679145, -1270263, -1725094, -1713013, -1356467, -973182, -650452, -371658, -308480, -632854, -1175493, -1558143, -1577158, -1274370, -791045, -354533, -225890, -412636, -575664, -453825, -236712, -273507, -557477, -780040, -790260, -703499, -608323, -457025, -249179, -75393, 42781, 147443, 173218, 3968, -260838, -314931, -21844, 369157, 498151, 294681, -3154, -183511, -298228, -515054, -794996, -862975, -586148, -252470, -263962, -602226, -872037, -901500]
41654i01500n2823k30786o1417M60048O92584K93296k15606j94630J94174K92963
41644B76303o0730l76388l05823j04124j46994l49557l34717l176L46099M40144
41634f18963L32814J92749k948l36474o09978m70933M2427M06974K86360J7967
41624g60005J04063M43918N12037J83288j25443j45121o5127l6878J06550L87117
41614F04399M24250J5180m09571l51437J2015J13535j63181m15644l99430k81402
41604h51286k06165p3309J35559J96882L59k21079k09317j3671J70510K99406
41594g72111M10455M07095J68928j67539k79627p2979J45771L9995k99832m40020
41584h59864j60332K45153L41373R0085j85924k87234k95301k43387R48L61268
$$ y = [-901500, -954323, -1185109, -1246526, -786478, -93894, 199402, -16204, -210834, -16660, 276303, 215573, -160815, -466638, -570762, -717756, -1067313, -1402030, -1405206, -1059107, -618963, -286149, -93400, -96348, -432822, -1042800, -1513733, -1471306, -1064332, -777972, -760005, -655942, -212024, 300013, 483301, 357858, 212737, 147610, 110732, 217282, 604399, 1028649, 1043829, 634258, 282821, 294836, 408371, 245190, -170454, -569884, -851286, -1057451, -1130760, -995201, -798319, -797960, -1019039, -1228356, -1242027, -1071517, -772111, -361656, 45439, 214367, 46828, -232799, -305778, -160007, -120012, -419844, -859864, -1020196, -775043, -433670, -343585, -529509, -816743, -1112044, -1355431, -1354483, -993215]
41574i93215M21122n451m36666k85788K81898N39475K25160j44731j20992M2949
41564d76239p8025l40205l02889J347J17733m9339m4536L90315Q19809O80609
41554G18580O7810m12082m47804l05078k94513l29884j94176K5178O2956o9759
41544a178772p3062J62460L41713J85582j33623k11856K5427K47725K17108R7242
41534c20056J40624K75696K18401j02893m47578n63134m06939q2491K54929M11967
41524f21474K80258J1989j10810n3217o0352k06880j88371J91511N57619L66729
41514A67002l08011p91000o44643j46840J74717J60723o10j35247j81807r8630
41504a804346J01200L07229M36923M92906M17963J01457l31511m84521j78262
$$ y = [-993215, -572093, -577544, -1014210, -1299998, -1018100, -478625, -253465, -398196, -519188, -476239, -554264, -894469, -1197358, -1196011, -1078278, -1127617, -1172153, -781838, 37971, 718580, 786390, 374308, -73496, -378574, -673087, -1002971, -1197147, -1171969, -1109013, -1178772, -1251834, -1089374, -747661, -562079, -695702, -907558, -882131, -634406, -417298, -320056, -179432, 96264, 314665, 211772, -235806, -798940, -1205879, -1288370, -1033441, -621474, -341216, -329227, -440037, -493254, -553606, -760486, -948857, -757346, -199727, 167002, -141009, -932009, -1576652, -1723492, -1548775, -1388052, -1388662, -1523909, -1705716, -1804346, -1703146, -1395917, -958994, -466088, -48125, 53332, -278179, -762700, -940962]
41495i40962K28394K82607L7081j02535O540J42033J66833J93154K55037J72536
41485D40718j19234l65162k87135N3197L09765K02076k19009n83823n19839o2118
41475a150564L22789K63926o1339j91901M598K36090K40019O1486j07864j34087
41465e16847o293J05477m4855l91560m59989K593N10798M40529k6647j82813O5677
41454e03930J05267k45393l59677R4703M96729K70718j58344j17674J70424M1908
41444b05269l90003l95983J23821M50648J79079k42043l05507j30625o6801j25927
41434a108610j31033o8209j2990L4677N5315j2853q6869P266K08504K49100R5672
41423g70030K1291J17748J10743j43260l37341j68849J72308K78577Q6723j23935
$$ y = [-940962, -712568, -429961, -392880, -495415, -488875, -346842, -180009, 13145, 268182, 440718, 321484, -43678, -330813, -277616, 32149, 234225, 15216, -568607, -1088446, -1150564, -827775, -563849, -625188, -817089, -812491, -576401, -336382, -274896, -382760, -516847, -523140, -417663, -462518, -854078, -1314067, -1311474, -800676, -360147, -386794, -569607, -503930, -398663, -644056, -1003733, -909030, -412301, -141583, -299927, -417601, -247177, -205269, -595272, -991255, -867434, -416786, -237707, -479750, -785257, -915882, -982683, -1108610, -1239643, -1307852, -1320842, -1286165, -1230850, -1243703, -1330572, -1323306, -1114802, -865702, -770030, -748739, -630991, -520248, -663508, -1000849, -1169698, -997390, -718813, -632090, -756025]
41413g56025j46798o088J74697K36655M8028k73276l41249L0830M59053L95675
41403a78498j29171m95228k87306J82478L17570J3311k56288j02053K62720L12800
41393c59665q6103m93764m76923j64188j9260j81782l15743j22251K68944N24408
41383a426327N13430L52522K02164J63252K59760L93016M00015K49577P3991o5753
41373A115647k74934n56115o43074l42337Q3016J61920j71048m82887m11578p7909
41363a599299J84181K84278L58878M33965L68792J47192o196O9670J86108R204
41353D36773m66672q20827o56559m8571N49077P74518O36831L70552J49527j5946
41343I08703j82809l51324m41323l77277j82727L3448J74774J95474O5974j87515
$$ y = [-756025, -902823, -908911, -734214, -497559, -449531, -722807, -1064056, -1033226, -574173, -178498, -307669, -802897, -1090203, -907725, -590155, -576844, -833132, -935185, -672465, -359665, -445768, -939532, -1416455, -1580643, -1599903, -1781685, -2097428, -2219679, -1950735, -1426327, -912897, -560375, -358211, -194959, 64801, 457817, 857832, 1107409, 1181400, 1115647, 840713, 284598, -358476, -700813, -617797, -455877, -626925, -1109812, -1521390, -1599299, -1415118, -1130840, -771962, -337997, 30795, 177987, 171791, 241461, 427569, 436773, -29899, -850726, -1507285, -1555856, -1006779, -232261, 404570, 775122, 924649, 908703, 725894, 374570, -66753, -444030, -626757, -593309, -418535, -223061, -157087, -344602]
41333c44602l89776l16902R818K58834J59952j51822l18102k04273R743J26988
41323a160142J21484M3617o4041j27915q4472K430j592j04890j71310j01207Q8275
41312a559763L34135N27969M89921J51316k38694l12429k8551K83892L54675K19582
41302B22053K133k68017m94993m47258o4762L40294M09132J62048p5209q4353
41292b98932O6905K01361K45210K66700L49143M04880J80866l91232r07039q42440
41282g24578k46043K50741K56712R2917J79114L10928N307o32814r28359n39530
41272a975605J15496M64541M38318L20911K41941J01866j34296l23165l11652
41263a061645q8493K11084L74538K46982j01913l83930l62132r9348J39629K08650
$$ y = [-344602, -734378, -1051280, -1041462, -782628, -622676, -774498, -1092600, -1296873, -1287130, -1160142, -1038658, -995041, -1059082, -1186997, -1271469, -1269039, -1270631, -1375521, -1546831, -1648038, -1559763, -1225628, -697659, -207738, -56422, -295116, -607545, -636096, -352204, 2471, 222053, 224186, -43831, -538824, -986082, -1050844, -710550, -301418, -139370, -214579, -298932, -232027, -30666, 214544, 481244, 830387, 1235267, 1416133, 1024901, 117862, -724578, -970621, -719880, -463168, -370251, -191137, 119791, 125098, -507716, -1436075, -1975605, -1860109, -1395568, -957250, -636339, -394398, -292532, -426828, -749993, -1061645, -1150138, -939054, -564516, -317534, -419447, -803377, -1165509, -1264857, -1125228, -916578]
41253i16578J99598K34758K67526J81964J3720p0971k1469R297j11141k89143
41243e02439l21182j46277J09978K76443K32950l2630l29241l35273L3246M05425
41233f09000L47629p1393l81600l58165k30415j96519j23944Q4875K02775N9272
41223a276485p7378J25056M98937N95559L61886J66580J59766O0350k83485n29802
41213a99016l23514J23361K80303J9316k52787j99634K1207Q3055r129j461J49841
41202c08458K15539R8297o222M1247J00124N3555N6982K24005L24005J43348p1171
41191H71251L1991K68876J57679k69543m73773k69275o8030j18719j29022Q6773
41181H8208J99099j1453j84580j3772J60009m9978l24489j35046L46471N18253
$$ y = [-916578, -716980, -482222, -214696, -32732, -19012, -89983, -111452, -102155, -213296, -502439, -823621, -969898, -859920, -583477, -350527, -383157, -712398, -1047671, -1014425, -609000, -261371, -332764, -714364, -1072529, -1302944, -1499463, -1623407, -1538532, -1335757, -1276485, -1353863, -1228807, -729870, -134311, 227575, 394155, 553921, 614271, 330786, -199016, -522530, -399169, -118866, -99550, -352337, -551971, -530764, -447709, -456838, -458299, -308458, -92919, 5378, -844, 40403, 140527, 194082, 251064, 475069, 799074, 942422, 871251, 903242, 1172118, 1329797, 1060254, 586481, 317206, 249176, 130457, 1435, 88208, 287307, 275854, 91274, 77502, 237511, 187533, -136956, -272002, 74469, 592722]
41171E92722K82575J8448j85355n27076q21377o14716j9801K96632R7883j23992
41161a004057j8773J09437n7606k85392k24118M0123K23846K74887K59813J46278
41151e35562l4440j04129l6821l5453j29890o3026K13272L29269O2211k64327
41141e98896k62550k5002J41713K07256K83563K88382J27952j4649N0077J51241
41131C49087J7271k71134m29209m02358l12769j37526J92920M93861M87288K04383
41121A91814o8765j74712j53233l9108J30457K14993J45414P6001J08952N8245
41111D90058j93884l31586m0760L53244K27523l81118p20955l53792K60573M42324
41101b48373J45520j78714k76222k69780k71375j82096M8928J96753j6204m89907
$$ y = [592722, 875297, 893745, 708390, 181314, -640063, -1254779, -1274580, -977948, -880065, -1004057, -1022830, -913393, -970999, -1256391, -1480509, -1440386, -1216540, -941653, -681840, -535562, -570002, -674131, -710952, -746405, -876295, -939321, -726049, -396780, -334569, -598896, -861446, -886448, -744735, -537479, -253916, 34466, 162418, 147769, 197846, 349087, 366358, 95224, -333985, -736343, -1049112, -1186638, -993718, -499857, -12569, 191814, 123049, -51663, -204896, -244004, -113547, 101446, 246860, 322861, 431813, 490058, 296174, -35412, -76172, 277072, 504595, 123477, -597478, -951270, -690697, -248373, -102853, -281567, -557789, -827569, -1098944, -1281040, -1232112, -1035359, -1051563, -1541470]
41091a541470p13366l11949M35118Q39481N91882O8832k20238j95252m8257J47120
41081i48099L61771M05985J75836o6250k6028J61719J88143J14350J98523L16309
41071H82259J11360l03881l94340m6941K03788r404l70852m47087k94647j79779
41061h49524j04556J7983N9188o3357r7876J69150M75346M19436O8918j65132
41051g0424j42194r0065j50366k00213j34588j7251P8795J36429R7564o9815k16098
41040g78226j45718R6688K81911L13802K77085K03129L2976j93237l50094m25458
41030f87142m62352l33667J00957N84824N97758O5204m11263k95173J82687L90255
41020b67912J74915j7131J37864L90696L17249r9308m79920n20845k89115q4973
$$ y = [-1541470, -2254836, -2566785, -2131667, -1292186, -700304, -631472, -851710, -1046962, -1095219, -948099, -586328, -180343, -4507, -70757, -96785, 64934, 253077, 367427, 565950, 882259, 993619, 689738, 295398, 248457, 452245, 442841, 71989, -375098, -669745, -849524, -954080, -936097, -876909, -940266, -1038142, -868992, -393646, 25790, 94708, -70424, -212618, -302683, -453049, -653262, -787850, -805101, -726306, -589877, -492313, -562128, -778226, -923944, -827256, -545345, -231543, 45542, 248671, 281647, 88410, -261684, -687142, -1149494, -1483161, -1382204, -797380, -199622, -134418, -545681, -840854, -658167, -267912, -92997, -110128, 27736, 418432, 735681, 636373, 156453, -364392, -653507, -738480]
41010g38480j14390k95626l50720j07968K79408M72333L16984j778k03370j95029
41000i38636m1553K08291M85320N60236J96907m70305r10918p25585j11819L62113
40990a385949M06203K57897K72797M55168N16087K94709m6201k58329l09464l48127
40980a45209m19296l65902r0154J99737J89335r0835k26567L5364L76303K84723
40970b52501k18083n35968k69031K49468M10736J43269n5357J26803L81407K67642
40960B48385j22306k89839m1370K48983J68293j99771m47055l85392j96834j07811
40950a124717j30236j36058k1547K27138M95299N58316K90603j21568l28201k05878
40940d96849M9013K24371K90115K62461J24693j5118N2739K94468L59525P0590
$$ y = [-738480, -852870, -1148496, -1499216, -1607184, -1327776, -855443, -538459, -540237, -743607, -938636, -980189, -771898, -286578, 273658, 470565, 260, -910658, -1636243, -1748062, -1385949, -979746, -721849, -449052, 6116, 522203, 816912, 770711, 512382, 202918, -145209, -564505, -930407, -1020561, -820824, -631489, -722324, -948891, -913527, -537224, -252501, -470584, -1006552, -1275583, -1026115, -615379, -472110, -527467, -400664, -19257, 248385, 126079, -163760, -205130, 43853, 212146, 12375, -434680, -820072, -1016906, -1124717, -1254953, -1391011, -1412558, -1185420, -690121, -131805, 158798, 37230, -290971, -496849, -447836, -223465, 66650, 329111, 453804, 438686, 491425, 785893, 1145418, 1216008]
40930A216008k48691k19015K2421M4823k15325m12352l63040k44649j69785K7830
40920e61775M06661O42835M09374j40051n04897l97015j8595J88618q785m14771
40910c98401o10792m15084p9481O2632L7774J18551L38752M15443J98574q2683
40900d14715j44733K314J70227K66308K95219K36073Q1503q6430j76420j83011
40890D6335j50141j28569j83894l12500l46977j31597J90744K97959J44379L1450
40880e42811J28105K14693P6068j31903j52444l8060j5583j13145k04723k93305
40870a073108m52315n66137m26307p0002K32868L42702L80460M64183N10606L78159
40860b78891R7030j15716n6728K33239M46344L05923j02166m29366n01955m51572
$$ y = [1216008, 967317, 748302, 770723, 815546, 600221, 187869, -175171, -419820, -589605, -561775, -155114, 487721, 897095, 757044, 252147, -144868, -163463, 25155, 16370, -398401, -1009193, -1424277, -1503758, -1441126, -1403352, -1284801, -946049, -530606, -332032, -414715, -559448, -557134, -386907, -120599, 174620, 410693, 492196, 405766, 229346, 46335, -103806, -232375, -416269, -728769, -1075746, -1207343, -1016599, -718640, -574261, -542811, -414706, -200013, -123945, -255848, -408292, -446352, -461935, -575080, -779803, -1073108, -1525423, -2091560, -2517867, -2587869, -2355001, -2012299, -1631839, -1167656, -657050, -278891, -181861, -297577, -354305, -121066, 325278, 631201, 529035, 99669, -402286, -853858]
40850h53858l74561j67386J45486K47279k0120k99169j66364K39163M16678K17966
40840f14886l6079j03097q0224q5461n0222O2092J23206N4784l5655l5335K1612
40829g79265M6403L880q8323j41797k0105K65226M62891L88329K21511K38607
40819E97357L45229K09578j84251m78516m48771k17009O1974L40649M45612J38697
40809H10549m16095o37587k34237L62374N18100J25709l94404o08842l89301Q0617
40799g83117M17323L21773q8436l84662l50748j74870m2647J33704M06946N48185
40789C451L69947L6855j98209l28974m34570m51207l60441l21955l35769q9595
40779b110467N00078R13566O50682k1242m34635m28206l43132k82501j9560L75409
$$ y = [-853858, -1228419, -1395805, -1250319, -1003040, -1023160, -1322329, -1488693, -1249530, -832852, -614886, -650965, -754062, -834286, -919747, -969969, -907877, -784671, -729887, -765542, -800877, -779265, -732862, -728982, -817305, -959102, -979207, -713981, -251090, 137239, 358750, 597357, 942586, 1152164, 967913, 489397, 40626, -176383, -114409, 226240, 671852, 810549, 394454, -243133, -477370, -114996, 403104, 528813, 134409, -474433, -863734, -783117, -365794, -44021, -132457, -517119, -867867, -1042737, -1085384, -951680, -544734, 3451, 373398, 410253, 212044, -116930, -551500, -1002707, -1363148, -1685103, -2020872, -2110467, -1610389, -696823, -46141, -67383, -502018, -930224, -1273356, -1555857, -1575417, -1200008]
40769a200008M69568J58632j40803j66667j54080k80201k82516M0637L82394L76179
40759g96865J69158J35468K47738J59950j91605m49956l02316J67118N93793O47954
40749C80437K87275j71639l21881j28016J4213j76177m36338l05660K27129O91735
40739F1078P02519L17584j50229m55373n25714m32504l19360k67624k19364r6531
40729a385518N5378J30894J00666j2649j90441l23659k01022K07811N72505N56569
40719d89466K74747J14208J51465R5567j59318l17783j82767j6839j23589l26243
40709i80018k17876J93774M49866K50280j92028m71329m37818k30225l0023R2554
40699a572843J69079K57176L48448L50779K23211R1636J04619J89046J16936j52406
$$ y = [-1200008, -730440, -571808, -712611, -879278, -1033358, -1313559, -1596075, -1555438, -1173044, -796865, -627707, -492239, -244501, -84551, -276156, -726112, -1028428, -861310, -267517, 380437, 667712, 496073, 174192, 46176, 60389, -115788, -552126, -857786, -630657, 61078, 763597, 1081181, 930952, 475579, -50135, -482639, -801999, -1069623, -1288987, -1385518, -1330140, -1199246, -1098580, -1111229, -1301670, -1625329, -1826351, -1618540, -1046035, -489466, -214719, -100511, 50954, 146521, -12797, -330580, -513347, -530186, -653775, -980018, -1197894, -1004120, -554254, -303974, -496002, -967331, -1405149, -1635374, -1665397, -1572843, -1403764, -1146588, -798140, -447361, -224150, -132514, -27895, 161151, 278087, 125681]
40689A25681l78627l70758k36875j76321j79677j09523L7211J45890J85183J86836
40679g70980Q5007j88340m65610m61381j76426O1009M7780l3570O2922K84651
40669a554938M21368M24057L71942K67450R3933l5658l0274k8992j93126l59575
40659f23813k13826J92137M23235K45042p5016j87697j14823r1914j78390k56372
40649h81437k67257k15188l6758K96686N93688N79663K33601j64088l32023k32575
40639d25688m4937j917k06139m84804m81245m0889N30046P49488M86005N2640
40629A32560j93715j66112K3627K26956K91993J31015j44076k89813k11118m8136
40619b46819N9438J19771J30159j0842k76939l93875j72989J60606K25270M286
$$ y = [125681, -252946, -623704, -860579, -1036900, -1216577, -1326100, -1288889, -1142999, -957816, -770980, -685973, -874313, -1339923, -1801304, -1977730, -1916721, -1868941, -1902511, -1839589, -1554938, -1133570, -709513, -337571, -70121, 23812, -11846, -42120, -71112, -264238, -623813, -837639, -645502, -222267, 22775, -52241, -239938, -354761, -446675, -625065, -881437, -1148694, -1363882, -1400640, -1103954, -510266, 69397, 302998, 138910, -193113, -425688, -470625, -472542, -678681, -1163485, -1644730, -1685619, -1155573, -406085, 79920, 132560, -61155, -227267, -203640, 23316, 315309, 446324, 302248, 12435, -198683, -246819, -187381, -67610, 62549, 51707, -225232, -619107, -792096, -631490, -406220, -401934]
40609d01934j50422l1789J66868J83755N4127M866J20025K55374K30367J5649
40599D46886k34141k95596q5922K13274L15835J35549j54930l60906m11342k62441
40589f93734J03244M69138M36747p3825n70525n44098j40997Q0141k4938o9247
40579a028094J16608J62548j51361l71742p440O23266P44407K09176l18004l02329
40569c22965M9089K67738K59296J87740O9717j71353m27136m75514k54313J04651
40559g13050M04366M35211J00047l55034m69759j51296J07951j23872n78086o47286
40549a990808k11814L03786N79175O44153N27943J77582j94042j71639K59248
40540g6416N80683M33365P2122j06411j22836j89974k54289j55426k6670j25944
$$ y = [-401934, -552356, -584145, -417277, -233522, -179395, -174529, -54504, 200870, 431237, 446886, 212745, -82851, -168773, 44501, 360336, 495885, 340955, -19951, -431293, -693734, -590490, -121352, 315395, 241570, -328955, -873053, -1014050, -933909, -958847, -1028094, -911486, -748938, -900299, -1272041, -1279481, -656215, 88192, 297368, -20636, -322965, -273876, -6138, 253158, 440898, 510615, 339262, -87874, -563388, -817701, -713050, -308684, 126527, 226574, -128460, -598219, -749515, -641564, -765436, -1343522, -1990808, -2202622, -1898836, -1319661, -675508, -147565, 30017, -164025, -335664, -76416, 504267, 937632, 1009754, 903343, 780507, 590533, 336244, 180818, 154148, 28204]
40530B8204l73073m22185j59308J69880L11194K39898P8413j4238Q0651K87775
40520B27211L40033J12940j71719k78034l03636m10298m16791q0409L42799L27583
40510c10321j16709l75593r2661L51461M32446J63173q0278r5764O2653K84000
40500B22407M01357K05477k59663n82704m38389j9506K37397K20249J54262J54022
40490B94909Q9419j00551k45178j83104N357R7688j4051k05346k38536k9092K08925
40479c19560J91117m5313j53691M0861K81932K57632L7043q9292n3323m0831j69080
40468f2505l69899n33357n61789l58518K2744L04163K94610J84742K68179M64179
40458c47451M50689K23695J29542K84114L50152N6842l75679n45989l82610j47210
$$ y = [28204, -344869, -767054, -926362, -756482, -445288, -205390, -126977, -141215, -60564, 227211, 567244, 680184, 508465, 230431, -73205, -483503, -900294, -980703, -637904, -310321, -427030, -802623, -895284, -543823, -111377, 51796, -28482, -124246, -61593, 222407, 623764, 829241, 569578, -13126, -451515, -471021, -233624, -13375, 140887, 294909, 384328, 283777, 38599, -144505, -139148, -41460, -55511, -260857, -499393, -528485, -319560, -128443, -173756, -327447, -286586, -4654, 252978, 290021, 200729, 147406, 106575, -62505, -432404, -965761, -1527550, -1886068, -1863324, -1559161, -1264551, -1079809, -811630, -347451, 103238, 326933, 456475, 740589, 1090741, 1147583, 771904, 225915, -156695, -303905]
40448c03905r1023k58966m78604m33914M7861O59136Q05588L18542k72483m11777
40438d19545k03581j00339j42825Q112L57667M39753M0847l94330l66448j634
40428g82323K22314J98943K15876L44171K80843q0932l34211j04513L34828L63210
40418F58206j43193o23611n57828q6258K60852K42603P4242N899L248q0484j94407
40407d40731j28517J48522L44504J68832k40679m11264j40855J87636J07755k68733
40397f73530m13569j41576J92235L05790L46350M35268L17330j53662n43326l57362
40387f86052J81270M13498J95640Q897J18013K01590k7089l49821m53405l94359
40377g91818l53787k63554r187K38721K30015K5613r2738l414J69750K50980J39267
$$ y = [-303905, -394928, -653894, -1132498, -1566412, -1518551, -859415, -53827, 264715, -7768, -419545, -623126, -723465, -866290, -858178, -500511, -60758, -19911, -414241, -780689, -782323, -560009, -361066, -145190, 198981, 479824, 398892, 64681, -39832, 294996, 658206, 515013, -108598, -666426, -752684, -491832, -249229, -174987, -169088, -165840, -246324, -440731, -569248, -420726, -76222, 92610, -148069, -559333, -700188, -512552, -404797, -673530, -1087099, -1228675, -1036440, -730650, -384300, 50968, 368298, 214636, -328690, -686052, -504782, -91284, 104356, 113253, 231266, 432856, 405767, 55946, -397459, -791818, -1145605, -1409159, -1418346, -1179625, -949610, -923997, -1016735, -1020149, -850399, -599419, -460152]
40366d60152j23661k88711r2721L47692N71626L72060P9728K3994L6735j57466
40356C09124l60726k00324J73322K35715j04099l78623l02760j24234q4852k9023
40346h66480J81015K83746K8095l20384k83250J72055O24338P47283N43867J16854
40336A227139m30628q49371q42388m28180L1355K67211L48481L98379L34599Q9898
40326A46495j33734j06380P0706J30064O2940O2695J06313k1103k54323k33421
40316a69748Q2151K18486j04797m68851l78850o8920j30150n19547n82342o8490
40306b191058N04107O55464N26374L92332J54845k62369m69631j25176L75454
40297d39658L19427k94290o97239l91898K16763M18513Q8729k75500k31464J50689
$$ y = [-460152, -583813, -872524, -965245, -617553, -45927, 326133, 405861, 429855, 466590, 309124, -51602, -251926, -78604, 157111, 53012, -325611, -628371, -752605, -837457, -866480, -685465, -401719, -373624, -694008, -977258, -805203, -180865, 566418, 1110285, 1227139, 796511, -52860, -895248, -1323428, -1292073, -1024862, -676381, -278002, 56597, 146495, 12761, -93619, -22913, 107151, 170091, 232786, 339099, 317996, 63673, -169748, -87597, 130889, 26092, -442759, -821609, -890529, -1020679, -1540226, -2122568, -2191058, -1686951, -1031487, -505113, -112781, 42064, -220305, -689936, -815112, -439658, -120231, -414521, -1111760, -1503658, -1286895, -868382, -779653, -1055153, -1286617, -1135928]
40287a135928M78167N00081K92076L8726k16301m98639o87370n93600k66200J0744
40277b078244R5856J36670K40667K64750J08507l1063O1551K80731L85614L48123
40267a86838K58190P0800k31488l76736r2564L95028N37470J81863k18951k14110
40257A22664J01531K98841J79056m8344q5824Q5590K04715P7146j66396k67573
40247E01406k17981k16033k72422j73724R8799K71775K31532J80436J56956j31097
40237D29647o82339r09831m47155J91898L32237J24676J39809L20378J71000j97651
40227e27331j45266L49792N25899L4222n08635m83668q6355J90407K78086L23816
40217d9033K70497O8346q5335o3234j8581l6285K5616J40153L7466k40778k51693
$$ y = [-1135928, -657761, -157680, 134396, 173122, -43179, -541818, -1229188, -1822788, -2088988, -2078244, -1982388, -1845718, -1605051, -1340301, -1231794, -1262857, -1201306, -920575, -534961, -186838, 71352, 142152, -89336, -466072, -558636, -163608, 373862, 555725, 336774, 122664, 224195, 523036, 702092, 653748, 567924, 653514, 858229, 935375, 768979, 501406, 283425, 67392, -205030, -378754, -279955, -8180, 223352, 403788, 560744, 429647, -252692, -1162523, -1609678, -1417780, -1085543, -960867, -821058, -500680, -329680, -527331, -672597, -322805, 203094, 237316, -271319, -754987, -841342, -650935, -372849, -49033, 221464, 289810, 204475, 141241, 122660, 86375, 111991, 252144, 289610, 48832, -202861]
40206b02861R9385L02545R0406q2758J29105K94473k1571l94232k09224K48176
40196B53444K20189k80895n19512k21812J03115O4381j15181j43956r4306r7330
40186h31863p6266L4441J58768K71176M03735M29927J79337k06037l61531j70398
40176a68711J47985L85039M58882K53466k67306p94826q99858n43634n8126L29525
40166a157564O04110O79902M44872P3377j20694j42840k34091l69113k94150n0253
40156e66444L9672o2404o5600O9285M3402j79896k45229m2428Q0551m2386j00191
40145a071668P5734J54823p5785k70601j34169J9415j74615m36944k92569J06362
40135b100017K28637L0056m7295J62305L74802M14447L87782K77847q2612n25476
$$ y = [-202861, -103476, 199069, 289475, 206717, 335822, 630295, 608724, 214492, 5268, 253444, 473633, 192738, -326774, -548586, -445471, -381090, -496271, -640227, -734533, -831863, -908129, -873688, -714920, -443744, -40009, 389918, 569255, 363218, 1687, -168711, -20726, 364313, 823195, 1076661, 809355, 14529, -885329, -1428963, -1487089, -1157564, -553454, 126448, 571320, 644697, 524003, 381163, 147072, -222041, -516191, -566444, -526772, -589176, -654776, -585491, -542089, -721985, -967214, -1009642, -929091, -971477, -1071668, -995934, -841111, -916896, -1187497, -1321666, -1302251, -1476866, -1913810, -2206379, -2100017, -1871380, -1841324, -1888619, -1726314, -1351512, -937065, -549283, -271436, -354048, -879524]
40125h79524n59422p7622L79935L25207o8257l15534k64736q5569J26351L65736
40115a053435M81791K95469p3943l01540k87654k28130k26443j28140J42005L46660
40105a033360K56005K3757j4079J70736K74842J22956r6529j18418P4955L00123
40095c9012L79349K20967j41158m88802n56502l38361j11419n6993n1953K6840
40085a157044K9810j85268l93154k51498J76109M74623M34197K45760J25804N2301
40075d48360n1881j46922k00655k57165k64228n1384L66637O54782N29922J60879
40065B91625p397J96737M66812M04690O328l29039k67188O5936K36446K2723l39022
40054G48651m66541k63144M9227K22464J90540N0082o0524q8939j12071j89226
$$ y = [-879524, -1438946, -1516568, -1136633, -811426, -879683, -1195217, -1459953, -1545522, -1419171, -1053435, -571644, -276175, -350118, -651658, -939312, -1167442, -1393885, -1522025, -1380020, -1033360, -777355, -753598, -767677, -596941, -322099, -199143, -295672, -414090, -339135, -39012, 340337, 561304, 420146, -68656, -625158, -963519, -1074938, -1131931, -1183884, -1157044, -1127234, -1312502, -1705656, -1957154, -1781045, -1306422, -872225, -626465, -500661, -448360, -500241, -647163, -847818, -1104983, -1369211, -1420595, -1053958, -399176, 130746, 291625, 284228, 480965, 947777, 1352467, 1358795, 1029756, 762568, 828504, 1064950, 1087673, 748651, 282110, 18966, 68193, 290657, 481197, 531279, 470755, 381816, 269745, 80519]
40044H0519j95896K2276L20795L40823J5968k86523k86251j51388j21574r2513
40034c53764R7379K49046Q3596k49657l63658j93761L3202K40677M62454M87060
40024D92574P4717m83717n60799m9054M38166L75789n4432l34161k75434j11271
40014d87622j16906k91445l41667l759N36964P34484L84317l3293l3258J68489
40004E16304J02488j16255n2715J62050L171m35196m40711J68522O90274N89924
39994A187856J94981K7660R1712J71179K54878L18605K34919K10364P05776J552526
39984D950456J789268Q83453m30861j080052r49498p01162p10279p95355p40118
39975B215852n33081k39582k0370q2246l23452l31368k1474J12783k56617p14431
$$ y = [80519, -115377, -93101, 227694, 568517, 584485, 297962, 11711, -139677, -261251, -353764, -256385, -7339, 76257, -173400, -537058, -730819, -697617, -456940, 5514, 492574, 567291, 83574, -477225, -526279, -88113, 287676, 233244, -100917, -376351, -487622, -604528, -895973, -1237640, -1241399, -704435, 30049, 414366, 381073, 347815, 516304, 618792, 502537, 449822, 611872, 615043, 179847, -260864, -92342, 597932, 1187856, 1382837, 1410497, 1502209, 1673388, 1928266, 2246871, 2481790, 2692154, 3397930, 4950456, 6739724, 7623177, 7192316, 6112264, 5162766, 4461604, 3751325, 2955970, 2215852, 1682771, 1443189, 1422819, 1340573, 1017121, 685753, 664279, 777062, 520445, -193986]
39965a93986o96371k77139R8376L14046N06718N84171L42096j09804m48489n08425
39955c88807k80016J86948O13142N83767J19638k24587j25259R6103J27086J72377
39945H80392L91345M21189Q986m10016l53397k5374J64338K88791M82931L96661
39935B245846j82563o64789m32668J47879L21650J36189J50526L24564J82603
39926B229237j52500q6811L71786N82611L08192j8833o7293O5420K78746N75081
39916D085636P78464P01945M86147L06554K4173l75109m21906J31016O97567O44045
39906G058532K26483M8752J19358J82623L73086P48096Q63423O43488Q49457J798175
39896A2911473K645144K957056L703411N372354O564784O106760N010827M521528
$$ y = [-193986, -890357, -1167496, -1069120, -755074, -248356, 335815, 677911, 568107, 119618, -388807, -668823, -481875, 131267, 715034, 834672, 610085, 484826, 580929, 708015, 880392, 1271737, 1692926, 1701912, 1291896, 938499, 913125, 1077463, 1366254, 1849185, 2245846, 2063283, 1398494, 965826, 1113705, 1435355, 1571544, 1722070, 2046634, 2229237, 2076737, 1989926, 2361712, 2944323, 3252515, 3233682, 3166389, 3231809, 3510555, 4085636, 4864100, 5566045, 6052192, 6358746, 6382919, 6007810, 5585904, 5716920, 6414487, 7058532, 7285015, 7333767, 7453125, 7635748, 8008834, 8756930, 9620353, 10263841, 11113298, 12911473, 15556617, 18513673, 22217084, 27589438, 34154222, 40260982, 45271809, 49793337]
39888D9793337M183190M152618O926672J3599735K1573917L0712020M7503015
39881A78444504P3715937R1976483P5608540J9826738m5151144q1124249p8048966
39874B35247843n6210081l7770271k7315802j9386346j2315389q359413p205850
39867F6684691o418362n759395o395355p457101o975624n091387l509994k694907
39859B2382566j924165j269587j381302j904932j915130j456046j201546j127517
39851A0202341q35113o18434r40207j354079j121255m35162J7076K00389M15232
39842E530788L91458j91928p39034m36305L70816N80059n1969o75690o60877k70136
39832C847182K606M1246k9933o3706R0218M35703P38580Q07218P09640N85373
$$ y = [49793337, 53976527, 58129145, 65055817, 78655552, 100229469, 130941489, 178444504, 252160441, 344136924, 419745464, 439572202, 394421058, 313296809, 235247843, 179037762, 141267491, 113951689, 94565343, 82249954, 73890541, 66684691, 60266329, 54506934, 48111579, 40654478, 33678854, 28587467, 25077473, 22382566, 20458401, 19188814, 17807512, 15902580, 13987450, 12531404, 11329858, 10202341, 9367228, 8748794, 7808587, 6454508, 5333253, 4898091, 4915167, 5115556, 5530788, 5922246, 5730318, 4991284, 4554979, 4925795, 5505854, 5453885, 4778195, 4117318, 3847182, 3849788, 3891034, 3861101, 3797395, 3887613, 4323316, 5061896, 5869114, 6578754, 7164127]
39822G164127N47090Q42546J644942K648249L557234M967695P570920J0050192
39814C8992995R229689L623166l989306q944146r318970p044070m849755l607612
39806A4091991k762535j901534j126232o06147m19311n56202q08523r09368q62242
39797D139897q33609p59828m61713j02507n3425k79313l29388j6956L23639L64302
39787A991099J83794K4687j8083M4940J65475J95049J1791k28439k13695J07750
39777B264368M80400P43443R97707J276018J310224Q23612n8268q56953j204548
39768E776003j180517j136932j211591j149846p18644j39828J55404J20966Q9117
39759F04132J70986Q9290k71173n73597n16952k52089n8145O5383K12677K89997
$$ y = [7164127, 7711217, 8553763, 10198705, 12846954, 16404188, 21371883, 28942803, 38992995, 48222684, 51845850, 47856544, 38912398, 29593428, 22549358, 17699603, 14091991, 11329456, 9427922, 8301690, 7695543, 7276232, 6720030, 5911507, 5002139, 4139897, 3306288, 2546460, 2084747, 1982240, 1928815, 1649502, 1320114, 1303158, 1626797, 1991099, 2174893, 2199580, 2181497, 2226437, 2391912, 2586961, 2598752, 2370313, 2156618, 2264368, 2744768, 3488211, 4485918, 5761936, 7072160, 7895772, 7837504, 6980551, 5776003, 4595486, 3458554, 2246963, 1097117, 378473, 238645, 394049, 515015, 604132, 775118, 864408, 593235, 19638, -497314, -749403, -807548, -742165, -529488, -239491]
39749b39491K15172J31529J52869J57248P2384N6793J43406N9883k84396n01034
39739c5637k86538O5745J36123K9736Q5200K26343J35882j32782k54904k12810
39729b43642k62224l96460l26094J8332L66696M92309L93713J40276j63665l23566
39719c04325k35286m4798Q1442J87794L24059L45568J72799r711p9605j90810
39709B47127l71542k99155J36798M56445K57591j22459j56109L4065j88k03698
39699b1125j99480l0798l761j864K98533O82410O18271J32730k55917l84222m99795
39688C34982n76694l49970K8379J48296R4320K35320L63847k1519o20035n73645
39678i36719J02111M45701J24216q8320K13619L20455k42024p35104m11630K31413
$$ y = [-239491, -24319, 107210, 260079, 417327, 489711, 546504, 689910, 749793, 465397, -35637, -322175, -256430, -120307, -90571, -5371, 220972, 356854, 224072, -30832, -243642, -505866, -902326, -1228420, -1210088, -843392, -351083, 42630, 182906, 19241, -304325, -539611, -584409, -502967, -315173, 8886, 354454, 527253, 517542, 437937, 247127, -124415, -423570, -286772, 169673, 427264, 304805, 148696, 182761, 182573, -21125, -220605, -251403, -255164, -257028, 41505, 723915, 1342186, 1474916, 1218999, 834777, 334982, -241712, -591682, -563303, -415007, -320687, -85367, 278480, 256961, -363074, -936719, -834608, -388907, -264691, -353011, -139392, 181063, -60961, -796065, -1207695, -976282]
39668i76282L29526K6436J3107K90715L59761J95460J23295Q4087j26591k30540
39658H8974P3882L52865L0452n27432m68331J68012M92590J53586k66961l19147
39648b21510k30947j95537J7058M12104N02453J08914k14842l0392K48236L195
39638C98732n89788p91178l41690K37548L75431R8529j43830p6597J25486J29393
39628e77964q7160j97173n607K35902K14776P8562K00139M91820M24761j47005
39618F31051o27312m35164J87560M92087J87211k83656m04920j88036K623k3823
39608d62379j43510k00669j94806j43135M2559L77432O14607M67384K0410l08904
39598F8989k86172j17141p2927q9056M5143K64028K79983K5875k02011r7083K98854
$$ y = [-976282, -646756, -620320, -607213, -316498, 43263, 238723, 362018, 446105, 319514, 88974, 162856, 515721, 546173, 18741, -449590, -281578, 211012, 364598, 97637, -221510, -452457, -647994, -630936, -218832, 283621, 392535, 177693, 147301, 395537, 398732, -191056, -982234, -1323924, -1086376, -710945, -612416, -756246, -832843, -707357, -577964, -665124, -862297, -867904, -632002, -417226, -338664, -138525, 353295, 778056, 631051, 3739, -431425, -243865, 248222, 435433, 151777, -253143, -441179, -438556, -462379, -605889, -806558, -1001364, -1144499, -1101940, -724508, -109901, 357483, 377893, 68989, -217183, -334324, -407251, -496307, -451164, -187136, 92847, 118722, -83289, -180372, 118482]
39587A18482O32577N75134J40031k91862l36220l8777J72923K8836k72156m07289
39577C21679l70908l54464l64324k45238Q148K37313L57811L58880J49015k88199
39567a90287o36209n18263p1365J33791j21628l74412j78384K00264J78209k36569
39557a814853m08514O153N31316N12081R045l17422j36061J50945O6479k31271
39547a632102k28806J38576L91828K36587k1234K6155K84056L31908L3287l12659
39537g52404l66313q1839L09882M86694K69707j59649l54382j01725K52797K15987
39527b81245j69638l51464l0290M02061L82875o1520l56869j49507K37743K46956
39517a30898j94325o29377p05916n62878m67413l51199q476M11364N15170K70592
$$ y = [118482, 751059, 1326193, 1466224, 1174362, 838142, 799365, 972288, 1001124, 728968, 321679, -49229, -403693, -768017, -1013255, -1005107, -767794, -409983, -51103, 97912, -190287, -826496, -1344759, -1416124, -1282333, -1403961, -1778373, -1956757, -1756493, -1578284, -1814853, -2223367, -2217214, -1685898, -1173817, -1164772, -1482194, -1618255, -1467310, -1400831, -1632102, -1860908, -1722332, -1330504, -1093917, -1115151, -1088996, -804940, -473032, -439745, -752404, -1118717, -1200556, -890674, -403980, -134273, -293922, -648304, -750029, -497232, -281245, -450883, -802347, -832637, -430576, -47701, -109221, -466090, -615597, -377854, -130898, -325223, -954600, -1660516, -2223394, -2690807, -3042006, -3050482, -2639118, -2123948, -1853356]
39507a853356J01208K60228M69024L81565R9094n0273j6074p709j07108j74193
39497h97594p9911J54023L82341L91684P7742l14800l52209O552K44790k2722
39487d10104m38880l61433K14026O13268L65542k32671n27864k51939K41032L80622
39477d08401J1067l75519j92649M23411O76861J72311m88501n37770r6223J47061
39467f68352M4413R2520M81726P40434M81243o5294m77260o32123n55757k27774
39457g86224J88829L01459j7348l61996k94244J08398M32007M43197K10084j05081
39447A19081l58395m53325m04882k80892n7672K75821M90718L20025n8259j20590
39437e28370K74811O39398N43009J82338j5438j8507p1169k07297k57301j82907
$$ y = [-1853356, -1752148, -1491920, -1022896, -641331, -542237, -592510, -608584, -616293, -723401, -897594, -977505, -823482, -441141, -49457, 28285, -286515, -638724, -632172, -387382, -410104, -848984, -1210417, -996391, -383123, -17581, -250252, -778116, -1030055, -789023, -408401, -397334, -772853, -965502, -542091, 134770, 307081, -181420, -719190, -815413, -668352, -623939, -531419, -49693, 690741, 1171984, 1106690, 629430, -2693, -558450, -786224, -597395, -295936, -313284, -675280, -969524, -861126, -429119, 14078, 224162, 119081, -239314, -692639, -1097521, -1378413, -1436085, -1160264, -669546, -349521, -407780, -528370, -253559, 385839, 928848, 1111186, 1095748, 1077241, 1006072, 798775, 541474, 358567]
39427C58567q3685O784O7970j4550k44828l73032k31597m2082q3306k23431j35945
39416i99135J47715K91606J99167J09139J41238J27193k0293j04079L6421K37244
39406A66216K14653p3369l94344m96608l30695o6274Q4381P7652L8007M3911M1431
39395f95039J7237O4298J54750P1679k29952m22756k54907J0706j5766j87374
39385a487124k8404M45257O67295L95243R5673J75373L06307l7711o87162r51641
39375a106894n83283o5789J12681M3957P0780K00482J58226j00448k41633R374
39365a502547M56534O07523K40601l12181n12450k00925K59359M33799K91727
39356b38560J38123J58306K09989R7097j17703k02830p7365J05345J74905J12554
$$ y = [358567, 274882, 281666, 349636, 335086, 90258, -282774, -514371, -556453, -639759, -863190, -999135, -851420, -559814, -360647, -251508, -110270, 16923, -3370, -107449, -71028, 166216, 380869, 307500, -86844, -583452, -914147, -980421, -896040, -818388, -780381, -736470, -695039, -677802, -613504, -458754, -387075, -617027, -1039783, -1294690, -1283984, -1299750, -1487124, -1515528, -1070271, -402976, -7733, 87940, 263313, 569620, 531909, -155253, -1106894, -1690177, -1755966, -1643285, -1599328, -1528548, -1328066, -1169840, -1270288, -1511921, -1502547, -1046013, -438490, -197889, -510070, -1022520, -1223445, -964086, -530287, -238560, -100437, 57869, 267858, 364955, 247252, 44422, -32943, 72402, 247307, 359861]
39346C59861q379j20604j56160o0019J14178K12101J56054K9851p7395j91007
39336B58481l08822k79407p328L08398L61307J35384r5498j59576j50883j70738
39326a08682j51452l8274O6703Q3278J00276J82189J78705o8707m13018n10102
39316f79084k47599R8349J90274J2867j48323p6234J22311J91040R6432O7949
39306c72018K19960L30708J75301q2474j08646P4859J17916r6180k70532j74943
39296a86049K7539R8401O3185K1136j03346l47631m80249k99859p161M7500j07400
39285a273934j16173J47472L82749K83914o1684k93497j79322J63308M01991L47192
39275a97984J74175J92540L91589M15192P6284l38634m54184k80057p5106O2376
$$ y = [359861, 351482, 230878, 74718, 14699, 128877, 340978, 497032, 526883, 449488, 258481, -50341, -329748, -337076, -28678, 332629, 468013, 372515, 212939, 62056, -108682, -260134, -298408, -231705, -148427, -48151, 134038, 312743, 244036, -168982, -679084, -926683, -828334, -638060, -625193, -773516, -849750, -727439, -536399, -439967, -372018, -152058, 178650, 353951, 271477, 162831, 237690, 355606, 259426, -11106, -186049, -158510, -60109, 3076, 24212, -79134, -426765, -907014, -1206873, -1214034, -1166534, -1273934, -1390107, -1242635, -859886, -575972, -637656, -931153, -1110475, -947167, -545176, -197984, -23809, 168731, 560320, 975512, 1051796, 713162, 258978, -21079, -96185, -33809]
39265c3809J85333K35910J16594o2752j16405j04307k28260m54917n42984m19785
39255a425382k34333n7395J59787L36186L09953J69346J88335L60260L54470O9845
39245B31072j26455O2265L77747L50349n7110m38195m84117k77684o1727P1581
39235c52274J88559L16991L44802J57234j49301l05627k01673n9192j14349k38953
39225d13783j24876K06111L83951K25576j8840q1873o0348j71717l39078k86739
39215f81616L6183L63156M41894K97575J34933Q2551R1533N8940o491o568N3511
39204H65601J0034k23740m62427m41533j59848J14462J42391j00395m45763n87686
39194a288904k58079L99418P57519L53352m42094p84738l98662J52464L02525
$$ y = [-33809, 151524, 387434, 504028, 441276, 324871, 220564, -7696, -462613, -1005597, -1425382, -1659715, -1717110, -1557323, -1221137, -911184, -741838, -553503, -193243, 161227, 231072, 104617, 166882, 544629, 894978, 837868, 399673, -84444, -362128, -423855, -352274, -163715, 153276, 498078, 655312, 506011, 200384, -1289, -60481, -174830, -413783, -538659, -332548, 51403, 276979, 258139, 176266, 115918, -55799, -394877, -681616, -645433, -282277, 159617, 457192, 592125, 674676, 766209, 825149, 818658, 812090, 865601, 875635, 651895, 189468, -252065, -411913, -297451, -155060, -255455, -701218, -1288904, -1546983, -1147565, -390046, -36694, -478788, -1263526, -1662188, -1509724, -1207199]
39185a207199J33558K649l4742r9989j16849O0670L32070M74431M43242L07722
39175B95563O0513k58535m34760l50777k15152k37549k61583n5783J99974J32773
39165a125316j96273l16750l0200L24271L85117K16937J00120J38080K41254L10716
39155D7956K80983J14515j19395k61950k55435k23943k85139l71334l28053j34466
39145a536261O4012J42298J58453K73899M92377N67808L08774p5621j69466P1315
39135B97588K24129K6037k23152j55142O5935M2329j68487j69215N7467J03380
39125A00869j25450j78793K07407O27697N79486J54754j99066l23593l65752l56627
39115A20932j92764M8715J44227N4176o3786j26145j34974M468L40881N87966
$$ y = [-1207199, -1073641, -1070992, -1105734, -1205723, -1322572, -1261902, -929832, -455401, -12159, 295563, 356076, 97541, -337219, -687996, -903148, -1140697, -1402280, -1458063, -1258089, -1125316, -1321589, -1638339, -1668539, -1344268, -959151, -742214, -642094, -504014, -262760, 47956, 328939, 443454, 324059, 62109, -193326, -417269, -702408, -1073742, -1401795, -1536261, -1472249, -1329951, -1171498, -897599, -405222, 162586, 471360, 395739, 226273, 297588, 521717, 547754, 324602, 169460, 235395, 277724, 109237, -59978, -2511, 100869, -24581, -203374, 4033, 631730, 1211216, 1365970, 1166904, 843311, 477559, 120932, -71832, -23117, 121110, 175286, 111500, -14645, -149619, -145151, 195730, 783696]
39105G83696L68374j95399n21242l38390m6356p6584k41850p7339L99653O97921
39095G52484N49423J95722o2164k35215m27395n46582m67046l00253k57034l20994
39085a119054k78787n3626J84104K63386K11662J55167J48852J82086K54446L42012
39075B90248L40212J52889j56586l88322m11608k87348j46345j5099J43803K58383
39065b19773J75171p9197k21205n2525K24654K57338O9227N0382L38954N19630
39055A062656J83692m18840o31575k46487K31022K52104j14440l63112k20930
39046b65910Q3776J85132K8924j21398n6983J17633J60950N4675K0801J44362
39036C51962J78897j04975n14241o16839k96043J06223K30341R4811r908J13589
$$ y = [783696, 1152070, 956671, 435429, 97039, 50683, -25901, -267751, -345090, 54563, 752484, 1301907, 1497629, 1435465, 1200250, 772855, 226273, -240773, -541026, -798060, -1119054, -1397841, -1451467, -1267363, -1003977, -792315, -637148, -488296, -306210, -51764, 290248, 630460, 783349, 626763, 238441, -173167, -460515, -606860, -621959, -478156, -219773, -44602, -123799, -345004, -397529, -172875, 84463, 153690, 204072, 543026, 1062656, 1246348, 827508, 195933, -50554, 180468, 432572, 318132, -44980, -265910, -182134, 2998, 31922, -89476, -146459, -28826, 132124, 186799, 207600, 351962, 530859, 425884, -88357, -705196, -1001239, -895016, -664675, -569864, -579772, -466183]
39026d66183L69759M59726J83014k70072m21400o8382L58405K64732l25128p70181
39016f85710o24967j23623K38078K75147J08749j03112k04237n5366K44924L49542
39006e80575J03038j97118k15711n1685l005m7624O2962K86503K87228n815k13654
38995e75456l0858L48159N20633L87776J50047o7889k98211m48689k59469K71965
38985a992O43098L61015l37483o64274k93297K03255K04898o8788k461L74769
38975D18740M60226J07933j41113J3175J73442Q40k18224j68975r9137l06285
38965B40622n12551l18284R7805L04310L14043L72497L65149Q1288j95546o5882
38955F83451K08115M8682m28219n31783j04521K84805L24881L26562M27985K52822
$$ y = [-466183, -96424, 363302, 546316, 276244, -145156, -213538, 144867, 409599, 84471, -685710, -1310677, -1434300, -1196222, -921075, -812326, -915438, -1119675, -1175041, -930117, -580575, -477537, -674655, -890366, -942051, -945056, -992680, -929718, -643215, -355987, -361802, -575456, -606314, -258155, 262478, 650254, 800301, 732412, 434201, -14488, -273957, -1992, 641106, 1002121, 664638, 364, -292933, -89678, 115220, 46432, 43971, 418740, 878966, 986899, 845786, 858961, 1032403, 1033243, 815019, 646044, 546907, 240622, -271929, -590213, -492408, -188098, 125945, 498442, 863591, 944879, 749333, 683451, 891566, 940248, 512029, -19754, -124275, 160530, 485411, 811973, 1239958, 1492780]
38945A492780l04543o84383m91887j22636j01387l09441l33289j35480Q1070K80802
38935f28394M24917K76389j66906m06315r8496L42754L08229j25543m08977l70319
38925h52661k75665j98668O1226M54532O19483M10320O4602k00773l78385m35681
38915g31670k89375p0921m0488j56168r2371K08604L75360J73646j06878r6789
38905h27050P7089l512l82762o24948m27549m7197Q2605k4577K1852L20056M59795
38894a376198J66069j93280j24905K15119K84560O9027R0389M42355N21203P123
38884A01462n33552m86703r1757N6055l9873K2365K10929J57226p1756k2557L31503
38873c66658M84823J95250j85800l05282k28952j34258m1768M032r1974j89076
$$ y = [1492780, 1188237, 503854, 11967, -110669, -212056, -521497, -854786, -990266, -909196, -628394, -203477, 72912, -93994, -500309, -598805, -256051, 52178, -73365, -482342, -852661, -1128326, -1326994, -1265768, -811236, -191753, 218567, 283169, 82396, -295989, -731670, -1021045, -1091966, -1132454, -1288622, -1380993, -1172389, -797029, -623383, -730261, -827050, -749961, -753473, -1136235, -1761183, -2188732, -2235929, -2153324, -2177901, -2156049, -1835993, -1376198, -1210129, -1403409, -1528314, -1313195, -1028635, -959608, -869219, -426864, 94339, 101462, -432090, -918793, -1010550, -954495, -994368, -972003, -761074, -603848, -675604, -698161, -366658, 118165, 313415, 127615, -177667, -406619, -540877, -582645, -578613, -670587, -859663]
38863h59663j0560L43011M10572N6525k94266l00546j49679j14694r3209Q1556
38853i30953K29298J14187r9466p3512J66990K71699P5797k05555k81344r6230
38843h29089J58432K45158J19473q882N9936K19247J96964l1808k12902j93556
38833b77027n5461J39966L94588N14776K22410l32445n84136k93977J06343J61720
38823c243j1352q1751n6844q4900n8630J20665J72541j53344n09004l42489K45640
38812g62711N81029L34219j31547l59341k87128o9446J64687K62344J11696j34921
38802b91119k04922j24406j62838l19723k60149J23930M73695M61663J99400l1900
38792a36369j39920j16683J00278M10467M73705J34097k97637m53186l88332l70566
$$ y = [-859663, -870223, -527212, -116640, -60115, -354381, -654927, -804606, -919300, -1012509, -930953, -701655, -587468, -686934, -760446, -593456, -321757, -245960, -451515, -732859, -829089, -670657, -425499, -306026, -314908, -254972, -35725, 161239, 129431, -83471, -277027, -332488, -192522, 202066, 716842, 939252, 606807, 22671, -271306, -164963, -3243, -14595, -96346, -153190, -238090, -296720, -176055, -3514, -156858, -665862, -1008351, -762711, -181682, 152537, 20990, -338351, -625479, -694925, -530238, -267894, -156198, -291119, -496041, -620447, -783285, -1103008, -1363157, -1239227, -765532, -303869, -104469, -136369, -276289, -392972, -292694, 117773, 591478, 725575, 427938, -25248, -413580, -784146]
38782g84146l86550k11588J43344M04303M22002K90680J00830j31803k77863j42224
38772e73015K01145L73765J45324k47617l93727k04563M6981J35097J50007K99544
38762f7059N54397O33947L68597m3457k53664j76777l8383k9923j06590j67396
38752F73692k19622k46426j16127J87888M11244L34787J15189N6565J28421K5395
38742A351006l02659n17867l83857q9859P0540Q9620J05478Q0236j05760l40927
38732d4049l46328o2033K42902K95180R7957j61224l38007l77316k42593N2082
38722h83429L44070L91199J36022j54429j55478Q5881J62732j24967l95109j50974
38712g44482M57060P17548K95083l00166m23058j46683k3060k04924k97836o7842
$$ y = [-784146, -1170696, -1382284, -1238940, -834637, -412635, -121955, -21125, -152928, -430791, -573015, -371870, 1895, 147219, -100398, -494125, -698688, -651707, -516610, -366603, -67059, 487338, 1121285, 1489882, 1446425, 1192761, 1015984, 977601, 947678, 841088, 673692, 454070, 207644, 91517, 279405, 690649, 1025436, 1140625, 1197190, 1325611, 1351006, 1048347, 530480, 146623, 56764, 127304, 216924, 322402, 402638, 296878, -44049, -390377, -452410, -209508, 85672, 183629, 22405, -315602, -692918, -935511, -883429, -539359, -148160, -12138, -166567, -322045, -236164, -73432, -198399, -593508, -744482, -287422, 430126, 725209, 425043, 1985, -144698, -167758, -372682, -670518, -738360]
38702g38360J91015J55669m4276r8102K776M9047J6744P4493K36979K90221J08784
38691B44990j57176k97651k96883k53097j46014J29918M78806N43848J21984m38216
38681f9491n22428j2722M92861M14379p6627l47821j69179R7807J21377j7750
38671h9594j38106k40083k99612j35666K71738O06630O03863L75332J34727j27785
38661I61444m29468n41546l10318j0556J1630j21234m3448K23736L14519J23898
38651A78657q3823j66247k56300l80076l59302j93579j28035k06995j54938J28240
38641a622398L32419K16543j1884m4937Q0847J43699J03782N9500K7846j0433
38631g25016j2278J1173l1698q8093L6372K93982L28950K2770k28220r1490J63776
$$ y = [-738360, -547345, -391676, -435952, -534054, -531278, -482231, -465487, -390994, -154015, 136206, 244990, 87814, -209837, -506720, -759817, -905831, -775913, -297107, 246741, 368725, -69491, -591919, -604641, -111780, 302599, 225972, -121849, -291028, -193221, -71844, -89594, -227700, -467783, -767395, -903061, -631323, -24693, 579170, 954502, 1089229, 961444, 531976, -9570, -319888, -330444, -318814, -440048, -483496, -259760, 54759, 178657, 94834, -71413, -327713, -707789, -1067091, -1260670, -1388705, -1595700, -1750638, -1622398, -1289979, -1073436, -1085320, -1130257, -1049410, -905711, -801929, -742429, -714583, -725016, -737294, -726121, -757819, -845912, -809540, -515558, -186608, -163838, -392058, -483548, -319772]
38620c19772J00003j91364k91849j56288r4670j56890o8438K19058M13764L84803
38610a61643L16519K74914R2077j72012j42423K39470M45051Q5908m36443m48366
38600I3052M5979L89878J61726l82825p57695p56092m39730L9357M39497M98461
38590f68392K07908j17244k03649j32987j34824k00631j37666N7606J60091Q9322
38580a080466N0726J78909K89494J93410M2264O8686J46112j1023k84609k55479
38570f61976O8586J32015l16930p12326m22698L05658O59778L50939j10543j89173
38560h96670R9941M32311N64734L89698k0067l05760j21753L30197M34803m605
38550I02829m56792m19286r0507N0980j6760O265J25477R8485j9068P3355L03945
$$ y = [-319772, -219769, -411133, -702982, -859270, -953940, -1110830, -1179268, -960210, -546446, -161643, 154876, 429790, 521867, 349855, 207432, 446902, 891953, 977861, 541418, 93052, 139031, 528909, 690635, 307810, -449885, -1205977, -1645707, -1606350, -1166853, -668392, -460484, -577728, -781377, -914364, -1049188, -1249819, -1387485, -1329879, -1169788, -1080466, -1029740, -850831, -561337, -367927, -325663, -256977, -110865, -121888, -406497, -661976, -593390, -461375, -778305, -1490631, -1913329, -1607671, -947893, -596954, -707497, -896670, -796729, -364418, 200316, 590014, 569947, 264187, 142434, 472631, 907434, 902829, 446037, 26751, -63756, -12776, -29536, -23271, 102206, 200691, 181623, 254978, 558923]
38539E58923K11164k92430o35814l76636J16929J85986j65699l23482P22L70470
38529c49867K90261j24258l98440l59604k24144j56100q9186O451N090j13901
38519a513698j50924n586J07647p463j56473j6190L24027M31028J59293j23524
38509i51863o2132K23583L83801L13291J56952J8765q3277q7630L0276J15676
38499E7442J9562j15406j3782K86790M19215J86345j63767k79162j25382O9031
38489C40886J24331J8285j77905l11074k11684P4475K21101l604l62159l88718
38479f76066j571L73502L57809O4914j41475j37976q7456j07615j21990l6133
38469e14057J07886J87828J12791j22477l98788n05002l29487k2640J45577Q9855
$$ y = [558923, 770087, 477657, -158157, -534793, -417864, -231878, -397577, -721059, -720337, -349867, -59606, -183864, -582304, -941908, -1166052, -1322152, -1411338, -1404887, -1399797, -1513698, -1664622, -1670208, -1562561, -1570024, -1726497, -1742687, -1418660, -987632, -828339, -951863, -1013995, -790412, -406611, -93320, 63632, 82397, -880, -88510, -58234, 57442, 77004, -38402, -52184, 234606, 653821, 840166, 676399, 397237, 271855, 340886, 465217, 483502, 305597, -5477, -217161, -142686, 78415, 74811, -287348, -676066, -677637, -304135, 53674, 118588, -22887, -160863, -248319, -355934, -477924, -514057, -406171, -218343, -105552, -228029, -626817, -1131819, -1461306, -1483946, -1338369, -1248514]
38459a248514n0540j55789k23268j99097M2667M18562N59696K56274j65554k03580
38449i69143J37417L43612J24858j72101o8120L74241O57250N06088J23079j93025
38439H64156l78503m69559m10942j99562m0658j17896k99239l12663j58775p5873
38429a599514j01191J1668L44816O05145N46179L17007J51561r744k63476l72690
38419c70239j04041K35060J33681k95596m06506q724L39516K38296L6131J41749
38409f0673L01408R6951k60704k70646l965M2226j80875k22694M4785K13748P7934
38398b22505k1909J68743L55606J85835j99981m41154m67218m09057k69973l1465
38388a353078J15193m391k09277j63698J58020M73102N85095N13444K87476r0076
$$ y = [-1248514, -1299054, -1454843, -1678111, -1877208, -1834541, -1415979, -856283, -600009, -765563, -969143, -831726, -488114, -363256, -535357, -603477, -229236, 428014, 934102, 1057181, 864156, 485653, 16094, -394848, -594410, -635068, -752964, -1052203, -1364866, -1523641, -1599514, -1700705, -1689037, -1344221, -739076, -192897, 124110, 275671, 265927, 2451, -370239, -474280, -239220, -105539, -401135, -807641, -816365, -476849, -238553, -202422, -60673, 240735, 337686, 76982, -193664, -197629, -155403, -336278, -558972, -514187, -300439, -222505, -244414, -75671, 279935, 465770, 265789, -175365, -642583, -1051640, -1321613, -1353078, -1237885, -1242276, -1451553, -1615251, -1457231, -984129, -399034, 114410, 401886, 311810]
38378C11810m48614m99256k02142J03614R3426j25377j61219J24500M20298L97765
38368A4805J77643J33556K94417K84988k6034j95759J49571O28548N47754q8731
38358A920758n55032m25677q0366j5567j68704k41218k61023l97861n11221l40861
38348a076772J266J40309k3721k23385k25655l5809K50365N07679N25111J86851
38338B6239k61894l89799q8820K85188L46398R9501j41388j47293j4365k2819
38328c09052k58861m30978k05372K79752M81912J49993l10310l84015j21316M9439
38318a058808J1584O1682L43847N68069M19954l2l04268k58462J6888K23698J92927
38307B17079J2314j41111k31751l23939l72899k78317j40800j62790k29492L5357
$$ y = [311810, -136804, -636060, -838202, -734588, -641162, -766539, -927758, -803258, -382960, 14805, 192448, 326004, 620421, 905409, 879375, 683616, 833187, 1461735, 2009489, 1920758, 1365726, 940049, 859683, 844116, 675412, 434194, 173171, -224690, -735911, -1076772, -1075506, -935197, -958918, -1182303, -1407958, -1443767, -1193402, -685723, -160612, 26239, -235655, -625454, -714274, -429086, -82688, 16813, -124575, -271868, -286233, -309052, -567913, -998891, -1204263, -924511, -442599, -292606, -602916, -986931, -1108247, -1058808, -1047224, -985542, -641695, -73626, 346328, 346296, 42028, -216434, -199546, 24152, 217079, 229393, 88282, -143469, -467408, -840307, -1118624, -1259424, -1422214, -1651706, -1616349]
38297a616349O25285R76494P30135K64911P5588K3688k57017n58504l99498N8372
38287g6895J55516k18499m63228k56981J0377P631k1850J55080K77588J18009
38277c13252k4208J64205M19582L27892J6267r0521M1051J08709L8545M41k6237
38266F62474k19676m84694m96871k05183Q3782J68683J66490K05021K16218J35426
38256B31670M7097J4163l8305j61207k61164k37697j21092m371O0460N3922j4907
38245d31431n6467M4999K48429L09832L4761m23571o23938k93043L00975N72788
38235c16666K85555j57774k37320K6595K01631J16440K3896P7748P6226j07010
38225a0679k25253n7659K07631K88009K29593J88005N2997k95811n59233l30567
$$ y = [-1616349, -991064, -14570, 715565, 980476, 1056064, 1079752, 822735, 264231, -135267, -76895, 78621, -139878, -603106, -860087, -849710, -842079, -863929, -708849, -431261, -313252, -337460, -173255, 246327, 574219, 590486, 499965, 541016, 649725, 688270, 688711, 662474, 442798, -41896, -538767, -743950, -660168, -491485, -324995, -119974, 96244, 231670, 278767, 292930, 254625, 93418, -167746, -405443, -526535, -530906, -470446, -416524, -431431, -487898, -442899, -194470, 115362, 150123, -273448, -897386, -1190429, -889454, -316666, -31111, -188885, -426205, -399610, -197979, -81539, -57643, 20105, 96331, -10679, -235932, -293591, -85960, 202049, 431642, 619647, 672644, 376833, -182400, -512967]
38215e12967K35808N42947L59218O7346K4941J04006M6581q6856r2677p459l2554
38204F48334j89135k83872j93267k4058L2393o4776j51473o0690J29601J57369
38194D26m9026k11173q3681J44761R2766k54824n38892n53840m37075k87717J3665
38183b164610M37175O21177L48326o0036j63659l3708p8108l22867l06791K05499
38173a517602P72311P87283K46880k68277l19975o9943M0651j29191l16610k52402
38163a026875J4530K30533K56052J76503J40483J81178K10632J39606k1717j72617
38153A28308k26264j93062j37142p6295O850O8871L7097l0802M1934K82047M29340
38142C30882K23569k33889n63796n31293k40906P1554K76644L57641L40663K90860
$$ y = [-512967, -277159, 265788, 625006, 692352, 717293, 821299, 867880, 781024, 688347, 680888, 648334, 459199, 175327, -17940, -41998, -9605, -74381, -225854, -286544, -156943, 426, -48600, -259773, -343454, -198693, -105927, -360751, -899643, -1453483, -1890558, -2178275, -2164610, -1727435, -1106258, -757932, -817968, -981627, -1015335, -1093443, -1416310, -1723101, -1517602, -745291, 41992, 288872, 20595, -299380, -369323, -328672, -457863, -774473, -1026875, -1012345, -781812, -525760, -349257, -208774, -27596, 183036, 322642, 300925, 128308, -97956, -291018, -428160, -504455, -497605, -428734, -391637, -422439, -380505, -98458, 330882, 554451, 320562, -243234, -774527, -1015433, -943879, -667235, -309594, 31069, 321929]
38132C21929K64460J99940k8538l64492m99027k11701K60682L91109k2195n43079
38122b30912n57395o930N13645M46478j03047n55148n43009k17101P4764J73892
38112a004763J37463P4732M8323L1231o6347k18555j84342J93457O17056N85496
38102B13751R4840k66564j05749K32589J90775k29521n78626o23914m95627k95193
38092a863239J4318L37250M35531K53602j259j26696o9069J51043M21379N12995
38082F5855L30938J15022J21853K19036J20836j01670j58563q9441j77601l48074
38072I8191k19812J61322K39891j88395o01915n52027l05569k66675k27425K36111
38062a626303R08579J088470N33742k36242o15841n18313k48279o8811j0598L9829
$$ y = [321929, 586389, 786329, 757791, 393299, -105728, -317429, -56747, 334362, 312167, -230912, -788307, -795237, -281592, 164886, 61839, -493309, -1036318, -1253419, -1178655, -1004763, -867300, -792568, -744245, -713014, -779361, -997916, -1182258, -988801, -371745, 213751, 308591, 42027, -63722, 168867, 359642, 130121, -448505, -1072419, -1568046, -1863239, -1848921, -1511671, -1076140, -822538, -823797, -950493, -1019562, -868519, -447140, 65855, 396793, 511815, 633668, 852704, 973540, 871870, 713307, 623866, 446265, 98191, -121621, 39701, 279592, 91197, -510718, -1062745, -1368314, -1634989, -1862414, -1626303, -717724, 370746, 904488, 668246, 52405, -465908, -714187, -782998, -793596, -753767]
38052g53767J40195J69592j4820k84376l08966k5285K04088Q5048j77728j83178
38042a149197J16663M26469N19031L80619P1837k93205n08012m40302j86646P8256
38032i84487K88027M02089L34384J23730m4728j47912l69735o50865n82968o9368
38022a701833L22719J28039k72439k38009J25502K24440P28r2456k6033k28864
38012a758206o15085m83322L19188R54472P69894K19565N9826K13808J01993l11870
38002e29737n24460l44389r4212j4008K208N3418N3702j7942j6732J29752K92586
37991a009814L01252J13193j50130k65506j22099O6518k4823l21315l56987L6777
37981a732934M20821M07872K45082L24043M61857K24580k63335m51262k12440
$$ y = [-753767, -613572, -443980, -458800, -743176, -1052142, -1077427, -873339, -788291, -966019, -1149197, -1032534, -606065, -87034, 293585, 365422, 72217, -435795, -876097, -1062743, -984487, -696460, -294371, 40013, 163743, 119015, -28897, -398632, -1049497, -1632465, -1701833, -1379114, -1251075, -1523514, -1761523, -1636021, -1411581, -1410853, -1503309, -1529342, -1758206, -2373291, -2856613, -2537425, -1582953, -813059, -593494, -533668, -319860, -217867, -529737, -1054197, -1398586, -1492798, -1506806, -1504598, -1451180, -1397478, -1415420, -1432152, -1302400, -1009814, -708562, -595369, -745499, -1011005, -1133104, -1066586, -1091409, -1412724, -1769711, -1732934, -1312113, -904241, -659159, -335116, 126741, 351321, 87986, -363276, -575716]
37972e75716L9074P1515Q4745J74645J35399m7005m7064K27170L91869J79859
37962F34491j48302k57913k08022j73222p9493J41812K69188J24854q6500j26425
37952I0468j34435l09228m46003k41624J38006K74533J51490J05331J93993J20833
37942e6636j90615m29419m04273k92201k48480j61103L6631J69355J43140J49433
37932a284168L13239M15744K31029q5295k20979j49805p4238n6339Q169J17980
37922g84663J47945J00996J34632K78196L14063N7746l32934m58230j24935L62883
37912c04301M82021J09494k86670k41939O7982R6391k34121l96845p5781L38536
37902d45233L51492P9349l9886L5535P528j50059j62185j3430l2420l14318m95774
$$ y = [-575716, -536642, -465127, -380382, -205737, -70338, -117343, -164407, 62763, 454632, 634491, 486189, 228276, 20254, -152968, -232461, -90649, 178539, 303393, 216893, 90468, -43967, -353195, -799198, -1040822, -902816, -628283, -476793, -371462, -177469, -56636, -247251, -676670, -1080943, -1373144, -1621624, -1782727, -1746096, -1576741, -1433601, -1284168, -970929, -555185, -324156, -409451, -630430, -780235, -854473, -910812, -902643, -784663, -636718, -535722, -401090, -122894, 191169, 248915, -84019, -542249, -667184, -304301, 177720, 287214, 544, -241395, -173413, -77022, -311143, -707988, -783769, -445233, -93741, -14392, -54278, -18743, -11215, -161274, -323459, -336889, -369309, -683627, -1179401]
37891a179401k90386R4860K93250K66985K37137K97838L03605P3480l75090p33631
37881a011353n99521M2193O04235M83218j37796m57993j15022L64203L78538P6746
37871c72552q690J82114K35413j6186k32275o0710M03163P17141N13439j35337
37861A225520o75463n62613O6292M56251J83126k75711k70207N7122Q5101k26197
37851F3221k93920O8846L25811J31606q8375J24661M67139L37276k32164o35407
37841B68694n22124j05618K54121L53139R5343m25455p73193n02468K43923P87913
37831c25725O97777K47998m0965n3822m8924j63753k34030p7618K42078M71558
37821G14574L88945k2321n27203p77026o03645k09534R643j29806m24523n40272
$$ y = [-1179401, -1469787, -1374927, -1081677, -814692, -577555, -279717, 23888, 97368, -277722, -1011353, -1610874, -1568681, -964446, -481228, -619024, -1077017, -1192039, -827836, -449298, -372552, -381242, -199128, 36285, 20099, -212176, -272886, 130277, 847418, 1360857, 1225520, 550057, -12556, 53736, 509987, 693113, 417402, 147195, 204317, 289418, 63221, -230699, -161853, 163958, 295564, 207189, 331850, 798989, 1136265, 904101, 268694, -253430, -359048, -104927, 248212, 343555, -81900, -855093, -1357561, -1113638, -325725, 372052, 620050, 579085, 525263, 476339, 312586, 78556, 938, 243016, 714574, 1103519, 1081198, 553995, -223031, -826676, -1036210, -1026567, -1156373, -1580896, -2121168]
37811b121168l67382n1383K56664N26000P02707O19583K09702k67781m21291j80074
37801a094423J18585J74605Q9115J32849K92744K97465O5143j46339j26731k2662
37791b19649q9415k98906m13279l46148k02353j0781K87189N51539M70127K3762
37781b47914l58853l46488j69853k34551m56169l85367O4378M47685M24319J85690
37771a077123Q8716J80695K83714K90669J72803p9764l22757k85269M8897K97124
37761d02295J45266k41710n03976n48380m54370j77728K84157O39090O27963M48497
37751a83486M19372L83778j9094n78479o41291r4494L98927L53019P9995N0948
37741A69195J52657J7066k90783m09096k83972j77977j83025j27336N7882K09123
$$ y = [-2121168, -2488550, -2539933, -2283269, -1757269, -1054562, -434979, -225277, -493058, -914349, -1094423, -975838, -801233, -712118, -579269, -286525, 10940, 76083, -70256, -196987, -219649, -309064, -607970, -1021249, -1367397, -1569750, -1580531, -1293342, -741803, -271676, -247914, -606767, -953255, -1123108, -1357659, -1813828, -2199195, -2134817, -1687132, -1262813, -1077123, -988407, -807712, -523998, -233329, -60526, -140290, -463047, -748316, -699419, -402295, -257029, -498739, -1002715, -1551095, -2005465, -2183193, -1899036, -1259946, -631983, -183486, 235886, 619664, 600570, 22091, -619200, -713694, -314767, 38252, 118247, 169195, 321852, 338918, 48135, -360961, -644933, -822910, -1005935, -1133271, -1075389, -866266]
37731h66266K02327J24811J26803K28187K93733J65106j29916l20974k05790N834
37721c76145p6419m17012n23611j50342L26451M45834K38916J2736j15856j69076
37711h04524r7683M5105J0658k15269k09436K43730O33118L82831k27062m20924
37701f59456n0078L04908K94086J70175J40916L6274j81130j93340R1873K62907
37691B17135M7215k15197j18457J59913J74732q4521k33023r9780P6614M6092
37681b9277j16492j24519J60267M94964M42736q2140n59868m28275J54643M72836
37671C84875J91763k77487m44016l22865j69988n6140L2683K5429m1485J4053
37661f63178J42414K1454l62686n30497k28253J27245J34563O5081K98600N44544
$$ y = [-866266, -663939, -539128, -412325, -184138, 109595, 274701, 144785, -176189, -381979, -376145, -452564, -869576, -1393187, -1543529, -1217078, -771244, -532328, -519592, -635448, -804524, -902207, -857102, -846444, -1061713, -1271149, -1027419, -394301, -11470, -238532, -659456, -709534, -404626, -110540, 59635, 200551, 236825, 55695, -137645, -45772, 217135, 264350, 49153, -69304, 90609, 265341, 180820, -52203, -151983, -75369, -29277, -145769, -270288, -110021, 384943, 827679, 745539, 185671, -242604, -87961, 384875, 576638, 299151, -144865, -467730, -637718, -693858, -661175, -635746, -677231, -663178, -520764, -499310, -861996, -1392493, -1620746, -1493501, -1358938, -1293857, -995257, -450713]
37651d50713L13100j58469k27580Q1956J43628j70657k82324O7223L62522J75166
37641a46148j84647k50348r0224q658L316R1110J45768P218j76324j53726L9548
37630g23115J85764K09143J54271K5951j26136j57531o8916p8054k55250l49173
37620a183046k01653l6974n5924o2003J42206K97234R5741j94911p7551L34507
37610i42374M20421N562l66457k47989J41015L68083L67501K89676J47801n3441
37600A29798j15301P7517K61488J15797k32120l45087p8339K50598L15479J49897
37590E29727k2893j32318k77679m74674n36109k74307K11219N48125M71573J38664
37580A81328n8334K3955J42894N4027j46247j82520J8115K50586K76062L2326
$$ y = [-450713, -137613, -296082, -523662, -441706, -298078, -468735, -751059, -683836, -321314, -146148, -330795, -581143, -671367, -680025, -676709, -585599, -439831, -432613, -608937, -762663, -723115, -537351, -328208, -173937, -147986, -274122, -431653, -500569, -578623, -833873, -1183046, -1384699, -1421673, -1477597, -1539600, -1397394, -1100160, -1004419, -1199330, -1276881, -942374, -521953, -516391, -882848, -1130837, -989822, -621739, -254238, 35438, 183239, 129798, 14497, 92014, 353502, 469299, 237179, -107908, -186247, 64351, 379830, 529727, 506834, 374516, 96837, -377837, -913946, -1188253, -977034, -428909, 42664, 181328, 122994, 146949, 289843, 343870, 197623, 15103, 33218, 283804, 559866, 592192]
37570E92192l39103n76612m79356j18481J88097K16250P8431N284j2972j56309
37560f02579l82947l75998J3397M70332N46363J93506k09326l31504k09176n1615
37550i39547Q1224K47309L73991K84709J4620j31972O733J67645L7776k14102
37540g1614j28114L19933N72828K42241l33732n67522l94934j97595j19540P3165
37530f04884M35641O00945K97324j96491l76084j31883J83513K20582l0495l26916
37520G1252m25794k43197J07444L88065M13458K07604k1600q1412J8657Q6498
37510E20975j3175j58561j14984R3396J28594j96876n52189m42525J18482N71744
37500d5119M87806K5355l65613m55852l18094j03070Q2234J86084K38782K91239
$$ y = [592192, 253089, -323523, -802879, -921360, -733263, -517013, -438582, -433298, -446270, -602579, -985526, -1361524, -1348127, -877795, -331432, -137926, -347252, -678756, -887932, -939547, -858323, -611014, -237023, 47686, 62306, -69666, -62933, 104712, 142488, -71614, -199728, 120205, 693033, 935274, 601542, 34020, -360914, -558509, -678049, -604884, -169243, 431702, 729026, 532535, 156451, 24568, 208081, 428663, 398168, 71252, -354542, -597739, -490295, -102230, 311228, 518832, 497232, 415820, 434477, 520975, 507800, 349239, 234255, 327651, 456245, 259369, -292820, -735345, -616863, -45119, 442687, 468042, 102429, -353423, -671517, -774587, -692353, -506269, -267487, 23752]
37490B3752K72783N1629l06634n31413m92514l52673k61155j25248J43634L83546
37480a194293M05596K74716J37043l7477k69218l22624j808M25032M79552J20690
37470A7209k16769k38086r5355k4846j3926M4172J26461J54309J09925j3106k12292
37459c62304l80449l84661k70262j94899j55869k0563J62888J78825K6342k2986
37449a423938J43896L05961L04187K80722L19792J94312k20232n68397m45460
37440a109157j8433K04724J21465R8880K95696L97808J88307l7464O8236L16471
37430E26533K44504j56996m01279k32095P524o5033k78380k22301O5034J88553
37420c23936R7097J47801L79742L20600j83325n29256k61952R5997j61188o73128
$$ y = [23752, 296535, 348164, 41530, -489883, -982397, -1335070, -1596225, -1721473, -1577839, -1194293, -788697, -513981, -376938, -414415, -683633, -1006257, -1008065, -583033, -103481, 17209, -199560, -437646, -533001, -557847, -571773, -527601, -401140, -246831, -136906, -150012, -362304, -742753, -1127414, -1397676, -1592575, -1748444, -1769007, -1606119, -1427294, -1400952, -1423938, -1280042, -974081, -669894, -389172, -69380, 124932, -95300, -663697, -1109157, -1127590, -922866, -801401, -702521, -406825, -9017, 179290, 141826, 210062, 526533, 771037, 614041, 212762, -19333, -11809, -76842, -355222, -577523, -512489, -323936, -226839, -79038, 300704, 621304, 437979, -91277, -353229, -257232, -418420, -1091548]
37410a091548m82084L87366Q58969M61676l700J18945K76579k01976p95929n78926
37400a050628K15207N10839M5867l62823k09488O4518L5446l0381J24862J55357
37390e01224k30288n89569l49052K72949N53142K82936m9586l9730J54796J85368
37380c10258L916j59329j05929J58883M56956N76028M41133J72060o0044j99495
37370I73921k80077k94383j96460l0536M5553o8988k53088k48353M3929L97110
37360H8628M81008K33559j05130l22707m22298m43388l31182j20621k3088j20158
37350a085377j63288P6933M31986N68939M29586J46283k69900p66014r65439n62397
37340b158688Q6377L14893Q4264k0861K12766L09988O498k17004P7286N25222
$$ y = [-1091548, -1573632, -1186266, -327297, 134379, 130679, 249624, 526203, 324227, -471702, -1050628, -835421, -324582, -278715, -641538, -851026, -786508, -751062, -781443, -656581, -501224, -731512, -1321081, -1670133, -1397184, -844042, -561106, -610692, -650422, -495626, -310258, -306342, -465671, -571600, -412717, 44239, 620267, 1061400, 1233460, 1173416, 973921, 693844, 399461, 203001, 172465, 218018, 149030, -104058, -352411, -308482, 88628, 569636, 803195, 698065, 375358, -46940, -490328, -821510, -942131, -965219, -1085377, -1248665, -1171732, -739746, -170807, 258779, 405062, 135162, -630852, -1596291, -2158688, -2072311, -1757418, -1673154, -1694015, -1481249, -1171261, -1164763, -1381767, -1304481, -779259]
37330g79259N26645J58005m7198O2902K02790K32260K48133K13659N188k37528
37320E85597k64966j57317j67907k08103J7586L95382M55440J00944k27170k33149
37310B96337j23726j17074q6281N3058N3111k22153m29051k20079J73303K45520
37300c77035n8694l18903k58740l7245O6900k5062k02158k76076r7689K41840
37290a342862L76147O1792m23180n38480j47134L39061N16644M14036K61102J20213
37280c62661m8122j52188o0763J48761K50316J63479L1378Q848R9092K03248K31597
37269E12985J61788N6720R269K5629L0772M0642J85101M22771M06360r0720p01630
37258A059687p77781k20880L41653L54556p370k01428o7693R0396J9357k02308
$$ y = [-779259, -252614, -94609, -141807, -78905, 123885, 356145, 604278, 817937, 823125, 585597, 320631, 163314, -4593, -212696, -195110, 200272, 655712, 756656, 529486, 296337, 172611, 55537, -30744, 22314, 75425, -146728, -575779, -795858, -622555, -377035, -435729, -754632, -1013372, -1050617, -983717, -1008779, -1210937, -1487013, -1584702, -1342862, -966715, -904923, -1328103, -1866583, -2013717, -1674656, -1158012, -743976, -482874, -362661, -410783, -562971, -623734, -474973, -224657, -61178, -29800, -20952, 78140, 281388, 512985, 674773, 731493, 740762, 766391, 797163, 837805, 1022906, 1445677, 1852037, 1761317, 1059687, 281906, 61026, 402679, 757235, 749865, 548437, 480744, 571140, 590497, 388189]
37248C88189l41978k40572Q6169L92264L50911l9041l34407j90068J30050J20100
37238C21617k06871l50779j04412J53172N7410k47058l97671k77738N522L27745
37228g19063N37097M88740K81208K21572L72607L91921M1348l96568m86158k28037
37218E04667M806j5485j81792k85175k15954p663J60195J11679n5402l2274K33267
37207B20869L85623J82225j13043j44685j2509m4305k33571l07357k06191q8332
37197c61276K8943K15327L10788J09753j92246k01460L7389R5937j08850j65084
37187b30779J16789L49594J83729j53293k39000m6041J54553K09307J12409j36641
37177C20627m12637m18567o9701K50068J33249k76879m72824k61553N9184J80387
$$ y = [388189, 46211, -194361, -108192, 284072, 634983, 595942, 261535, 71467, 201517, 321617, 114746, -236033, -340445, -187273, -129863, -376921, -774592, -1052330, -1046808, -719063, -181966, 306774, 587982, 809554, 1182161, 1574082, 1615430, 1218862, 732704, 504667, 509473, 493988, 312196, 27021, -188933, -196596, -36401, 75278, 19876, -12398, 220869, 606492, 788717, 675674, 530989, 518480, 474175, 240604, -66753, -272944, -361276, -332333, -117006, 193782, 303535, 111289, -90171, -52782, 43155, -65695, -230779, -113990, 235604, 419333, 266040, 27040, -19001, 135552, 344859, 457268, 320627, -92010, -510577, -580278, -330210, -196961, -473840, -946664, -1208217, -1149033, -968646]
37167i68646J38128J38659K58408M01663M10803J75697k32434n15387m02355j5205
37157f10669J85291m8262l76440k63504K83688O29501L00349l54513n75744j67977
37147i98280L10603L76377K13433K06209K71840R0366k33384k64947M1381K17842
37137B31440k2179l82459m52042k43623n4802l2599p7668k6348K04784N22698
37127c32798O50670L94930n0715k86796k17132j07705j10654p2159Q7577J70171
37117A25389N5981o7197m8748m2551j89150l16549k26059k8979O5688O6985N5363
37106e49827k5624j57381r3818K56460N43047M24902Q4909q7839j17117l00626
37096b2914o02367o54865l18111J69372N52508P03504M99940q150l77177j94214
$$ y = [-968646, -830518, -691859, -433451, -31788, 379015, 554712, 322278, -193109, -595464, -610669, -425378, -473640, -850080, -1113584, -829896, -200395, 99954, -254559, -830303, -998280, -687677, -311300, -97867, 108342, 380182, 470548, 237164, -27783, 13598, 231440, 209261, -173198, -625240, -868863, -923665, -956264, -1033932, -1060280, -855496, -332798, 317872, 712802, 662087, 375291, 158159, 50454, -60200, -132359, -44782, 125389, 181370, 114173, 65425, 22874, -166276, -482825, -708884, -737863, -672175, -605190, -549827, -575451, -732832, -826650, -570190, -27143, 397759, 482668, 394829, 277712, -22914, -625281, -1280146, -1598257, -1428885, -876377, -172873, 327067, 318917, -58260, -252474]
37086b52474K88867M33194J35408p7715L6313N1877l20019o22658l13640L61472
37076b79375O76998L95869n0455k44402j96463q0485M7063J55825J46079j4999
37066E55655k11642l18305l11920k13604n0448P5713J6999k25683m22703l44198
37056a450136l7283K25878K75956K20257K47159L52612L63498J91488n3044k03665
37046A32720j96322p9415L3088J6001j36866k28310n4756K84732M53466L04655
37036E28993M4406j13754k21654l76239m61450l32027q1894R3020J52109J31087
37026f37403r838k24550k68357l4413J86683J10068p0380m06K18557K08395M095
37015e17549K0187L16263M43927J49859k60815m38096m18444l45428j86497K9426
$$ y = [-252474, 36393, 469587, 604995, 527280, 563593, 615470, 295451, -327207, -640847, -279375, 397623, 793492, 743037, 498635, 302172, 221687, 268750, 424575, 570654, 555655, 344013, 25708, -286212, -499816, -550264, -474551, -457552, -683235, -1105938, -1450136, -1487419, -1261541, -985585, -765328, -518169, -165557, 197941, 389429, 336385, 132720, -63602, -143017, -109929, -93928, -230794, -459104, -513860, -229128, 224338, 528993, 573399, 459645, 237991, -138248, -599698, -931725, -1013619, -920599, -768490, -637403, -647241, -871791, -1140148, -1174561, -987878, -877810, -948190, -948596, -730039, -521644, -517549, -497362, -181099, 262828, 412687, 151872, -286224, -704668, -1050096, -1236593, -1207167]
37005a207167P5808j01938k09880m8036J85004K63097K74695L42679L45872K01577
36995A21711Q5166P0446q1451m27713n36513j29050L27288K15514l07463n65704
36985a227769l42387Q134K76015N48465O97538M31613n4344j68367J56702K92481
36975F18081p0813m00394k06831J56874J19864j79327k26688l4009n081j14436
36965c42760M0947M18797M91848J31871j61417j40128k32017o79004q78556k34440
$$ y = [-1207167, -1131359, -1233297, -1443177, -1491213, -1306209, -1043112, -768417, -425738, -79866, 121711, 206877, 277323, 195872, -231841, -768354, -897404, -570116, -354602, -662065, -1227769, -1570156, -1562022, -1286007, -737542, -40004, 391609, 337265, 168898, 325600, 618081, 547268, 146874, -59957, 96917, 216781, 37454, -189234, -223243, -228324, -342760, -301813, 116984, 608832, 740703, 579286, 439158, 207141, -471863, -1350419, -1584859]
$$ [...]
##END NTUPLES=NMR SPECTRUM
##END=
