##TITLE=31P_DE-80H_X3
 64 sc D2O
 26.2.2025
##JCAMPDX= 6.0         $$ Bruker NMR JCAMP-DX V2.0
##DATA TYPE= NMR SPECTRUM
##DATA CLASS= NTUPLES
##ORIGIN= UXNMR, Bruker Analytische Messtechnik GmbH
##OWNER= root
$$ XWIN-NMR		Version 3.5
$$ Thu Jun 19 15:10:01 2025 Russian Standard Time (UT+4h)  Yarkov@DPX200
##.OBSERVE FREQUENCY= 81.013821
##.OBSERVE NUCLEUS= ^31P
##.ACQUISITION MODE= SIMULTANEOUS
##.ACQUISITION SCHEME= undefined
##.AVERAGES= 64
##.DIGITISER RES= 17
##SPECTROMETER/DATA SYSTEM= spect
##.PULSE SEQUENCE= zgpg30
##.SOLVENT NAME= CDCl3
##.SHIFT REFERENCE= (INTERNAL, CDCl3, 0, 198.062)
##AUDIT TRAIL= $$ (NUMBER, WHEN, WHO, WHERE, WHAT)
$$ ##TITLE= Audit trail, XWIN-NMR		Version 3.5
$$ ##JCAMPDX= 5.01
$$ ##ORIGIN= Bruker BioSpin GmbH
$$ ##OWNER= Yarkov
$$ C:/Bruker/XWIN-NMR/data/yarkov2/nmr/P31/2/pdata/1/auditp.txt
$$ ##AUDIT TRAIL=  $$ (NUMBER, WHEN, WHO, WHERE, WHAT)
(   1,<2025-06-19 15:09:00.21 +0400>,<Yarkov>,<DPX200>,
      <created by zg, POWCHK disabled, PULCHK disabled
       configuration hash MD5:
       00 E9 B6 7A A2 85 ED C7 34 08 36 98 17 FE 4E 26
       data hash MD5: 32K
       C7 8D FA 94 55 98 69 5B D8 25 2F 35 F1 5B B7 11>)
(   2,<2025-06-19 15:09:05.96 +0400>,<Yarkov>,<DPX200>,
      <Start of raw data processing
       efp BC_mod = 2 LB = 1.5 FT_mod = 6 PKNL = 1 PHC0 = 1505.71 PHC1 = 58.35953 SI = 64K 
       data hash MD5: 64K
       33 6B 3A 84 36 0A 2A 8F 80 E3 30 5C 4E D0 90 66>)
(   3,<2025-06-19 15:09:38.53 +0400>,<Yarkov>,<DPX200>,
      <pk PHC0 = 181.6871 PHC1 = -13 
       data hash MD5: 64K
       13 E2 8D 56 3E 8E 7B AB 76 A9 82 30 BD 43 B6 0E>)
$$ ##END=
$$ 
$$ hash MD5
$$ 6D 25 D9 34 DC BE D4 47 7A CC EA 2E 31 A8 FC C9
##$RELAX= 
##$RELAX= 
##$RELAX= 
##$RELAX= 
##$RELAX= 
##$RELAX= 
##$RELAX= 
##$RELAX= 
$$ Bruker specific parameters
$$ --------------------------
##$DU= <C:/Bruker/XWIN-NMR>
##$EXPNO= 2
##$NAME= <P31>
##$PROCNO= 1
##$TYPE= <nmr>
##$USER= <yarkov2>
##$AMP= (0..31)
100 100 100 100 100 100 100 100 100 100 100 100 100 100 100 100 100 100 
100 100 100 100 100 100 100 100 100 100 100 100 100 100 
##$AQSEQ= 0
##$AQ_mod= 1
##$AUNM= <au_zg>
##$AUTOPOS= <>
##$BF1= 81.014009
##$BF2= 200.13
##$BF3= 200.13
##$BF4= 200.13
##$BF5= 200.13
##$BF6= 200.13
##$BF7= 200.13
##$BF8= 200.13
##$BYTORDA= 1
##$CFDGTYP= 0
##$CFRGTYP= 5
##$CHEMSTR= <none>
##$CNST= (0..31)
1 1 145 1 1 1 1 1 1 1 1 1 1 1 1 1 1 1 1 1 1 1 1 1 1 1 1 1 1 1 1 1 
##$CPDPRG= <waltz16>
##$CPDPRG1= <>
##$CPDPRG2= <waltz16>
##$CPDPRG3= <>
##$CPDPRG4= <mlev>
##$CPDPRG5= <mlev>
##$CPDPRG6= <mlev>
##$CPDPRG7= <mlev>
##$CPDPRG8= <mlev>
##$CPDPRGB= <>
##$CPDPRGT= <>
##$D= (0..31)
0 1 0 0 0 0 0 0 0 0.06 0 0.03 2e-05 3e-06 0 0 0.0002 0 0 0 0 0 0 0 0 0 
0 0 0 0 0 0 
##$DATE= 1750331339
##$DBL= (0..7)
120 120 120 11 120 120 24 19 
##$DBP= (0..7)
150 150 150 150 150 150 150 150 
##$DBP07= 0
##$DBPNAM0= <>
##$DBPNAM1= <>
##$DBPNAM2= <>
##$DBPNAM3= <>
##$DBPNAM4= <>
##$DBPNAM5= <>
##$DBPNAM6= <>
##$DBPNAM7= <>
##$DBPOAL= (0..7)
$$ [...]
##$SUBNAM2= <"">
##$SUBNAM3= <"">
##$SUBNAM4= <"">
##$SUBNAM5= <"">
##$SUBNAM6= <"">
##$SUBNAM7= <"">
##$SUBNAM8= <"">
##$SUBNAM9= <"">
##$SW= 400.765351723535
##$SWIBOX= (0..15)
0 1 3 0 0 0 0 0 0 0 0 0 0 0 0 0 
##$SW_h= 32467.5324675325
##$TD= 32768
##$TD0= 1
##$TE= 0
##$TE2= 300
##$TE3= 300
##$TEG= 300
##$TL= (0..7)
0 120 53 12 22 120 120 120 
##$TP= (0..7)
150 150 150 150 150 150 150 150 
##$TP07= 0
##$TPNAME0= <>
##$TPNAME1= <>
##$TPNAME2= <>
##$TPNAME3= <>
##$TPNAME4= <>
##$TPNAME5= <>
##$TPNAME6= <>
##$TPNAME7= <>
##$TPOAL= (0..7)
0.5 0.5 0.5 0.5 0.5 0.5 0.5 0.5 
##$TPOFFS= (0..7)
0 0 0 0 0 0 0 0 
##$TUNHIN= 0
##$TUNHOUT= 0
##$TUNXOUT= 0
##$USERA1= <user>
##$USERA2= <user>
##$USERA3= <user>
##$USERA4= <user>
##$USERA5= <user>
##$V9= 5
##$VALIST= <valist>
##$VCLIST= <CCCCCCCCCCCCCCC>
##$VD= 0
##$VDLIST= <DDDDDDDDDDDDDDD>
##$VPLIST= <PPPPPPPPPPPPPPP>
##$VTLIST= <TTTTTTTTTTTTTTT>
##$WBST= 1024
##$WBSW= 4
##$XGAIN= (0..3)
0 0 0 0 
##$XL= 0
##$YL= 0
##$YMAX_a= 197
##$YMIN_a= -1446
##$ZGOPTNS= <>
##$ZL1= 120
##$ZL2= 120
##$ZL3= 120
##$ZL4= 120
##$ABSF1= 0
##$ABSF2= 0
##$ABSG= 0
##$ABSL= 0
##$ALPHA= 0
##$AQORDER= 0
##$ASSFAC= 0
##$ASSFACI= 0
##$ASSFACX= 0
##$ASSWID= 0
##$AUNMP= <proc_1d>
##$AZFE= 0.1
##$AZFW= 0.5
##$BCFW= 0
##$BC_mod= 2
##$BYTORDP= 0
##$COROFFS= 0
##$CY= -3
##$DATMOD= 1
##$DC= 0
##$DFILT= <>
##$DTYPP= 0
##$F1P= 0
##$F2P= 0
##$FCOR= 1
##$FTSIZE= 65536
##$FT_mod= 6
##$GAMMA= 0
##$GB= 0
##$INTBC= 1
##$INTSCL= 9.790993e-09
##$ISEN= 30
##$LB= 1.5
##$LEV0= 0
##$LPBIN= 0
##$MAXI= 10000
##$MC2= 0
##$MEAN= 0
##$ME_mod= 0
##$MI= 50
##$NCOEF= 0
##$NC_proc= -12
##$NLEV= 6
##$NOISF1= 182.463
##$NOISF2= 159.3651
##$NSP= 0
##$NTH_PI= 0
##$NZP= 0
##$OFFSET= 198.0616
##$PC= 4
##$PHC0= 1687.397
##$PHC1= 45.35953
##$PH_mod= 1
##$PKNL= yes
##$PPARMOD= 0
##$PSCAL= 0
##$PSIGN= 0
##$REVERSE= no
##$SF= 81.0140089999434
##$SI= 65536
##$SIGF1= 159.3651
##$SIGF2= -187.1042
##$SINO= 113.3802
##$SIOLD= 16384
##$SREGLST= <1H.CDCl3>
##$SSB= 0
##$STSI= 65536
##$STSR= 0
##$SW_p= 32467.5324675325
##$SYMM= 0
##$S_DEV= 0
##$TDeff= 32768
##$TDoff= 0
##$TI= <>
##$TILT= no
##$TM1= 0
##$TM2= 0
##$TOPLEV= 0
##$USERP1= <user>
##$USERP2= <user>
##$USERP3= <user>
##$USERP4= <user>
##$USERP5= <user>
##$WDW= 1
##$XDIM= 65536
##$YMAX_p= 401674593
##$YMIN_p= -77093188
$$ End of Bruker specific parameters
$$ ---------------------------------
##NTUPLES= NMR SPECTRUM
##VAR_NAME=  FREQUENCY,     SPECTRUM/REAL,   SPECTRUM/IMAG
##SYMBOL=    X,             R,               I
##VAR_TYPE=  INDEPENDENT,   DEPENDENT,       DEPENDENT
##VAR_FORM=  AFFN,          ASDF,            ASDF
##VAR_DIM=   65536,         65536,           65536
##UNITS=     HZ,            ARBITRARY UNITS, ARBITRARY UNITS
##FACTOR=    0.49542278885378, 1,            1
##FIRST=     16045.7642231865, 0,            0
##LAST=      -16421.768244346, 0,            0
##MIN=       -16421.768244346, -77093188,    0
##MAX=       16045.7642231865, 401674593,    0
$$ Real data points
##PAGE= N=1
##DATA TABLE= (X++(R..R)), XYDATA
$$ [...]
$$ plain form
42507 -7230635 -6584991 -6108168 -5241910 -3312454 -912486 551393 512945 -279707 -866200
42498 -866200 -984395 -869650 -800928 -1047793 -1784414 -2782141 -3464680 -3469497 -2993917 -2505590
42488 -2505590 -2268579 -2187659 -1985727 -1548542 -1162639 -1237654 -1663808 -1754432 -1104864 -151472
42478 -151472 538040 1099025 1794763 1925061 307168 -3038076 -6528957 -8610175 -9021450
42469 -9021450 -8364392 -7318433 -6623418 -6835636 -7443080 -7111539 -5637274 -4775863 -5956219
42460 -5956219 -7850479 -7762803 -5258358 -2803402 -2496964 -3646228 -4243883 -3524511 -2036823
42451 -2036823 -255268 1488854 2272513 1293688 -666515 -1725051 -1102584 103622 596264
42442 596264 350974 -4894 -315852 -664130 -737212 -344239 -164102 -1067364 -2825215 -4265844
$$ packed form
42507g230635O45644M76823Q66258J929456K399968J463879l8448p92652n86493
42498h66200j18195J14745O8722k46865p36621r97727o82539m817M75580M88327
42488b505590K37011Q0920K01932M37185L85903p5015m26154r0624O49568R53392
42478a51472O89512N60985O95738J30298j617893l345244l490881k081218m11275
42469i021450O57058J045959O95015k12218o07444L31541J474265Q61411j180356
42460e956219j894260Q7676K504445K454956L06438j149264n97655P19372J487688
42451b036823J781555J744122P83659r78825j960203j058536O22467J206206M92642
42442E96264k45290l55868l10958l48278p3082L92973J80137r03262j757851j440629
$$ plain form
42432 -4265844 -4669259 -4317340 -3720126 -3084722 -2627887 -2557496 -2417712 -1243652 1044544
42423 1044544 2949309 2813240 745674 -1404028 -1945052 -883237 310184 138374 -1617332
42414 -1617332 -3753875 -4850385 -4699886 -4286118 -4256031 -3986909 -2642076 -651805 659576
42405 659576 759486 372365 138059 -377800 -1845580 -3850364 -5064485 -4697963 -3350871
42396 -3350871 -2308562 -2246483 -2844612 -3565919 -4426734 -5713346 -7150991 -7884784 -7450236
42387 -7450236 -6398653 -5725823 -5893102 -6477116 -6447715 -4824993 -1747934 900721 830876
42378 830876 -2021919 -4889001 -5034410 -2715327 -436961 151157 -539668 -1501348 -2323272
42369 -2323272 -2814606 -2690738 -1998152 -1036352 150524 1292432 1208739 -906084 -3511859
$$ packed form
42432d265844m03415L51919N97214O35404M56835P0391J39784J174060K288196
42423A044544J904765j36069k067566k149702n41024J061815J193421j71810j755706
42414a617332k136543j096510J50499M13768L0087K69122J344833J990271J311381
42405F59576R9910l87121k34306n15859j467780k004784j214121L66522J347092
42396c350871J042309O2079n98129p21307q60815j286612j437645p33793M34548
42387g450236J051583O72830j67279n84014K9401J622722L077059K648655o9845
42378H30876k852795k867082j45409K319083K278366N88118o90825r61680q21924
42369b323272m91334J23868O92586R61800J186876J141908q3693k114823k605775
$$ plain form
42360 -3511859 -3826673 -1393387 1153428 1557582 405232 -782746 -1923030 -3311647
42352 -3311647 -4028045 -3497685 -3299907 -5052872 -7393649 -7564702 -5522303 -3898441 -3976740
42343 -3976740 -4328179 -3780809 -3143413 -3145581 -3053859 -2557998 -2929042 -4778000 -6441601 -6350395
42333 -6350395 -5579438 -6118443 -7623214 -7922659 -6275793 -4264823 -3530131 -4137270 -5248801
42324 -5248801 -6122129 -6259701 -5593980 -4729233 -4280928 -3990606 -3186867 -1983189 -1247936
42315 -1247936 -1473056 -2373559 -3479317 -4448039 -4973285 -5073165 -5284978 -5946503 -6594395
42306 -6594395 -6720895 -6625231 -6670037 -6295904 -4946814 -3493926 -3314952 -4185927 -4588042
42297 -4588042 -4036735 -3467343 -3164003 -2151202 -300750 662210 -629230 -3194193 -5067526
$$ packed form
42360c511859l14814K433286K546815M04154j152350j187978j140284j388617
42352c311647p16398N30360J97778j752965k340777j71053K042399J623862p8299
42343c976740l51439N47370O37396k168R1722M95861l71044j848958j663601R1206
42333f350395P70957n39005j504771k99445J646866K010970P34692o07139j111531
42324e248801q73328j37572O65721Q64747M48305K90322Q03739J203678P35253
42315a247936k25120r00503j105758r68722n25246r9880k11813o61525o47892
42306f594395j26500R5664m4806L74133J349090J452888J78974q70975m02115
42297d588042N51307N69392L03340J012801J850452R62960j291440k564963j873333
$$ plain form
42288 -5067526 -5723362 -6054249 -6702739 -7509114 -8092244 -8044157 -7001896 -5337868 -4322540
42279 -4322540 -4853099 -6456712 -8138166 -9538492 -10544358 -10594991 -9462263 -8115784 -7648017
42270 -7648017 -7742070 -7319272 -6348805 -5839574 -6271874 -7211276 -8309350 -9439286 -9854694
42261 -9854694 -8523639 -5600897 -2527722 -387528 879692 1409521 718735 -1279699
42253 -1279699 -3373054 -3936441 -2486109 -65636 1630406 1501365 -90348 -1643835
42245 -1643835 -2160497 -2291166 -3196724 -4560592 -4819021 -3417926 -1708275 -1247933 -2138202
42236 -2138202 -3409428 -4245048 -4529860 -4928911 -6469456 -9064356 -10558464 -8795407 -4915460
42227 -4915460 -2743002 -4022601 -6086585 -5650416 -3264045 -2005216 -2897212 -4011481
$$ packed form
42288e067526o55836l30887o48490q06375n83130M8087J042261J664028J015328
42279d322540n30559j603613j681454j400326j005866n0633J132728J346479M67767
42270g648017r4053M22798R70467N09231m32300r39402j098074j129936m15408
42261i854694J331055K922742L073175K140194J267220N29829o90786j998434
42253a279699k093355n63387J450332K420473J696042j29041j591713j553487
42245a643835n16662j30669r05558j363868k58429J401095J709651M60342q90269
42236b138202j271226q35620k84812l99051j540545k594900j494108J763057L879947
42227d915460K172458j279599k063984M36169K386371J258829q91996j114269
$$ plain form
42219 -4011481 -3815081 -3168467 -3583920 -5116792 -6596635 -6978096 -6145524 -5069695 -5058958
42210 -5058958 -6088381 -6321414 -4410786 -1746326 -876479 -2059629 -3276348 -3587996 -4181026
42201 -4181026 -5474117 -5551975 -2970726 582669 2210402 1326968 -365084 -1595754 -2507470
42192 -2507470 -3324707 -3669272 -3248267 -2076645 -50416 2676775 4960129 5351354 3657534
42183 3657534 1097015 -1016307 -2023642 -1653456 -95303 1583777 2038242 883296
42175 883296 -1267452 -3840591 -6474106 -8283720 -8197465 -6357508 -4192612 -2730973 -1766545
42166 -1766545 -1003606 -876998 -1606071 -2497684 -3029750 -3704921 -4872768 -5576320 -4772611
42157 -4772611 -3062179 -1906418 -1584827 -1304270 -972068 -1229504 -1778505 -1488093 -568073
$$ packed form
42219d011481J96400O46614m15453j532872j479843l81461Q32572J075829J0737
42210e058958j029423k33033J910628K664460Q69847j183150j216719l11648n93030
42201d181026j293091p7858K581249L553395J627733q83434j692052j230670r11716
42192b507470q17237l44565M21005J171622K026229K727191K283354L91225j693820
42183C657534k560519k113322j007335L70186J558153J679080M54465j154946
42175H83296k150748k573139k633515j809614Q6255J839957K164896J461639R64428
42166a766545P62939J26608p29073q91613n32066o75171j167847p03552Q03709
42157d772611J710432J155761L21591K80557L32202k57436n49001K90412R20020
$$ plain form
42148 -568073 -828903 -2914620 -4929951 -5069492 -4156662 -3939125 -4075607 -2948505 -835948
42139 -835948 129907 -699154 -1419594 -505326 1128849 1968463 2090549 2223936 2064918
42130 2064918 1116641 153547 131928 325520 -734824 -2877511 -4521026 -5012295 -5007445
42121 -5007445 -4684788 -3568974 -2361047 -2779720 -4709326 -5453725 -3210518 237398 1913838
42112 1913838 1501885 868176 538701 -996591 -4277255 -7231952 -7516782 -5291942 -2706828
42103 -2706828 -1378468 -1283321 -1667719 -2083336 -2485348 -2938258 -3473196 -4018797 -4385766
42094 -4385766 -4470304 -4509374 -4962819 -6012571 -7262593 -8103046 -8352047 -8318357 -8208293 -7853444
42084 -7853444 -7258166 -6941648 -7153233 -7092584 -5802081 -3830941 -3032929 -4342608 -6564962
$$ packed form
42148e68073k60830k085717k015331j39541R12830K17537j36482J127102K112557
42139h35948R65855q29061p20440R14268J634175Q39614J22086J33387j59018
42130B064918r48277r63094k1619J93592j060344k142687j643515m91269M850
42121e007445L22657J115814J207927m18673j929606p44399K243207L447916J676440
42112A913838m11953o33709l29475j535292l280664k954697k84830K224840K585114
42103b706828J328360R5147l84398m15617m02012m52910n34938n45601l66969
42094d385766q4538l9070m53445j049752j250022q40453k49001L3690J10064L54849
42084g853444N95278L16518k11585O0649J290503J971140P98012j309679k222354
$$ plain form
42075 -6564962 -7883397 -7865226 -7352126 -6984355 -6642525 -6047184 -5219375 -4457242 -4227377
42066 -4227377 -4794996 -5690477 -6047025 -5767753 -5623468 -5763835 -5148060 -3275015 -1402000
42057 -1402000 -777742 -604523 555993 1979355 1426862 -1455278 -4404988 -5587486 -5506240
42048 -5506240 -5279221 -4897041 -4240125 -4151812 -5052165 -5708698 -4929873 -3608655 -3535744 -4785168
42038 -4785168 -5809430 -5762183 -5231632 -4852815 -4714268 -5223143 -7023836 -9530305 -10768560
42029 -10768560 -9469021 -6547913 -3841688 -2045377 -672152 482016 894498 370411
42021 370411 -355299 -566028 -639698 -1517103 -3192872 -4465114 -4503968 -4047067 -4383883 -5568499
42011 -5568499 -6538677 -6837462 -7087427 -7531386 -7309552 -5922461 -4458514 -4300604 -5137534
$$ packed form
42075f564962j318435J8171N13100L67771L41830N95341Q27809P62133K29865
42066d227377n67619q95481l56548K79272J44285j40367O15775J873045J873015
42057a402000O24258J73219J160516J423362n52493k882140k949710j182498Q1246
42048e506240K27019L82180O56916Q8313r00353o56533P78825J321218P2911j249424
42038d785168j024262M7247N30551L78817J38547n08875j800693k506469j238255
42029a0768560J299539K921108K706225J796311J373225J154168M12482n24087
42021C70411p25710k10729p3670q77405j675769j272242l8854M56901l36816j184616
42011e568499r70178k98785k49965m43959K21834J387091J463947J57910q36930
$$ plain form
42002 -5137534 -5351022 -4183512 -2550897 -1710991 -1971205 -2832413 -3674972 -4027862 -3657339
41993 -3657339 -2703025 -1566416 -633861 -218345 -530589 -1394896 -2210184 -2529615 -2469842
41984 -2469842 -2297620 -2021142 -1758881 -1975290 -2758526 -3357304 -3153148 -2658802 -2773621
41975 -2773621 -3483290 -4152590 -4608222 -4891500 -4486429 -3192121 -2386637 -3680452 -6269652
41966 -6269652 -7465270 -6281587 -4660595 -4356379 -4475420 -3457714 -1945119 -1885176 -3715917
41957 -3715917 -6187896 -8356144 -9987619 -10360163 -8560836 -5187786 -2193471 -618540
41949 -618540 262986 1183856 1610735 918554 -292220 -1018783 -1294961 -1862445 -2815648
41940 -2815648 -3466326 -3423616 -3057310 -2817491 -2669774 -2437395 -2354556 -2924756 -4197052 -5370655
$$ packed form
42002e137534k13488J167510J632615Q39906k60214q61208q42559l52890L70523
41993c657339R54314J136609R32555M15516l12244q64307q15288l19431N9773
41984b469842J72222K76478K62261k16409p83236n98778K04156M94346j14819
41975b773621p09669o69300m55632k83278M05071J294308Q05484j293815k589200
41966f269652j195618J183683J620992L04216j19041J017706J512595N9943j830741
41957c715917k471979k168248j631475l72544J799327L373050K994315J574931
41949f18540Q81526R20870M26879o92181j210774p26563k76178n67484r53203
41940b815648o50678M2710L66306K39819J47717K32379Q2839n70200j272296j173603
$$ plain form
41930 -5370655 -5391944 -4110543 -2683867 -2530140 -3866576 -5518625 -6190866 -5706072 -4998677
41921 -4998677 -5152043 -6472134 -8235508 -9250583 -8839433 -7315990 -5441646 -3656471
41913 -3656471 -2172091 -1538507 -2420250 -4684544 -7242854 -8980799 -9450238 -8696456 -7185456
41904 -7185456 -6109902 -6742690 -8695560 -9579680 -7548133 -3877944 -1826859 -2850644
41896 -2850644 -5084803 -5927513 -5031435 -3999468 -4010082 -4900981 -6234324 -7939863 -9517773
41887 -9517773 -9548823 -6914279 -2468948 1054810 1221570 -1860151 -5471295 -6651147 -4815820
41878 -4815820 -2023525 -719230 -1532229 -3323835 -4738444 -5130644 -4450911 -3179519 -2386673
41869 -2386673 -3002621 -4760692 -6460114 -7412341 -7940413 -8330797 -8243910 -7584092 -6972570
$$ packed form
41930e370655k1289J281401J426676J53727j336436j652049o72241M84794P07395
41921d998677j53366j320091j763374j015075M11150J523443J874344J785175
41913c656471J484380O33584q81743k264294k558310j737945m69439P53782J511000
41904g185456J075554o32788j952870q84120K031547L670189K051085j023785
41896b850644k234159q42710Q96078J031967j0614q90899j333343j705539j577910
41887i517773l1050K634544M445331L523758J66760l081721l611144j179852J835327
41878d815820K792295J304295q12999j791606j414609l92200O79733J271392P92846
41869b386673o15948j758071j699422r52227n28072l90384Q6887O59818O11522
$$ plain form
41860 -6972570 -6642033 -5750520 -3742469 -1634159 -774276 -869365 -550936 432419 1036566
41851 1036566 861156 734049 1068228 1081109 250490 -677963 -872788 -565219 -248251 272259
41841 272259 1087784 1323546 236367 -1319411 -1643284 -229820 1773742 2972044 2879916
41832 2879916 1916327 976672 877765 1604781 2208521 1890380 926196 92257 -379756 -700730
41822 -700730 -855997 -775274 -817627 -1354085 -2141750 -2739011 -3169308 -3550827 -3592610 -3208693
41812 -3208693 -3021170 -3343318 -3350670 -2417268 -1581659 -2205929 -3725225 -4505558 -4638609 -5804673
41802 -5804673 -8170953 -9573610 -8548572 -6361898 -5047694 -4980465 -5445619 -6152036 -6890916
41793 -6890916 -6886861 -5890241 -5097715 -5765276 -7560015 -9235511 -10126129 -10055851 -8806099
$$ packed form
41860f972570L30537Q91513K008051K108310Q59883r5089L18429R83355O04147
41851A036566j75410j27107L34179J2881q30619r28453j94825L07569L16968N20510
41841B72259Q15525K35762j087179j555778l23873J413464K003562J198302r2128
41832B879916r63589r39655r8907P27016O03740l18141r64184q33939m72013l20974
41822g00730j55267Q0723m2353n36458p87665n97261m30297l81519m1783L83917
41812c208693J87523l22148p352R33402Q35609o24270j519296p80333j33051j166064
41802e804673k366280j402657J025038K186674J314204O7229m65154p06417p38880
41793f890916M055R96620P92526o67561j794739j675496q90618P0278J249752
$$ plain form
41784 -8806099 -6841639 -5557264 -5488233 -5261068 -3765181 -2268619 -2501699 -3576748 -3170222
41775 -3170222 -1342618 -611209 -2042594 -3802904 -4319974 -4524103 -5667378 -6890012 -6662926
41766 -6662926 -5280527 -4120898 -3307790 -1897712 40127 1223279 1041384 250622 -424247
41757 -424247 -1168235 -2107998 -2485781 -1615029 -179416 262018 -884718 -2450710 -2841668
41748 -2841668 -1916012 -1112148 -1654107 -3010998 -3451174 -1988028 492835 2012195 1322187
41739 1322187 -834692 -2209627 -1196782 1288426 2611760 1465850 -554308 -1030572
41731 -1030572 399412 2240343 3476586 4180317 4095359 2470083 -279003 -2317010 -2555682
41722 -2555682 -1854699 -1372335 -980607 -228763 332218 30651 -596277 -644015 -372634 -621767
$$ packed form
41784h806099J964460J284375O9031K27165J495887J496562k33080j075049M06526
41775c170222J827604P31409j431385j760310n17070k04129j143275j222634K27086
41766f662926J382399J159629Q13108J410078J937839J183152j81895p90762o74869
41757d24247p43988r39763l77783Q70752J435613M41434j146736j565992l90958
41748b841668R25656Q03864n41959j356891m40176J463146K480863J519360o90008
41739A322187k156879j374935J012845K485208J323334j145910k020158m76264
41731a030572J429984J840931J236243P03731q4958j625276k749086k038007k38672
41722b555682P00983M82364L91728P51844N60981l01567o26928m7738K71381k49133
$$ plain form
41712 -621767 -1215471 -1337206 -1213007 -1945585 -3546284 -4446764 -3446210 -1221632 633565
41703 633565 1426811 1644238 1748975 1315070 -387565 -3061390 -5125588 -5352161 -4513642
41694 -4513642 -4439512 -5374831 -5599752 -4230444 -2876806 -3267726 -4565644 -4861587 -4392135
41685 -4392135 -5004893 -6785637 -7687229 -6818186 -5720046 -5555503 -5283743 -4019421 -3258039
41676 -3258039 -4781397 -7580537 -8963059 -8145583 -6821423 -6347614 -6174765 -5315748 -3862549
41667 -3862549 -2478741 -1438445 -758817 -573442 -867818 -1302052 -1620825 -1898526 -2268509
41658 -2268509 -2822652 -3815016 -5442332 -7299881 -8529808 -8650625 -7879391 -6688703 -5584337
41649 -5584337 -5250546 -6110976 -7518118 -8127327 -7458557 -6434999 -5974261 -5808934 -5363200
$$ packed form
41712f21767n93704j21735J24199p32578j600699r00480J000554K224578J855197
41703F33565P93246K17427J04737m33905j702635k673825k064198k26573Q38519
41694d513642P4130r35319k24921J369308J353638l90920j297918k95943M69452
41685d392135o12758j780744r01592Q69043J098140J64543K71760J264322P61382
41676c258039j523358k799140j382522Q17476J324160M73809J72849Q59017J453199
41667c862549J383808J040296O79628J85375k94376m34234l18773k77701l69983
41658b268509n54143r92364j627316j857549j229927j20817P71234J190688J104366
41649e584337L33791q60430j407142o09209O68770J023558M60738J65327M45734
$$ plain form
41640 -5363200 -5059515 -5689350 -6827820 -7056263 -5863756 -4327603 -3624795 -3760396 -4142517
41631 -4142517 -4443878 -4200475 -2498552 729714 3591486 3884576 2011744 938679 2682438
41622 2682438 5877729 7599026 6716626 4415258 2066732 13196 -1623719 -2364238
41614 -2364238 -2158655 -1803082 -1886031 -1942944 -1310495 -324746 63748 -422726 -1203472 -1779690
41604 -1779690 -2126326 -2182667 -1796823 -1448407 -2196700 -4221892 -5975840 -5800497 -4302684
41595 -4302684 -3961875 -5873656 -7915596 -7255881 -4108934 -1513293 -1341537 -2154400 -1741720
41586 -1741720 -292251 401553 -94133 -551557 -436621 -634017 -1491513 -1901933 -1163497
41577 -1163497 -334515 -619442 -1470147 -1543280 -777503 -170367 37373 525066 1313352 1334563
$$ packed form
41640e363200L03685o29835j138470k28443J192507J536153P02808j35601l82121
41631d142517l01361K43403J701923L228266K861772K93090j872832j073065J743759
41622B682438L195291J721297q82400k301368k348526k053536j636915p40519
41614b364238K05583L55573q2949n6913O32449R85749L88494m86474p80746n76218
41604a779690l46636n6341L85844L48416p48293k025192j753948J75343J497813
41595d302684L40809j911781k041940O59715L146947K595641J71756q12863M12680
41586a741720J449469O93804m95686m57424J14936j97396q57496m10420P38436
41577a163497Q28982k84927q50705p3133P65777O07136K07740M87693P88286K1211
$$ plain form
41567 1334563 -103742 -2323368 -4030482 -4387133 -3224403 -1026112 982131 1490204
41559 1490204 410355 -864032 -924143 190419 1267299 1372444 705143 153234 263294
41550 263294 687233 632131 -160369 -1090767 -1503374 -1522624 -1786220 -2651190 -4089815 -6013956
41540 -6013956 -8037275 -9181700 -8721992 -7353196 -6641240 -7116641 -7747957 -7581175 -6969253
41531 -6969253 -6612373 -6230683 -5096854 -3432801 -2339595 -2400862 -3041546 -3348183 -3087805
41522 -3087805 -2848111 -3403352 -4889440 -6492626 -7202935 -7004141 -6884804 -7428453 -7993455
41513 -7993455 -7808940 -7300232 -7520141 -8618302 -9751954 -10310199 -10295036 -9588555 -7926680
41504 -7926680 -5788473 -4258001 -3587036 -2859836 -1643869 -988774 -1887324 -3511458 -4127283
$$ packed form
41567A334563j438305k219626j707114l56651J162730K198291K008243N08073
41559A490204j079849j274387o0111J114562J076880J05145o67301n51909J10060
41550B63294M23939n5102p92500r30398m12607j9250k63596q64970j438625j924141
41540f013956k023319j144425M59708J368796P11956m75401o31316J66782O11922
41531f969253L56880L81690J133829J664053J093206o1267o40684l06637K60378
41522c087805K39694n55241j486088j603186p10309J98794J19337n43649n65002
41513g993455J84515N08708k19909j098161j133652n58245J5163P06481J661875
41504g926680K138207J530472O70965P27200J215967O55095q98550j624134o15825
$$ plain form
41495 -4127283 -3366656 -2445671 -2324410 -2859064 -3819741 -5437868 -7453849 -8715051 -8485540
41486 -8485540 -7422444 -6572074 -6111296 -5818797 -5976881 -6704467 -7012975 -5912879 -4201168
41477 -4201168 -3669764 -4497402 -4983923 -4213935 -3297479 -3145401 -2703831 -896173 963332
41468 963332 706105 -1282310 -2229274 -643115 1938979 3229791 2619124 751718 -1743253
41459 -1743253 -4075317 -5074556 -4462637 -3666252 -4201063 -5684692 -6490012 -6010919 -5205963
41450 -5205963 -5036761 -5371188 -5506539 -4992154 -3845881 -2621818 -2310324 -3482604 -5366614
41441 -5366614 -6332202 -5503393 -3527564 -1719444 -884764 -1039076 -1825242 -3001564 -4643353
41432 -4643353 -6741597 -8495391 -8578443 -6718120 -4495664 -3635118 -3841760 -3530326 -2536206
$$ packed form
41495d127283P60627R20985J21261n34654r60677j618127k015981j261202K29511
41486h485540J063096Q50370M60778K92499j58084p27586l08508J100096J711711
41477d201168N31404q27638m86521P69988R16456J52078M41570J807658J859505
41468I63332k57227j988415r46964J586159K582094J290812o10667j867406k494971
41459a743253k332064r99239O11919P96385n34811j483629q05320M79093Q04956
41450e205963J69202l34427j35351N14385J146273J224063L11494j172280j884010
41441e366614r65588Q28809J975829J808120Q34680j54312p86166j176322j641789
41432d643353k098244j753794q3052J860323K222456Q60546k06642L11434R94120
$$ plain form
41423 -2536206 -2539438 -4401426 -6666510 -7671511 -7818568 -8381223 -9019544 -8221206 -5894256
41414 -5894256 -3835053 -3417477 -4193535 -5150470 -6048183 -6811008 -6668716 -4955437 -2294265
41405 -2294265 -139684 674081 432761 -57599 -38492 828498 1964315 2031325 371927
41396 371927 -1842474 -2742635 -2092585 -1597010 -2546121 -3984589 -3928492 -1947781 250283
41387 250283 745981 -677152 -2611967 -3567874 -3237176 -2459705 -2117280 -2109881 -1588625 -289450
41377 -289450 744113 259109 -1535289 -3038427 -3169971 -2652676 -3014978 -4725216 -6803740
41368 -6803740 -8012681 -7820813 -6269070 -3639749 -656182 1470269 1856192 853538
41360 853538 -247741 -534390 -212257 29240 -43843 -276646 -800009 -1943833 -3364602
$$ packed form
41423b536206l232j861988k265084j005001j47057n62655o38321P98338K326950
41414e894256K059203M17576p76058r56935q97713p62825J42292J713279K661172
41405b294265K154581Q13765k41320m90360J9107Q66990J135817O7010j659398
41396C71927k214401r00161O50050M95575r49111j438468N6097J980711K198064
41387B50283M95698j423133j934815r55907L30698P77471L42425P399N21256J299175
41377b89450J033563m85004j794398j503138j31544N17295l62302j710238k078524
41368f803740j208941J91868J551743K629321K983567K126451L85923j002654
41360H53538j101279k86649L22133K41497p3083k32803n23363j143824j420769
$$ plain form
41351 -3364602 -3908484 -2844454 -932295 263677 43003 -881669 -1458848 -1444791 -1352614
41342 -1352614 -1634194 -2152543 -2345615 -1869096 -1178287 -1279754 -2548720 -3967125 -4113193
41333 -4113193 -2887886 -1569911 -1037018 -795694 -245657 -59921 -1374507 -3988104 -6308509
41324 -6308509 -7072402 -6461173 -5566887 -5362349 -6100614 -7045535 -6834789 -4851611 -2282071
41315 -2282071 -1032805 -1482999 -2175772 -1984310 -1570234 -2097427 -3452171 -4717308 -5751410
41306 -5751410 -7069127 -8395178 -8647025 -7620877 -6588721 -6581122 -6834434 -5795879 -3351188
41297 -3351188 -1193643 -856592 -1998480 -3013868 -3001340 -2568347 -2630523 -2990890 -2709182
41288 -2709182 -1742791 -1406219 -2727776 -4885342 -6042062 -5564948 -4600761 -4373085 -4764362
$$ packed form
41351c364602n43882J064030J912159J195972k20674r24672n77179J4057R2177
41342a352614k81580n18349j93072M76519O90809j01467j268966j418405j46068
41333d113193J225307J317975N32893K41324N50037J85736j314586k613597k320405
41324f308509p63893O11229Q94286K04538p38265r44921K10746J983178K569540
41315b282071J249266m50194o92773J91462M14076n27193j354744j265137j034102
41306e751410j317717j326051k51847J026148J032156P599k53312J038555K444691
41297c351188K157545L37051j141888j015388J2528M32993o2176l60367K81708
41288b709182R66391L36572j321557k157566j156720M77114R64187K27676l91277
$$ plain form
41279 -4764362 -4963658 -4724714 -4291217 -3642801 -2680703 -1857011 -1718094 -1951983 -1818272
41270 -1818272 -1498893 -1943220 -3175149 -4000422 -3996417 -4504366 -6480796 -8392621 -7936724
41261 -7936724 -5424290 -3592837 -3870670 -4630376 -3884000 -2128900 -1279096 -1874066 -2792622
41252 -2792622 -3096704 -2719337 -1665956 -11101 1296796 1032713 -530908 -1575639 -961212
41243 -961212 409881 941137 189623 -1202625 -2559168 -3366340 -3155229 -2189999 -1799577
41234 -1799577 -2902050 -4387945 -4174524 -2057971 -362586 -1123806 -3491204 -4868642
41226 -4868642 -4184024 -2942701 -3007043 -4388742 -5786390 -6530087 -7036042 -7588520 -7724329
41217 -7724329 -7113200 -6234359 -5624519 -5016643 -3889933 -2496225 -1607037 -1466844 -1761699
$$ packed form
41279d764362j99296K38944M33497O48416R62098Q23692J38917k33889J33711
41270a818272L19379m44327j231929q25273M005n07949j976430j911825M55897
41261g936724K512434J831453k77833p59706P46376J755100Q49804n94970r18556
41252b792622l04082L77367J053381J654855J307897k64083j563621j044731O14427
41243i61212J371093N31256p51514j392248j356543q07172K11111R65230L90422
41234a799577j102473j485895K13421K116553J695385p61220k367398j377438
41226d868642O84618J241323o4342j381699j397648p43697n05955n52478j35809
41217g724329O11129Q78841O09840O07876J126710J393708Q89188J40193k94855
$$ plain form
41208 -1761699 -2462572 -3750652 -5016763 -4977028 -3273742 -1168724 -73534 -78268 -547151
41199 -547151 -1367341 -2577832 -3303422 -2431120 -414382 821511 240611 -953628 -946928
41190 -946928 405698 1691555 1890235 1337242 808050 432439 -181700 -1178960 -2168158
41181 -2168158 -2621514 -2475983 -2417118 -3435500 -5746569 -8146216 -8935969 -7772979 -6198586
41172 -6198586 -5888829 -6704321 -7125062 -6473565 -5809114 -6298784 -7529294 -8189493 -7934156
41163 -7934156 -7589427 -7586739 -7217481 -5828103 -3964756 -2660934 -2036961 -1351495 -277633
41154 -277633 627717 846505 621775 374605 -104091 -1240575 -2612189 -3037077 -2045949
41145 -2045949 -769285 -810311 -2410546 -4260868 -5082794 -4825518 -4217952 -3805528 -3785419
$$ packed form
41208a761699p00873j288080j266111L9735J703286K105018J095190m734m68883
41199e47151q20190j210491p25590Q72302K016738J235893n80900j194239O700
41190i46928J352626J285857J98680n52993n29192l75611o14139r97260r89198
41181b168158m53356J45531N8865j018382k311069k399647p89753J162990J574393
41172f198586L09757q15492m20741O51497O64451m89670j230510o60199K55337
41163g934156L44729K688L69258J389378J863347J303822O23973O85466J073862
41154b77633R05350K18788k24730k47170m78696j136484j371614m24888R91128
41145b045949J276664m1026j600235j850322q21926K57276O07566M12424K0109
$$ plain form
41136 -3785419 -4205027 -4744487 -4680568 -3673032 -2317478 -1320037 -426661 1032852 2685374
41127 2685374 3158837 1798862 -442654 -2158246 -2850065 -2770678 -2091606 -912930 214940
41118 214940 466434 -421582 -1704388 -2144101 -1137473 478118 976244 -466076 -2697525
41109 -2697525 -3864877 -3560895 -2930076 -2786978 -2770166 -2608627 -2978204 -4336877 -5837258
41100 -5837258 -6330330 -5846719 -5238543 -4891715 -4679430 -4742914 -5328046 -6033274 -6095413 -5408121
41090 -5408121 -4617223 -4261794 -4347059 -4658980 -5027254 -5360267 -5701622 -6041510 -5993612 -5231623
41080 -5231623 -4363228 -4428426 -5170941 -5017835 -3491515 -2274323 -2718898 -3686666 -3498725
41071 -3498725 -2766562 -3128802 -4120556 -3904875 -2685797 -2502702 -3444693 -3085358 -604342
$$ packed form
41136c785419m19608n39460O3919J007536J355554R97441Q93376J459513J652522
41127B685374M73463j359975k241516j715592o91819P9387O79072J178676J127870
41118B14940K51494q88016j282806m39713J006628J615591M98126j442320k231449
41109b697525j167352L03982O30819J43098J6812J61539l69577j358673j500381
41100e837258m93072M83611O08176L46828K12285o3484n85132p05228o2139O87292
41090e408121P90898L55429q5265l11921l68274l33013l41355l39888M7898P61989
41080e231623Q68395o5198p42515J53106J526320J217192m44575r67768J87941
41071c498725P32163l62240r91754K15681J219078J83095r41991L59335K481016
$$ plain form
41062 -604342 1363586 562551 -1584517 -2439579 -1953316 -1796781 -2209686 -2174043 -1820524
41053 -1820524 -2210989 -3073966 -2987952 -1854003 -1223149 -1858331 -2650357 -2464370 -1710861
41044 -1710861 -1485190 -2173059 -3483333 -5097618 -6751284 -8116726 -8911566 -8876466 -7741581
41035 -7741581 -5651391 -3452967 -2015423 -1372062 -966119 -464039 152008 881607 1508114
41026 1508114 1567985 1116449 872239 867796 -128452 -2676232 -5059508 -5249669 -3841158
41017 -3841158 -3132746 -3662427 -3863267 -3198842 -3171786 -4492841 -5584573 -5226197 -4761899
41008 -4761899 -5992117 -8268681 -9430847 -8626029 -6551277 -3769248 -613009 1711384
41000 1711384 1768896 -252710 -2591805 -3834868 -3821380 -2924555 -1638618 -757251 -774370
$$ packed form
41062f04342J967928q01035k147068q55062M86263J56535m12905L5643L53519
41053a820524l90465q62977Q6014J133949O30854o35182p92026J85987P53509
41044a710861K25671o87869j310274j614285j653666j365442p94840L5100J134885
41035g741581K090190K198424J437544O43361M05943N02080O16047P29599O26507
41026A508114N9871m51536k44210m443r96248k547780k383276j90161J408511
41017c841158P08412n29681k00840O64425K7056j321055j091732L58376M64298
41008d761899j230218k276564j162166Q04818K074752K782029L156239K324393
41000A711384N7512k021606k339095j243063J3488Q96825J285937Q81367j7119
$$ plain form
40991 -774370 -1088405 -797372 -147181 -101226 -653904 -852881 -432603 -19640 342946 1257678
40981 1257678 2190153 1373554 -1576559 -4409012 -4848267 -3427044 -2466493 -3093394 -4631367
40972 -4631367 -6290009 -7880951 -9033589 -9134697 -8237716 -7026686 -5844354 -4727914
40964 -4727914 -4273308 -5109009 -6280609 -5624449 -2517772 899730 2256841 1826974 1694301
40955 1694301 2640701 3262973 2128940 -462468 -3187948 -5136797 -6022327 -5788399 -4772003
40946 -4772003 -3827233 -3562820 -3633804 -3373970 -2959111 -3216493 -4190327 -4645756 -3495708
40937 -3495708 -1302919 251912 277877 -545047 -1155924 -1414749 -1769435 -2139740 -1978160
40928 -1978160 -1415119 -1439198 -2472866 -3468375 -3238273 -2314828 -2424145 -4006233 -5355158
$$ packed form
40991g74370l14035K91033O50191M5955n52678j98977M20278M12963L62586R14732
40981A257678R32475q16599k950113k832453m39255J421223R60551o26901j537973
40972d631367j658642j590942j152638j01108Q96981J211030J182332J116440
40964d727914M54606q35701j171600O56160L106677L417502J357111m29867j32673
40955A694301R46400O22272j134033k591408k725480j948849q85530K33928J016396
40946d772003R44770K64413p0984K59834M14859k57382r73834m55429J150048
40937c495708K192789J554831K5965q22924o10877k58825l54686l70305J61580
40928a978160N63041k4079j033668r95509K30102R23445j09317j582088j348925
$$ plain form
40919 -5355158 -4875540 -3362971 -2968013 -4220068 -5302362 -4525681 -2451104 -875212 -485714
40910 -485714 -549229 -604306 -1254976 -2939563 -4827861 -5702478 -5559017 -5606239 -6722799 -8477765
40900 -8477765 -9787856 -10121402 -9850317 -9651023 -9721534 -9498691 -8189808 -5778009 -3367477
40891 -3367477 -2126817 -1926273 -1561038 -437309 623582 652622 -17332 -273279 156648
40882 156648 436765 -43861 -839432 -1177346 -939312 -561655 -334762 -204674 -152372 -469332
40872 -469332 -1523796 -3185822 -4536680 -4511706 -3105960 -1595808 -1101676 -1258836 -981954
40863 -981954 -265746 -231716 -1340123 -2657677 -3301311 -3547762 -3802954 -3466665 -1976512
40854 -1976512 -390401 -545046 -2623480 -4704677 -5038207 -3896975 -2786459 -2570485 -2949402
$$ packed form
40919e355158M79618J512569L94958j252055j082294P76681K074577J575892L89498
40910d85714o3515n5077o50670j684587j888298q74617J43461m7222j116560j754966
40900h477765j310091l33546K71085J99294p0511K22843J308883K411799K410532
40891c367477J240660K00544L65235J123729J060891K9040o69954k55947M29927
40882A56648K80117m80626p95571l37914K38034L77657K26893J30088N2302l16960
40872d69332j054464j662026j350858K4974J405746J510152M94132j57160K76882
40863i81954P16208L4030j108407j317554o43634k46451k55192L36289J490153
40854a976512J586111j54645k078434k081197l33530J141232J110516K15974l78917
$$ plain form
40845 -2949402 -3283970 -3274450 -3012244 -2896245 -3462560 -4869443 -6498970 -7418813 -7353473 -6887767
40835 -6887767 -6528458 -5934964 -4564482 -2923847 -2472011 -3981483 -6517489 -8472318 -9153585
40826 -9153585 -8805637 -7595453 -5542253 -3246320 -1585532 -559816 537013 1580248
40818 1580248 1422630 -234340 -1934936 -2296814 -1785554 -1643055 -1896997 -1727759 -1259854
40809 -1259854 -1547025 -2891748 -4400065 -5200049 -5029006 -3699443 -1246092 1221841 2052497
40800 2052497 900889 -876705 -2040438 -2738419 -3545895 -4255472 -4382222 -4174713 -4299894
40791 -4299894 -4852481 -5275741 -5072742 -4253129 -3322385 -3022605 -3707100 -4781260 -5178067
40782 -5178067 -4547252 -3531773 -2826719 -2623977 -3080119 -4406480 -6042376 -6593744 -5327826
$$ packed form
40845b949402l34568R520K62206J15999n66315j406883j629527r19843O5340M65706
40835f887767L59309N93494J370482J640635M51836j509472k536006j954829o81267
40826i153585L47948J210184K053200K295933J660788J025716J096829J043235
40818A580248j57618j656970j700596l61878N11260J42499k53942J69238M67905
40809a259854k87171j344723j508317p99984J71043J329563K453351K467933Q30656
40800B052497j151608j777594j163733o97981q07476p09577j26750K07509j25181
40791d299894n52587m23260K02999Q19613R30744K99780o84495j074160l96807
40782e178067O30815J015479P05054K02742m56142j326361j635896n51368J265918
$$ plain form
40773 -5327826 -3194870 -1719011 -1344481 -1500812 -1802423 -2361625 -3128348 -3656434 -3543882
40764 -3543882 -2701133 -1319571 66736 702094 170961 -1318709 -3376656 -5687667 -7531903
40755 -7531903 -7780288 -6197177 -4366267 -4348457 -6356613 -8446437 -8611053 -6626841 -3774247
40746 -3774247 -1395836 -75161 205914 -336226 -1432024 -2723034 -3832930 -4613944 -5233590
40737 -5233590 -5833782 -6196026 -6015175 -5408014 -4772655 -4230559 -3699853 -3436428 -3811378
40728 -3811378 -4504386 -4737647 -4512697 -4684686 -5408942 -5556592 -4422019 -3051383 -2801124
40719 -2801124 -3289861 -3059105 -1875367 -1033659 -1438228 -2645194 -3972883 -5364206 -6713638
40710 -6713638 -7355081 -6887387 -5844029 -4910175 -3961408 -2499679 -691991 692154 1255564
$$ packed form
40773e327826K132956J475859L74530j56331l01611n59202p66723n28086J12552
40764c543882Q42749J381562J386307O35358n31133j489670k057947k311011j844236
40755g531903k48385J583111J830910J7810k008156k089824j64616J984212K852594
40746c774247K378411J320675K81075n42140j095798j291010j109896p81014o19646
40737e233590o00192l62244J80851O07161O35359N42096N30706K63425l74950
40728c811378o93008k33261K24950j71989p24256j47650J134573J370636K50259
40719b801124m88737K30756J183738Q41708m04569j206966j327689j391323j349432
40710f713638o41443M67694J043358R33854R48767J461729J807688J384145N63410
$$ plain form
40701 1255564 1276307 984333 127717 -1375147 -2721904 -2766581 -1330380 474852 1370450
40692 1370450 920389 -679798 -3007795 -5038029 -5241088 -3241581 -901764 -384128 -1382148
40683 -1382148 -1838233 -1283701 -1390761 -2748447 -3449252 -2227527 -906310 -1699621 -3667005
40674 -3667005 -4289100 -3557664 -3801111 -5748868 -7403299 -7143191 -5674055 -4296435 -3244492
40665 -3244492 -2531014 -2635046 -3350367 -3469373 -2682386 -2461279 -3859836 -5535737 -5320839
40656 -5320839 -3102248 -891878 -348816 -1261352 -2380213 -2891778 -2816967 -2330644 -1109838
40647 -1109838 1186825 3656266 4210294 1879544 -1450385 -2945262 -2291296 -1766534 -2794750
40638 -2794750 -4178181 -4330233 -3596194 -3316860 -3837748 -4554959 -5005631 -4945967 -4196157
$$ packed form
40701A255564K0743k91974q56616j502864j346757m4677J436201J805232Q95598
40692A370450m50061j600187k327997k030234k03059J999507K339817N17636r98020
40683a382148m56085N54532j07060j357686p00805J221725J321217p93311j967384
40674c667005o22095P31436k43447j947757j654431K60108J469136J377620J051943
40665c244492P13478j04032p15321j19006P86987K21107j398557j675901K14898
40656e320839K218591K210370N43062r12536j118861n11565P4811M86323J220806
40647a109838K296663K469441N54028k330750l329929j494877O53966N24762j028216
40638b794750j383431j52052P34039K79334n20888p17211m50672N9664P49810
$$ plain form
40629 -4196157 -3288088 -3412913 -4852042 -6289379 -6490877 -5735746 -4738481 -3279880 -1103759
40620 -1103759 792092 1163621 211124 -928292 -1731754 -2159848 -1734705 -192295 1448400
40611 1448400 1885780 1243291 486484 -373724 -1962673 -3728343 -4123547 -2729060 -831750
40602 -831750 279254 440408 14610 -649694 -1106077 -1255665 -1841448 -3357058 -4691116
40593 -4691116 -4310425 -2701642 -1975368 -2894504 -4070883 -4528128 -5164210 -6753192 -8168661
40584 -8168661 -7904119 -6217761 -4544568 -3667593 -3560466 -4202516 -5419118 -6561152 -7318174
40575 -7318174 -8174730 -9167371 -9105408 -7256963 -4995926 -4240598 -4751121 -4614570 -3189039
40566 -3189039 -1798499 -1335486 -1008162 -244636 -282394 -2489964 -5892178 -7771666 -6691019
$$ packed form
40629d196157R08069j24825j439129j437337k01498P55131R97265J458601K176121
40620a103759J895851L71529r52497j139416q03462m28094M25143J542410J640695
40611A448400M37380o42489p56807q60208j588949j765670l95204J394487J897310
40602h31750J111004J61154m25798o64304m56383j49588n85783j515610j334058
40593d691116L80691J608783P26274r19136j176379m57245o36082j588982j415469
40584h168661K64542J686358J673193Q76975J07127o42050j216602j142034p57022
40575g318174q56556r92641O1963J848445K261037P55328n10523J36551J425531
40566c189039J390540M63013L27324P63526l7758k207570l402214j879488J080647
$$ plain form
40557 -6691019 -4031285 -2433046 -3259808 -5631320 -7489520 -7506271 -6211079 -5283584 -5635557
40548 -5635557 -6439805 -6344797 -5295868 -4498718 -4669108 -5132609 -4964319 -4327884 -4093482
40539 -4093482 -4561944 -5273286 -5896333 -6565592 -7232343 -7298458 -6224742 -4222557 -2136000
40530 -2136000 -781583 -407627 -592600 -740059 -903994 -1893145 -4128912 -6674839 -8076383
40521 -8076383 -7998868 -7222716 -6155532 -4480958 -2459134 -1305037 -1664271 -2761586 -3736465
40512 -3736465 -4755822 -5966312 -6480119 -5612375 -4224248 -3483452 -3035849 -1890488 -490244
40503 -490244 -201114 -1110981 -2122940 -3055616 -4690662 -6603636 -7073453 -5840297 -5039423
40494 -5039423 -6316441 -8572271 -9766008 -9578065 -8899421 -7857152 -6052444 -4127336
$$ packed form
40557f691019K659734J598239q26762k371512j858200j6751J295192R27495l51973
40548e635557q04248R5008J048929P97150j70390m63501J68290O36435K34402
40539d093482m68462p11342o23047o69259o66751o6115J073716K002185K086557
40530b136000J354417L73956j84973j47459j63935r89151k235767k545927j401544
40521h076383P7515P76152J067184J674574K021824J154097l59234j097315r74879
40512c736465j019357j210490n13807Q67744J388127P40796M47603J145361J400244
40503d90244K89130r09867j011959r32676j635046j912974m69817J233156Q00874
40494e039423j277018k255830j193737J87943O78644J042269J804708J925108
$$ plain form
40486 -4127336 -3417806 -4120148 -5011598 -4981641 -3928977 -2302291 -712955 61928 -381438
40477 -381438 -1430671 -2048056 -2025990 -2013852 -2328743 -2462517 -1911526 -905342 -78089 217737
40467 217737 105581 -91151 -265642 -751672 -1981402 -3838613 -5668091 -7031989 -7943474
40458 -7943474 -8157751 -7038444 -4741514 -2784105 -2480196 -3271672 -3602583 -3048612 -2395137
40449 -2395137 -1854149 -698448 1058209 2022721 1166989 -843247 -2842279 -4728278 -6799966
40440 -6799966 -8267212 -7800214 -5475988 -3022205 -1880273 -1876298 -2089397 -2192485 -2357288
40431 -2357288 -2426998 -1981224 -1105885 -496697 -715540 -1712242 -3122893 -4676128 -6169614
40422 -6169614 -7328666 -7907690 -7855283 -7324053 -6615437 -6074025 -5819739 -5570749 -4960609
$$ packed form
40486d127336P09530p02342q91450K9957J052664J626686J589336P74883m43366
40477c81438j049233o17385K2066J2138l14891j33774N50991J006184Q27253K95826
40467B17737j12156j96732j74491m86030j229730j857211j829478j363898r11485
40458g943474k14277J119307K296930J957409L03909p91476l30911N53971O53475
40449b395137N40988J155701J756657R64512q55732k010236j999032j885999k071688
40440f799966j467246M66998K324226K453783J141932L975k13099j03088j64803
40431b357288o9710M45774Q75339O09188k18843r96702j410651j553235j493486
40422f169614j159052n79024N2407N31230P08616N41412K54286K48990O10140
$$ plain form
40413 -4960609 -4061260 -3363575 -3229835 -3604738 -4194626 -4574216 -4241645 -3165937 -2283672
40404 -2283672 -2691580 -4144940 -5179882 -5063102 -4655700 -4754336 -4692480 -3701934 -2760455
40395 -2760455 -3525249 -5766188 -7403181 -7180185 -6019285 -5538688 -6368080 -8121949 -9912889
40386 -9912889 -10603140 -9576252 -7572901 -5902642 -4781963 -3525171 -2332474 -2391406 -3886996
40377 -3886996 -5433847 -6014963 -5979976 -5520031 -3904524 -1279357 467920 113681 -991747
40368 -991747 -1018287 -458838 -1008478 -2574895 -3468457 -3143901 -2783896 -3202770 -3893977 -4312686
40358 -4312686 -4642860 -5065751 -5460068 -5935143 -6554722 -6553688 -5042582 -2575823 -866411
40349 -866411 -788116 -1650290 -2469446 -2917302 -3002061 -2876961 -3015495 -3623480 -3986376 -3388909
$$ packed form
40413d960609Q99349O97685J33740l74903n89888l79590L32571J075708Q82265
40404b283672m07908j453360j034942J16780M07402r8636O1856R90546R41479
40395b760455p64794k240939j636993K22996J160900M80597q29392j753869j790940
40386i912889o90251J026888K003351J670259J120679J256792J192697n8932j495590
40377c886996j546851n81116L4987M59945J615507K625167J747277l54239j105428
40368i91747k6540N59449n49640j566417q93562L24556L60005m18874o91207m18709
40358d312686l30174m22891l94317m75075o19579J034J511106K466759J709412
40349h66411P8295q62174q19156m47856q4759J25100j38534o07985l62896N97467
$$ plain form
40339 -3388909 -2377565 -1914885 -1707540 -913214 -107092 -562957 -1682041 -1471619 -351
40330 -351 79584 -2510075 -5454556 -6078111 -4877623 -4064526 -4217369 -4469922 -4834127 -6028922
40320 -6028922 -7542247 -7968104 -7145825 -6230224 -5713185 -4993592 -3914837 -3130722 -2734135
40311 -2734135 -1989349 -795468 -115888 -483591 -1209530 -1579461 -1803551 -2197375 -2352949
40302 -2352949 -1834853 -992588 -375612 114309 816013 1502302 1683422 1451596 1365154 1589647
40292 1589647 1715705 1459373 1105707 1133821 1659962 2343090 2676380 2333721 1392374 297800
40282 297800 -471097 -775551 -875770 -1163304 -1865600 -2922213 -4016260 -4756331 -5008715
40273 -5008715 -5094652 -5436137 -5849345 -5447691 -3630955 -1068816 786721 1232625 848986
$$ packed form
40339c388909J011344M62680K07345P94326Q06122m55865j119084K10422J471268
40330c51P9935k589659k944481o23555J200488Q13097j52843k52553l64205j194795
40320f028922j513325m25857Q22279R15601N17039P19593J078755P84115L96587
40311b734135P44786J193881O79580l67703p25939l69931k24090l93824j55574
40302b352949N18096Q42265O16976M89921P01704O86289J81120k31826q6442K24493
40292A589647J26058k56332l53666K8114N26141O83128L33290l42659r41347j094574
40282B97800p68897l04454j00219k87534p02296j056613j094047p40071k52384
40273e008715q5937l41485m13208M01654J816736K562139J855537M45904l83639
$$ plain form
40264 848986 371291 -252244 -1160355 -1600459 -629710 1345408 2643398 2120792 301874
40255 301874 -1439439 -2224684 -1994610 -1066704 230894 1685719 3069021 3737610 2716468
40246 2716468 -130762 -3158068 -4141612 -2743205 -1005455 -999651 -2656764 -4327091 -4717930
40237 -4717930 -3627374 -1415665 1310505 3652237 4785224 4484615 3073472 1108785
40229 1108785 -619326 -1270087 -757389 -138983 -570512 -1911064 -2884511 -2643712 -1693517
40220 -1693517 -1113781 -1240722 -1416510 -924830 138479 1080543 1493930 1533709 1316594
40211 1316594 641943 -347356 -857312 -483521 -51132 -483441 -1201172 -837254 564608
40202 564608 1409161 796779 -482791 -1687282 -3421016 -6246912 -9109156 -10326457 -9536371
$$ packed form
40264H48986m77695o23535r08111m40104R70749J975118J297990n22606j818918
40255C01874j741313p85245K30074R27906J297598J454825J383302O68589j021142
40246B716468k847230l027306r83544J398407J737750N804j657113j670327l90839
40237d717930J090556K211709K726170K341732J132987l00609j411143j964687
40229A108785j728111o50761N12698O18406m31529j340552r73447K40799R50195
40220a693517N79736j26941j75788M91680J063309R42064M13387L9779k17115
40211A316594o74651r89299n09956L73791M32389m32309p17731L63918J401862
40202E64608Q44553o12382j279570j204491j733734k825896k862244j217301P90086
$$ plain form
40193 -9536371 -7698120 -5731595 -4064347 -2997038 -2538280 -2183022 -1635746 -1416132 -2041442
40184 -2041442 -3014929 -3384455 -2966085 -2308648 -1768950 -1271030 -668926 173993 1236766
40175 1236766 1835661 968004 -1212081 -3030625 -3215225 -2467749 -2271964 -2916778 -3718755
40166 -3718755 -4430906 -5196129 -5689828 -5572731 -5344978 -5571545 -5745593 -5113438 -4084892
40157 -4084892 -3554886 -3414496 -3105583 -2967102 -3424485 -3569561 -2539794 -1753656 -3375666
40148 -3375666 -6646431 -8282910 -6972023 -5073510 -5087770 -6658792 -8076983 -8625800 -8138737
40139 -8138737 -6149119 -3088594 -881498 -823573 -2036355 -3231718 -4537220 -6087040
40131 -6087040 -6374362 -4138153 -946725 303214 -902508 -2396074 -2552074 -1973314 -1827875
$$ packed form
40193i536371J838251J966525J667248J067309M58758L55258N47276K19614o25310
40184b041442r73487l69526M18370O57437N39698M97920O02104Q42919J062773
40175A236766N98895q67657k180085j818544j84600P47476J95785o44814q01977
40166c718755p12151p65223m93699J17097K27753k26567j74048O32155J028546
40157d084892N30006J40390L08913J38481m57383j45076J029767P86138j622010
40148c375666l270765j636479J310887J898513j4260j571022j418191n48817M87063
40139h138737J989618L060525K207096N7925j212782j195363j305502j549820
40131f087040k87322K236209L191428J249939j205722j493566j56000N78760J45439
$$ plain form
40122 -1827875 -2167827 -2424801 -2447588 -2545855 -3176021 -4712088 -6858076 -8349349 -8050600
40113 -8050600 -6356603 -4725490 -3852796 -3173825 -2239140 -1621797 -2053098 -3329557 -4574943
40104 -4574943 -5242590 -5478169 -5647782 -5775182 -5490856 -4534052 -3264092 -2493028 -2725880
40095 -2725880 -3687405 -4576682 -4605807 -3459225 -1629153 -156893 451599 823796 1576177
40086 1576177 1987018 999128 -649738 -935766 473198 1465040 505145 -1245320 -2019744
40077 -2019744 -2107351 -2790736 -3837772 -4012014 -3395127 -3238542 -3767652 -3921322 -3252310
40068 -3252310 -2501445 -2212936 -2228116 -2647737 -3864814 -5422803 -6174965 -5877220 -5417897
40059 -5417897 -5202133 -4555771 -3145064 -1831920 -1555515 -2243169 -3266239 -4168254 -4588766
$$ packed form
40122a827875l39952k56974k2787r8267o30166j536067k145988j491273K98749
40113h050600J693997J631113Q72694O78971R34685O17343m31301j276459j245386
40104d574943o67647k35579j69613j27400K84326R56804J269960P71064k32852
40095b725880r61525q89277k9125J146582J830072J472260O08492L72197P52381
40086A576177M10841r87890j648866k86028J408964R91842r59895j750465p74424
40077b019744q7607o83385j047036j74242O16887J56585n29110j53670O69012
40068c252310P50865K88509j5180m19621j217077j557989p52162K97745M59323
40059e417897K15764O46362J410707J313144K76405o87654j023070r02015m20512
$$ plain form
40050 -4588766 -4267340 -3487450 -2859263 -2499857 -2135815 -1966589 -2397865 -2874040 -2272685
40041 -2272685 -846546 -467107 -2186802 -4622440 -5694793 -5198677 -4631177 -4926972 -5415241
40032 -5415241 -5066964 -4017456 -3367319 -3574202 -3590041 -2248198 -320050 77166 -1349201
40023 -1349201 -2025097 -38008 2678895 2882949 808762 -401343 218383 254694 -1483397
40014 -1483397 -2529863 -747569 2042767 2871578 1969337 1614592 2190909 2291581 1811514
40005 1811514 2030660 2992065 3468527 3461520 4225233 5695751 6383882 6219286 7044180 9456067
39995 9456067 11335257 10614851 7756211 4452614 1585542 -405173 -843861 -18651 301103
39986 301103 -869452 -2057683 -1549281 -258995 -430057 -2040489 -2668585 -1092813 901336
$$ packed form
40050d588766L21426P79890O28187L59406L64042J69226m31276m76175O01355
40041b272685J426139L79439j719695k435638j072353M96116N67500k95795m88269
40032e415241L48277J049508O50137k06883j5839J341843J928148L97216j426367
40023a349201o75896J987089K716903K04054k074187j210105O19726L6311j738091
40014a483397j046466J782294K790336Q28811r02241l54745N76317J00672m80067
40005A811514K19146R61405M76462p007P63713J470518O88131j64596Q24894K411887
39995I456067J879190p20406k858640l303597k867072j990715m38688Q25210L19754
39986C01103j170555j188231N08402J290286j71062j610432o28096J575772J994149
$$ plain form
39977 901336 1079475 -218850 -682389 933321 3264870 3832407 1691838 -1540447 -3375273
39968 -3375273 -3081697 -2174223 -2100412 -2241562 -1022967 1579647 3890973 4804246 4921044
39959 4921044 5125642 5226246 4711684 3946444 3696998 3984592 4245228 4312493 4509026 4993208
39949 4993208 5649386 6360176 6767824 6184449 4629544 3594619 4542802 6679147 7615742
39940 7615742 6617517 5715191 6748583 8696658 9357434 8680401 8617385 10080219 11975311
39931 11975311 13406190 14979661 17262355 19515276 20945832 21984998 23259517 24398324
39923 24398324 25094481 26363813 29200399 32637206 34885296 36175387 38693804 43474421
39915 43474421 48978492 53330844 56588013 59972436 63928659 67917863 71536286 75069601
$$ packed form
39977I01336J78139j298325m63539J615710K331549N67537k140569l232285j834826
39968c375273K93576R07474P3811j41150J218595K602614K311326R13273J16798
39959D921044K04598J00604n14562p65240k49446K87594K60636O7265J96533M84182
39949D993208O56178P10790M07648n83375j554905j034925R48183K136345R36595
39940G615742r98225r02326J033392J948075O60776o77033o3016J462834J895092
39931A1975311J430879J573471K282694K252921J430556J039166J274519J138807
39923B4398324O96157J269332K836586L436807K248090J290091K518417M780617
39915D3474421N504071M352352L257169L384423L956223L989204L618423L533315
$$ plain form
39907 75069601 79292706 85068642 92574389 100684962 107939456 114394633 121497769 129854676
39899 129854676 138722545 148621907 162751800 184269181 213686640 250708745 296038217
39892 296038217 346540309 388524755 401674593 374681492 316526059 249838369 193400430
39885 193400430 152273297 122485177 100305131 85064071 75982764 70027310 63706342
39878 63706342 55864172 48096330 42566611 39516744 36992329 33135936 28404958 24886511
39870 24886511 23546943 23080156 21753503 19484669 17446371 16310246 15785559 15541628
39862 15541628 15557981 15456555 14381670 12059998 9507760 8097062 8051700 8361462 8198566
39853 8198566 7894032 8238503 9259269 10218800 10592130 10395628 9619604 8142958 6411206
$$ packed form
39907G5069601M223105N775936P505747Q110573P254494O455177P103136Q356907
39899A29854676Q867869R899362J4129893K1517381K9417459L7022105M5329472
39892B96038217N0502092M1984446J3149838k6993101n8155433o6687690n6437939
39885A93400430m1127133k9788120k2180046j5241060r081307n955454o320968
39878F3706342p842170p767842n529719l049867k524415l856393m730978l518447
39870B4886511j339568m66787j326653k268834k038298j136125n24687k43931
39862A5541628J6353j01426j074885k321672k552238j410698m5362L09762j62896
39853H198566l04534L44471J020766R59531L73330j96502p76024j476646j731752
$$ plain form
39844 6411206 5370298 5300878 5502046 5635790 6400556 7983254 8865156 7616593 5245906
39835 5245906 4084630 4630030 5296408 5243717 5370431 6046652 6019855 4665309 3507306
39826 3507306 4100686 5848454 7333555 8390945 9208031 8754951 6264646 3392310 2609913
39817 2609913 3849011 4906902 4962203 5370857 6775039 7752104 7133832 5785216 5064787
39808 5064787 4978617 4881418 4836876 5269596 6090415 6927306 7526611 7469813 6354302 4663048
39798 4663048 3489134 2991987 2199010 789154 -131425 341689 1695286 3142313 4778240
39789 4778240 6668519 7890209 7644104 6599151 6136220 6793303 8118722 9326251 9499728
39780 9499728 8099395 5980228 4900195 5253344 5397117 4070430 2218612 1365404 1490813
$$ packed form
39844F411206j040908o9420K01168J33744P64766J582698Q81902j248563k370687
39835E245906j161276N45400O66378n2691J26714O76221k6797j354546j158003
39826C507306N93380J747768J485101J057390Q17086m53080k490305k872336p82397
39817B609913J239098J057891N5301M08654J404182R77065o18272j348616p20429
39808E064787q6170r7199m4542M32720Q20819Q36891N99305n6798j115511j691254
39798D663048j173914m97147p92977j409856r20579M73114J353597J447027J635927
39789D778240J890279J221690k46105j044953m62931O57083J325419J207529J73477
39780I499728j400333k119167j080033L53149J43773j326687j851818q53208J25409
$$ plain form
39771 1490813 1799709 2249826 2752311 2133052 -214861 -2623035 -3043588 -1854467 -860220
39762 -860220 -379276 477441 1405653 1326873 777906 1221047 2111285 1431489 -679991 -1731722
39752 -1731722 -852465 -19025 -347093 -113600 1971639 4214223 4648005 4000145 3705672
39743 3705672 2988348 563379 -2238594 -2906024 -1490927 -232051 125898 992569 2886472
39734 2886472 4240608 3865812 2628739 1839095 1440241 666376 -522659 -1388204 -1173975
39725 -1173975 374573 2621363 4130351 3918567 2595706 1434904 521110 -1022786
39717 -1022786 -3079916 -4307408 -4211457 -4037300 -4908890 -6265107 -6947405 -6806025 -6328279
39708 -6328279 -5623329 -4851733 -4846395 -5973285 -6864736 -5774399 -3163858 -1526253 -2266632
$$ packed form
39771A490813L08896M50117N02485o19259k347913k408174m20553J189121R94247
39762h60220M80944Q56717R28212p8780n48967M43141Q90238o79796k111480j051731
39752a731722Q79257Q33440l28068K33493K085239K242584M33782o47860k94473
39743C705672p17324k424969k801973o67430J415097J258876L57949Q66671J893903
39734B886472J354136l74796j237073p89644l98854p73865j189035q65545K14229
39725a173975J548548K246790J508988k11784j322861j160802r13794j543896
39717a022786k057130j227492R5951J74157q71590j356217o82298J41380M77746
39708f328279P04950P71596N338j126890q91451J090337K610541J637605p40379
$$ plain form
39699 -2266632 -3971911 -4442699 -3441492 -2466139 -2475977 -3035011 -3491590 -3781811 -3830399 -3249181
39689 -3249181 -2240716 -1971667 -3198430 -5015409 -5839533 -5323045 -4393270 -3646021 -2832571
39680 -2832571 -2023387 -2078651 -3423667 -5242208 -6489352 -6960674 -6757980 -5547330 -3311563
39671 -3311563 -1246669 -727695 -1521596 -2055667 -1512400 -717443 -720092 -1357391 -1715689 -1411673
39661 -1411673 -813106 -336581 -199793 -813884 -2663478 -5290750 -6834903 -5565989 -2221623
39652 -2221623 22891 -1171204 -4456562 -6313504 -5301080 -3474964 -3235428 -4198061
39644 -4198061 -4193221 -2329064 267257 2239315 3246006 3565588 3530591 3426522 3232499
39635 3232499 2524110 1205696 29314 -302705 -130410 -89384 114824 1032970 1973235
$$ packed form
39699b266632j705279m70788J001207R75353r838n59034m56579k90221m8588N81218
39689c249181J008465K69049j226763j816979q24124N16488R29775P47249Q13450
39680b832571Q09184n5264j345016j818541j247144m71322K02694J210650K235767
39671c311563K064894N18974p93901n34071N43267P94957k649o37299l58298L04016
39661a411673N98567M76525J36788o14091j849594k627272j544153J268914L344366
39652b221623K244514j194095l285358j856942J012424J826116K39536r62633
39644d198061M840J864157K596321J972058J006691L19582l4997j04069j94023
39635C232499p08389j318414j176382l32019J72295M1026K04208R18146R40265
$$ plain form
39626 1973235 1649074 318612 -224053 843350 2168917 2025371 183265 -2486373 -5085681
39617 -5085681 -6684403 -6377756 -4347790 -2170002 -1219113 -1291584 -1395165 -1187236 -925468
39608 -925468 -704188 -567052 -806714 -1393458 -1715168 -1658806 -2213790 -3996247 -5891340
39599 -5891340 -6477596 -6303229 -7163103 -9184453 -10296339 -9077670 -6734511 -5394415 -5408827
39590 -5408827 -5332347 -4025807 -1846439 41731 795782 349097 -711225 -1594309 -1876611
39581 -1876611 -1667409 -1193316 -517743 114571 50515 -1094573 -2612587 -3119858 -1998184
39572 -1998184 -63195 1438019 2208949 2956812 4229358 5610350 6146384 5290238 3285940
39563 3285940 805841 -1657715 -4125055 -6825332 -9351213 -10289514 -8388153 -4387762
$$ packed form
39626A973235l24161j330462n42665J067403J325567j43546j842106k669638k599308
39617e085681j598722L06647K029966K177788R50889p2471j03581K07929K61768
39608i25468K21280J37136k39662n86744l21710N6362n54984j782457j895093
39599e891340n86256J74367q59874k021350j111886J218669K343159J340096j4412
39590e408827P6480J306540K179368J888170P54051m46685j060322q83084k82302
39581a876611K09202M74093O75573O32314o4056j145088j518014n07271J121674
39572a998184J934989J501214P70930P47863J272546J380992N36034q56146k004298
39563C285940k480099k463556k467340k700277k525881r38301J901361M000391
$$ plain form
39555 -4387762 -985159 -245222 -1459540 -2388798 -2254082 -2307839 -3437624 -4630078 -4486042
39546 -4486042 -3143559 -1724130 -711053 -56326 -283181 -1965114 -4150341 -4814062 -3418335
39537 -3418335 -1880804 -2217242 -4059595 -5432961 -5367877 -4577709 -3791204 -2781249 -1479654
39528 -1479654 -924960 -2097825 -4302756 -5752458 -5711402 -5109461 -4814862 -4268348 -2533547
39519 -2533547 -102608 1271132 473854 -1878575 -4258145 -5617302 -5945313 -5898635 -5972424
39510 -5972424 -5822675 -4618364 -2392479 -579974 -472712 -1475555 -1893369 -1316492 -1049682
39501 -1049682 -2043632 -3659546 -4884581 -5497485 -5388960 -4057012 -1827526 -423937 -931509
39492 -931509 -1986644 -1490797 387474 1496180 744918 -769258 -1810461 -2608298 -3849138
$$ packed form
39555d387762L402603P39937j214318r29258J34716n3757j129785j192454J44036
39546d486042J342483J419429J013077O54727k26855j681933k185227o63721J395727
39537c418335J537531l36438j842353j373366O5084P90168P86505J009955J301595
39528a479654N54694j172865k204931j449702M1056O01941K94599N46514J734801
39519b533547K430939J373740p97278k352429k379570j359157l28011M6678p3789
39510e972424J49749J204311K225885J812505J07262j002843m17814N76877K66810
39501a049682r93950j615914j225035o12904J08525J331948K229486J403589n07572
39492i31509j055135M95847J878271J108706p51262j514176j041203p97837j240840
$$ plain form
39483 -3849138 -5268697 -6032740 -5856964 -5206521 -4797984 -5068758 -5619447 -5227917 -3192445
39474 -3192445 -634805 496082 -211160 -1349055 -1897906 -2322932 -2964946 -2866141 -1366505
39465 -1366505 199325 -195247 -2773722 -5896575 -8046607 -8764569 -8049237 -6227498 -4486389
39456 -4486389 -4319152 -5996364 -8243461 -9613737 -9580363 -8285692 -6104877 -3792538 -2325404
39447 -2325404 -2043457 -2284400 -2222750 -1801546 -1597247 -2074136 -3243266 -4775036 -6079027
39438 -6079027 -6372201 -5038794 -2140125 1422836 4367224 5837637 5861511 4965252 3462063
39429 3462063 1446375 -559400 -1611471 -1401588 -804322 -785143 -1125805 -921034 -70700
39420 -70700 562810 411443 -283556 -1320893 -2917430 -4794480 -5777589 -5112263 -3667900
$$ packed form
39483c849138j419559p64043J75776O50443M08537k70774n50689L91530K035472
39474c192445K557640J130887p07242j137895n48851m25026o42014R8805J499636
39465a366505J565830l94572k578475l122853k150032p17962P15332J821739J741109
39456d486389J67237j677212k247097j370276L3374J294671K180815K312339J467134
39447b325404K81947k40943O1650M21204K04299m76889j169130j531770j303991
39438f079027k93174J333407K898669L562961K944388J470413K3874q96259j503189
39429C462063k015688k005775j052071K09883N97266J9179l40662K04771Q50334
39420g0700O33510j51367o94999j037337j596537j877050r83109O65326J444363
$$ plain form
39411 -3667900 -2982983 -3367656 -3820080 -3790055 -4056012 -5385972 -7015318 -7289656 -5724334
39402 -5724334 -3700758 -2846949 -3231858 -3629416 -3237470 -2437847 -1853848 -1436459 -924032
39393 -924032 -654594 -1224741 -2492883 -3508322 -3471280 -2388899 -823826 606674 1493844
39384 1493844 1788981 1723251 1315177 142712 -1920307 -3910902 -4455197 -3398877 -2127562
39375 -2127562 -1957235 -2706362 -3206670 -2781795 -1770380 -869736 -458157 -559852 -1160344
39366 -1160344 -2341525 -3972019 -5306476 -5368085 -4160435 -3087516 -3422683 -4620390 -5131302
39357 -5131302 -4788765 -5058902 -6567392 -7817608 -7314808 -5795899 -5019577 -5131375 -4807796
39348 -4807796 -3718741 -3196062 -4124224 -5458589 -5542384 -4178558 -2737951 -2489453 -3222214
$$ packed form
39411c667900O84917l84673m52424L0025k65957j329960j629346k74338J565322
39402e724334K023576Q53809l84909l97558L91946P99623N83999M17389N12427
39393i24032K69438n70147j268142j015439L7042J082381J565073J430500Q87170
39384A493844K95137o5730m08074j172465k063019j990595n44295J056320J271315
39375b127562J70327p49127n00308M24875J011415R00644M11579j01695o00492
39366a160344j181181j630494j334457o1609J207650J072919l35167j197707n10912
39357e131302L42537k70137j508490j250216N02800J518909P76322j11798L23579
39348d807796J089055N22679r28162j334365q3795J363826J440607K48498p32761
$$ plain form
39339 -3222214 -3522648 -2433280 -812359 -575218 -2304448 -4299268 -4658180 -3593932 -2666289
39330 -2666289 -2386334 -2075853 -1804317 -2665558 -4823311 -6935729 -8167226 -9283921 -10864449
39321 -10864449 -11786446 -10723845 -8197353 -5886194 -4560324 -3826267 -3324390 -2970545 -2404620
39312 -2404620 -1380396 -515342 -623149 -1419138 -1794137 -1251563 -235795 787107 1668344
39303 1668344 2097950 1707285 714068 -258971 -1017967 -1827627 -2723928 -3441200 -3854967
39294 -3854967 -3878491 -3257224 -2213720 -1820654 -2695603 -3729679 -3368054 -1873393 -865631
39285 -865631 -727877 -168940 1365115 2582931 2334249 1189621 170334 -753842 -1916682
39276 -1916682 -2937190 -3549786 -4325241 -5345351 -5255871 -3183832 -795668 -667286 -2890259
$$ packed form
39339c222214l00434J089368J620921K37141j729230j994820l58912J064248R27643
39330b666289K79955L10481K71536q61241k157753k112418j231497j116695j580528
39321a0864449r21997J062601K526492K311159J325870P34057N01877L53845N65925
39312b404620J024224Q65054j07807p95989l74999N42574J015768J022902Q81237
39303A668344M29606l90665r93217r73039p58996q09660q96301p17272m13767
39294c854967k3524O21267J043504L93066q74949j034076L61625J494661J007762
39285h65631J37754N58937J534055J217816k48682j144628j019287r24176j162840
39276a916682j020508o12596p75455j020110Q9480K072039K388164J28382k222973
$$ plain form
39267 -2890259 -4951429 -5024220 -3891965 -3318326 -3824275 -4643497 -4915809 -4266730 -2806670
39258 -2806670 -1174976 -356034 -1064684 -3239117 -5995457 -7968393 -8126072 -6748194 -5326762
39249 -5326762 -4991726 -5331278 -5287654 -4719712 -4214892 -3757987 -2792696 -1609701 -1433244
39240 -1433244 -2672564 -4011758 -3865313 -2205351 -460982 27556 -855684 -2036009 -2160120
39231 -2160120 -810742 1008851 1909428 1669472 1322155 1673916 2329832 2381714 1501639
39222 1501639 48177 -1440829 -2475825 -2655174 -1906923 -706707 60753 -428228 -2250717
39213 -2250717 -4286007 -4913058 -3721396 -2157187 -1759926 -2151504 -1781676 -402854 556402
39204 556402 255566 -339413 -143752 336255 -51557 -1248572 -2098581 -1893427 -958951
$$ packed form
39267b890259k061170p2791J132255N73639n05949q19222k72312O49079J460060
39258b806670J631694Q18942p08650k174433k756340j972936j57679J377878J421432
39249e326762L35036l39552M3624N67942N04820M56905R65291J182995J76457
39240a433244j239320j339194J46445J659962J744369M88538q83240j180325j24111
39231b160120J349378J819593R00577k39956l47317L51761O55916N1882q80075
39222A501639j453462j489006j034996j79349P48251J200216P67460m88981j822489
39213b250717k035290o27051J191662J564209L97261l91578L69828J378822R59256
39204E56402l00836n94979J95661M80007l87812j197015q50009K05154R34476
$$ plain form
39195 -958951 40907 698105 910012 795672 398563 -707655 -3024838 -6062158 -8297129
39186 -8297129 -8657361 -7486514 -5695389 -3769727 -2144989 -1527853 -1832607 -1632985 23442
39177 23442 1779685 1395988 -1147242 -3412065 -3564996 -2401660 -1873313 -2692218 -4123566
39168 -4123566 -5426514 -6626346 -7973983 -9143396 -9159528 -7277651 -4092983 -1447191
39160 -1447191 -714578 -1369127 -1846747 -1625410 -1607609 -2425226 -3345379 -3286979 -2220494 -1063421
39150 -1063421 -703095 -1559961 -3563605 -5913676 -7214463 -6636864 -5014421 -4209670 -5127432
39141 -5127432 -6681865 -7038355 -5695881 -3944714 -3267002 -3790544 -4610546 -5075297 -5000820
39132 -5000820 -3960044 -1569410 1247554 2471345 1241516 -929557 -2022432 -1796244
$$ packed form
39195i58951R99858O57198K11907j14340l97109j106218k317183l037320k234971
39186h297129l60232J170847J791125J925662J624738O17136l04754J99622J656427
39177B3442J756243l83697k543230k264823j52931J163336N28347q18905j431348
39168d123566j302948j199832j347637j169413j6132J881877L184668K645792
39160a447191P32613o54549m77620K21337J7801q17617r20153N8400J066485J157073
39150a063421L60326q56866k003644k350071j300787N77599J622443Q04751r17762
39141e127432j554433l56490J342474J751167O77712n23542q20002m64751P4477
39132e000820J040776K390634K816964J223791j229829k171073j092875K26188
$$ plain form
39124 -1796244 -1239473 -629760 340446 981672 -34483 -2566762 -4848715 -5881431 -6518531
39115 -6518531 -7508017 -7907734 -6617102 -4489371 -3532705 -4394865 -5809952 -6462752 -6421662
39106 -6421662 -6507899 -6910215 -6868700 -5637444 -3540697 -1827698 -1309335 -1427987 -1127003
39097 -1127003 -352504 63083 -153738 -433069 -653834 -1537555 -3229076 -4581442 -4690809
39088 -4690809 -4277900 -4562413 -5421639 -5752862 -5268699 -4850751 -5239960 -6268118 -7353100
39079 -7353100 -8007278 -7874898 -6931656 -5680277 -4668123 -3908537 -3204989 -2762786 -2895269
39070 -2895269 -3390004 -3821256 -4241629 -4843762 -5192463 -4685542 -3681077 -3198020 -3384333
39061 -3384333 -3239349 -2198545 -1147340 -1284447 -2525545 -3641854 -3715577 -2961428 -2197199
$$ packed form
39124a796244N56771O09713R70206O41226j016155k532279k281953j032716o37100
39115f518531r89486l99717J290632K127731R56666q62160j415087o52800M1090
39106f421662q6237m02316M1515J231256K096747J712999N18363j18652L00984
39097a127003P74499M15587k16821k79331k20765q83721j691521j352366j09367
39088d690809M12909k84513q59226l31223M84163M17948l89209j028158j084982
39079g353100o54178J32380R43242J251379J012154P59586P03548M42203j32483
39070b895269m94735m31252m20373o02133l48701N06921J004465M83057j86313
39061c384333J44984J040804J051205j37107j241098j116309p3723P54149P64229
$$ plain form
39052 -2197199 -1875355 -1723511 -1214372 -278121 577561 887254 747374 558634 494026 488995
39042 488995 548261 724616 900666 847709 395580 -570235 -1972605 -3232921 -3554882 -2849092
39032 -2849092 -1932753 -1478548 -1344044 -1355295 -1912866 -2982061 -3265686 -1652287 892985
39023 892985 2224416 1729638 859551 817196 1005670 266338 -1329658 -2585524 -2573177
39014 -2573177 -1559717 -844611 -1607641 -3454687 -4436792 -3281959 -1207858 -458205 -1441969
39005 -1441969 -2719208 -3499401 -4298984 -5054698 -4743038 -3549090 -3306931 -4597440 -5277024
38996 -5277024 -3442597 -317432 1541816 1611942 1102801 433024 -775084 -1831095 -1443264
38987 -1443264 -16415 557484 -309620 -1035371 -223126 1519360 2573176 2031243 191458
$$ packed form
39052b197199L21844J51844N09139R36251Q55682L09693j39880j88740o4608n031
39042D88995N9266J76355J76050n2957m52129r65815j402370j260316l21961P05790
39032b849092R16339M54205J34504j1251n57571j069195k83625J613399K545272
39023H92985J331431m94778q70087m2355J88474p39332j595996j255866J2347
39014b573177J013460P15106p63030j847046r82105J154833K074101P49653r83764
39005a441969j277239p80193p99583p55714L11660J193948K42159j290509o79584
38996e277024J834427L125165J859248P0126n09141o69777j208108j056011L87831
38987a443264J426849N73899q67104p25751Q12245J742486J053816n41933j839785
$$ plain form
38978 191458 -1617318 -1616562 822937 3982500 5318475 4302557 2601501 1457410 377843
38969 377843 -1322641 -3252817 -4782703 -5768131 -5850457 -4419357 -1964300 -76708 687169
38960 687169 1506754 2925423 3401995 1703560 -655396 -1310794 -535360 -742656 -2788522
38951 -2788522 -4759578 -4704476 -2960641 -1266209 -779676 -1493272 -2627405 -3089049 -2308809
38942 -2308809 -1087172 -1001277 -2606269 -4754942 -5970765 -5945163 -5382088 -4888813 -4436219
38933 -4436219 -3658735 -2440635 -1316928 -1201569 -2405039 -4100333 -5254617 -5898222 -6784574
38924 -6784574 -7915580 -8325025 -7507477 -6172073 -5173539 -4451050 -3530236 -2422617 -1439569
38915 -1439569 -637933 -34126 120084 -98432 44883 861798 1163788 -673576 -4419584
$$ packed form
38978A91458j808776P56K439499L159563J335975j015918j701056j144091j079567
38969C77843j700484j930176j529886r85428q2326J431100K455057J887592P63877
38960F87169Q19585J418669M76572j698435k358956o55398P75434k07296k045866
38951b788522j971056N5102J743835J694432M86533p13596j134133m61644P80240
38942b308809J221637Q5895j604992k148673j215823K5602N63075M93275M52594
38933d436219P77484J218100J123707J15359j203470j695294j154284o43605q86352
38924f784574j131006m09445Q17548J335404R98534P22489R20814J107619R83048
38915a439569Q01636O03807J54210k18516J43315Q16915L01990j837364l746008
$$ plain form
38906 -4419584 -7614212 -7930938 -5507858 -2654691 -1582368 -2638984 -4433967 -5338841
38898 -5338841 -4935002 -4147485 -3978718 -4305481 -4250644 -3581549 -3084982 -3363973 -3918878 -3903722
38888 -3903722 -3278963 -2560546 -1812146 -737461 377651 787934 505910 443584 934223
38879 934223 1023010 -88520 -1666044 -2409524 -2191543 -1752940 -1133511 182495 1598209
38870 1598209 1456559 -637969 -2802976 -3107551 -1945870 -1171141 -1487024 -1877643 -1449059
38861 -1449059 -732821 -852011 -2001470 -3144696 -3140685 -2108525 -1501338 -2423695 -4004873
38852 -4004873 -4286025 -2881211 -1598312 -1793338 -2398347 -1796491 -518643 -271199 -946843
38843 -946843 -767879 620095 1423381 659265 -207517 284833 1170420 562057 -1553876
$$ packed form
38906d419584l194628l16726K423080K853167J072323j056616j794983r04874
38898e338841M03839P87517J68767l26763N4837O69095M96567k78991n54905J5156
38888c903722O24759P18417P48400J074685J115112M10283k82024o2326M90639
38879I34223Q8787j111530j577524p43480K17981M38603O19429J316006J415714
38870A598209j41650k094528k165007l04575J161681P74729l15883l90619M28584
38861a449059P16238j19190j149459j143226M011J032160O07187r22357j581178
38852d004873k81152J404814J282899j95026o05009O01856J277848K47444o75644
38843i46843J78964J387974Q03286p64116q66782M92350Q85587o08363k115933
$$ plain form
38834 -1553876 -3547464 -4431768 -4508705 -4259548 -3956889 -4068530 -4788012 -5351221 -4975737
38825 -4975737 -4296902 -4641704 -5925262 -6578023 -5788112 -4571452 -4119558 -4168180 -3767283
38816 -3767283 -2902999 -2441166 -2777689 -3344727 -3504027 -3419667 -3794239 -4864677 -5881294
38807 -5881294 -5787827 -4426512 -2770856 -1803253 -1513376 -1291962 -890740 -490767 -167265
38798 -167265 85518 29926 -479398 -1065770 -1428578 -2095151 -3679702 -5573387 -6473267
38789 -6473267 -6261043 -6144780 -6622052 -6591287 -5212157 -3526411 -3147456 -4069123 -4945577
38780 -4945577 -5140251 -5305684 -6001048 -6854725 -7388726 -7798467 -8344512 -8449395 -7104564
38771 -7104564 -4274814 -1466301 -403227 -1038520 -1381560 158836 2593383 3393304 1693672
$$ packed form
38834a553876j993588q84304p6937K49157L02659j11641p19482n63209L75484
38825d975737O78835l44802j283558o52761P89911J216660M51894m8622M00897
38816c767283Q64284M61833l36523n67038j59300Q4360l74572j070438j016617
38807e881294R3467J361315J655656R67603K89877K21414M01222L99973L23502
38798a67265K52783n5592n09324n86372l62808o66573j584551j893685q99880
38789f473267K12224J16263m77272L0765J379130J685746L78955r21667q76454
38780d945577j94674j65433o95364q53677n34001m09741n46045j04883J344831
38771g104564K829750K808513J063074o35293l43040J540396K434547P99921j699632
$$ plain form
38762 1693672 -649761 -1626618 -1545828 -2011581 -3350939 -4453553 -4803076 -5181201 -6147714
38753 -6147714 -7038493 -6973243 -5977113 -4562906 -2938866 -1319465 -536806 -1523317 -4142216
38744 -4142216 -6954194 -8312214 -7708115 -6182388 -5407360 -6135363 -7527401 -8223324 -7929153
38735 -7929153 -7476635 -7390171 -7144648 -6145164 -4757054 -3760030 -3205114 -2523099 -1615130
38726 -1615130 -1143558 -1617865 -2675286 -3458151 -3379034 -2363447 -682790 1137183 2400937
38717 2400937 2603668 1838387 723285 -184393 -869984 -1685054 -2723172 -3516219 -3444940
38708 -3444940 -2378080 -808383 567967 1277480 1182061 442703 -557593 -1462838 -2248079
38699 -2248079 -3143671 -4145634 -4764125 -4492082 -3501408 -2632273 -2536565 -2925161 -2871112 -1918835
$$ packed form
38762A693672k343433r76857Q0790m65753j339358j102614l49523l78125r66513
38753f147714q90779O5250R96130J414207J624040J619401P82659r86511k618899
38744d142216k811978j358020O04099J525727P75028p28003j392038o95923K94171
38735g929153M52518Q6464K45523R99484J388110R97024N54916O82015R07969
38726a615130M71572m74307j057421p82865P9117J015587J680657J819973J263754
38717B400937K02731p65281j115102r07678o85591q15070j038118p93047P1279
38708c444940J066860J569697J376350P09513r5419p39358j000296r05245p85241
38699b248079q95592j001963o18491K72043R90674Q69135R5708l88596N4049R52277
$$ plain form
38689 -1918835 -706762 -293465 -979735 -2105393 -2997364 -3680201 -4435421 -5101652 -5294082
38680 -5294082 -5062428 -4730431 -4140391 -2721198 -516234 1408617 1965985 1126966 -318918
38671 -318918 -1752359 -3067109 -4293071 -5415168 -6525191 -7673668 -8489253 -8373361 -7289508
38662 -7289508 -6059878 -5598131 -5988346 -6534391 -6584083 -6059817 -5295975 -4729196 -4809356 -5803801
38652 -5803801 -7347657 -8381671 -7963415 -6200189 -4090888 -2378091 -868734 942041
38644 942041 2875838 4054393 3845584 2603151 1391897 980243 1066626 614473 -831900
38635 -831900 -2326850 -2518824 -1457746 -661688 -1061865 -1736910 -1464409 -803240 -1394302
38626 -1394302 -3457191 -5378437 -6004941 -6012315 -6380485 -6703028 -6052251 -4719480 -3821136
$$ packed form
38689a918835J212073M13297o86270j125658q91971o82837p55220o66231j92430
38680e294082K31654L31997N90040J419193K204964J924851N57368q39019j445884
38671c18918j433441j314750j225962j122097j110023j148477q15585J15892J083853
38662g289508J229630M61747l90215n46045m9692N24266P63842N66779q0160r94445
38652e803801j543856j034014M18256J763226K109301J712797J509357J810775
38644I42041J933797J178555k08809j242433j211254m11654Q6383m52153j446373
38635h31900j494950j91974J061078P96058m00177o75045K72501O61169n91062
38626a394302k062889j921246o26504p374l68170l22543O50777J332771Q98344
$$ plain form
38617 -3821136 -3478827 -2642178 -871996 737268 925325 -52122 -688007 36328 1583021
38608 1583021 2503853 1902944 183001 -1534388 -2543518 -3023495 -3537362 -4342947 -5226089
38599 -5226089 -5794323 -5898330 -5931937 -6602279 -8070100 -9465082 -9805860 -9339643 -9214899
38590 -9214899 -9715736 -9771006 -8653443 -7166507 -6296150 -5503211 -3551478 -641297 1505636
38581 1505636 1662601 195241 -1857602 -3760694 -4930077 -4781491 -3276752 -1166928
38573 -1166928 577559 1288432 732420 -579644 -1288044 -286712 1843591 3228523 2740498
38564 2740498 1012092 -632547 -1427651 -1255757 -503268 -135073 -921476 -2202527 -2456400
38555 -2456400 -1558205 -1275775 -2772251 -4826588 -5622818 -5254651 -5083475 -5378273 -5139689
$$ packed form
38617c821136L42309Q36649J770182J609264J88057r77447o35885P24335J546693
38608A583021R20832o00909j719943j717389j009130m79977n13867q05585q83142
38599e226089n68234j04007l3607o70342j467821j394982l40778M66217J24744
38590i214899n00837n5270J117563J486936Q70357P92939J951733K910181K146933
38581A505636J56965j467360k052843j903092j169383J48586J504739K109824
38573a166928J744487P10873n56012j312064p08400J001332K130303J384932m88025
38564B740498j728406j644639p95104J71894P52489L68195p86403j281051k53873
38555b456400Q98195K82430j496476k054337p96230L68167J71176k94798K38584
$$ plain form
38546 -5139689 -3902124 -2264330 -774881 404427 821236 46547 -1246656 -1724588 -1075554
38537 -1075554 -188188 390227 952688 1462190 1283513 558208 557659 1939112 3674933 4450025
38527 4450025 4215898 3630433 2878044 1959144 1391722 1569604 1853465 1231562 -351832
38518 -351832 -2022393 -3045666 -3259210 -2777645 -1916823 -1177468 -812987 -709681 -1002699
38509 -1002699 -2131398 -3709443 -4173132 -2588965 -272713 565681 -455209 -1646998
38501 -1646998 -1644485 -926513 -811489 -1885200 -3666363 -5093620 -5178629 -3849489 -2261585
38492 -2261585 -1654890 -1900408 -1838774 -956261 92863 530723 52179 -1537394 -4031725
38483 -4031725 -5999335 -5688243 -3411982 -1785808 -2656472 -4805920 -5760891 -4983619 -3907099
$$ packed form
38546e139689J237565J637794J489449J179308M16809p74689j293203m77932O49034
38537a075554Q87366N78415N62461N09502j78677p25305n49J381453J735821P75092
38527D450025k34127n85465p52389r18900n67422J77882K83861o21903j583394
38518c51832j670561j023273k13544M81565Q60822P39355L64481J03306k93018
38509a002699j128699j578045m63689J584167K316252Q38394j020890j191789
38501a646998K513P17972J15024j073711j781163j427257q5009J329140J587904
38492b261585O06695k45518O1634Q82513J049124M37860m78544j589573k494331
38483d031725j967610L11092K276261J626174q70664k149448r54971P77272J076520
$$ plain form
38474 -3907099 -3361388 -2600500 -1050296 360446 369695 -819950 -1754097 -1656862 -1515550
38465 -1515550 -2827964 -5462802 -7444416 -7249749 -5706527 -4756682 -4741108 -4198817 -2390334
38456 -2390334 -491762 328017 578029 1147144 1566343 974261 -70426 -346208 -25406
38447 -25406 -357193 -1553571 -2613875 -3194560 -3941352 -4708149 -4196348 -2109006 -234591
38438 -234591 -399423 -2342981 -4483654 -5834195 -6218837 -5521367 -3983893 -2763783 -2972960
38429 -2972960 -4296444 -5502529 -6161890 -6864659 -7725687 -7751586 -6182883 -3818681 -2418698
38420 -2418698 -2986292 -4954584 -6875447 -7573735 -6694769 -4563093 -1907676 279090 1076051
38411 1076051 311423 -1126841 -2059464 -2179870 -2122722 -2322824 -2306450 -1463053 -172780
$$ packed form
38474c907099N45711P60888J550204J410742R249j189645r34147R7235J41312
38465a515550j312414k634838j981614J94667J543222R49845J5574N42291J808483
38456b390334J898572Q19779K50012N69115M19199n92082j044687k75782L20802
38447b5406l31787j196378j060304n80685p46792p66797N11801K087342J874415
38438b34591j64832j943558k140673j350541l84642O97470J537474J220110k09177
38429b972960j323484j206085o59361p02769q61028k5899J568703K364202J399983
38420b418698n67594j968292j920863o98288Q78966K131676K655417K186766P96961
38411A076051p64628j438264r32623j20406N7148k00102J6374Q43397J290273
$$ plain form
38402 -172780 373844 -488320 -2087783 -3098626 -2881093 -1973901 -1314926 -1252935 -1505175
38393 -1505175 -1798995 -2067224 -2118865 -1801520 -1595474 -2208990 -3225377 -3129154 -1405950
38384 -1405950 364057 607395 35847 294012 1047095 471937 -1502982 -2759666 -2336533
38375 -2336533 -1996714 -3307691 -5073349 -5295855 -4224533 -3534876 -3422541 -2578741 -756146
38366 -756146 518892 57982 -1473910 -2512044 -2242486 -1149005 -519454 -1355376 -3254029
38357 -3254029 -4603692 -4361777 -3180613 -2230268 -1629252 -914985 -372724 -734345 -1964444
38348 -1964444 -3417050 -4819230 -6080440 -6623823 -6094676 -5302941 -5218358 -5441849 -4956655
38339 -4956655 -3876506 -2927927 -1731974 475432 2649497 2642185 360873 -1846176 -2488878
$$ packed form
38402a72780N46624q62164j599463j010843K17533R07192O58975O1991k52240
38393a505175k93820k68229n1641L17345K06046o13516j016387R6223J723204
38384a405950J770007K43338n71548K58165P53083n75158j974919j256684M23133
38375b336533L39819j310977j765658k22506J071322O89657J12335Q43800J822595
38366g56146J275038m60910j531892j038134K69558J093481O29551q35922j898653
38357c254029j349663K41915J181164R50345O01016P14267N42261l61621j230099
38348a964444j452606j402180j261210n43383N29147P91735Q4583k23491M85194
38339d956655J080149R48579J195953K207406K174065p312k281312k207049o42702
$$ plain form
38330 -2488878 -2642878 -3625196 -4916048 -5490229 -5525217 -5483912 -4867447 -3232152 -1407113
38321 -1407113 -503532 -581606 -1212653 -2297404 -3377716 -3362563 -2133108 -1284024 -1959418
38312 -1959418 -3026428 -2843349 -1848077 -1766562 -3043155 -4733570 -6272485 -7550449 -7756475
38303 -7756475 -6136506 -3758465 -2576468 -2619762 -2023037 -234531 758265 -671785 -3271853
38294 -3271853 -4619683 -4358582 -4319400 -5813083 -8033386 -9246152 -8702607 -7015166 -5145040
38285 -5145040 -3583835 -2490974 -2029937 -2068043 -1851494 -756324 583715 701952 -881322
38276 -881322 -3033900 -4522364 -5234555 -5415083 -4790378 -3371074 -2169645 -1946394 -1974942
38267 -1974942 -1306729 -592460 -1150966 -2645216 -3340467 -2657897 -1921059 -2294326 -3318640
$$ packed form
38330b488878j54000r82318j290852n74181l4988M1305O16465J635295J825039
38321a407113R03581p8074o31047j084751j080312J5153J229455Q49084o75394
38312a959418j067010J83079R95272Q1515j276593j690415j538915j277964k06026
38303g756475J619969K378041J181997m3294N96725J788506R92796j430050k600068
38294c271853j347830K61101L9182j493683k220303j212766N43545J687441J870126
38285e145040J561205J092861M61037l8106K16549J095170J340039J18237j583274
38276h81322k152578j488464p12191j80528O24705J419304J201429K23251k8548
38267a974942O68213P14269n58506j494250o95251O82570P36838l73267j024314
$$ plain form
38258 -3318640 -3932255 -3889993 -3736302 -4147039 -5477703 -7180463 -7701860 -5995274 -3209520
38249 -3209520 -1753484 -2473269 -3849271 -4216642 -3567861 -2739501 -2069895 -1626778 -1779613
38240 -1779613 -2608936 -3300709 -2904026 -1437630 155047 863909 287112 -1057896 -1952483
38231 -1952483 -1523661 -181602 947161 1379562 1403087 1109561 303406 -731406 -1487186
38222 -1487186 -2227839 -3506691 -4703305 -4555301 -3415184 -3314031 -5111843 -7135300 -7555894
38213 -7555894 -6684008 -5779782 -4920715 -3532276 -2155713 -2132145 -3799686 -6034375 -7352063
38204 -7352063 -6898842 -4976295 -3192003 -3261123 -4938023 -6067849 -5482238 -4684557 -5535721
38195 -5535721 -7466662 -8555407 -8427111 -8208285 -8131353 -7200519 -5263638 -3632685 -3267694
$$ packed form
38258c318640o13615M2262J53691m10737j330664j702760n21397J706586K785754
38249c209520J456036p19785j376002l67371O48781Q28360O69606M43117j52835
38240a779613q29323o91773L96683J466396J592677P08862n76797j345008q94587
38231a952483M28822J342059J128763M32401K3525k93526q06155j034812p55780
38222a487186p40653j278852j196614J48004J140117J01153j797812k023457m20594
38213g555894Q71886R04226Q59067J388439J376563K3568j667541k234689j317688
38204g352063M53221J922547J784292o9120j676900j129826N85611P97681q51164
38195e535721j930941j088745J28296K18826P6932R30834J936881J630953L64991
$$ plain form
38186 -3267694 -3717902 -4225617 -4658571 -4946371 -4707456 -3968167 -3395127 -3307717 -3120918 -2214008
38176 -2214008 -861369 68536 47972 -662491 -1349940 -1693703 -2314756 -3976021 -5986118
38167 -5986118 -6291535 -4004308 -1112156 -485204 -2564074 -5203168 -6494113 -6421399 -5832988
38158 -5832988 -5233943 -4896736 -4924429 -4743251 -3533354 -1613583 -501187 -1089239 -2473702
38149 -2473702 -3038197 -2141476 -445903 828422 723948 -755360 -2451731 -3024766 -2284290
38140 -2284290 -1147215 -372570 -32090 -193090 -1229005 -3183457 -5490329 -7527687 -8888286
38131 -8888286 -9125656 -8055079 -6455268 -5655810 -6135256 -7115785 -7612943 -7185603 -5687066
38122 -5687066 -3270130 -874304 228015 -242107 -1398157 -2509707 -3637347 -4752473
$$ packed form
38186c267694m50208n07715m32954k87800K38915P39289N73040Q7410J86799R06910
38176b214008J352639R29905k0564p10463o87449l43763o21053j661265k010097
38167e986118l05417K287227K892152O26952k078870k639094j290945P2714N88411
38158e832988N99045L37207k7693J81178J209897J919771J112396n88052j384463
38149b473702n64495Q96721J695573J274325j04474j479308j696371n73035P40476
38140b284290J137075P74645L40480j61000j035915j954452k306872k037358j360599
38131h888286k37370J070577J599811P99458m79446r80529m97158M27340J498537
38122e687066K416936K395826J102319m70122j156050j111550j127640j115126
$$ plain form
38114 -4752473 -5250163 -4833935 -4109484 -3866312 -4392923 -5632100 -7108501 -7563674 -5904041
38105 -5904041 -3037536 -1581620 -2918232 -5421551 -6393409 -4979747 -2437650 -328107
38097 -328107 653192 627732 185970 -174983 -648846 -1670765 -2767415 -2873012 -2132959
38088 -2132959 -2099078 -3432534 -4787740 -5023250 -5123789 -6406131 -7968142 -7849052 -6096140
38079 -6096140 -4680192 -4522604 -4487847 -3521444 -2089488 -1009888 -276708 298721 404630
38070 404630 -83863 -544776 -405491 51248 169639 -249945 -981161 -1811944 -2612239 -3267817
38060 -3267817 -3788659 -4272798 -4684257 -4875073 -4783253 -4413823 -3847693 -3517830 -4001617 -4999511
38050 -4999511 -5047935 -3140218 -329224 1293913 1092345 295607 -46771 -252283 -799558
$$ packed form
38114d752473m97690M16228P24451K43172n26611j239177j476401m55173J659633
38105e904041K866505J455916j336612k503319r71858J413662K542097K109543
38097c28107R81299k5460m41762l60953m73863j021919j096650j05597P40053
38088b132959L3881j333456j355206k35510j00539j282342j562011J19090J752912
38079f096140J415948J57588L4757R66403J431956J079600P33180N75429J05909
38070D04630m88493m60913J39285M56739J18391m19584p31216q30783q00295o55578
38060c267817n20842m84139m11459j90816R1820L69430N66130L29863m83787r97894
38050d999511m8424J907717K810994J623137k01568p96738l42378k05512n47275
$$ plain form
38041 -799558 -1196237 -888745 -475881 -1052659 -2729130 -4588274 -5902639 -6709570 -7261888
38032 -7261888 -7545115 -7497963 -7298944 -7139269 -6798602 -5668896 -3364196 -317087 2393458
38023 2393458 3890130 4013748 3006637 1196994 -620232 -1013320 990847 4579447
38015 4579447 7576420 8400963 7201324 5062528 2805934 897518 -134858 22299
38007 22299 848899 1233987 566761 -656964 -1505949 -1719706 -1854822 -2357815 -2907477 -2945915
37997 -2945915 -2530900 -2207122 -2233647 -2449389 -2709039 -2827115 -2340808 -1239216 -739311
37988 -739311 -2031415 -4119328 -4492910 -2557760 -721487 -984611 -2165727 -2236667 -1900039
37979 -1900039 -3372259 -6379162 -8119092 -7285496 -5603150 -4844997 -4677560 -4360449 -4334755
$$ packed form
38041g99558l96679L07492M12864n76778j676471j859144j314365q06931n52318
38032g261888k83227M7152J99019J59675L40667J129706K304700L047109K710545
38023B393458J496672J23618j007111j809643j817226l93088K004167L588600
38015D579447K996973Q24543j199639k138796k256594j908416j032376J57157
38007B2299Q26600L85088o67226j223725q48985k13757j35116n02993n49662l8438
37997b945915M15015L23778k6525k15742k59650j18076M86307J101592M99905
37988g39311j292104k087913l73582J935150J836273k63124j181116p0940L36628
37979a900039j472220l006903j739930Q33596J682346P58153J67437L17111K5694
$$ plain form
37970 -4334755 -4711856 -4078949 -1638117 792707 873481 -946718 -2080650 -1357102 -121368
37961 -121368 198020 -87479 -54430 146915 -421051 -2103951 -4248515 -5973294 -6897726
37952 -6897726 -7106034 -6694649 -5661515 -4341258 -3601806 -4073600 -5210225 -5689995 -4886928
37943 -4886928 -3411147 -2069407 -979212 -25196 527787 462918 176460 218607 535904
37934 535904 610912 125156 -831560 -1946753 -2851153 -3409598 -3959696 -4814678 -5494282 -5156745
37924 -5156745 -3957827 -3122998 -3342180 -4027870 -4604679 -5380388 -6303910 -6011322 -3463898
37915 -3463898 147850 2565699 3195274 3331710 3832294 3991668 2971508 1174288 -261450
37906 -261450 -563360 346964 1895256 2984259 2795659 1752106 1076197 1165487 1048354
$$ packed form
37970d334755l77101O32907K440832K430824Q0774j820199j133932P23548J235734
37961a21368L19388k85499L3049K01345n67966j682900k144564j724779r24432
37952f897726k08308M11385J033134J320257P39452m71794j136625m79770Q03067
37943d886928J475781J341740J090195R54016N52983o4869k86458M2147L17297
37934E35904P5008m85756r56716j115193r04400n58445n50098q54982o79604L37537
37924e156745J198918Q34829k19182o85690n76809p75709r23522K92588K547424
37915c463898L611748K417849O29575J36436N00584J59374j020160j797220j435738
37906b61450l01910R10324J548292J089003j88600j043553o75909Q9290j17133
$$ plain form
37897 1048354 -225103 -2224899 -3595758 -3523979 -2433550 -1444836 -1307291 -1683274 -1507257
37888 -1507257 -334886 812923 463137 -1497422 -3642276 -4744200 -5050234 -5531424 -6422909
37879 -6422909 -6976388 -6367916 -4475542 -1959176 124820 963948 580781 -201803 -504173
37870 -504173 -66252 781573 1556174 1890663 1611434 843510 9568 -490662 -659290 -844321
37860 -844321 -1252425 -1637075 -1602569 -1135684 -625985 -407438 -616188 -1511941 -3345190 -5557985
37850 -5557985 -6752556 -6170209 -4736069 -3743892 -2938583 -1166669 1264479 2531805 1982233
37841 1982233 1198617 1459394 1621294 -58511 -3038610 -5064002 -5112737 -4304767 -4110926
37832 -4110926 -4909688 -6132798 -6695274 -5502296 -2699299 -206056 220280 -738020 -957523
$$ packed form
37897A048354j273457j999796j370859P1779J090429R88714J37545l75983J76017
37888a507257J172371J147809l49786j960559k144854j101924l06034m81190q91485
37879f422909n53479O08472J892374K516366K083996Q39128l83167p82584l02370
37870e04173M37921Q47825P74601L34489k79229p67924q33942n00230j68628j85031
37860h44321m08104l84650L4506M66885N09699K18547k08750q95753j833249k212795
37850e557985j194571N82347J434140R92177Q05309J771914K431148J267326n49572
37841A982233p83616K60777J61900j679805k980099k025392m8735Q07970J93841
37832d110926p98762j223110n62476J192978K802997K493243M26336r58300k19503
$$ plain form
37823 -957523 -2663 360768 -970081 -2690848 -2956325 -1767652 -628568 -657533 -1776073
37814 -1776073 -3089116 -3419911 -2064486 329868 2012846 1735587 -118182 -2127055
37806 -2127055 -3119074 -2806917 -1763981 -1000502 -1118151 -1781770 -2333840 -2590880 -2402662
37797 -2402662 -1017643 1852929 4636680 5149107 3394591 1602698 1196763 1405072 1438243
37788 1438243 2164553 4391291 6949032 8009668 7400934 6275457 5231215 4040256
37780 4040256 2647856 1235849 -274940 -1810547 -2755375 -2875069 -2973618 -3679849 -4332676
37771 -4332676 -4163654 -3777534 -4109194 -4591808 -3921158 -2238297 -968685 -650538 -433263
37762 -433263 256496 976839 1366721 1718948 2188790 2442457 2297942 1928670 1495624 1338576
$$ packed form
37823i57523R54860L63431j330849j720767k65477J188673J139084k8965j118540
37814a776073j313043l30795J355425K394354J682978k77259j853769k008873
37806b127055r92019L12157J042936P63479j17649o63619n52070k57040J88218
37797b402662J385019K870572K783751N12427j754516j791893m05935K08309L3171
37788A438243P26310K226738K557741J060636o08734j125477j044242j190959
37780D040256j392400j412007j510789j535607r44828j19694r8549p06231o52827
37771d332676J69022L86120l31660m82614O70650J682861J269612L18147K17275
37762d33263O89759P20343L89882L52227M69842K53667j44515l69272m33046j57048
$$ plain form
37752 1338576 2100894 3590938 4114871 2484068 220507 -181711 996399 1022795 -886508
37743 -886508 -2080620 -540168 1925521 2419708 1135583 514542 1266466 1653333 570686
37734 570686 -741660 -539489 1232208 3119908 3742242 2895132 1620964 1243717 1930909
37725 1930909 2431070 1697134 311937 -420702 -348754 -479907 -1364130 -2434384 -2870769
37716 -2870769 -2295312 -802527 804425 1109551 -392811 -2016566 -1537110 760408 2272568
37707 2272568 1798259 1324355 2936925 5440273 5884906 3728200 1458000 1019122 1443590
37698 1443590 771347 -981889 -1929016 -848389 1398944 2994783 3093310 2436521 2286954
37689 2286954 2931112 3358180 2535538 829577 -255912 192339 1485483 2277780 2102274
$$ packed form
37752A338576P62318J490044N23933j630803k263561m02218J178110K6396j909303
37743h86508j194112J540452K465689M94187j284125o21041P51924L86867j082647
37734E70686j312346K02171J771697J887700O22334q47110j274168l77247O87192
37725A930909N00161p33936j385197p32639P1948j31153q84223j070254m36385
37716b870769N75457J492785J606952L05126j502362j623755M79456K297518J512160
37707B272568m74309m73904J612570K503348M44633k156706k270200m38878M24468
37698A443590o72243j753236r47127J080627K247333J595839R8527o56789j49567
37689B286954O44158M27068q22642j705961j085489M48251J293144P92297j75506
$$ plain form
37680 2102274 1538362 1109399 613983 -281998 -1154706 -939910 900528 3459565 4974954
37671 4974954 4567151 3160119 2307245 2308746 2093603 922872 -605313 -1552359 -1846883
37662 -1846883 -1885010 -1557352 -542630 713155 1163680 311156 -1398491 -3250375 -4759294
37653 -4759294 -5602826 -5683803 -5248237 -4454734 -3026975 -966766 662366 597241 -983396
37644 -983396 -2567388 -3119499 -2890181 -2389598 -1717883 -1293448 -2099911 -4413562 -6967247
37635 -6967247 -8079246 -7234604 -5244149 -3392921 -2617912 -2777486 -2550081 -950550 952218
37626 952218 1101822 -481309 -1344937 -61181 1740363 2082354 1671621 2345983 3809225
37617 3809225 4172812 3015268 1664055 837739 200892 32453 1017641 2259897 1802549
$$ packed form
37680B102274n63912m28963m95416q95981q72708K14796J840438K559037J515389
37671D974954m07803j407032q52874J501k15143j170731j528185r47046k94524
37662a846883l8127L27658J014722J255785M50525q52524j709647j851884j508919
37653d759294q43532q0977M35566P93503J427759K060209J629132o5125j580637
37644i83396j583992n52111K29318N00583O71715M24435q06463k313651k553685
37635f967247j111999Q44642J990455J851228P75009j59574K27405J599531J902768
37626I52218J49604j583131q63628J283756J801544L41991m10733O74362J463242
37617C809225L63587j157544j351213q26316o36847j68439R85188J242256m57348
$$ plain form
37608 1802549 -387126 -2049055 -1847021 -943316 -664260 -678369 -486120 -672976 -1349545
37599 -1349545 -1212297 265261 1390008 801803 -36159 986544 3144393 3968296 3115771
37590 3115771 2576727 3109856 3053064 1357195 -375976 -171291 1426634 2188398 1258698
37581 1258698 95676 392524 1906040 2723007 1509274 -833174 -2111666 -1450425 -331593
37572 -331593 -618614 -2205309 -3463389 -3560463 -3199705 -3132417 -3117995 -2704677 -2099471 -1712758
37562 -1712758 -1478749 -1180685 -1010373 -1272152 -1788492 -2083614 -2110457 -2463071 -3722646
37553 -3722646 -5582093 -6698855 -5745312 -2901223 -69554 857451 -101331 -1245773 -1234577
37544 -1234577 -376740 129660 -366128 -1557043 -2708179 -3172686 -2670923 -1544547 -693069
$$ packed form
37608A802549k189675j661929K02034R03705K79056j4109J92249j86856o76569
37599a349545J37248J477558J124747n88205q37962J022703K157849Q23903q52525
37590C115771n39044N33129n6792j695869j733171K04685J597925P61764r29700
37581A258698j163022K96848J513516Q16967j213733k342448j278492O61241J118832
37572c31593k87021j586695j258080r7074L60758O7288J4422M13318O05206L86713
37562a712758K34009K98064J70312k61779n16340k95122k6843l52614j259575
37553c722646j859447j116762R53543K844089K831669R27005r58782j144442J1196
37544a234577Q57837N06400m95788j190915j151136m64507N01763J126376Q51478
$$ plain form
37535 -693069 -841001 -1710735 -2204562 -1698160 -989722 -1459370 -3133183 -4168362 -2880978
37526 -2880978 11532 1973005 1469961 -588401 -2349999 -3007354 -2831179 -2132569 -1053906
37517 -1053906 65252 875421 1344267 1463335 1088477 533110 659692 1684964 2538907
37508 2538907 2255244 1372619 980232 1031481 817138 475754 476857 66536 -1801742 -3970108
37498 -3970108 -3687660 -398307 3068825 4210198 3963576 4584941 5972162 6246766 5148122
37489 5148122 4447437 4943759 5205955 4010238 2349381 1900932 2600159 2989151 2385148
37480 2385148 1449264 737281 -150627 -1642594 -3277082 -4336847 -4910765 -5552882 -6010431
37471 -6010431 -5162096 -2627450 174399 1336508 728066 239492 1523295 3978142 5405339
$$ packed form
37535f93069j47932q69734m93827N06402P08438m69648j673813j035179J287384
37526b880978K892510J961473n03044k058362j761598o57355J76175O98610J078663
37517a053906J119158Q10169M68846J19068l74858n55367J26582J025272Q53943
37508B538907k83663q82625l92387N1249k14343l41384J103m10321j868278k168366
37498c970108K82448L289353L467132J141373k46622O21365J387221K74604j098644
37489E148122p00685M96322K62196j195717j660857m48449O99227L88992o04003
37480B385148r35884p11983q87908j491967j634488j059765n73918o42117m57549
37471f010431Q48335K534646K801849J162109o08442m88574J283803K454847J427197
$$ plain form
37462 5405339 4482816 2201162 803170 1505437 3365626 4325526 3238130 779541 -1507576
37453 -1507576 -2712905 -2962993 -2757523 -2435043 -2210571 -2191075 -2176849 -1829330 -1258383 -1121074
37443 -1121074 -1801599 -2662777 -2537551 -1113974 407400 371195 -1531917 -3784378 -4636034
37434 -4636034 -4005342 -3356072 -3738624 -4581766 -4680959 -3809184 -2865144 -2782238 -3730831 -5076528
37424 -5076528 -5709789 -4810295 -2829493 -1387470 -1598120 -2735706 -3095457 -1880428 301091
37415 301091 2370907 3476680 3192753 1989909 1262080 1880388 2815277 2156537 -544234
37406 -544234 -3852365 -6219237 -7153702 -6839343 -5892313 -5488021 -6272748 -6935580 -5413784
37397 -5413784 -1997817 367008 -263134 -2269640 -2628548 -472187 2609238 4747969
$$ packed form
37462E405339r22523k281654j397992P02267J860189R59900j087396k458589k287117
37453a507576j205329k50088K05470L22480K24472J9496J4226L47519N70947J37309
37443a121074o80525q61178J25226J423577J521374l6205j903112k252461q51656
37434d636034O30692O49270l82552q43142r9193Q71775R44040Q2906r48593j345697
37424e076528o33261Q99494J980802J442023k10650j137586l59751J215029K181519
37415C01091K069816J105773k83927j202844p27829O18308R34889o58740k700771
37406e44234l308131k366872r34465L14359R47030M04292p84727o62832J521796
37397e413784L415967K364825o30142k006506l58908K156361L081425K138731
$$ plain form
37389 4747969 4983685 3120446 -111740 -3036870 -4262626 -3803884 -2485312 -944995
37381 -944995 81126 -455016 -2561918 -4348789 -3897115 -1587047 641296 1853555 2607652
37372 2607652 3303865 3611487 3482901 3304428 2917838 1763671 153828 -810687 -822565
37363 -822565 -759724 -1248874 -1877675 -2087608 -1849534 -1200738 -106646 942820 1204444
37354 1204444 888631 1129428 2362354 3643748 3979547 3432987 2523852 1530204 967271
37345 967271 1786565 4209731 6914077 8136471 7302473 5179033 2914796 1362220 821711
37336 821711 902641 900352 566205 162423 -231223 -718089 -793099 367342 2293434 2976858
37326 2976858 1213041 -1539881 -2761401 -1930956 -868926 -1135597 -2209866 -2565381 -1723624
$$ packed form
37389D747969K35716j863239l232186k925130j225756M58742J318572J540317
37381i44995J026121n36142k106902j786871M51674K310068K228343J212259P54097
37372B607652O96213L07622j28586j78473l86590j154167j609843r64515j1878
37363h22565O2841m89150o28801k09933K38074O48796J094092J049466K61624
37354A204444l15813K40797J232926J281394L35799n46560r09135r93648n62933
37345I67271Q19294K423166K704346J222394q33998k123440k264237j552576n40509
37336H21711Q0930k289l34147m03782l93646m86866p5010J160441J926092O83424
37326B976858j763817k752922j221520Q30445J062030k66671j074269l55515Q41757
$$ plain form
37317 -1723624 -640365 -398782 -1076362 -1938675 -2368185 -2298154 -1885317 -1272493 -866279
37308 -866279 -1297985 -2583081 -3722295 -3811443 -3235320 -2971593 -3003604 -2462216 -1255856
37299 -1255856 -389377 -476299 -1020864 -1421213 -1565312 -1151065 275452 2060484 2554232
37290 2554232 1293470 -139661 -362795 -76440 -559510 -1473043 -1673256 -1342998 -1637342
37281 -1637342 -2687243 -3548828 -3870894 -4101987 -4173554 -3472635 -2214347 -1510585 -1863355
$$ packed form
37317a723624J083259K41583o77580q62313m29510P0031M12837O12824M06214
37308h66279m31706j285096j139214q9148N76123K63727l2011N41388J206360
37299a255856Q66479q6922n44565m00349j44099M14247J426517J785032M93748
37290B554232j260762j433131k23134K86355m83070r13533k00213L30258k94344
37281a637342j049901q61585l22066k31093p1567P00919J258288P03762l52770
$$ [...]
##END NTUPLES=NMR SPECTRUM
##END=
