##TITLE=31P_DE-80H_X3
 64 sc D2O
 26.2.2025
##JCAMPDX= 6.0         $$ Bruker NMR JCAMP-DX V2.0
##DATA TYPE= NMR SPECTRUM
##DATA CLASS= NTUPLES
##ORIGIN= UXNMR, Bruker Analytische Messtechnik GmbH
##OWNER= root
$$ XWIN-NMR		Version 3.5
$$ Wed Jun 18 14:30:38 2025 Russian Standard Time (UT+4h)  Yarkov@DPX200
##.OBSERVE FREQUENCY= 81.013821
##.OBSERVE NUCLEUS= ^31P
##.ACQUISITION MODE= SIMULTANEOUS
##.ACQUISITION SCHEME= undefined
##.AVERAGES= 64
##.DIGITISER RES= 17
##SPECTROMETER/DATA SYSTEM= spect
##.PULSE SEQUENCE= zgpg30
##.SOLVENT NAME= CDCl3
##.SHIFT REFERENCE= (INTERNAL, CDCl3, 0, 198.062)
##AUDIT TRAIL= $$ (NUMBER, WHEN, WHO, WHERE, WHAT)
$$ ##TITLE= Audit trail, XWIN-NMR		Version 3.5
$$ ##JCAMPDX= 5.01
$$ ##ORIGIN= Bruker BioSpin GmbH
$$ ##OWNER= Yarkov
$$ C:/Bruker/XWIN-NMR/data/yarkov2/nmr/P31/2/pdata/1/auditp.txt
$$ ##AUDIT TRAIL=  $$ (NUMBER, WHEN, WHO, WHERE, WHAT)
(   1,<2025-06-18 14:29:32.82 +0400>,<Yarkov>,<DPX200>,
      <created by zg, POWCHK disabled, PULCHK disabled
       configuration hash MD5:
       00 E9 B6 7A A2 85 ED C7 34 08 36 98 17 FE 4E 26
       data hash MD5: 32K
       FC FD 21 BB 3D 29 C7 A6 F7 A8 38 3C 0B 3D 21 A4>)
(   2,<2025-06-18 14:29:59.15 +0400>,<Yarkov>,<DPX200>,
      <Start of raw data processing
       efp BC_mod = 2 LB = 1.5 FT_mod = 6 PKNL = 1 PHC0 = 1669.046 PHC1 = 70.95951 SI = 64K 
       data hash MD5: 64K
       0A 51 60 50 0A E3 74 80 80 56 F2 89 08 40 30 48>)
(   3,<2025-06-18 14:30:16.43 +0400>,<Yarkov>,<DPX200>,
      <pk PHC0 = -22.6 PHC1 = 0 
       data hash MD5: 64K
       B2 1B BB 7F FA D4 FD 4C EA 9F 18 AA 15 21 6A FE>)
$$ ##END=
$$ 
$$ hash MD5
$$ AB 66 59 38 59 D0 E1 7A 6B 0E 25 77 C3 F2 22 A1
##$RELAX= 
##$RELAX= 
##$RELAX= 
##$RELAX= 
##$RELAX= 
##$RELAX= 
##$RELAX= 
##$RELAX= 
$$ Bruker specific parameters
$$ --------------------------
##$DU= <C:/Bruker/XWIN-NMR>
##$EXPNO= 2
##$NAME= <P31>
##$PROCNO= 1
##$TYPE= <nmr>
##$USER= <yarkov2>
##$AMP= (0..31)
100 100 100 100 100 100 100 100 100 100 100 100 100 100 100 100 100 100 
100 100 100 100 100 100 100 100 100 100 100 100 100 100 
##$AQSEQ= 0
##$AQ_mod= 1
##$AUNM= <au_zg>
##$AUTOPOS= <>
##$BF1= 81.014009
##$BF2= 200.13
##$BF3= 200.13
##$BF4= 200.13
##$BF5= 200.13
##$BF6= 200.13
##$BF7= 200.13
##$BF8= 200.13
##$BYTORDA= 1
##$CFDGTYP= 0
##$CFRGTYP= 5
##$CHEMSTR= <none>
##$CNST= (0..31)
1 1 145 1 1 1 1 1 1 1 1 1 1 1 1 1 1 1 1 1 1 1 1 1 1 1 1 1 1 1 1 1 
##$CPDPRG= <waltz16>
##$CPDPRG1= <>
##$CPDPRG2= <waltz16>
##$CPDPRG3= <>
##$CPDPRG4= <mlev>
##$CPDPRG5= <mlev>
##$CPDPRG6= <mlev>
##$CPDPRG7= <mlev>
##$CPDPRG8= <mlev>
##$CPDPRGB= <>
##$CPDPRGT= <>
##$D= (0..31)
0 1 0 0 0 0 0 0 0 0.06 0 0.03 2e-05 3e-06 0 0 0.0002 0 0 0 0 0 0 0 0 0 
0 0 0 0 0 0 
##$DATE= 1750242572
##$DBL= (0..7)
120 120 120 11 120 120 24 19 
##$DBP= (0..7)
150 150 150 150 150 150 150 150 
##$DBP07= 0
##$DBPNAM0= <>
##$DBPNAM1= <>
##$DBPNAM2= <>
##$DBPNAM3= <>
##$DBPNAM4= <>
##$DBPNAM5= <>
##$DBPNAM6= <>
##$DBPNAM7= <>
##$DBPOAL= (0..7)
$$ [...]
##$SUBNAM2= <"">
##$SUBNAM3= <"">
##$SUBNAM4= <"">
##$SUBNAM5= <"">
##$SUBNAM6= <"">
##$SUBNAM7= <"">
##$SUBNAM8= <"">
##$SUBNAM9= <"">
##$SW= 400.765351723535
##$SWIBOX= (0..15)
0 1 3 0 0 0 0 0 0 0 0 0 0 0 0 0 
##$SW_h= 32467.5324675325
##$TD= 32768
##$TD0= 1
##$TE= 0
##$TE2= 300
##$TE3= 300
##$TEG= 300
##$TL= (0..7)
0 120 53 12 22 120 120 120 
##$TP= (0..7)
150 150 150 150 150 150 150 150 
##$TP07= 0
##$TPNAME0= <>
##$TPNAME1= <>
##$TPNAME2= <>
##$TPNAME3= <>
##$TPNAME4= <>
##$TPNAME5= <>
##$TPNAME6= <>
##$TPNAME7= <>
##$TPOAL= (0..7)
0.5 0.5 0.5 0.5 0.5 0.5 0.5 0.5 
##$TPOFFS= (0..7)
0 0 0 0 0 0 0 0 
##$TUNHIN= 0
##$TUNHOUT= 0
##$TUNXOUT= 0
##$USERA1= <user>
##$USERA2= <user>
##$USERA3= <user>
##$USERA4= <user>
##$USERA5= <user>
##$V9= 5
##$VALIST= <valist>
##$VCLIST= <CCCCCCCCCCCCCCC>
##$VD= 0
##$VDLIST= <DDDDDDDDDDDDDDD>
##$VPLIST= <PPPPPPPPPPPPPPP>
##$VTLIST= <TTTTTTTTTTTTTTT>
##$WBST= 1024
##$WBSW= 4
##$XGAIN= (0..3)
0 0 0 0 
##$XL= 0
##$YL= 0
##$YMAX_a= 198
##$YMIN_a= -230
##$ZGOPTNS= <>
##$ZL1= 120
##$ZL2= 120
##$ZL3= 120
##$ZL4= 120
##$ABSF1= 0
##$ABSF2= 0
##$ABSG= 0
##$ABSL= 0
##$ALPHA= 0
##$AQORDER= 0
##$ASSFAC= 0
##$ASSFACI= 0
##$ASSFACX= 0
##$ASSWID= 0
##$AUNMP= <proc_1d>
##$AZFE= 0.1
##$AZFW= 0.5
##$BCFW= 0
##$BC_mod= 2
##$BYTORDP= 0
##$COROFFS= 0
##$CY= -3
##$DATMOD= 1
##$DC= 0
##$DFILT= <>
##$DTYPP= 0
##$F1P= 0
##$F2P= 0
##$FCOR= 1
##$FTSIZE= 65536
##$FT_mod= 6
##$GAMMA= 0
##$GB= 0
##$INTBC= 1
##$INTSCL= 9.790993e-09
##$ISEN= 30
##$LB= 1.5
##$LEV0= 0
##$LPBIN= 0
##$MAXI= 10000
##$MC2= 0
##$MEAN= 0
##$ME_mod= 0
##$MI= 50
##$NCOEF= 0
##$NC_proc= -12
##$NLEV= 6
##$NOISF1= 182.463
##$NOISF2= 159.3651
##$NSP= 0
##$NTH_PI= 0
##$NZP= 0
##$OFFSET= 198.0616
##$PC= 4
##$PHC0= 1646.446
##$PHC1= 70.95951
##$PH_mod= 1
##$PKNL= yes
##$PPARMOD= 0
##$PSCAL= 0
##$PSIGN= 0
##$REVERSE= no
##$SF= 81.0140089999434
##$SI= 65536
##$SIGF1= 159.3651
##$SIGF2= -187.1042
##$SINO= 113.3802
##$SIOLD= 16384
##$SREGLST= <1H.CDCl3>
##$SSB= 0
##$STSI= 65536
##$STSR= 0
##$SW_p= 32467.5324675325
##$SYMM= 0
##$S_DEV= 0
##$TDeff= 32768
##$TDoff= 0
##$TI= <>
##$TILT= no
##$TM1= 0
##$TM2= 0
##$TOPLEV= 0
##$USERP1= <user>
##$USERP2= <user>
##$USERP3= <user>
##$USERP4= <user>
##$USERP5= <user>
##$WDW= 1
##$XDIM= 65536
##$YMAX_p= 317062346
##$YMIN_p= -96898205
$$ End of Bruker specific parameters
$$ ---------------------------------
##NTUPLES= NMR SPECTRUM
##VAR_NAME=  FREQUENCY,     SPECTRUM/REAL,   SPECTRUM/IMAG
##SYMBOL=    X,             R,               I
##VAR_TYPE=  INDEPENDENT,   DEPENDENT,       DEPENDENT
##VAR_FORM=  AFFN,          ASDF,            ASDF
##VAR_DIM=   65536,         65536,           65536
##UNITS=     HZ,            ARBITRARY UNITS, ARBITRARY UNITS
##FACTOR=    0.49542278885378, 1,            1
##FIRST=     16045.7642231865, 0,            0
##LAST=      -16421.768244346, 0,            0
##MIN=       -16421.768244346, -96898205,    0
##MAX=       16045.7642231865, 317062346,    0
$$ Real data points
##PAGE= N=1
##DATA TABLE= (X++(R..R)), XYDATA
$$ [...]
39948c431733k00098N30670Q38999R1186p04615j84265J366103K219335J336083
39939A861665m51852j529074j227018k24355L85592J04178o90664j196776r79534
39930c947838l75146N8464M11083J225206K304763K498463J298514l5558k8692
39921C409259P17251K15685j795291l035767j773397O49990J662199Q04051l60763
39912D93217r65238j487263j812542q32474J356272K738406K038740O33580M32438
39903B595136J082044R50051m1988n71411m40278p54516j473133j037770P68963
39894A077098J670492N5066k277541k404274l76189J021669K85781j092416j234661
39885c274975l33775L58698N47956O77323O45765J00835m56304j54360P87848
$$ y = [-3431733, -3631831, -3101161, -2262162, -2170976, -2875591, -3059856, -1693753, 525582, 1861665, 1409813, -119261, -1346279, -1570634, -1185042, -1080864, -1771528, -2968304, -3947838, -4322984, -4264520, -3853437, -2628231, -323468, 2174995, 3473509, 3437951, 3409259, 4126510, 4342195, 2546904, -488863, -2262260, -1612270, 49929, 853980, 493217, -472021, -1959284, -3771826, -4604300, -3248028, -509622, 1529118, 2162698, 2595136, 3677180, 4627231, 4585243, 4013832, 3573554, 2819038, 1345905, 308135, 1077098, 2747590, 2802656, 525115, -1879159, -2255348, -1233679, -947898, -2040314, -3274975, -3608750, -3250052, -2702096, -2024773, -1379008, -1278173, -1734477, -1888837, -1100989]
39876a100989J251135R21104O54995Q58768O69261n36100j748266j496349N5710
39867d70731J248203J051741R7339n25225o16720o52085q72951j086811j009270
39858b836510m43712N81883J570944J786647J068719J40826k55919k66620n08520
39849H37738r35657p32898M49428J576810J073494j278971l636646l795989j645996
39840h088687O53845J255846P17398Q17942J915675K680932K235884J163912K13387
39831C566134o05852j197276j057845m50035m85945j205152j111829K27303Q58967
39822a461530n23558j871292n94446K068460K520012K09577j689957j315143m80539
39813c138416q78115j086588N46684K515807K270807J74604j245739j095574p35656
$$ y = [-1100989, 150146, 1071250, 1726245, 2585013, 3254274, 2718174, 969908, -526441, -470731, 777472, 1829213, 1926552, 1401327, 784607, 132522, -740429, -1827240, -2836510, -3280222, -2698339, -1127395, 659252, 1727971, 1868797, 1612878, 1346258, 837738, -97919, -830817, -381389, 1195421, 2268915, 989944, -2646702, -6442691, -8088687, -7434842, -6178996, -5461598, -4643656, -2727981, -47049, 2188835, 3352747, 3566134, 2960282, 1763006, 705161, 255126, -230819, -1435971, -2547800, -2320497, -1461530, -1985088, -3856380, -4450826, -2382366, 137646, 347223, -1342734, -2657877, -3138416, -4016531, -5103119, -4556435, -2040628, 230179, 404783, -840956, -1936530, -2672186]
39804b672186j065664j438147j278549q96477m53272L62939J349239J684083J061903
39795c346131L3884p76847r56113p3821J715839L037145K490180N41731q60725
39786A805142o62334K62279M92621m07488j741431k252237j025811J276057K406929
39777A53727R07935j765835k790640j459332L49848J091658J155242J235094R84637
39768a37666J93256k27109L69959J047776N43090q52139j707973j322345l51903
39759b445054J45461k29255q63193o52978O77463J849839J471002J52156o1613
39750D3828J385269K667552K197519O25232o84710j650849k622524k885089j775868
39741b699640m11139m22602j413726j479911j17385J122442J039644K74138k6134
$$ y = [-2672186, -3737850, -5175997, -6454546, -7351023, -7804295, -7441356, -6092117, -4408034, -3346131, -3312247, -4089094, -5045207, -5119028, -3403189, -366044, 2124136, 2665867, 1805142, 1142808, 1405087, 1897708, 1490220, -251211, -2503448, -3529259, -2253202, 153727, 1061662, -704173, -3494813, -4954145, -4604297, -3512639, -2357397, -1122303, -137666, 55590, -171519, 198440, 1246216, 1789306, 937167, -770806, -2093151, -2445054, -2299593, -2528848, -3392041, -4045019, -3367556, -1517717, -46715, 105441, 43828, 1429097, 4096649, 6294168, 6919400, 6234690, 4583841, 1961317, -923772, -2699640, -3110779, -3533381, -4947107, -6427018, -6544403, -5421961, -4382317, -4108179, -4134313]
39732d134313K81374P00243R65690J011774Q20285O71682Q66198R94178K91595
39723B468706j052598j857945j584214j062779j062018j061286k85268P88529
39715d708873J049280N18819L42216R54218J318502M86544q39336j096902L8432
39706a937100J143258Q13318o35625j646509j276188p4251P87966P68766K38877
39697a817488j14649K5947L66287L92953P4419o0611K18391L23905k37695q34655
39687a663196n04430M41793P84026L88825M33220J242080J459562K94340q66880
39678B009340m91313O04900N31771o62802j219017o17402k60236r38393j499454
39669b542606p95788M95454R47327K80785o48246j001079m41790P83533J652913
$$ y = [-4134313, -3852939, -3152696, -2187006, -1175232, -354947, 316735, 1182933, 2177111, 2468706, 1416108, -441837, -2026051, -3088830, -4150848, -5212134, -5497402, -4708873, -3659593, -3140774, -2798558, -1844340, -525838, -39294, -878630, -1975532, -1937100, -793842, 19476, -616149, -2262658, -3538846, -3613097, -2825131, -2056365, -1817488, -1932137, -1906190, -1539903, -1146950, -1072531, -1133142, -914751, -590846, -828541, -1663196, -2167626, -1725833, -941807, -552982, -119762, 1122318, 2581880, 2876220, 2009340, 1518027, 2122927, 2654698, 1991896, 772879, 155477, -104759, -1043152, -2542606, -3338394, -2842940, -1895613, -1614828, -2263074, -3264153, -3705943, -2922410, -1269497]
39660a269497J041931p29113j771048q17139J120874K096367J600843O55202N6712
39651A985132l17022o41821p25436o11915o95150r19601n92496N69505J693925
39642b54879J565742O8109j486611j534296J72937K101669K269971L63975j676469
39633A590148j698713J12097J400298N29412j440234k194096r96988P24615J341874
39624f31587O27558o16382j557334j612389o28467O00516P46665l36169r90314
39615d397903J22073J852171J923361K24013r26508r3610J383161J621839P87554
39606B496151J88893p491n54851j345989j538794j156679r73490q78215L4397
39597c736068J492997J744498m7486k250666k541055o11688J638607K269895J120231
$$ y = [-1269497, -227566, -956679, -2727727, -3544866, -2423992, -327625, 1273218, 1928420, 1985132, 1668110, 1026289, 300853, -311062, -1006212, -1925813, -2518309, -1948804, -254879, 1310863, 1378972, -107639, -1641935, -1468998, 632671, 2902642, 3266617, 1590148, -108565, 3532, 1403830, 1933242, 493008, -1701088, -2698076, -1973461, -631587, -4029, -620411, -2177745, -3790134, -4418601, -3818085, -3071420, -3407589, -4397903, -4275830, -2423659, -500298, -276285, -1202793, -1296403, 86758, 1708597, 2496151, 2685044, 2677553, 2122702, 776713, -762081, -1918760, -2892250, -3770465, -3736068, -2243071, -498573, -546059, -2796725, -5337780, -5949468, -4310861, -2040966, -920735]
39588i20735l42491o63598O8651M25922m64979j694970j842860r70902l26886
39579f732848l47878k60420L02061O88253N92546O70091J171344J227738L59492
39570b329621l98334P1575J236071J700563J129732L28390j49603m46495p20573
39561D21705r33866j173984j450024j342682n42036M45671Q05394N13715L21075
39552b935032O88234J250877J344883P25943k11447p88203p41940n15688n18931
39543a701304l97994J74769L23346r98544k741443k403708L32403K568872K138699
39534b704904O84208Q10427J860202J298028o94127j265297M57636J926921J173323
39525C546417n27190j267048j353197j804910j982707q35549P65097J049599J657
$$ y = [-920735, -1263226, -1926824, -1858173, -1432251, -1897230, -3592200, -5435060, -6405962, -6732848, -7080726, -7341146, -7039085, -6350832, -5758286, -5088195, -3916851, -2689113, -2329621, -2727955, -2656380, -1420309, 280254, 1409986, 1738376, 1588773, 1142278, 421705, -512161, -1686145, -3136169, -4478851, -5020887, -4575216, -3769822, -3256107, -2935032, -2246798, -995921, 348962, 1074905, 863458, 75255, -666685, -1182373, -1701304, -2099298, -1924529, -1601183, -2599727, -5341170, -7744878, -7412475, -4843603, -2704904, -2020696, -1210269, 649933, 1947961, 1253834, -11463, 446173, 2373094, 3546417, 3019227, 1752179, 398982, -1405928, -3388635, -4224184, -3459087, -2409488, -2407831]
39516b407831q50695q15066m98447j85727N66632J666328K237110J875634J089014
39507B676952L43798l55302q72151r00842o24348n01718l72083K15660P67229
39498C77195K39436j007875j123148M97387J683531J85509k796087l557108n71336
39489f072496L253822L858857P38154k691781l186731j068727Q50093R19030K12055
39480c187724M60802J498011J639185K33135j294908j323972j36363O52937L82884
39471a076013J00340Q75268K164985K442075J125063p03607j525285r47165R2932
39462B548593M54481p3189p40636p94309k99048O9699j04401n75908q58558p07914
39452a081190j31696O67297J180462Q90484J6794m98346k24943K8762n51265j268047
$$ y = [-2407831, -3258526, -4073592, -4572039, -4757766, -4191134, -2524806, -287696, 1587938, 2676952, 3020750, 2665448, 1793297, 892455, 268107, -233611, -605694, -390034, 377195, 616631, -391244, -1514392, -1017005, 666526, 852035, -1944052, -5501160, -6072496, -2818674, 1040183, 1778337, -913444, -4100175, -5168902, -4318809, -3399779, -3187724, -2726922, -1228911, 410274, 643409, -651499, -1975471, -2111834, -1458897, -1076013, -975673, -100405, 2064580, 4506655, 5631718, 4928111, 3402826, 2455661, 2548593, 3003074, 2929885, 2189249, 1394940, 1095892, 1165591, 1061190, 485282, -373276, -1081190, -1212886, -545589, 634873, 1525357, 1542151, 1043805, 818862, 847624, 296359, -971688]
39442i71688p20784R41173J806358O65258j336348k184282j379166q1513N48641
39433b712351L25504l21710q89726j034084p61780l53967R6439P45766J429783
39424c476126J632519J357819J288233J557818J241038j29560j434909j499447
39416E37385r58027j122496j559463o41996J545493K790671J766414j94916j174171
39407I88894j132979j226434j658017j463794m2602J957895L118206K306832k09669
39398B638332k471868k469783n26625Q43984M2677j622686j884991n41651O36248
39389e356363M66204l84598n55250M84151J989464K474871J059883j149481j669826
39380b640945M97370L238225L689803J734008k18795o31583l92047p76550j507328
$$ y = [-971688, -1692472, -751299, 1055059, 1720317, 383969, -1800313, -3179479, -3260992, -2712351, -2386847, -2708557, -3598283, -4632367, -5394147, -5748114, -5651675, -4905909, -3476126, -1843607, -485788, 802445, 2360263, 3601301, 3471741, 2036832, 537385, -420642, -1543138, -3102601, -3744597, -2199104, 591567, 2357981, 2163065, 988894, -144085, -1370519, -3028536, -4492330, -4534932, -2577037, 541169, 2848001, 2638332, 166464, -2303319, -2829944, -1985960, -1943283, -3565969, -5450960, -5992611, -5356363, -4890159, -5274757, -5830007, -5345856, -3356392, -881521, 178362, -971119, -2640945, -2143575, 1094650, 4784453, 6518461, 6299666, 5668083, 5276036, 4499486, 2992158]
39371B992158j632737j142229o64508k88068K69719O93814L02323p09517j080838
39362a259883M1326J829090K489750J275967o47107j637809j512789j386522j700186
39353b508163j440993J47927J940620K014315P7960k041456k316989m03619K196382
39344b334016L363362K138280j25520q81160N94961J987816R06542j606643k309696
39335A733926l58989J441146O52975j478013k094036p14403O17057N05837k58642
39326D6858l77037J96861O76931P29459O76362P63123P55564L36852l05930n50186
39316B948857j27857L89859K66525l98059q59271q30018p06887o43028k10209
39307a70088O99217J359553J053573j09256j532873k663206k865450j604011O28403
$$ y = [2992158, 1359421, 217192, -447316, -735384, -465665, 228149, 530472, -179045, -1259883, -1218557, 610533, 3100283, 4376250, 3729143, 2091334, 578545, -807977, -2508163, -3949156, -3801229, -1860609, 153706, 231666, -1809790, -4126779, -4530398, -2334016, 1029346, 3167626, 3042106, 2160946, 2755907, 4743723, 5650265, 4043622, 1733926, 1374937, 2816083, 3469058, 1991045, -102991, -817394, -200337, 305500, 46858, -330179, -133318, 543613, 1273072, 1949434, 2712557, 3468121, 3804973, 3499043, 2948857, 2821000, 3210859, 3477384, 3079325, 2220054, 1390036, 683149, 40121, -170088, 529129, 1888682, 2942255, 2832999, 1300126, -1363080, -4228530, -5832541, -5204138]
39298e204138K216658J988052M96733p27581p50887K79203J500485J744233M38254
39289A981012j307989j495507J30050J366912N56926r15421p03157R35876J704425
39280B253127Q72874M0901K32426M60911k08222j097667j325855j205427j257226
39271a234158j145681n71434n7575R5300N01018J360350J611960N74046o43649
39262D90177p12832j44795k64114q50809n12367R23787K052930J916443R22224
39253C820644l17801j605160k369374j761806j51913P27299k0818j063296n98585
39244c340810J169350K370083J945113P28434r158j51777l69836p38173n62621
39235A040605L45614R83378L78508q52380j062497K01962J442868J164213j85925
$$ y = [-5204138, -2987480, -999428, -502695, -1230276, -1981163, -1701960, -201475, 1542758, 1981012, 673023, -822484, -692434, 674478, 1231404, 315983, -387174, 548702, 2253127, 3126001, 3166902, 3399328, 3860239, 3652017, 2554350, 1228495, 23068, -1234158, -2379839, -2951273, -3008848, -2913548, -2412530, -1052180, 559780, 1133826, 490177, -222655, -367450, -631564, -1482373, -1994740, -1070953, 981977, 2898420, 3820644, 3502843, 1897683, -471691, -2233497, -2385410, -1658111, -1678929, -2742225, -3340810, -2171460, 198623, 2143736, 2872170, 2863012, 2711235, 2341399, 1603226, 1040605, 1386219, 2369597, 2748105, 1895725, 833228, 1035190, 2478058, 3642271, 3456346]
39226C456346r98998o79071o7010O8868l8943J31635N19790O29767J66576o25482
39216B563478j086209p54707n7957J8539p25328j302308j021883n75168p21404
39207c662947p47136L36981J674030J473783r5880r20551j60085N47530j19008
39198a673283j057873o90113N05430R16551K11384o23780q96295n65992L09355
39189c564616J265750J270730J01252q39385l91716M42105j3096j373703j750385
39180d853064o46225N91655J125529J535389K182962K467868K134595J721897
39172F260606J278039J85788j293295j940418j588685j480576j935281j591403
39164b105225l8235Q33531k36913j420420m71973J492521J511527o10675j967360
$$ y = [3456346, 2457348, 1778277, 1711267, 1780135, 1741192, 1872827, 2392617, 3022384, 3188960, 2563478, 1477269, 722562, 664605, 683144, -42184, -1344492, -2366375, -2941543, -3662947, -4410083, -4073102, -2399072, -925289, -1021169, -1941720, -2101805, -1554275, -1673283, -2731156, -3421269, -2915839, -1999288, -1787904, -2411684, -3307979, -3873971, -3564616, -2298866, -1028136, -926884, -1766269, -2157985, -1715880, -1728976, -3102679, -4853064, -5499289, -4907634, -3782105, -2246716, -63754, 2404114, 4538709, 6260606, 7538645, 7724433, 6431138, 4490720, 2902035, 1421459, -513822, -2105225, -2143460, -1309929, -1546842, -2967262, -3439235, -1946714, -435187, -1045862, -3013222]
39155c013222q78604J037697J767095J555516J494278J323981K58401j168108
39147B377034j697680j203793n91624k02952M31152J357174J839142J382848L03257
39138C994558q66081j809063k138525j460277j26912O69453J30368j086664j521891
39129d215034n45466J010803J812642J322399J37290o97223n93702K21525J100079
39120d46687J608479J689435J324263M49562o03236j038745m90809K67073J68005
39111B927340o78645j150856q32904o02480j056795j359789n73643O21730P87419
39102a918623n7479m36960L34474J226661J171679M85216K5992o1780m4338J28798
39092H53640M61769N21948J94903J30468N66203M72460r38994k466155k200414
$$ y = [-3013222, -3891826, -2854129, -1087034, 468482, 1962760, 3286741, 3545142, 2377034, 679354, -524439, -1116063, -1319015, -887863, 469311, 2308453, 3691301, 3994558, 3128477, 1319414, -819111, -2279388, -2406300, -1736847, -1606479, -2693143, -4215034, -4760500, -3749697, -1937055, -614656, -477366, -1174589, -1768291, -1546766, -446687, 1161792, 2851227, 4175490, 4625052, 4021816, 2983071, 2492262, 2759335, 2927340, 2248695, 1097839, 264935, -337545, -1394340, -2754129, -3327772, -2706042, -1918623, -1976102, -2413062, -2078588, -851927, 319752, 804968, 830960, 769180, 724842, 853640, 1315409, 1837357, 2032260, 2162728, 2728931, 3201391, 2262397, -203758, -2404172]
39083b404172l45639Q96084M53689k96449j0363M93204r7629j049721n83340J086037
39073a858299J696744K29648j481416j287867M43629J738578J824767J546175
39065B851959J409089Q87650j27702p26940n02757m13925j149217j671823p35016
39056a78682Q06986Q22325j014013k517679j880318l1050P35928k69024j500278
39047e025805j270273L23361J732725J831153J103535Q34920J323809J508603
39039B362028O25480n13238o64747j3688J87063m57985j088811j015504l63293
39030i42695O40528J721582J940583N87234j163674j294155m1984J13203j606773
39021d6151k634176q94767J814585K458972J134870K68162N95559P44339K57422
$$ y = [-2404172, -2749811, -1853727, -1400038, -1696487, -1706850, -1213646, -1311275, -2360996, -2944336, -1858299, -161555, 68093, -1413323, -2701190, -2257561, -518983, 1305784, 2851959, 4261048, 5148698, 5020996, 4294056, 3791299, 3377374, 2228157, 556334, -178682, 628304, 1450629, 436616, -2081063, -3961381, -3992431, -3256503, -3525527, -5025805, -6296078, -5972717, -4239992, -2408839, -1305304, -470384, 853425, 2362028, 2987508, 2474270, 1809523, 1795835, 1982898, 1524913, 436102, -579402, -942695, -302167, 1419415, 3359998, 3947232, 2783558, 1489403, 1447419, 1560622, -46151, -2680327, -3575094, -1760509, 698463, 1833333, 2101495, 2697054, 3441393, 3698815]
39012C698815J67518M97415j34169j879316k957069k349629j215951p81850o18804
39003e573040L3160Q08798J089309J027366Q39552L05603k80664J0417J078016
38994f61483J335257r5235j927377k447690j566930j65221J351525K601254K497159
38985I21259N45684j804136k570957j631846n28821k57452l60362J8934J111614
38976d556083K366325K701978J380082p98261j899272j190154j76635l73821j084772
38967c630613p68248L04361N72457j05266k38695P34750J519216J061124L5705
38958e15209m50639l85339l01047k44839j56445m35805j168023j375142j21022
38949e153510J830214K468615Q72818j587332k737386j844090L5663J592106K466419
$$ y = [3698815, 3866333, 4363748, 4229579, 2350263, -606806, -2956435, -4172386, -4954236, -5573040, -5539880, -4731082, -3641773, -2614407, -1774855, -1469252, -1749916, -1739499, -661483, 673774, 578539, -1348838, -3796528, -5363458, -5528679, -4177154, -1575900, 921259, 1466943, -337193, -2908150, -4539996, -5068817, -5326269, -5686631, -5667697, -4556083, -2189758, 512220, 1892302, 1094041, -805231, -1995385, -2172020, -2545841, -3630613, -4398861, -4094500, -3522043, -3627309, -3866004, -3131254, -1612038, -550914, -515209, -965848, -1351187, -1652234, -1897073, -2053518, -2489323, -3657346, -5032488, -5153510, -3323296, -854681, 18137, -1569195, -4306581, -6150671, -6115008, -4522902, -2056483]
38940b056483K909642K991959K612182J839493P57464o33990j878302k019708
38932D522257r05715N0868m52201j626800j720549q05497n93689j377800j317973
38923d227099M50567K062972J602519j56167j224842j205307r41505n99394N5731
38914d182525M15941m2320l31757O50881J925468J598002k02433j550432j609451
38905c328626j254135r25815j9634J325161J841918J123060L35389L75030P44288
38896B16636P53638M70010M624q20246j626527j551462o16075J15904Q6740j55843
38886c122601j01410J59672N97953J168478J095825k14667j550893j022995R69881
38877b020757J919856Q34580m18182j57556Q07494R88985M04702k68949r53554
$$ y = [-2056483, 853159, 3845118, 6457300, 8296793, 9054257, 8420267, 6541965, 4522257, 3616542, 3667410, 3215209, 1588409, -132140, -937637, -1531326, -2909126, -4227099, -3776532, -1713560, -111041, -267208, -1492050, -2697357, -3638862, -4238256, -4182525, -3766584, -3808904, -4140661, -3489780, -1564312, 33690, -168743, -1719175, -3328626, -4582761, -5508576, -5528210, -4203049, -2361131, -1238071, -902682, -527652, 216636, 970274, 1440284, 1444908, 624662, -1001865, -2553327, -3169402, -3053498, -2966758, -3122601, -3224011, -3064339, -2466386, -1297908, -202083, -416750, -1967643, -2990638, -2020757, -100901, 733679, 315497, 157941, 965435, 1954420, 2359122, 2090173, 1136619]
38868A136619j325186m79915J200290J634219M4773j386620o64903Q97269Q13886
38859A870432p43918j615420j125776m69970k46821N8772M25025K46154j68763
38850a770285Q3195P69472Q40499L56084L83775J031737J250288O32498j29552
38841C447711o23436j099383j474007j343286r29893o63600m5226J522360K982088
38832A773328K485382Q7749k086457k523338j615437k86315R28932J343895N54882
38823F62621l24077K24749J464548R92550j435272k972443j661321P94541J703362
38814e50742R80947L55357M98175Q50306J206910J573908J191846m81165k248650
38805C376892k268620m72568J409566K005726J336665N1302j145637j541482j041979
$$ y = [1136619, -188567, -668482, 531808, 2166027, 2210800, 824180, 159277, 1056546, 1870432, 1126514, -488906, -1614682, -2084652, -2331473, -2272701, -1847676, -1601522, -1770285, -1687090, -917618, -77119, 278965, 662740, 1694477, 2944765, 3577263, 3447711, 2824275, 1724892, 250885, -1092401, -2022294, -2685894, -2731120, -1208760, 1773328, 4258710, 4346459, 2260002, -263336, -1878773, -2165088, -1236156, 107739, 662621, 338544, 563293, 2027841, 3020391, 1585119, -1387324, -3048645, -2254104, -550742, 430205, 785562, 1283737, 2134043, 3340953, 4914861, 6106707, 5625542, 3376892, 1108272, 635704, 2045270, 4050996, 5387661, 5438963, 4293326, 2751844, 1709865]
38796A709865n68113q35909j107516k89680J131381J638938R73046L85591N58096
38787C595699P53418L41378k65195p25408j468117k487273k627445j150347Q03433
38778c229857J466138O72508k35249m11988k82632l28757k16115M61003J323667
38769g81282J627228J128147J40393r39219j798233k180934k055647j613579q68169
38760g341295L72623J784821K307303J364363l7984l62614M47166J044640P73595
38751C52618M03495M31228J12993r16545j405420k60248J404325J616851L32015
38742B071312q39279j233675j525807j666107o66894J091147J533203r9491j788934
38733c124525j602811l60213J50657J25802Q62624J928360J579646k26159j433820
$$ y = [1709865, 1141752, 305843, -801673, -1091353, 40028, 1678966, 2652012, 3037603, 3595699, 4349117, 4690495, 4425300, 3699892, 2231775, -255498, -2882943, -4033290, -3229857, -1763719, -1091211, -1326460, -1738448, -2021080, -2349837, -2565952, -2104949, -781282, 845946, 1974093, 2114486, 1175267, -622966, -2803900, -4859547, -6473126, -7341295, -6968672, -5183851, -2876548, -1512185, -1550169, -1912783, -1465617, -420977, 352618, 756113, 1187341, 1300334, 383789, -1021631, -1281879, 122446, 1739297, 2071312, 1232033, -1642, -1527449, -3193556, -3860450, -2769303, -1236100, -1335591, -3124525, -4727336, -5087549, -4936892, -4811090, -3948466, -2020106, -440460, -666619, -2100439]
38724b100439q12430N31166J083256Q19957M77765K37795J051k421K70455K94633
38714H00788j42920l64406J55472Q12480P62026K33045M2167K30363K11371K4687
38704B765073K92377Q95751Q78780M6630m35359K45238J121646P34349p27447
38695E817038j739665j647563j250760j052666l40311J250879K424032J718896
38687E179880k78556j556491j319126o77686n63549l68580N96118J425492O92363
38678C129865j224792k208803j037113J052122K010722J486401P72656N88882
38670D569940J77439r63730j666895o53761J136870J444470o5906j238085p24500
38661B015842k3217q93864k330611k105479l19890Q84895P12912M10941N99257
$$ y = [-2100439, -2912869, -2381703, -1298447, -478490, -725, 237070, 238121, 235700, 506155, 800788, 657868, 293462, 448934, 1261414, 2023440, 2256485, 2298652, 2529015, 2740386, 2765073, 3057450, 3953201, 4831981, 4878611, 4443252, 4688490, 5810136, 6544485, 5817038, 4077373, 2429810, 1179050, 126384, -213927, 1036952, 3460984, 5179880, 4901324, 3344833, 2025707, 1348021, 784472, 415892, 1012010, 2437502, 3129865, 1905073, -303730, -1340843, -288721, 1722001, 3208402, 3981058, 4569940, 4747379, 3783649, 2116754, 1462993, 2599863, 4044333, 3978427, 2740342, 2015842, 1992625, 1098761, -1231850, -3337329, -3657219, -2772324, -2059412, -1648471, -1049214]
38652a049214M12318k14996O7383J329219J453212n16469k237354j307788J035179
38643a028510J787113N43469n31667m16347k63453p51392q75789K5479R88463
38634e22634R76213K89449k80975n35497n05834q1176M52922M63554L4052L0541
38624C20615O47652Q64977p8994j530490k299625j937046o90857R35726K062006
38615a706036J802455M64537m61927k48592L1105o62542j405130o60007R68982
38606a877155J146424p66934k367923j329719J219344J954920k29634k622485
38598d873162k163526O18433K429879J533679l39215p65964J86155P01597J36904
38589b535220m27446k97008j85543p27998j271437r21156M6562O52164O07001
$$ y = [-1049214, -636896, -851892, -784509, 544710, 1997922, 1481453, -755901, -2063689, -1028510, 758603, 1302072, 770405, 354058, 90605, -660787, -1536576, -1511097, -522634, 453579, 743028, 462053, -73444, -579278, -660454, -207532, 256022, 290074, 320615, 968267, 1833244, 1754250, 223760, -2075865, -4012911, -4703768, -3768042, -1706036, 96419, 560956, 99029, -149563, -118458, -781000, -2186130, -2846137, -1877155, -730731, -1497665, -3865588, -5195307, -3975963, -2021043, -2250677, -4873162, -7036688, -6418255, -3988376, -2454697, -2793912, -3559876, -3373721, -2672124, -2535220, -2962666, -3259674, -3445217, -4173215, -5444652, -6365808, -6319246, -5667082, -5060081]
38580e060081M54503N20450M18773k63312j171872j388454n07384O59626Q80223
38571e457528J27318k16972P01671J748335J293454k52295q03621M09200J708306
38562g42132J460131L91792L12196J372121J932062R10435r01886k021477j918530
38553G94712j149451m11509L9753J93667k1839n82752j069373r52376k89992L08538
38543c140622O42838J215139K052175K015897L52525j609483j761066j27711J041332
38534F81024L51845j108206j769615j633838j343400o18372R37397K380447K332080
38525B09362R64421j99373k91398J39444K27533k71976j065334j593296j333999
38516c214616m14178L28694L76131J48054R2948o8106m25649j66971J014095J661808
$$ y = [-5060081, -4605578, -4085128, -3666355, -3929667, -5101539, -6489993, -6997377, -6337751, -5457528, -5330210, -5547182, -4845511, -3097176, -1803722, -2056017, -2859638, -2450438, -742132, 717999, 1109791, 1421987, 2794108, 4726170, 5636605, 4734719, 2713242, 794712, -354739, -766248, -726495, -532828, -554667, -1137419, -2206792, -3159168, -3449160, -3140622, -2497784, -1282645, 769530, 2785427, 3137952, 1528469, -232597, -360308, 681024, 1032869, -75337, -1844952, -3478790, -4822190, -5440562, -4503165, -2122718, 209362, 1173783, 974410, 683012, 822456, 1049989, 778013, -287321, -1880617, -3214616, -3628794, -3300100, -2923969, -2775915, -2682967, -2751073, -3176722, -3343693, -2329598, -667790]
38506f67790L55697j760769k128880l54014J289112J206696M19754M35409R47225
38497b57560Q34005J51534k08863l6242K16913L95484N55017M03902j98787o10968
38487A244435k24580M42226M35008j46190l92368j82621l97090j364818k152149
38478b738147j860078q17371J11642P78637J550640K198747J867784L14337j426380
38469b0189k005638j178803K8493M73258k5456p27499q48980k97073L49372M63529
38459c788986l8243o76314q78950l79811P25599J980866K589033J935982M26086
38450A895262o58787o14729j55663j60217k11364M94450J297542Q08961n55272
38441B140183p87546M28300Q53463o47389j821528n35271J306805L59697k661489
$$ y = [-667790, -312093, -2072862, -4201742, -4555756, -3266644, -2059948, -1640194, -1204785, -257560, 576445, 727979, 519116, 482874, 699787, 1095271, 1650288, 2054190, 1855403, 1244435, 1019855, 1462081, 1897089, 1750899, 1358531, 1175910, 778820, -585998, -2738147, -4598225, -5415596, -5303954, -4525317, -2974677, -775930, 1091854, 1406191, -20189, -2025827, -3204630, -3176137, -2702879, -2728335, -3455834, -4304814, -4601887, -4252515, -3788986, -3827229, -4503543, -5382493, -5762304, -5036705, -3055839, -466806, 1469176, 1895262, 1236475, 621746, 466083, 305866, 94502, 588952, 1886494, 2695455, 2140183, 1352637, 1780937, 2634400, 1987011, 165483, -369788, 937017, 1296714, -1364775]
38432a364775l584030r69634J762607J489933m05956q62483K47755P57381m1449
38423b970651p95120o19154j23693l6162l37094p10077p61262o9722J060289J458457
38413c904189O88189J9568O07449J575391J419806M57414R990j06612r75136j851968
38403b060098p68169J844391K901593J055309j170120j137569K05488L58526p68518
38394D60833j286253o06457J44112M64195R41365J502827J322010O35791O99210
38385D277633J548844J657731M10629q51372j109499j287628k356181l280872
38377i90715k524213o56621L35069o1398m42228J9429L03327o31139j982891k024627
38367h656007l05495J873605L005081K819946K149381J694379J219898J27236
$$ y = [-1364775, -4948805, -5918439, -4155832, -2665899, -3071855, -3934338, -3686583, -2929202, -2970651, -3765771, -4384925, -4508618, -4544780, -4881874, -5591951, -6353213, -6422935, -5362646, -3904189, -3216000, -3196432, -2588983, -1013592, 406214, 863628, 873618, 767006, -208130, -2060098, -2828267, -983876, 1917717, 2973026, 1802906, 665337, 870825, 1229351, 460833, -825420, -1431877, -1287765, -823570, 117795, 1620622, 2942632, 3578423, 4277633, 5826477, 7484208, 7894837, 7043465, 5933966, 4646338, 2290157, -990715, -3514928, -4171549, -3836480, -3897878, -4340106, -4320677, -4017350, -4648489, -6631380, -8656007, -8961502, -7087897, -4082816, -1262870, 886511, 2580890, 3800788, 3928024]
38359C928024j317732j914763j071512J17707J12683j006111j638792q45075N47773
38350c087798J271960J122702O71372L09651K01777N09251R92821R61877K54068
38341C207681l42384l04510k59819p72850j079346l18528O44573K97032r39323
38332A32526j119118J08847Q58296J46002l79603Q44615K585825K612455R83926
38323F773771m28476q82727j103418j149847l09366P68058K32904j884057k905806
38314h88964j152943J371962J648825k44908j632919j169172j92282j56774o09935
38305c027110l67417O20066J410378J321558M12886p31404j260667o64916M56896
38296a829730Q02091k609p37784j46240J307844J935633Q67701j001822k035257
$$ y = [3928024, 2610292, 695529, -375983, -258276, -145593, -1151704, -2790496, -3635571, -3087798, -1815838, -693136, -21764, 287887, 489664, 998915, 1991736, 2953613, 3207681, 2865297, 2560787, 2300968, 1528118, 448772, 130244, 774817, 1071849, 132526, -986592, -877745, -19449, 126553, -253050, 591565, 3177390, 5789845, 6773771, 6345295, 5462568, 4359150, 3209303, 2899937, 3667995, 3900899, 2016842, -888964, -2041907, -669945, 978880, 733972, -898947, -2068119, -2260401, -2417175, -3027110, -3394527, -2774461, -1364083, -42525, 370361, -361043, -1621710, -2286626, -1829730, -1027639, -1030248, -1768032, -1914272, -606428, 1329205, 2196906, 1195084, -840173]
38287h40173j391057L16803J530762J141177k66596q98557N8554J254985R88456
38278A894354k87109n35602Q35662K025674J456281n5551q04589p86080j275064
38269B467976k371755k680708j576730k84849r1945o03868n87677K34314J079408
38260d415834J263432O74668m71628j523357j408534K35241K056967K148200L67754
38251a073091j399232j566028n01728N53699J212271J735983J908053J264385
38243B134312J03694q38527j555371k481341l107657k251370p5639J493606J159923
38234e418370j0777k19855O31340J325311J372211J191469P05866n40836j844609
38225b808250j645541J18902J458121R17102n33020j142546q09474o53804r86774
$$ y = [-840173, -2231230, -1914427, -383665, 757512, 490916, -407641, -349087, 905898, 1894354, 1607245, 1071643, 1907305, 3932979, 5389260, 5333709, 4529120, 3743040, 2467976, 96221, -2584487, -4161217, -4446066, -4538011, -5141879, -5729556, -5495242, -4415834, -3152402, -2477734, -2949362, -4472719, -5881253, -5646012, -3589045, -1440845, -1073091, -2472323, -4038351, -4540079, -3986380, -2774109, -1038126, 869927, 2134312, 2238006, 1399479, -155892, -2637233, -5744890, -7996260, -8071899, -6578293, -5418370, -5429147, -5649002, -5017662, -3692351, -2320140, -1128671, -422805, -963641, -2808250, -4453791, -4334889, -2876768, -1959666, -2492686, -3635232, -4444706, -5098510, -6085284]
38216f085284j081295n74105J74769R70341J882644K466237J965271N22167o63916
38207d23171o73149K25645J137797J469746J220431Q52913Q79061J134078P12737
38198F536088p06836j828168j110371Q77600J752336L43662j741730k268826j118964
38189G34791L4371J20517l46994m87402k94282m09970j108237j779812j484974
38180e021992j31362J062246P99474n43823j111765J21039J899658K184231O29426
38171a12868j193371j825028j356213p52853m57768j00294P01341J718739K373774
38162a004541K347193J700198N77036p57113j595659j227077p5499L41644o60818
38153c54636j727684j249573K03857O93514j12809n60295J73047P81150J39962
$$ y = [-6085284, -7166579, -7740684, -7565915, -6595574, -4712930, -2246693, -281422, 240745, -423171, -1096320, -870675, 267122, 1736868, 2957299, 3810212, 4689273, 5823351, 6536088, 5829252, 4001084, 2890713, 3768313, 5520649, 5864311, 4122581, 1853755, 734791, 769162, 889679, 542685, 55283, -238999, -648969, -1757206, -3537018, -5021992, -5153354, -4091108, -3291634, -3835457, -4947222, -4826183, -2926525, -742294, -112868, -1306239, -3131267, -4487480, -5240333, -5698101, -5798395, -5097054, -3378315, -1004541, 1342652, 3042850, 3619886, 2862773, 1267114, 40037, -35462, 306182, -354636, -2082320, -3331893, -3128036, -2434522, -2547331, -3107626, -2934579, -2153429, -2013467]
38144b013467q20948p39977J25017Q17657J379026K089356K144813Q64986o46737
38135C199726r36918n97447j155183k077678j318646J102382K572330J607363
38127B395929j39654o49459l13524m97281r67429n69447N06112Q99698R2683j139875
38117c82247j956271j953762q36303J149299K640184K291618N61156o86195m53458
38108C74021M64950R03662O04863j72920j217824j982176j602888j15207J056285
38099a687234P35243l79102p22154j26805J68881k87008m48468K44213O45272
38090a857162j86536j026793j13226J893775K565807J317728K76686Q93930J678963
38081E443172O44031j538129k556864j685786k28435O77931J004776Q95410M00610
$$ y = [-2013467, -2834415, -3574392, -3449375, -2631718, -1252692, 836664, 2981477, 3846463, 3199726, 2262808, 1665361, 510178, -1567500, -2886146, -1783764, 788566, 2395929, 2256275, 1606816, 1293292, 796011, -171418, -740865, -234753, 664945, 757628, -382247, -2338518, -4292280, -5128583, -3979284, -1339100, 952518, 1513674, 827479, 374021, 838971, 1742633, 2347496, 2174576, 956752, -1025424, -2628312, -2743519, -1687234, -951991, -1331093, -2053247, -2180052, -2011171, -2298179, -2746647, -2502434, -1857162, -2043698, -3070491, -3183717, -1289942, 1275865, 2593593, 2870279, 3764209, 5443172, 6087203, 4549074, 1992210, 306424, 77989, 755920, 1760696, 2656106, 3056716]
38072C056716L7660J98294J89051p09108j563296r21456N94451Q89503l25873
38063A445942j122146o38010l09378q88623q21703P60786J801763L91934j727973
38054a107408j491664P94792J983265Q30003o93994r89672r41005j584566k013482
38045e213731j023838P13966J596020J269913O63190M13490K61653k75947j232508
38036b827792j955873j396523P46480L004174L192696R58417j610747k480566
38028b369734j830531r74209k17503Q71401J784562J433639K00361n4531J341766
38019A85221K544060J570060q82722k283106j540139r9839L12387k21199n47918
38010i63195k86703j5835j24109l85204m97874l14093L34969J331493J909060
$$ y = [3056716, 3094376, 3292670, 3481721, 2772613, 1209317, 287861, 882312, 1771815, 1445942, 323796, -314214, -623592, -1512215, -2333918, -1573132, 228631, 620565, -1107408, -2599072, -1804280, 178985, 1008988, 314994, -674678, -1615683, -3200249, -5213731, -6237569, -5523603, -3927583, -2657670, -1994480, -1580990, -1319337, -1595284, -2827792, -4783665, -6180188, -5433708, -2429534, 763162, 1721579, 110832, -2369734, -4200265, -5174474, -5391977, -4520576, -2736014, -1302375, -1102014, -1156545, 185221, 2729281, 4299341, 3416619, 1133513, -406626, -506465, -194078, -415277, -963195, -1249898, -1265733, -1389842, -1775046, -2272920, -2587013, -2252044, -920551, 988509]
38001I88509J376299J91407m59036j85713L06593M96131O63455R99140J064023
37992E440808N68230j31835o87544j074155j003897j56434O18440k01680k284511
37983A087422l007353r62827J514926J283750j128689k314323q88633Q71994O82641
37974b861092o93012j063187J24067J577517K091447J635361J002646R72701J438466
37965D224914J234859m77859k662935l279817j865419n2230P80952R86519J204171
37956I3155R69482j16964j054329p01621L75619O96139K7633n29286l15985K74243
37946b81914Q26856J338048J552392R99744j5365m19913J55297O20118k59597
37937D515666k170436l448965k920455j161409K06100K98429k18266j58039O86796
$$ y = [988509, 2364808, 2556215, 2097179, 1911466, 2218059, 2714190, 3377645, 4376785, 5440808, 6009038, 5877203, 5189659, 4115504, 3111607, 2955173, 3573613, 3371933, 1087422, -1919931, -2882758, -1367832, -84082, -1212771, -3527094, -4415727, -3543733, -2861092, -3554104, -4617291, -4493224, -2915707, -824260, 811101, 1813747, 2786448, 4224914, 5459773, 4981914, 2318979, -960838, -2826257, -2878487, -2097535, -1111016, 93155, 1062637, 945673, -108656, -810277, -434658, 261481, 289114, -240172, -556157, -281914, 544942, 1882990, 3435382, 4435126, 4419761, 3999848, 4155145, 4775263, 4515666, 2345230, -1103735, -4024190, -5185599, -4979499, -4681070, -4899336, -5057375, -4370579]
37928d370579J467899J500824R73937M27182J53680K60727O56776P28801k21693
37919A577554j777880k385736j205858O14553J323523P58480K43344N67253J089462
37910H04695R27753J47282n50254p12263l77833J36710L91847O7042o74591j228331
37900a067943j128150m75965K70403P71409R87114J050676J096793J137225J002299
37891C643861M76289l64852r90772q59195j60554K00179k46302p09019j93247
37882G96388P62794N52492r67842j771518m77677J341735J238188n61945j623084
37873g10469r53554l7170o3294l35478j18196M866k86607N3294J542559K674501
37863A770452J869240k39313j905162k508938k222643p34135J762141L304369
$$ y = [-4370579, -2902680, -1401856, -427919, -737, 152943, 413670, 1070446, 1799247, 1577554, -200326, -2586062, -3791920, -3177367, -1853844, -1095364, -852020, -284767, 804695, 1732448, 1879730, 1329476, 617213, 239380, 376090, 767937, 834979, 160388, -1067943, -2196093, -2672058, -2401655, -1630246, -643132, 407544, 1504337, 2641562, 3643861, 4120150, 3755298, 2764526, 1905331, 1744777, 1944956, 1698654, 989635, 796388, 1559182, 2111674, 1143832, -627686, -1105363, 236372, 1474560, 912615, -710469, -1664023, -1701193, -1764487, -2099965, -2218161, -2213295, -2499902, -2446608, -904049, 1770452, 3639692, 3400379, 1495217, -1013721, -3236364, -3970499, -2208358, 1096011]
37855A096011K133939n35567j838996j118656l59799p80216j203805l78713R99776
37846a986026J504073Q54336k80739j346812k015162j985901j291300l42432N33608
37837f356355J142037J164133N80309J11835L46531P17155L91552k13453j31205
37828b247461L09473o268p69912m52012J052695J904168J008986n38634j400031
37819a138996j626609j493858m87595J310756K350920J561545Q035p42802q28369
37810a086973j231581j684980j074491N91900K109521K717063K604556K039590
37802D984605J158896N34758Q60622J860540K191226P26597k169853m600153m557788
37793I89450j971729Q06131J405827J99159n23689J0081K62135o03551j101616
$$ y = [1096011, 3229950, 2694383, 855387, -263269, -623068, -1403284, -2607089, -2985802, -1986026, -481953, 372383, 91644, -1255168, -3270330, -5256231, -6547531, -6889963, -6356355, -5214318, -4050185, -3469876, -3358041, -3011510, -2294355, -1902803, -2116256, -2247461, -1937988, -1944256, -2714168, -3166180, -2113485, -209317, 799669, 261035, -1138996, -2765605, -4259463, -4747058, -3436302, -1085382, 476163, 484198, -258604, -1086973, -2318554, -4003534, -5078025, -4486125, -2376604, 340459, 2945015, 4984605, 6143501, 6678259, 7538881, 9399421, 11590647, 12317244, 10147391, 5547238, 989450, -982279, -176148, 1229679, 1428838, 905149, 915230, 1177365, 573814, -527802]
37784e27802l8278J198978P54738p37705j313971p74648n40652j004254j057266
37775d040860j33681R68501J388892J078025L93094j95189j91975L09540N08115
37766H4462M2096m86527p41808j179240j529690m90293J702087K361744Q5608
37757a51561k474832k188383q2366P47447L36078J040248K454612J696717j099304
37748B78656k199083k49923J492771O48089o36017J27286J547133J255825O1144
37739B325881K9775P58802P17900L88611R36109J382791K62431j248736j010590
37730D542974L65972O29566k08298l34931J75363m40418j976366k199736o69323
37721a15197N62768M95589L60668O52195P7828j513048k093908p32199P15918
$$ y = [-527802, -566080, 632898, 1387636, 649931, -664040, -1438688, -1979340, -2983594, -4040860, -4174541, -3206040, -1817148, -739123, -346029, -541218, -733193, -423653, 84462, 126558, -359969, -1101777, -2281017, -3810707, -4301000, -2598913, -237169, -151561, -2626393, -4814776, -4897142, -4149695, -3813617, -2773369, -318757, 1377960, 278656, -1920427, -2170350, -677579, -29490, -665507, -538221, 1008912, 2264737, 2325881, 2355656, 3114458, 3832358, 4220969, 5157078, 6539869, 6802300, 5553564, 4542974, 4908946, 5538512, 5330214, 4995283, 5170646, 4730228, 2753862, 554126, -115197, 447571, 943160, 1303828, 1956023, 2033851, 520803, -1573105, -2305304, -1589386]
37712a589386O87657K44681O57543J030462L43526k66589M07738J073722M5164
37703B634518j467477j020963R29403J514472q5232j470653q02316O72144Q11276
37694A715172n55459k033106k551201j854572k48783J190955J149646k38013j118946
37685d544307l02937J009807J077974L29839N68309J886580K348209J051731l84467
37676C040738l70768K03259m10626j816507j992160m43741J054268J065388J38937
37667D68788o47318j199554j639786j449245m89112K67649J97271J66040R45178
37658c380089J589234R98596J00905M63787J429625R98618o68477j237135m3582
37649B51482P01276m29482j664582r06521R54854J586457O63263k77449m61426
$$ y = [-1589386, -901729, -657048, 495, 1030957, 1374483, 1107894, 1515632, 2589354, 2634518, 1167041, 146078, 1075481, 2589953, 2504721, 1034068, 231752, 903896, 1715172, 1159713, -873393, -3424594, -5279166, -5527949, -4336994, -3187348, -3425361, -4544307, -4847244, -3837437, -2759463, -2429624, -1861315, 25265, 2373474, 3425205, 3040738, 2669970, 2873229, 2462603, 646096, -1346064, -1789805, -735537, 329851, 468788, -178530, -1378084, -3017870, -4467115, -4956227, -4688578, -4491307, -4325267, -3380089, -1790855, -792259, -691354, -227567, 1202058, 2200676, 1532199, 295064, 251482, 952758, 523276, -1141306, -2047827, -1092973, 493484, 1156747, 879298, 417872]
37640D17872l39370o0756N73387R89625M64307l42518j35241R02087J356679P89777
37630D615849J4821o56777j553951k060624j084326N30368M16582j599077k541492
37621c918627n29607K137652K195343Q9469j017459N6141J406967J338233K86504
37612B044616p61262j564909j778970p62076R25285J505597M37188n97634k31251
37603g83416M93571l0017j214065j119307N71627K185002K500538J972081J346857
37594E922871N09153p43525j793938j795639p23228N61209J034214K78844j068215
37585B181746j711288j036980P4680L62388j40427l64721O8798M94186O11513
37576E39895R78220J667024J661702M06525r65612r47174L32488J306325R00142
$$ y = [417872, 78502, 17746, 591133, 1580758, 2045065, 1702547, 1567306, 2469393, 3826072, 4615849, 4630670, 3973893, 2419942, 359318, -725008, -194640, 221942, -1377135, -3918627, -4448234, -2310582, -115239, -25770, -1043229, -987088, 419879, 1758112, 2044616, 1283354, -281555, -2060525, -2822601, -1897316, -391719, 45469, -552165, -783416, -289845, -319862, -1533927, -2653234, -2081607, 103395, 2603933, 4576014, 5922871, 6432024, 5688499, 3894561, 2098922, 1375694, 1936903, 2971117, 3249961, 2181746, 470458, -566522, -491842, -129454, -269881, -634602, -565804, -71618, 539895, 1518115, 3185139, 4846841, 5253366, 4287754, 3340580, 3673068, 4979393, 5879535]
37567E879535m27861j377194j033665L45942J385630P72331j209743k690853k173152
37558e29030j54149J529683J617960M18034p15631o87595J72808L24657r81268
37549I95469k255262j553949N11451J397486M86206K693J140457J830103K59544
37540B814198j714031j399311K32387J72822j520441j850025P7978J728704J427912
37531b9807O48736Q79266J193789N48450k1578O16067J485506J166962J17338
37522F604729l98673l40516k50955J14861Q92807J030910k18898j708703j868630
37513C856932q94297j0446N13318J084786J388167Q41309k00707j068200j862158
37504C648704k626424k403005o61652J208451J508894N92181l6675j91597p43026
$$ y = [5879535, 5451674, 4074480, 3040815, 3386757, 4772387, 5544718, 4334975, 1644122, -529030, -683179, 846504, 2464464, 2882498, 2166867, 1479272, 1652080, 1976737, 995469, -1259793, -2813742, -2302291, -904805, -418599, -415906, 724551, 2554654, 2814198, 1100167, -299144, -66757, 106065, -1414376, -3264401, -3186423, -1457719, -29807, 618929, 1498195, 2691984, 3240434, 3218856, 3834923, 5320429, 6487391, 6604729, 6206056, 5865540, 5614585, 5729446, 6622253, 7653163, 7434265, 5725562, 3856932, 2962635, 2952189, 3465507, 4550293, 5938460, 6779769, 6579062, 5510862, 3648704, 1022280, -1380725, -2042377, -833926, 674968, 1267149, 1230474, 1038877, 295851]
37495B95851j526177j479461n47423L21615P84632J109946J055219M25482J54997
37486E94681R50079J491790J75438j877649k026981j00807J436446J323559P41830
37477B708386L91877o81098k391970k595439l38722K123228K271610N09869j118209
37468H79532j701069j389431j99427J312480J513576k75012k167713j895891J39375
37459c783580J629396J541522Q94244P18933Q20664O00120m0381p47925j011679
37450F21314n10933L78227P85401M60388J50802M67249J043496J249006R71489
37441E616439K80639p74609j586682j280536j46013L78584k16955p67400n09527
37432I93940l34430q19494o60716J209287L251223L129929J088273n63214q58225
$$ y = [295851, -1230326, -2709787, -3257210, -2935595, -2150963, -1041017, 14202, 439684, 594681, 1544760, 3036550, 3211988, 1334339, -692642, -793449, 642997, 1966556, 2708386, 3100263, 2419165, 27195, -2568244, -2906966, -783738, 1487872, 1997741, 879532, -821537, -2210968, -2410395, -1097915, 415661, 140649, -2027064, -3922955, -3783580, -2154184, -612662, 281582, 1000515, 1821179, 2421299, 2380918, 1632993, 621314, 110381, 488608, 1274009, 1734397, 1885199, 2352448, 3395944, 4644950, 5616439, 5897078, 5122469, 3535787, 2255251, 2109238, 2487822, 2270867, 1503467, 993940, 659510, -159984, -820700, 388587, 3639810, 6769739, 7858012, 7294798, 6436573]
37423F436573r67908j645388j939173r92857M14624R08798K08658q05059j187908
37414D30360p57754r3278K00783K36901N16006R08985P82379K57211J58431L33762
37404B973786m52872k128980k511159l14985K508148L203722J777110K33361o03655
37395D684476j280508j594967q27316K61497J62114o51749j34917J898361L089244
37386E606235J946492q2838q27162l0439J080364J492902Q66125n90409j997367
37377G463903k393068j793598r37632r8253Q16694J296698P73436r0419k14634
37368D823127L3235m50496j181781o06854J066263J900871J379808J075608J640361
37359I680142J685882N43584m12567l71759n06721j370608j393485K29765J553265
$$ y = [6436573, 5468665, 3823277, 1884104, 891247, 1305871, 2214669, 2423327, 1618268, 430360, -327394, -420672, -219889, 17012, 533018, 1442003, 2224382, 2481593, 2640024, 2973786, 2520914, 391934, -2119225, -2434210, 73938, 3277660, 5054770, 5288131, 4684476, 3403968, 1809001, 981685, 1243182, 1405296, 753547, 618630, 2516991, 5606235, 7552727, 7469889, 6642727, 6612288, 7692652, 9185554, 10051679, 9461270, 7463903, 5070835, 3277237, 2339605, 2241352, 3058046, 4354744, 5128180, 5037761, 4823127, 4856362, 4405866, 3224085, 2617231, 3683494, 5584365, 6964173, 8039781, 9680142, 11366024, 11909608, 11497041, 11125282, 10618561, 9247953, 7854468, 8084233, 9637498]
37350I637498R30842j49872K59200J076363K67453j189434o92919J541194K738792
37341A4419117J974771J152642J346860J150758m71596k145465k127308o64299
37333A4635480P95659J465782J386454Q02770K02208J95785P70716J274556J415766
37324B2945176J568296J923583K157487K125817K099890K163129K146122K216984
37316C9346484K680723L170714L051548K755422L574777N702455P510587P454082
37308G5246792N995627N004792N728565P872236J0266444J1909969J2590489J2930584
37300A47545498J3796890J5468429J7404272J8821370J9357819J9171969J8513164
37293B70079411J7198535J4579857J0283196M921347m32613n517839j0863569
$$ y = [9637498, 10568340, 10418468, 10677668, 11754031, 12021484, 10832050, 10139131, 11680325, 14419117, 16393888, 17546530, 18893390, 20044148, 19572552, 17427087, 15299779, 14635480, 15431139, 16896921, 18283375, 19086145, 19288353, 19484138, 20254854, 21529410, 22945176, 24513472, 26437055, 28594542, 30720359, 32820249, 34983378, 37129500, 39346484, 42027207, 45197921, 48249469, 51004891, 54579668, 60282123, 67792710, 75246792, 81242419, 86247211, 91975776, 99848012, 110114456, 122024425, 134614914, 147545498, 161342388, 176810817, 194215089, 213036459, 232394278, 251566247, 270079411, 287277946, 301857803, 312140999, 317062346, 316629733, 311111894, 300248325]
37286C00248325j6190605j9775226k0223992j8300936j6159569j5170533j5206674
37279A79220790j5498847j5251956j3858811j1576836r768789r469440r874860
37272I3921251r249453p234893n239293m502424m756749m988746m677423l987418
37264D9284852l341769l045889k982352k706622k152939j906711k266528k503117
37256B8378925j827382p06849k94819q05682j416607j612288j639140j691744
37248A8384414j609620j399039j195848p39045K54606J238258J264889K93496
37240A6492111p73243j344035j583492j626927j263207n32005Q8551J92267l24549
37231I325471j277420j889067j063438J114599K735722K100274n1586j574674
$$ y = [300248325, 284057720, 264282494, 244058502, 225757566, 209597997, 194427464, 179220790, 163721943, 148469987, 134611176, 123034340, 113265551, 103796111, 93921251, 84671798, 77436905, 72197612, 67695188, 62938439, 57949693, 53272270, 49284852, 45943083, 42897194, 39914842, 37208220, 35055281, 33148570, 30882042, 28378925, 26551543, 25844694, 25549875, 24744193, 23327586, 21715298, 20076158, 18384414, 16774794, 15375755, 14179907, 13440862, 13695468, 14933726, 16198615, 16492111, 15718868, 14374833, 12791341, 11164414, 9901207, 9369202, 9457753, 9650020, 9325471, 8048051, 6158984, 5095546, 6210145, 8945867, 11046141, 10994555, 9419881]
37223I419881j690937j304146j028779o34753k46539l12910m11963J88924Q69074
37214D847852M34823n43034l96793N51915J84691j585462k024142J43614K374170
37205C987634K076066L86923j06260N01558K59289r60259j413631n74821K74111
37196D430610M45802O08620R60726O32697n69476j401376q57790M39600J111524
37187E800937N81180n90437j398157j220867l42484L07645J60461m64250j023365
37178A810663j417318j617372j278936l40499N18060O35585J61282l43626n14005
37169b386166n0464J148677K258072K002893N32459l98994j1031J50414j216304
37160B029556k614563j680569J204708L299739L075217J448443k82476j668675
$$ y = [9419881, 7728944, 6424798, 5396019, 4761266, 4514727, 4201817, 3789854, 3978778, 4847852, 5282675, 4739641, 4342848, 4894763, 5079454, 3493992, 1469850, 1613464, 3987634, 6063700, 6450623, 6344363, 6845921, 7105210, 6144951, 4731320, 4156499, 4430610, 4876412, 5485032, 6445758, 7078455, 6508979, 5107603, 4249813, 4689413, 5800937, 6382117, 5791680, 4393523, 3172656, 2830172, 3137817, 3298278, 2834028, 1810663, 393345, -1224027, -2502963, -2843462, -2325402, -1689817, -1528535, -1872161, -2386166, -2436630, -1287953, 970119, 2973012, 3505471, 3106477, 3095446, 3245860, 2029556, -585007, -2265576, -1060868, 2238871, 5314088, 6762531, 6480055, 4811380]
37152D811380k199828j249928M80060J168918K78104o25346j93803Q08600Q53092
37143D131249j11672q46735p20138l95737o46148j160769r28847K34744R93155
37134E49102o733j947307k243005K29195L306432M013081K083079k39621j246502
37125D497721j065302l22670O86747J327219P13778r76629k368455k466492j525871
37116a499954k32266R92487J711656J501095N26152o15461j581592k098341j536117
37107b832341J56252J521677J122752k27649m53341O75352J349655P59069J49350
37098B220776L28989L65218k81242m91077L10427O90001l90337j494628r95394
37089B62733J03812j07269j095700q33005N74820R38359l31773j199025k71431
$$ y = [4811380, 2611552, 1361624, 1841684, 3010602, 3288706, 2663360, 2469557, 3278157, 4131249, 4019577, 3172842, 2452704, 2056967, 1410819, 250050, -678797, -444053, 549102, 542369, -1404938, -3647943, -3418748, -112316, 3900765, 5983844, 5744223, 4497721, 3432419, 3109749, 3796496, 5123715, 5837493, 4860864, 2492409, 25917, -1499954, -1732220, -739733, 971923, 2473018, 2999170, 2383709, 802117, -1296224, -2832341, -2676089, -1154412, -31660, -259309, -712650, -37298, 1312357, 2071426, 2220776, 2549765, 2914983, 2633741, 2142664, 2453091, 3143092, 2752755, 1258127, 262733, 366545, 259276, -836424, -1669429, -1094609, -156250, -488023, -1687048, -1958479]
37080a958479J142042J260835L08302m73469q35676j130866r84742M2501J051836
37071a577716O75348p48293j340991l02477R65615R99100L84121O10732J543798
37062A209237J556764J86240q71724j35011J444744J807724O90983j96156J53853
37053E846654O07918k58353j863242k215263n50409J560688K049600P53452o23725
37044E307320q62360p42454j617570l044049l035075q22616J843867K824051K055954
37035A907068J019689N43172K77602j33879n54013q58067j014300q33081m04004
37026d9813m10704j150991j708130j097462K32962J124454J374443J427927J023389
37017G66075k62363j542613j464460l53714K20994r0435j91463L23275P41430
$$ y = [-1958479, -816437, 444398, 752700, 279231, -556445, -1687311, -2672053, -2629552, -1577716, -902368, -1650661, -2991652, -3294129, -2328514, -1329414, -945293, -334561, 1209237, 2766001, 2952241, 2080517, 1945506, 3390250, 5197974, 5888957, 5692801, 5846654, 6454572, 6196219, 4332977, 2117714, 1567305, 3127993, 5177593, 5931045, 5307320, 4444960, 3702506, 2084936, -959113, -3994188, -4816804, -2972937, -148886, 1907068, 2926757, 3469929, 3747531, 3613652, 3059639, 2201572, 1187272, 354191, -49813, -460517, -1611508, -3319638, -4417100, -4184138, -3059684, -1685241, -257314, 766075, 503712, -1038901, -2503361, -2857075, -2636081, -2726516, -2917979, -2594704, -1853274]
37008a853274R23731J340778J398204P6593j569213j227586Q04629J474481k87646
36999A080697j694561n76231J205729J057436k11669l03803N16896L08514r00409
36990D82599j240140p3384J462450K370876K238854O50584j778108k786558j121690
36981B05483J166006J378583M3693m65438q8814o93137k137937k195157n08805
36972c295523O53261J78186l57329K41551R43254P66994M14936M37448j0128j296174
36962a323524k123116j467438q1686R60230J599869J801074R99367m41996r71004
36953a048224j47169M67109j59597q03834r1666J272444J823045J492125J008694
36944C812927M00650m37121p74157r0764P93684Q85185M40053J47785j16069o35570
$$ y = [-1853274, -929543, 411235, 1809439, 1886032, 316819, -910767, -106138, 1368343, 1080697, -613864, -1190095, 15634, 1073070, 861401, 557598, 1074494, 1383008, 482599, -757541, -830925, 631525, 3002401, 5241255, 5891839, 4113731, 1327173, 205483, 1371489, 2750072, 2793765, 2328327, 2239513, 1546376, -591561, -2786718, -3295523, -2642262, -2464076, -2821405, -2579854, -1636600, -869606, -454670, -17222, -27350, -1323524, -3446640, -4914078, -4995764, -4035534, -2435665, -634591, 364776, -77220, -1048224, -1195393, -728284, -887881, -1691715, -1783381, -510937, 1312108, 2804233, 3812927, 4213577, 3776456, 3002299, 2911535, 3705219, 4590404, 5030457, 5178242, 5062173, 4426603]
36934D426603r93767r48947j081615j508782j200648K33681J412660J181377L76119
36925A896681J09515k06272j290612j933971q14838P60232N06295j168367j790982
36916c932319p40170K02113K05610M90486J551685J956861R76864J35427P27211
36907A573768J611921J096595l10461p37738K02401R88497M49640p18344r29390
36898C226889L34103J810932J804571K69897r59015n44462M56039J72353j204546
36889E366761j815463j193054q39089j339247j150112N88458K082676J509685
36881C210615J4595j13573Q50670P55153n10500o45979J030519J921990j767k793245
36871C718478l103066r45501N39710k43723j395678q61570M39710L71115r09175
$$ y = [4426603, 3432836, 2483889, 1402274, -106508, -1307156, -1073475, 339185, 1520562, 1896681, 2006196, 1799924, 509312, -1424659, -2239497, -1479265, -972970, -2141337, -3932319, -4672489, -4470376, -4264766, -3774280, -2222595, -265734, 711130, 846557, 1573768, 3185689, 4282284, 3971823, 3234085, 3436486, 4424983, 4874623, 4156279, 3226889, 3560992, 5371924, 7176495, 7446392, 6487377, 5942915, 6398954, 6571307, 5366761, 3551298, 2358244, 1519155, 179908, -970204, -381746, 1700930, 3210615, 3225210, 3111637, 3962307, 4717460, 4206960, 3560981, 4591500, 6513490, 6511723, 3718478, 615412, -330089, 209621, -34102, -1429780, -2291350, -1851640, -1480525, -2389700]
36862b389700j208820L09706J934930J950181P69024k52881q20569j320793j355230
36853b384152j97087J526779K082343Q62845p31450j131889m55356N0482l02548
36844f80033j197499k005016k129317j054595J001246K580419K165997J63991
36836a154807j199773n40278R05886J046457j13345o09207M52390J538406J029034
36827A354763m16520j070123p87820q07111j256066p31784J258656L067088K984721
36818C595804J393795q9604o86777p11675n89610o75926j349187k199121j851884
36809c164185Q8630J627770O45609j762854k284190j2910K052029J168684j333271
36800b974688k105010m37326J248108J202791M78788O86136J372273R55980o12555
$$ y = [-2389700, -3598520, -3288814, -1353884, 596297, 1365321, 1112440, 291871, -1028922, -2384152, -2581239, -1054460, 1027883, 1890728, 1159278, 27389, -427967, -377485, -680033, -1877532, -3882548, -6011865, -7066460, -6065214, -3484795, -1318798, -1154807, -2354580, -2894858, -1988972, -942515, -1055860, -1665067, -1212677, 325729, 1354763, 938243, -131880, -919700, -1726811, -2982877, -3714661, -2456005, 611083, 3595804, 4989599, 4899995, 4213218, 3501543, 2911933, 2236007, 886820, -1312301, -3164185, -3075555, -1447785, -802176, -2565030, -4849220, -4862130, -2810101, -1641417, -2974688, -5079698, -5517024, -4268916, -3066125, -2587337, -1901201, -528928, 427052, -185503]
36791a85503j634426j054027J83256O45751L77682M67183J097792J168207Q5084
36782A150999j032607o95820Q82849J933219J300118k79245j272049j118700n16227
36773C52537l25200o84845j120308j140487o47405L1634L93350J32962n84521
36764c592283j188916j146213m66786K65005N35329N45766R33256J777733K282450
36755e4659J758983O30953k5467J70939N40497L83999j22939l47242j50384l7419
36745B747261m69847j311593j934551j736180o84812M52220O10942m50701j575820
36736d353081j234663O83366K531071K684049J283108k42117r85015j157434j084773
36727a875489o08842K53781R15719R56366O24740K03820m35130j187086j429732
$$ y = [-185503, -1819929, -2873956, -2690700, -2044949, -1667267, -1200084, -102292, 1065915, 1150999, 118392, -577428, 305421, 2238640, 3538758, 3259513, 1987464, 868764, 352537, 27337, -657508, -1777816, -2918303, -3565708, -3534074, -3140724, -3007762, -3592283, -4781199, -5927412, -6394198, -6129193, -5593864, -5048098, -4114842, -2337109, -54659, 1704324, 2335277, 2309810, 2480749, 3021246, 3405245, 3282306, 2935064, 2784680, 2747261, 2277414, 965821, -968730, -2704910, -3389722, -2937502, -2326560, -2777261, -4353081, -5587744, -4904378, -2373307, 310742, 1593850, 1351733, 366718, -790716, -1875489, -2484331, -2230550, -1314831, -358465, 266275, 470095, 34965, -1152121, -2581853]
36718b581853j038785q74751j423507j746652q14957Q26920J870727K023840J729963
36709b029055R28596l09692p11260N65622J760492M42870k506370l590413j743567
36700g192777K43247K78015q2753J075261K591211K477959J385043J106021J294791
36691C176018M87550q41293j117550o96896j186372k274794k097400n54096N12889
36682d591944M82920N61213R65086L05256j492052k243288o83540J470677J909972
36673c315700O14475p44915r81504q9231J083357J243260j13712j552889j155784
36664e012643O72287J564573O89215j30540N21281J548901J403273L95069l38383
36655A313033n92188n51040L3240Q70782P98906l06452p80777K70929J199330
$$ y = [-2581853, -3620638, -4495389, -5918896, -7665548, -8480505, -7653585, -5782858, -3759018, -2029055, -1100459, -1410151, -2121411, -1555789, 204703, 647573, -1858797, -5449210, -7192777, -6949530, -6671515, -6754268, -5679007, -3087796, -609837, 775206, 1881227, 3176018, 3663568, 2822275, 1704725, 1007829, -178543, -2453337, -4550737, -5104833, -4591944, -4109024, -3547811, -2582725, -2277469, -3769521, -6012809, -6696349, -5225672, -3315700, -2701225, -3446140, -4427644, -4516875, -3433518, -2190258, -2303970, -3856859, -5012643, -4340356, -2775783, -2086568, -2217108, -1695827, -146926, 1256347, 1651416, 1313033, 720845, 169805, 203045, 1073827, 1872733, 1566281, 785504, 1056433, 2255763]
36646B255763K65308j515960j913634q02365Q5219L9387J6922O80001J494263
36637F04904J771894J383214N25969l22235n75471l95711p07111j619983j852809
36628a187339p01655N91811P06902K74582N00425R10207L19384q56765j236675
36619f79123p39444k77374J70891J106662J688128O64815j109743j445851j45709
36610g66748P21192J24282o03418k67473M87171P34025O46956N04605P998n99440
36600I89150l61382N94366O91868o98658k037882j890722r99514q19070j216085
36591e747929j071724k98704J82082j4277m05209n36991k91067M01362J376391
36582f406066K039772J970180J458042J018142P48826N36637M17396L63594J86935
$$ y = [2255763, 2521071, 1005111, -908523, -1710888, -1625669, -1586282, -1569360, -889359, 604904, 2376798, 3760012, 4285981, 3963746, 3388275, 2992564, 2285453, 665470, -1187339, -1888994, -1297183, -590281, -315699, 184726, 1094933, 1414317, 557552, -679123, -1418567, -1695941, -1525050, -418388, 1269740, 1934555, 824812, -621039, -766748, -45556, 78726, -524692, -792165, -304994, 429031, 1075987, 1580592, 1588590, 989150, 627768, 1222134, 1914002, 1215344, -822538, -2713260, -3712774, -4531844, -5747929, -6819653, -7118357, -6936275, -6950552, -7355761, -7892752, -8183819, -7782457, -6406066, -4366294, -2396114, -938072, 80070, 828896, 1365533, 1782929, 2146523, 2333458]
36573B333458n8632r1978L642j43377m03565k62983J31420P0243l41089j46048
36563A091091O56660O56260p85363k195574j969973n91105M09592P35006J063671
36554i29735J252250N54332o14607q35994J87865J068950O84653m43647j196952
36545b72885j313528j179872q94375k91502M09819O07304k777j004037j561914
36536e503767j135753o461Q90081Q07154q0890q89400r90132o36934m89531n59622
36526h595255K2511J792293L686618L815415J847132k18501m56246N27978P25249
36517C147194k28224p81392k27131J55407n88412j321332o10776Q99262J373817
36508A818413L49697r61437j513841j302911o63377P2046K83339m12055j239161
$$ y = [2333458, 2274826, 2182848, 2186490, 2043113, 1639548, 1376565, 1507985, 1578228, 1237139, 1091091, 1747751, 2404011, 1618648, -576926, -2546899, -3138004, -2728412, -1993406, -929735, 322515, 876847, 262240, -573754, -385889, 683061, 1367714, 924067, -272885, -1586413, -2766285, -3660660, -3952162, -3542343, -2935039, -2937816, -3941853, -5503767, -6639520, -6645981, -5755900, -4948746, -5029636, -5919036, -6909168, -7546102, -8035633, -8595255, -8572744, -6780451, -3093833, 721582, 2568714, 2350213, 1893967, 2421945, 3147194, 2918970, 2137578, 1910447, 2065854, 1477442, 156110, -454666, 444596, 1818413, 2168110, 1206673, -307168, -1610079, -2273456, -2201410, -1918071, -2330126, -3569287]
36499c569287q97865O52488J933657J801946Q04704K70540O45442J226286J164870
36490D032781K62974j014790j883301j681250m32918Q94716J097113Q6044p30156
36481F31213p7988J244672J101059q82454k207155p36004J951396K367309p4681
36472C317367k344162k251539j184428j158341j385154R192K245200K547689K98829
36463I4653j821097j373418Q54989K215448J437344l69981j415137j174750n86481
36454b138430n28716m98222N97531K379917K843131R13769j803927k865727j873118
36445b973792m26037K05780J11080j74548l18506n1254N67134Q91265N86358L74468
36435a208052Q81227J325277O77887m10330m51066M44570P31642p2759q90269
$$ y = [-3569287, -4467152, -3814664, -1881007, -79061, 725643, 996183, 1641625, 2867911, 4032781, 4295755, 3280965, 1397664, -283586, -716504, 178212, 1275325, 1361369, 631213, 553225, 1797897, 2898956, 2016502, -190653, -926657, 1024739, 3392048, 3317367, 973205, -1278334, -2462762, -3621103, -5006257, -4997065, -2751865, -204176, 94653, -1726444, -3099862, -2244873, -29425, 1407919, 1037938, -377199, -1551949, -2138430, -2667146, -3165368, -2567837, -187920, 2655211, 3568980, 1765053, -1100674, -2973792, -3399829, -3194049, -3082969, -3257517, -3576023, -3627277, -3060143, -2168878, -1582520, -1208052, -326825, 998452, 1676339, 1266009, 814943, 1259513, 1991155, 1918396, 1028127]
36426A028127j152226j443361j760050j125754L77396J073810J65524q69665m25823
36417d132022J047419K033193J865613P20731r86681k182330j484953Q08946K354862
36408D4778J638903k4158p01039o23824r91426j291584j69894J671717J918344
36399A471817O1108j755600j752731o18815M6564o9654k09897K2434L07992K57146
36389b239636r1539k90020j004L79602J05251n69004l04907J216814K149104Q67350
36379A222011j324486j760197k27524R42042N59887o663L83369Q18903L97581
36370A004923M135M73527O96814n73107k267041k336010p77756N67406P77686
36361b429423N72695M90387J74147l30163j79474Q47229J723175J509541M73523
$$ y = [1028127, -124099, -1567460, -3327510, -4453264, -4075868, -3002058, -2836534, -3706199, -4132022, -3084603, -1051410, 814203, 1534934, 548253, -1634077, -3119030, -2310084, 44778, 1683681, 1659523, 958484, 334660, -656766, -1948350, -2118244, -446527, 1471817, 1532925, -222675, -1975406, -2594221, -2547657, -2617311, -2827208, -2804774, -2496782, -2239636, -2331175, -2621195, -2622199, -2242597, -2137346, -2706350, -3011257, -1794443, 354661, 1222011, -102475, -1862672, -2090196, -1148154, -588267, -594930, -211561, 607342, 1004923, 1009058, 1482585, 2179399, 1606292, -660749, -2996759, -3774515, -3207109, -2429423, -1856728, -1366341, -1192194, -1522357, -1701831, -854602, 868573, 2378114, 2851637]
36352B851637m96071q55650n44290J21342M72584P2067n98988o90069k06690J20434
36342B46306J50211M59287R92322P59411o18871k070094k403015j669285o31722
36333d785450K82756Q68114Q39290M15232M18150R80320R77184k61632j499502
36324a765538j156260K54319P60878k07295j139993p73282L17882Q83917N79215
36315b246157j65927q65677r93691j45168J189944J751279J021514n5457m68074
36306i77414n08465r41749j444266r67873N32033J763360J679280O74492j13915
36297c04517k31013k00111n04075o84600J38213J802123K757112J850940J15212
36288D739284l09470Q69481J476658j44553k677815l518511k154106m68141Q334
$$ y = [2851637, 2355566, 1499916, 955626, 1076968, 1549552, 1621619, 1022631, 332562, 125872, 246306, 396517, 855804, 1848126, 2607537, 1988666, -81428, -2484443, -4153728, -4785450, -4502694, -3634580, -2795290, -2380058, -1961908, -981588, -4404, -266036, -1765538, -2921798, -2667479, -1906601, -2113896, -3253889, -4027171, -3709289, -2825372, -2246157, -2412084, -3277761, -4271452, -4416620, -3226676, -1475397, -453883, -509340, -977414, -1485879, -2427628, -3871894, -4839767, -4307734, -2544374, -865094, -190602, -304517, -535530, -735641, -1239716, -1924316, -1786103, 16020, 2773132, 4624072, 4739284, 4429814, 5299295, 6775953, 6631400, 3953585, 435074, -1719032, -2187173, -2178839]
36279b178839l21133m22400j64479K9009J09317K77767N05700P56311J232671
36270a76076J876930K018302J103312m46881j622230j918366j582742r25741N318
36261a668174R82574J413010R59774K9844p11151j059331j109095o65675M42162
36252a386062J452786J011914j024918k835657k521892l81693J546119J915244
36244b224159J105357O8156o38281n97438L60784J384671J154348j78908p78572
36235c44042L57499J799443J651507J20404j129546j386210j243088j086674p25038
36226a985745l16925l05737m51194j05184N68306P65663M17188K70618N51724
36217e91286O24874J37355m36815n23228M4384J128506K094380J870451K80422
$$ y = [-2178839, -2499972, -2922372, -3086851, -3057842, -2948525, -2670758, -2165058, -1408747, -176076, 1700854, 3719156, 4822468, 4375587, 2753357, 834991, -747751, -1673492, -1668174, -685600, 727410, 1687184, 1717028, 1005877, -53454, -1162549, -1828224, -1386062, 66724, 1078638, 53720, -2781937, -5303829, -5685522, -4139403, -2224159, -1118802, -1050646, -1688927, -2286365, -1925581, -540910, 613438, 434530, -344042, 13457, 1812900, 3464407, 3584811, 2455265, 1069055, -174033, -1260707, -1985745, -2302670, -2608407, -3059601, -3164785, -2596479, -1830816, -1413628, -1143010, -591286, 33588, 170943, -265872, -789100, -744716, 383790, 2478170, 4348621, 4629043]
36208D629043j088418p07577N37800M51406j179121k280475j649153m17433J35022
36199a568906K61594M41239K71037k81107k34192O03691Q06116l75243j447640
36190a523411r44535J94973K87451l08367q1866Q68122J099748L55592k30623
36181b82916k63991n17658j184793j417671q46084j29808K17512L21175J91409
36172c912825k71147m89968K25277J234579J100645j88547r70824l29081O47766
36163b954125P18616L20844N39992J188108J127247J45770n67295R332J285239
36154A813728J587049J26067j859620k397190j208693m4233j71887n76872K41531
36145b490120J553713J249627p87067k114260j119774O98474R40557m00120j250169
$$ y = [4629043, 3540625, 2833048, 3370848, 3822254, 2643133, 362658, -1286495, -1703928, -1568906, -1307312, -866073, -595036, -876143, -1110335, -506644, 299472, -75771, -1523411, -2467946, -2272973, -1985522, -2293889, -2375755, -1507633, -407885, -52293, -282916, -546907, -1064565, -2249358, -3667029, -4513113, -4642921, -4425409, -4104234, -3912825, -4183972, -4673940, -4448663, -3214084, -2113439, -2301986, -3272810, -3601891, -2954125, -2235509, -1914665, -1374673, -186565, 940682, 1086452, 519157, 528489, 1813728, 3400777, 3526844, 1667224, -729966, -1938659, -1982892, -2154779, -2731651, -2490120, -936407, 313220, -473847, -2588107, -3707881, -3009407, -2068850, -2468970, -3719139]
36136c719139m89464P54448R38052J43641k87545L18551J117651R59520n9416
36127c23701q22909p90830n46168n59503l55146M73561J262588J199238N99732
36118A36862K66382J49279k17857m69033R0293J091450J579699J568003J651880
36109E846958J439628J86754j173703q21288Q35506J152024q29616k714500k308048
36100A613715p38976k57722p01871m10738N36430M98450p50220j514713p67109
36091b492754O13091J468959J662538J354253L96788r27829j600282r68199M26452
36082f6983J507103J683977J053329O8900q41008j614684k348070k489180r61098
36073d007714K047316M139824L064574j84328k246361j583366j15647q4390j025288
$$ y = [-3719139, -4208603, -3454155, -2516103, -2372462, -2660007, -2341456, -1223805, -264285, -323701, -1146610, -1937440, -2483608, -3043111, -3398257, -2924696, -1662108, -462870, 136862, 403244, 552523, 334666, -134367, -44074, 1047376, 2627075, 4195078, 5846958, 7286586, 7473340, 6299637, 5478349, 6313855, 7465879, 6636263, 3921763, 1613715, 874739, 617017, -84854, -495592, 40838, 539288, -210932, -1725645, -2492754, -1879663, -410704, 1251834, 2606087, 3002875, 2075046, 474764, -493435, -66983, 1440120, 3124097, 4177426, 4246326, 3405318, 1790634, -557436, -3046616, -4007714, -1960398, 2179426, 5244000, 5059672, 2813311, 1229945, 1114298, 1029908, 4620]
36064D620j131677k79848O0230o83614j491582j464425q03324M3710R55810J615222
36054c174878J583066J240285J477239J985420J193446j232423l145852k572697
36046b646394o14823O4450r20201j429281l78330O81288L02222n44578k21857
36037e707504J003218J661482J276222L83410o80842j486647r80667R28827K100505
36028a501996O61104j750027j753136Q14227K482210J294307m54953m7250J589465
36019A333951J796132L90657n73986l35292j91430q94825j442897q84576K61788
36010e40478R93514J122362J010697P75430L14137k62070o03214m48752M4620
36001B406246K83328j76209r09466r58512j35823N57545K06663q57452j599548
$$ y = [4620, -1127057, -1406905, -1346675, -2030289, -3521871, -4986296, -5789620, -5745910, -4790100, -3174878, -1591812, -351527, 1125712, 3111132, 4304578, 3072155, -73697, -2646394, -3261217, -3196767, -4116968, -5546249, -5924579, -5243291, -4941069, -5485647, -5707504, -4704286, -3042804, -1766582, -1383172, -2064014, -3550661, -4531328, -3602501, -1501996, -840892, -2590919, -4344055, -3529828, -1047618, 246689, -208264, -255514, 1333951, 3130083, 3520740, 2946754, 2611462, 2420032, 1525207, 82310, -802266, -540478, 453036, 1575398, 2586095, 3361525, 3675662, 3413592, 2810378, 2361626, 2406246, 2689574, 2513365, 1603899, 645387, 509564, 1067109, 1273772, 416320, -1183228]
35992a183228j440713m64818Q80722J768290J360738j46824j424532j502561p34003
35983b886929J65279J048724J653681J224417n7294m46748J031336K579444J784233
35974F096143q49646k525606k044421r74504q12173j068196p87708j31360M75557
35965b621914J254938K082533J854512R2061j699489j562024M47881K366953K666660
35956D882111J599260K95771o27400j257209j660567j533722p59460j017j31157
35947H06610r35478j088516J00663J608502K087224J645373J219094Q00408k75409
35938E968471j559391j652246l50215Q54627Q55878J81145l56463q86146j561330
35929A494330j657476p02111L45766K03503r34409j700143j357217m53595J59065
$$ y = [-1183228, -2623941, -3088759, -2208037, -439747, 920991, 774167, -650365, -2152926, -2886929, -2721650, -1672926, -19245, 1205172, 1147878, 701130, 1732466, 4311910, 6096143, 5246497, 2720891, 676470, -298034, -1110207, -2178403, -2966111, -3097471, -2621914, -1366976, 715557, 2570069, 2662130, 962641, -599383, -151502, 2215451, 4882111, 6481371, 6777142, 6149742, 4892533, 3231966, 1698244, 938784, 937767, 806610, -128868, -1217384, -1116721, 491781, 2579005, 4224378, 5443472, 6243880, 5968471, 4409080, 2756834, 2406619, 3261246, 4117124, 4298269, 3941806, 3055660, 1494330, -163146, -865257, -519491, -315988, -1250397, -2950540, -4307757, -4761352, -4602287]
35920d602287K55596K19139N31157J224776J673246J211971J11279n57601k80962
35911b13686K16684J6356p84289j341688j127753l21102M72445N69832k38274
35902b751475j138368q68205O79028J991711J696506K67367p68444q84221q12846
35893b588947r19946n42605N92707J299016K93938j731649k541864j085488J158015
35884f066823K152787J778419J312959J094558K55987j253706k125187j755160
35876d606166j256479j409070j072991R21722L440378M283512L062596J253459
35868D616961n4005q77088j282283j218945j119400j261687r78833J36221J009724
35859a029335P06225K79521R31300J413686j0639j912118j375136J036571J798957
$$ y = [-4602287, -4346691, -4127552, -3596395, -2371619, -698373, 513598, 624877, 67276, -213686, 2998, 19354, -764935, -2106623, -3234376, -3555478, -3083033, -2513201, -2751475, -3889843, -4758048, -4079020, -2087309, -390803, -123436, -891880, -1776101, -2588947, -3508893, -4051498, -3458791, -2159775, -1865837, -3597486, -6139350, -7224838, -6066823, -3914036, -2135617, -822658, 271900, 527887, -725819, -2851006, -4606166, -5862645, -7271715, -8344706, -7422984, -3982606, 300906, 3363502, 4616961, 4562956, 3685868, 2403585, 1184640, 65240, -1196447, -2175280, -2039059, -1029335, -323110, -43589, 887711, 2301397, 2290758, 378640, -996496, 40075, 1839032]
35850A839032J56292p64945M83022J271532j16513j254362m3634J255271j32411
35841B693284k579778k730653q42765L41782L52710P92147J588071J213657l5146
35832G93309m35786n0601l48554j060009n93667O99632Q48863k40681o73468J5547
35822a045415L14294k18944k64964N68528J065773P32248K90558k51553j407679
35813b17154k129357q36978J394852J804688L12594l79152O11504J263020Q11709
35804B635726J044965K218317J757022j035988k853974j474210N57631K52130
35796C101619j033358n42396Q54491M42031j405889j936376n58744P98318J128412
35787H48108J004857M04315j091996k280125j405026Q07824J752106O10037q53138
$$ y = [1839032, 1995324, 1230379, 1713401, 2984933, 2868420, 1614058, 1570424, 2825695, 2693284, 113506, -2617147, -3459912, -3118130, -2765420, -1973273, -385202, 828455, 793309, 357523, 306922, -41632, -1101641, -1695308, -995676, -146813, -387494, -1060962, -1045415, -731121, -950065, -1215029, -646501, 419272, 1151520, 1442078, 1190525, -217154, -2346511, -3183489, -1788637, 16051, 328645, -50507, 560997, 1824017, 2635726, 3680691, 5899008, 7656030, 6620042, 3766068, 2291858, 2849489, 3101619, 2068261, 1525865, 2380356, 2822387, 1416498, -519878, -1078622, -280304, 848108, 1852965, 2257280, 1165284, -1114841, -2519867, -1712043, 40063, 650100, -203038]
35778b03038j153647n75322K35600J066384J358548N00747q69149j381070p79645
35769a800592P7261P36621J213692J065660R1106n57336K23174J460287J388964
35760C898837K23652m53508n53998j308181k483269k383233p86510N88356Q71661
35751b386193R17993J045644L95164q73295j230051m28725j12643q64700j103337
35742d640143n2601O99376J25744j65837J265136K897879K523377P16144k83828
35733C085247N4656N74701Q56993J290696J346939J12860j648429k085365r78669
35724B609629j4606j36087l61260K94489J206585J147927j01881j733927k777546
35715A33323k638863j460438k49118m1346o87465r92280k34362R89014J608209
$$ y = [-203038, -1356685, -1932007, -1696407, -630023, 728525, 1229272, 360123, -1020947, -1800592, -1723331, -986710, 226982, 1292642, 1383748, 826412, 1049586, 2509873, 3898837, 4122489, 3668981, 3114983, 1806802, -676467, -3059700, -3846210, -3257854, -2386193, -1468200, -422556, -27392, -900687, -2130738, -2559463, -2672106, -3536806, -4640143, -4692744, -3993368, -3867624, -4033461, -2768325, 129554, 2652931, 3369075, 3085247, 3139903, 3714604, 4571597, 5862293, 7209232, 7322092, 5673663, 3588298, 2609629, 2595023, 2458936, 2097676, 2392165, 3598750, 4746677, 4644796, 2910869, 133323, -2505540, -3965978, -4215096, -4256442, -4943907, -5936187, -6170549, -5181535, -3573326]
35706c573326J269698M77916j5319K56545J187243K059743J985436O64681j200428
35697C112189k300790j747243J4037J404730J249014R8846m83973J9041N01380
35688A867231l5259j017156j197385l79020N26013P52203K73211n29213j059318
35679g98693o25137Q65407K400718K710093J603220j9159j331003k151319k461709
35670A92418k094623j103356M8714R00485J320199J332878R18822J49708o12332
35661A052913q16802j78239Q23777J072436r8313j902525k718683j890541l79028
35652e035005O02991R36768J156083J350843J218820P78752L27362m3296l08282
35643I85036k16142K49190M27177l01146j527318k158593j613083k05991J352697
$$ y = [-3573326, -2303628, -1825712, -1841031, -1584486, -397243, 1662500, 3647936, 4312617, 3112189, 811399, -935844, -921807, 482923, 1731937, 1830783, 1346810, 1365851, 1867231, 1831972, 814816, -382569, -761589, -235576, 516627, 789838, 260625, -798693, -1423830, -558423, 1842295, 4552388, 6155608, 6136449, 4805446, 2654127, 192418, -1902205, -3005561, -2956847, -2056362, -736163, 596715, 1515537, 1665245, 1052913, 236111, 57872, 881649, 1954085, 1855772, -46753, -2765436, -4655977, -5035005, -4432014, -3495246, -2339163, -988320, 230500, 1009252, 1336614, 1293318, 985036, 768894, 1018084, 1445261, 1144115, -383203, -2541796, -4154879, -4360870, -3008173]
35634c008173K286908J959299N22571q04713q42424K05150J036721P55991l60535
35625A750795j318813j188243J17299J331497P94723j335968k679972j534666
35617d063348P06797J586866J220758J714909L237823L336376Q65148j861570
35609F743759k267136r42399j50013m01946n37391k42651l68901j077975j516520
35600g61173j308914q62300k40557P72084J487337Q20805p11755j098067M14612
35591a487928K041476J833665K26752q32743n11344K75154L99685l01403j186537
35582D56777j389952m59727R65900J476752N83795l61440J14598J379078J479716
35573D245497N9168j080979p58767j55023p29473j741171j472137j33864L91875
$$ y = [-3008173, -721265, 1238034, 1760605, 955892, 113468, 318618, 1355339, 2111330, 1750795, 431982, -756261, -638962, 692535, 1487258, 151290, -2528682, -4063348, -3356551, -1769685, -548927, 1165982, 4403805, 7740181, 8605329, 6743759, 4476623, 3534224, 3384211, 2982265, 2444874, 2202223, 1833322, 755347, -761173, -2070087, -2932387, -3172944, -2400860, -913523, -92718, -804473, -1902540, -1487928, 553548, 2387213, 2613965, 1781222, 1269878, 1545032, 1944717, 1643314, 456777, -933175, -1392902, -427002, 1049750, 1633545, 1272105, 1386703, 2765781, 4245497, 4304665, 3223686, 2464919, 2309896, 1580423, -160748, -1632885, -1766749, -1374874]
35564a374874l96907q21452J52537J076678K48485j456879j602317M43453K648902
35555a082374K856408J005145j372906k856508k923732j831694l33995P71748
35547e767908J173247J033586N26404k29803q36856p96377j49136N65809J071185
35538c409849J478303J560784P30854q26853j783519j195209R4455M66696k84783
35529c169121p27484J34938J436773J597179L63596r40527j072685j92305O22790
35520a946846P33829M25950K29291K41817K21758k5265n40727j181023j495854
35511c337070j004568J27154J078889J380126J429997J552622J223103J02308
35503B552561q13069m24261M19509j94099k135667k877750j036845J453832K034295
$$ y = [-1374874, -1771781, -2593233, -2440696, -1364018, -1115533, -2572412, -4174729, -3731276, -1082374, 1774034, 2779179, 1406273, -1450235, -4373967, -6205661, -6539656, -5767908, -4594661, -3561075, -3034671, -3264474, -4101330, -4897707, -5046843, -4481034, -3409849, -1931546, -370762, 360092, -466761, -2250280, -3445489, -3351034, -2884338, -3169121, -3896605, -3761667, -2324894, -727715, -364119, -1304646, -2377331, -2569636, -1946846, -1213017, -787067, -557776, -315959, -94201, -119466, -660193, -1841216, -3337070, -4341638, -4214484, -3135595, -1755469, -325472, 1227150, 2450253, 2552561, 1739492, 1315231, 1734740, 1540641, -595026, -3472776, -4509621, -3055789, -1021494]
35494a021494R71442M07452R46534J203249L66689p64456j400396j668035j588172
35485b547187p57570M28946P26497p1715n26267K95406J265051Q86767m14252
35476g14324r48404j27835R87856J195861K65880j150859j927087j172089O22350
35467b968651J603841O78090q69150r99045K84448J203450J033821R00353J464016
35458B331173J633110M90079r65855j255866n75285j85131l67543l51611J43838
35449H96909O10233P91210Q20025M44036o68538j858915j972498j074224m13638
35440b425400m15966r5017R66825J497298M55944j064774j242376j38290N34615
35431a927141m8484r08194r07049p2626R84315J916308K447648K139481R26935
$$ y = [-1021494, -50052, 357400, 1303934, 2507183, 2873872, 2109416, 709020, -959015, -2547187, -3304757, -2875811, -2149314, -2221029, -2747296, -2451890, -1186839, -300072, -714324, -1662728, -1790563, -802707, 393154, 659034, -491825, -2418912, -3591001, -2968651, -1364810, -686720, -1555870, -2554915, -2270467, -1067017, -33196, 867157, 2331173, 3964283, 4454362, 3488507, 2232641, 1657356, 1472225, 1104682, 753071, 896909, 1507142, 2298352, 3118377, 3562413, 2893875, 1034960, -937538, -2011762, -2425400, -2841366, -2936383, -1969558, -472260, -16316, -1081090, -2323466, -2461756, -1927141, -1975625, -2883819, -3790868, -3863494, -2879179, -962871, 1484777, 3624258, 4551193]
35422D551193n17567j348446j267846o15739o6796j99441r14898j316608o69843
35413b365991N65650J217873Q41784L1562n98199r06972p08563K29005J391542
35404c02309J680637Q08671k61967o61238n68177m46958k93941j91458n99585
35395h36325j346028j292008N9679J463955J466932L15825o98118j063227j056115
35386b985430o65801J09055M66523j92127r02549l93971O41926L98350r85793
35377d509817j266170N45956K576457K691224J109855n56871j466184j610200
35369b485750r26930L52725J251072J069125L15081j75195l07391j95742M37732
35360f65273J350122J297099k48439j754221j469438L8900P51585J21635n79243
$$ y = [4551193, 4033626, 2685180, 1417334, 801595, 734799, 535358, -379540, -1696148, -2365991, -1800341, -582468, 259316, 290878, -307321, -1214293, -1922856, -1693851, -302309, 1378328, 2186999, 1925032, 1263794, 695617, 248659, -45282, -236740, -836325, -2182353, -3474361, -3414682, -1950727, -483795, -167970, -866088, -1929315, -2985430, -3651231, -3542176, -3075653, -3267780, -4170329, -4564300, -3922374, -3524024, -4509817, -5775987, -5230031, -2653574, 37650, 1147505, 590634, -875550, -2485750, -3412680, -3059955, -1808883, -739758, -424677, -599872, -907263, -1103005, -665273, 684849, 1981948, 1733509, -20712, -1490150, -1451250, -699665, -578030, -1157273]
35351a157273o27783p06080j131305r65823L73953J894506K229424J205144l92392
35342G22371j780404k339288j664318j96652Q17591O91926J51297K63285J040190
35333b294002J693397J733892J121379j36574j584812j887224n6967K679307L445677
35324D714073R48633k562336l599468j472641J069673J409122Q4514n57970K17529
35315B51129R37766M87513l85771o24508m79064o06094o63158o5564O21233M74079
35305e2439l9104L77001J624189K091014J052218j97748k34040N59712P37934
35296E918737k22189j437548j772746r90901N7489K66150m46564q96437k32271
35287B43720O27057K10871j124232j541472n69473J45588m61362j220990q87605
$$ y = [-1157273, -1785056, -2491136, -3622441, -4588264, -4214311, -2319805, -90381, 1114763, 722371, -1058033, -3397321, -5061639, -5258291, -4440700, -3748774, -3597477, -3334192, -2294002, -600605, 1133287, 2254666, 2118092, 533280, -1353944, -1410911, 1268396, 4714073, 5662706, 3100370, -499098, -1971739, -902066, 507056, 591570, 33600, 251129, 1188895, 1676408, 1290637, 666129, 187065, -419029, -1082187, -1147751, -526518, -52439, -91543, 285458, 1909647, 4000661, 5052879, 4855131, 4621091, 5180803, 5918737, 5696548, 4259000, 2486254, 1495353, 1552842, 1818992, 1372428, 475991, 243720, 870777, 1081648, -42584, -1584056, -2153529, -2007941, -2469303, -3690293, -4577898]
35278d577898k63647n36246q57973L33589K380307L021407J740443L96126L22071
35269A958179P34133N41568j356k66545m42801q13913r79664p14442o05215r19550
35259a509606q31421J41420Q61722J33437j097843p68457J184091K394504J226653
35250A734500j037255k031989j309707l45135j20013r3201L26840N67324q4056
35241b392692r82753p23347Q43985K121824J668931J0283j007358m16554Q62722
35232a4959J240760K63662j029796j388273o90225J42432M11228L86669N79392
35223i9110P51728K99186o06590j101717r18299o91880p21762m15812M74609J053221
35213a976426N81507k59246m74027l67301p12891r12268K80933K280359K743059
$$ y = [-4577898, -4841545, -5377791, -6235764, -5902175, -3521868, -500461, 1239982, 1636108, 1958179, 2692312, 3233880, 3232524, 2965979, 2523178, 1709265, 729601, 15159, -590056, -1509606, -2341027, -2199607, -1337885, -1204448, -2302291, -3070748, -1886657, 507847, 1734500, 697245, -1334744, -2644451, -2989586, -3109599, -3202800, -2875960, -2308636, -2392692, -3375445, -4098792, -3254807, -1132983, 535948, 546231, -461127, -877681, -14959, 1225801, 1489463, 459667, -928606, -1618831, -1476399, -1065171, -678502, -99110, 652618, 951804, 345214, -756503, -1674802, -2366682, -3088444, -3504256, -3029647, -1976426, -1394919, -1654165, -2128192, -2495493, -3208384, -4120652, -3839719, -1559360, 1183699]
35204A183699O53940k148015l277847k453270j048686q0927L86128O00631Q44807
35195e339540J317715J640064J057669k95166j110879n95871L85490P14300O87619
35186a538599J148699J715070J312123O2412q35491r86917j129738j496710j254908
35177c004059j0027J242845J260599j4591j485646j867181o65755J158428J778768
35168a606619O56463l36390O85878K533118K277695k73721j976730j069538J94066
35159A084222n70044j871848j070803P22419J73372k487043l222503m22804K377871
35150e287161J808740m58006p95315P37176J169798j59957p35620P36267K246688
35141g37390J805633L61615p0311N92173J018473P68349M14716J12993l95308
$$ y = [1183699, 1837639, -310376, -3588223, -6041493, -7090179, -7171106, -6784978, -6184347, -5339540, -4021825, -2381761, -1324092, -1619258, -2730137, -3326008, -2940518, -2226218, -1538599, -389900, 1325170, 2637293, 2699705, 1864214, 877297, -252441, -1749151, -3004059, -3014086, -1771241, -510642, -525233, -2010879, -3878060, -4543815, -3385387, -1606619, -950156, -1286546, -600668, 1932450, 4210145, 3936424, 1959694, 890156, 1084222, 514178, -1357670, -2428473, -1706054, -1532682, -4019725, -7242228, -7665032, -5287161, -3478421, -3936427, -4731742, -3994566, -2824768, -2984725, -3720345, -2984078, -737390, 1068243, 1429858, 1359547, 1951720, 2970193, 3738542, 4153258, 4266251, 3870943]
35132C870943p74810n03912l4652k12458p09585m54462L56128K27424j225528
35123E39088k317729j577951J93042J188225R85008M77616J24783l39314p46173
35114a473405m47773M59101J009558P25510J74117k9413J12825M87225J067012
35105B084757J362267P38522l42906n58192K63502O18820l71185j471908j302585
35096A021092m76052k04813j1951J038227J755566K18859k438937k676817L11732
35087a463094K980092K355293k3023j079276q00095j140003j968418j357936O43238
35078a853222J637417N38025r70769j194652m69860J93673N30066L85549m54290
35069a658063j079954k5304K105086K607704N06646j593503j128897P78490J385817
$$ y = [3870943, 3096133, 2592221, 2557569, 2345111, 1635526, 1181064, 1537192, 1764616, 539088, -1778641, -3356592, -3163550, -1975325, -990317, -512701, -387918, -727232, -1473405, -1921178, -1462077, -452519, 272991, 447108, 417695, 530520, 1017745, 2084757, 3447024, 4185546, 3842640, 3284448, 3547950, 4166770, 3795585, 2323677, 1021092, 545040, 340227, 328276, 1366503, 3122069, 3340928, 901991, -1774826, -1463094, 1516998, 3872291, 3849268, 2769992, 1969897, 829894, -1138524, -2496460, -1853222, -215805, 322220, -648549, -1843201, -2313061, -2119388, -1589322, -1203773, -1658063, -2738017, -2763321, -658235, 1949469, 2456115, 862612, -266285, 512205, 1898022]
35060A898022N30826J96173P31626L50723j505193k822299j879629L04916J442638
35051g52197Q11256l06102m55895L72731Q35292j71483j910971k274865l53713
35042d205947K073060K519203Q06241r63927j135473m9305R84157J112747L00043
35033A440799p88533j212819p81707l93291o32873o80451K83065J361567J212557
35024a91686L81676M03025R68841L41859j342348j733028P2755J862365J421240
35015B184699o42635k358877k866261k192093l61599J787829K477078J242359
35007g29500l2914J89414Q23580K05413j047902j201176k66337L70036L10761
34998a378625J34336j99779q96200r83315M10543J968721J612441k95073j405949
$$ y = [1898022, 2428848, 2625021, 3356647, 3707370, 2202177, -620122, -2499751, -2194835, -752197, 59059, -247043, -702938, -330207, 505085, 333602, -1577369, -3852234, -4205947, -2132887, 386316, 1192557, 228630, -906843, -956148, 28009, 1140756, 1440799, 652266, -560553, -1342260, -1735551, -2368424, -3048875, -2765810, -1404243, -191686, 189990, 593015, 1561856, 1903715, 561367, -1171661, -1098906, 763459, 2184699, 1542064, -816813, -3683074, -5875167, -6236766, -4448937, -1971859, -729500, -762414, -573000, 250580, 455993, -591909, -1793085, -2059422, -1689386, -1378625, -1244289, -1444068, -2340268, -3323583, -2913040, -944319, 668122, 373049, -1032900]
34989a032900q81310j26613j1094K27210Q90738R86135K78104J09712J141549
34980A581531K020174J433692O1210o45923m48850n6432J15837k2754n89930j293658
34970B154897j397838p65922j57604K7889L64696J160555J602455R45557k49121
34961C685564r07542q85560q58652j171193j413165r63343K89444J570797J728872
34952A075222O03018m79450l73882K04010j30531j046970r96346R3180O28448
34943d23301J02159q5063P92255J458959R11971J05193J32266M89066N13607Q42606
34933D839718J830498K112260O19133j290386j712447j125930j317211k194166
34925A761469j973976k89786J008951M13221j392046k488629j574977J027238
$$ y = [-1032900, -1914210, -2040823, -2051917, -1824707, -933969, 52166, 330270, 439982, 1581531, 3601705, 5035397, 5096607, 4450684, 4001834, 3945402, 4061239, 4038485, 3448555, 2154897, 757059, -8863, -166467, -138578, 226118, 1386673, 2989128, 3934685, 3685564, 2778022, 1892462, 1033810, -137383, -1550548, -2513891, -2224447, -653650, 1075222, 1678240, 1198790, 824908, 1028918, 898387, -148583, -1144929, -1051749, -423301, -321142, -406205, 386050, 1845009, 2756980, 2862173, 2994439, 3483505, 3997112, 4839718, 6670216, 8782476, 9401609, 8111223, 6398776, 5272846, 3955635, 1761469, -212507, -502293, 506658, 919879, -472167, -2960796, -4535773, -3508535]
34917c508535L414274L600278J757201J91804K88139P34048q678j074394r36546
34908D457591k79872o36644j317942o14902P27763N23867o96080j86612K000355
34899C977524K366477m18329k963029k336696n33279q81634k579987k324407J49642
34890e543718J837938J326723N05399J021190J844053J382604l0915r90872j002748
34881C49654n24469O7351O15642Q54476O46032K00355l04203q80417j275295r79564
34871a230438q2237N09213K63438q3796M44149J496885J736512O97168o02940
34862C147954j148643j128416j086892p34441L54834J364811R43921o42018j434276
34853c63166l89038J121927J245377J13090o73492l36101M38717P54859L63803
$$ y = [-3508535, -94261, 3506017, 5263218, 5455022, 5743161, 6477209, 6468531, 5394137, 4457591, 4177719, 3541075, 2223133, 1608231, 2335994, 2859861, 2163781, 1977169, 3977524, 6344001, 5925672, 2962643, 625947, 92668, -788966, -3368953, -5693360, -5543718, -3705780, -2379057, -1873658, -852468, 991585, 2374189, 2343274, 1352402, 349654, -174815, -107464, 508178, 1362654, 2008686, 2209041, 1904838, 1024421, -250874, -1230438, -1312675, -803462, -540024, -623820, -179671, 1317214, 3053726, 3750894, 3147954, 1999311, 870895, -215997, -950438, -595604, 769207, 1713128, 1071110, -363166, -752204, 369723, 1615100, 1728190, 1054698, 718597, 1157314, 1912173, 2275976]
34844B275976m87920j179713r35897K79440J400658J511421R61218M94531N8384
34835D378098n04669n53944J08271P5686j646574l261133k224979P13602K258335
34826f57307J424958O61917J411736J691742k80727k751579k950327j018219Q04119
34817a663687J409684J127892J54331j108305j251000L48276J794260R37253j366751
34808C81953k460666j691842o85870l19691O3434N67155M07192j28973K25960
34799c641348J266756J255834j10791r47666k09288P14842N29126J11673O61118
34790c69744J491986J266793J26666q75007j358307j330065m73460R02919J362883
34781G44664K94933p43366k84857N64245r0480j605811j714947l28277K93570
$$ y = [2275976, 1788056, 608343, -327554, -48114, 1352544, 2863965, 3825183, 4319714, 4378098, 3873429, 3319485, 3427756, 3503442, 1856868, -1404265, -3629244, -2915642, -657307, 767651, 1429568, 2841304, 4533046, 4252319, 1500740, -1449587, -2467806, -1663687, -254003, 873889, 1028220, -80085, -1331085, -982809, 811451, 1748704, 381953, -2078713, -3770555, -4456425, -4776116, -4712682, -4145527, -3738335, -3867308, -3641348, -2374592, -1118758, -1229549, -2177215, -2386503, -1671661, -1142535, -1030862, -369744, 1122242, 2389035, 2515701, 1640694, 282387, -1047678, -1521138, -618219, 744664, 1039597, 296231, 11374, 575619, 485139, -1120672, -2835619, -3163896, -2870326]
34772b870326o06879r95834M19519J836200J177384o09844j099233K021R25166
34763a821826Q61430P43491J075958J006220P1090p21658l72627O23346J037660
34754B503084L94477q61875j916508j804729l1408K273988K760959N42267k175503
34745A684752k474776m38561R68364j36319k160711k348055m05570J373446J266664
34736b670766J62537J7459J123445J944061J560933J004578J356426J618633J55628
34727F272934k162224k496065k45756J595127O92975j130577q43388J043285J543999
34718D270310O3883j051851o76911l11180p77946p03062N06258J044857k35313
34709B129045j576516j032720N78081J348445J079886M86406n96402k096470k481394
$$ y = [-2870326, -3477205, -4473039, -4053520, -2217320, -1039936, -1649780, -2749013, -2746992, -1821826, -960396, -216905, 859053, 1865273, 1936363, 1214705, 842078, 1465424, 2503084, 2897561, 2035686, 119178, -1685551, -1716959, 557029, 3317988, 3860255, 1684752, -790024, -1228585, -260221, -396540, -2557251, -4905306, -5310876, -3937430, -2670766, -2508229, -2490770, -1367325, 576736, 2137669, 3142247, 4498673, 6117306, 6272934, 4110710, 1614645, 1368889, 2964016, 3656991, 2526414, 1683026, 2726311, 4270310, 4334193, 3282342, 2605431, 2294251, 1516305, 813243, 1319501, 2364358, 2129045, 552529, -480191, 97890, 1446335, 2526221, 3012627, 2416225, 319755, -2161639]
34700b161639r38191P17195O28406j32752K85363J018546K17274j086196m56175
34691a908169J372479J286003r40510k079484o84908Q69578O26115k20609k75735
34682a955240l25172r13896n81571J230004K168748M68008j724318j325656J005377
34673a953716K056770Q26240p42727j192361j002914o73422K24979J594701K196089
34664A333639J159446r08905k633223k955075j617165N88032K117847J965259
34656i50145O30537n73311q49867k59360O13505R28624L04937l70276J20128J216394
34646H11166R29027r68323j939961k91722J989102K002932J41234q93408l46272
34637A433775j8314q97967j782913j558794o42330L53185J462299K264270J676904
$$ y = [-2161639, -3099830, -2382635, -1754229, -1886981, -1601618, -583072, -365798, -1451994, -1908169, -535690, 750313, -190197, -2269681, -2954589, -2085011, -1458896, -1679505, -1955240, -2280412, -3194308, -3775879, -2545875, -377127, 90881, -1633437, -2959093, -1953716, 103054, 929294, 186567, -1005794, -2008708, -2682130, -2457151, -862450, 1333639, 2493085, 1584180, -1049043, -4004118, -5621283, -5033251, -2915404, -950145, -319608, -892919, -1742786, -2002146, -1388641, -460017, -155080, -525356, -405228, 811166, 1740193, 771870, -1168091, -1459813, 529289, 2532221, 2673455, 1780047, 1433775, 1415461, 517494, -1265419, -2824213, -3466543, -3113358, -1651059, 613211, 2290115]
34628B290115l36920k186062k464017j292316M75590K132447K850784J962869
34620C432490J46509q74387m56966K07670N665o09766p16445l81823j77422j47667
$$ y = [2290115, 1953195, -232867, -2696884, -3989200, -3513610, -1381163, 1469621, 3432490, 3578999, 2704612, 2247646, 2455316, 2460981, 1851215, 1134770, 752947, 575525, 427858]
$$ [...]
##END NTUPLES=NMR SPECTRUM
##END=
