##TITLE=31P_DE-80H_X3
 64 sc D2O
 26.2.2025
##JCAMPDX= 6.0         $$ Bruker NMR JCAMP-DX V2.0
##DATA TYPE= NMR SPECTRUM
##DATA CLASS= NTUPLES
##ORIGIN= UXNMR, Bruker Analytische Messtechnik GmbH
##OWNER= root
$$ XWIN-NMR		Version 3.5
$$ Wed Jun 18 14:42:30 2025 Russian Standard Time (UT+4h)  Yarkov@DPX200
##.OBSERVE FREQUENCY= 81.013821
##.OBSERVE NUCLEUS= ^31P
##.ACQUISITION MODE= SIMULTANEOUS
##.ACQUISITION SCHEME= undefined
##.AVERAGES= 64
##.DIGITISER RES= 17
##SPECTROMETER/DATA SYSTEM= spect
##.PULSE SEQUENCE= zgpg30
##.SOLVENT NAME= CDCl3
##.SHIFT REFERENCE= (INTERNAL, CDCl3, 0, 198.062)
##AUDIT TRAIL= $$ (NUMBER, WHEN, WHO, WHERE, WHAT)
$$ ##TITLE= Audit trail, XWIN-NMR		Version 3.5
$$ ##JCAMPDX= 5.01
$$ ##ORIGIN= Bruker BioSpin GmbH
$$ ##OWNER= Yarkov
$$ C:/Bruker/XWIN-NMR/data/yarkov2/nmr/P31/2/pdata/1/auditp.txt
$$ ##AUDIT TRAIL=  $$ (NUMBER, WHEN, WHO, WHERE, WHAT)
(   1,<2025-06-18 14:41:17.20 +0400>,<Yarkov>,<DPX200>,
      <created by zg, POWCHK disabled, PULCHK disabled
       configuration hash MD5:
       00 E9 B6 7A A2 85 ED C7 34 08 36 98 17 FE 4E 26
       data hash MD5: 32K
       4C AA DC 71 77 D2 99 71 60 6D 44 0B 02 BD 31 3D>)
(   2,<2025-06-18 14:41:22.15 +0400>,<Yarkov>,<DPX200>,
      <Start of raw data processing
       efp BC_mod = 2 LB = 1.5 FT_mod = 6 PKNL = 1 PHC0 = 1646.446 PHC1 = 70.95951 SI = 64K 
       data hash MD5: 64K
       6C 48 B8 00 BA 66 8B F4 C8 63 42 83 6F 69 11 4F>)
(   3,<2025-06-18 14:42:10.00 +0400>,<Yarkov>,<DPX200>,
      <pk PHC0 = -140.7363 PHC1 = -12.59998 
       data hash MD5: 64K
       60 70 F2 01 B8 DF C3 71 6D B9 5F 1E 19 5D 2F E5>)
$$ ##END=
$$ 
$$ hash MD5
$$ 2A DC 47 CC 49 86 55 F1 F7 99 81 0C 62 59 E6 C5
##$RELAX= 
##$RELAX= 
##$RELAX= 
##$RELAX= 
##$RELAX= 
##$RELAX= 
##$RELAX= 
##$RELAX= 
$$ Bruker specific parameters
$$ --------------------------
##$DU= <C:/Bruker/XWIN-NMR>
##$EXPNO= 2
##$NAME= <P31>
##$PROCNO= 1
##$TYPE= <nmr>
##$USER= <yarkov2>
##$AMP= (0..31)
100 100 100 100 100 100 100 100 100 100 100 100 100 100 100 100 100 100 
100 100 100 100 100 100 100 100 100 100 100 100 100 100 
##$AQSEQ= 0
##$AQ_mod= 1
##$AUNM= <au_zg>
##$AUTOPOS= <>
##$BF1= 81.014009
##$BF2= 200.13
##$BF3= 200.13
##$BF4= 200.13
##$BF5= 200.13
##$BF6= 200.13
##$BF7= 200.13
##$BF8= 200.13
##$BYTORDA= 1
##$CFDGTYP= 0
##$CFRGTYP= 5
##$CHEMSTR= <none>
##$CNST= (0..31)
1 1 145 1 1 1 1 1 1 1 1 1 1 1 1 1 1 1 1 1 1 1 1 1 1 1 1 1 1 1 1 1 
##$CPDPRG= <waltz16>
##$CPDPRG1= <>
##$CPDPRG2= <waltz16>
##$CPDPRG3= <>
##$CPDPRG4= <mlev>
##$CPDPRG5= <mlev>
##$CPDPRG6= <mlev>
##$CPDPRG7= <mlev>
##$CPDPRG8= <mlev>
##$CPDPRGB= <>
##$CPDPRGT= <>
##$D= (0..31)
0 1 0 0 0 0 0 0 0 0.06 0 0.03 2e-05 3e-06 0 0 0.0002 0 0 0 0 0 0 0 0 0 
0 0 0 0 0 0 
##$DATE= 1750243276
##$DBL= (0..7)
120 120 120 11 120 120 24 19 
##$DBP= (0..7)
150 150 150 150 150 150 150 150 
##$DBP07= 0
##$DBPNAM0= <>
##$DBPNAM1= <>
##$DBPNAM2= <>
##$DBPNAM3= <>
##$DBPNAM4= <>
##$DBPNAM5= <>
##$DBPNAM6= <>
##$DBPNAM7= <>
##$DBPOAL= (0..7)
$$ [...]
##$SUBNAM2= <"">
##$SUBNAM3= <"">
##$SUBNAM4= <"">
##$SUBNAM5= <"">
##$SUBNAM6= <"">
##$SUBNAM7= <"">
##$SUBNAM8= <"">
##$SUBNAM9= <"">
##$SW= 400.765351723535
##$SWIBOX= (0..15)
0 1 3 0 0 0 0 0 0 0 0 0 0 0 0 0 
##$SW_h= 32467.5324675325
##$TD= 32768
##$TD0= 1
##$TE= 0
##$TE2= 300
##$TE3= 300
##$TEG= 300
##$TL= (0..7)
0 120 53 12 22 120 120 120 
##$TP= (0..7)
150 150 150 150 150 150 150 150 
##$TP07= 0
##$TPNAME0= <>
##$TPNAME1= <>
##$TPNAME2= <>
##$TPNAME3= <>
##$TPNAME4= <>
##$TPNAME5= <>
##$TPNAME6= <>
##$TPNAME7= <>
##$TPOAL= (0..7)
0.5 0.5 0.5 0.5 0.5 0.5 0.5 0.5 
##$TPOFFS= (0..7)
0 0 0 0 0 0 0 0 
##$TUNHIN= 0
##$TUNHOUT= 0
##$TUNXOUT= 0
##$USERA1= <user>
##$USERA2= <user>
##$USERA3= <user>
##$USERA4= <user>
##$USERA5= <user>
##$V9= 5
##$VALIST= <valist>
##$VCLIST= <CCCCCCCCCCCCCCC>
##$VD= 0
##$VDLIST= <DDDDDDDDDDDDDDD>
##$VPLIST= <PPPPPPPPPPPPPPP>
##$VTLIST= <TTTTTTTTTTTTTTT>
##$WBST= 1024
##$WBSW= 4
##$XGAIN= (0..3)
0 0 0 0 
##$XL= 0
##$YL= 0
##$YMAX_a= 98
##$YMIN_a= -139
##$ZGOPTNS= <>
##$ZL1= 120
##$ZL2= 120
##$ZL3= 120
##$ZL4= 120
##$ABSF1= 0
##$ABSF2= 0
##$ABSG= 0
##$ABSL= 0
##$ALPHA= 0
##$AQORDER= 0
##$ASSFAC= 0
##$ASSFACI= 0
##$ASSFACX= 0
##$ASSWID= 0
##$AUNMP= <proc_1d>
##$AZFE= 0.1
##$AZFW= 0.5
##$BCFW= 0
##$BC_mod= 2
##$BYTORDP= 0
##$COROFFS= 0
##$CY= -3
##$DATMOD= 1
##$DC= 0
##$DFILT= <>
##$DTYPP= 0
##$F1P= 0
##$F2P= 0
##$FCOR= 1
##$FTSIZE= 65536
##$FT_mod= 6
##$GAMMA= 0
##$GB= 0
##$INTBC= 1
##$INTSCL= 9.790993e-09
##$ISEN= 30
##$LB= 1.5
##$LEV0= 0
##$LPBIN= 0
##$MAXI= 10000
##$MC2= 0
##$MEAN= 0
##$ME_mod= 0
##$MI= 50
##$NCOEF= 0
##$NC_proc= -14
##$NLEV= 6
##$NOISF1= 182.463
##$NOISF2= 159.3651
##$NSP= 0
##$NTH_PI= 0
##$NZP= 0
##$OFFSET= 198.0616
##$PC= 4
##$PHC0= 1505.71
##$PHC1= 58.35953
##$PH_mod= 1
##$PKNL= yes
##$PPARMOD= 0
##$PSCAL= 0
##$PSIGN= 0
##$REVERSE= no
##$SF= 81.0140089999434
##$SI= 65536
##$SIGF1= 159.3651
##$SIGF2= -187.1042
##$SINO= 113.3802
##$SIOLD= 16384
##$SREGLST= <1H.CDCl3>
##$SSB= 0
##$STSI= 65536
##$STSR= 0
##$SW_p= 32467.5324675325
##$SYMM= 0
##$S_DEV= 0
##$TDeff= 32768
##$TDoff= 0
##$TI= <>
##$TILT= no
##$TM1= 0
##$TM2= 0
##$TOPLEV= 0
##$USERP1= <user>
##$USERP2= <user>
##$USERP3= <user>
##$USERP4= <user>
##$USERP5= <user>
##$WDW= 1
##$XDIM= 65536
##$YMAX_p= 273168788
##$YMIN_p= -360060639
$$ End of Bruker specific parameters
$$ ---------------------------------
##NTUPLES= NMR SPECTRUM
##VAR_NAME=  FREQUENCY,     SPECTRUM/REAL,   SPECTRUM/IMAG
##SYMBOL=    X,             R,               I
##VAR_TYPE=  INDEPENDENT,   DEPENDENT,       DEPENDENT
##VAR_FORM=  AFFN,          ASDF,            ASDF
##VAR_DIM=   65536,         65536,           65536
##UNITS=     HZ,            ARBITRARY UNITS, ARBITRARY UNITS
##FACTOR=    0.49542278885378, 1,            1
##FIRST=     16045.7642231865, 0,            0
##LAST=      -16421.768244346, 0,            0
##MIN=       -16421.768244346, -360060639,   0
##MAX=       16045.7642231865, 273168788,    0
$$ Real data points
##PAGE= N=1
##DATA TABLE= (X++(R..R)), XYDATA
$$ [...]
7351B394312N741502N35944n619090l386069M182775N857247o61474n898116m323554
7342a176523k463375o303057r881278m922866M233029N611850k452137q165205
7334b5519562k643474Q273208J2235866N470927m399423p885128k428736O894544
7326a0001778J2350105R474662N48420p010693p031916n27958N042713L395570
7318F239125l611798p759560l864520L937667O906047J725590o384037j0074255
7310a2885741o750732Q03724P492241Q960658M881924L90488J060619N278087
7302I231268N611547k96329n235618k822419K393334J555805m768066p236946
7294a567424j603355N929018Q938376Q947408R358941P538033m79729j0626768
$$ y = [2394312, 8135814, 8671758, 3052668, -333401, 3849374, 9706621, 9045147, 3147031, -1176523, -3639898, -9942955, -19824233, -24747099, -20514070, -14902220, -17354357, -25519562, -28163036, -19889828, -7653962, -2183035, -6582458, -14467586, -16896322, -10001778, 2348327, 11822989, 12371409, 5360716, -1671200, -2199158, 2843555, 6239125, 2627327, -5132233, -8996753, -5059086, 1846961, 3572551, -2811486, -12885741, -19636473, -18832749, -11340508, -2379850, 2502074, 2892562, 3953181, 9231268, 14842815, 14546486, 9310868, 6488449, 8881783, 10437588, 5669522, -1567424, -3170779, 2758239, 11696615, 20644023, 30002964, 37540997, 37061268, 26434500]
7286B6434500j3576014p221699k83897q13498n528056n105483J981928O772077
7278B659858K402067n807639p458578j209827M677402N349572N102985P393231
7270A3109071P013191j077997j0697877j1280244l483889J514490j374155m634447
7262a0911857j031458N552491P347446M189382J416642P17590l09242k012849
7254D958145k277476j136194o79201j004573o69983n46534k824087o256657o508420
7245a6944980j905789M169447P065761M830647j082003o547787p070233k286486
7237a9771423K607667K882623M54843M18763K944452L679624J610665N53818J916700
7228b702268K064699o80740k031738J479170O134869N988428J170277l174827
$$ y = [26434500, 12858486, 5636787, 5352890, 4539392, -988664, -6094147, -4112219, 2659858, 5061925, -745714, -8204292, -9414119, -4736717, 612855, 5715840, 13109071, 20122262, 19044265, 8346388, -2933856, -6417745, -4903255, -6277410, -10911857, -11943315, -6390824, 956622, 5146004, 6562646, 7280236, 6970994, 4958145, 2680669, 1544475, 865274, -139299, -809282, -1355816, -4179903, -10436560, -16944980, -18850769, -14681322, -7615561, -2784914, -3866917, -10414704, -17484937, -19771423, -17163756, -14281133, -13826290, -13407527, -10463075, -6783451, -5172786, -4618968, -2702268, -637569, -1318309, -3350047, -1870877, 4263992, 10252420, 11422697, 8247870]
7220H247870m129195k968090j365150L11950J596887K170281L016598M656684
7212A1537835N179683K808557o79034k077616j218874k30032L38579R75415J40737
7203A6775250l555906o663677l877067L377722O807509K012147n397575p624925
7195A853478m494055j355319m42171N65025K719711L600382J494985j761945l268974
7186a088883k203320K10319K160524K234098M81539j096889m73854J662174K425891
7177D311599N38992j644340j062602J627984K162598j758437o021650l909560
7169e755416M683586J1005300P723155r60388m750115j790403n79358n770607
7161C805754j0188965o244649J628643L945123Q53928J52846K800284J235764
$$ y = [8247870, 4118675, 1150585, -214565, 97385, 1694272, 3864553, 6881151, 11537835, 16717518, 19526075, 18847041, 16769425, 15550551, 15320519, 15659098, 16634513, 16775250, 13219344, 6555667, 2678600, 6056322, 12863831, 14875978, 9478403, 1853478, -2640577, -3995896, -4438067, -3873042, -1153331, 2447051, 3942036, 2180091, -1088883, -3292203, -3081884, -921360, 1312738, 1794277, 697388, 223534, 1885708, 4311599, 4850591, 3206251, 2143649, 3771633, 5934231, 4175794, -1845856, -5755416, -1071830, 9933470, 17656625, 16696237, 11946122, 10155719, 9576361, 3805754, -6383211, -12627860, -10999217, -7054094, -6200166, -6047320, -3247036, -2011272]
7153b011272o664195j2254648q815115j219484K405247J868427J711845K515948
7145b2463247K372519K844013N972610P977316L645322l900262n296018K225856
7137f621891J0314583R882851J406271p248618r611696n118283K215298P313999
7129B532514P856576N966426N018175M726452J623626n128970j1054851j1098800
7121D41148n527258N12523K756725J921616J696308L140843K622489k970068j0063755
7112e469429j1138569m368212L569404O322960N108954L902988K290035j457248
7104a239117m173154j774615K895755L768276J758007L057212P436159P325984
7096A9054507L15752o381275p284545n981740o490930n490869K99619N813882
$$ y = [-2011272, -8675467, -20930115, -29745230, -30964714, -28559467, -26691040, -24979195, -22463247, -20090728, -17246715, -11274105, -3296789, 348533, -3551729, -8847747, -6621891, 3692692, 13575543, 14981814, 7733196, -1878500, -6996783, -4781485, 2532514, 10389090, 16355516, 21373691, 26100143, 27723769, 22594799, 11539948, 441148, -5086110, -4573587, -1816862, 104754, 1801062, 4941905, 7564394, 4594326, -5469429, -16607998, -20976210, -17406806, -11083846, -5974892, -2071904, 218131, -1239117, -5412271, -7186886, -4291131, -522855, 1235152, 4292364, 11728523, 19054507, 19370259, 12988984, 5704439, -277301, -6768231, -12259100, -11959481, -6145599]
7088f145599M550331r58041l320944j381117L94295O75241J624854K500044P94721
7079a266215j267166P74220M842525L966830k401951o472763l720684O90760M37163
7070d417281l112048m771379l466682j599426K22074L219549O955649R405856
7062B436312R484599P105288K204499l882120p468336n677429k17712L860198
7054G845299L116596j503156o320494q388775p448792m882958j228392L863216
7046a4947456Q609722Q704240K810598l529225l707995J105569L727278J391933
7038D164664j253866p70213k90219l018929n849494m204367P67951M786606O781696
7029A113829P247817L576661n876651j4667618j3281944k353710O409341N160686
$$ y = [-6145599, -1595268, -2553309, -5874253, -7255370, -6861075, -6185834, -4560980, -2060936, -1266215, -2533381, -1759161, 3083364, 7050194, 4648243, -1824520, -5545204, -4854444, -4417281, -7529329, -12300708, -15767390, -17366816, -17144742, -13925193, -6969544, 2436312, 11920911, 19026199, 21230698, 17348578, 9880242, 4202813, 3985101, 7845299, 10961895, 9458739, 3138245, -5250530, -12699322, -17582280, -18810672, -14947456, -6337734, 2366506, 5177104, 1647879, -2060116, -954547, 2772731, 4164664, 2910798, 2140585, 1850366, -1168563, -7018057, -11222424, -10454473, -5667867, 1113829, 8361646, 11938307, 6061656, -8605962, -21887906, -24241616, -17832275, -12671589]
7021a2671589p25901k150955R08606K186912M95932N41543L547184M714880J481922
7012a671466k157904k486649j745015k914978l462497J85297N101943N388756
7004c762513J891955J380293N524186P692338L112747m008633p099199n538675
6996h07501k160216K327943O948652P152608R27459m957869k607017M771711O451516
6987A8047286k83453o690734n989060j689223P44280K515827O266180Q461017
6979B1382120M127460m013115p794700m090263J935667L982999J338967j996489
6971A4872646k595893j273433j712317n041701p072986l632361K567831N063989
6963A175775L335313L086256N651975M760885k289404p756325m255528L383343
$$ y = [-12671589, -13397490, -15548445, -14639839, -12452927, -11956995, -11415452, -7868268, -3153388, -1671466, -3829370, -6316019, -8061034, -10976012, -14438509, -14253212, -9151269, -3762513, -1870558, -490265, 5033921, 12726259, 15839006, 11830373, 4731174, -807501, -2967717, -639774, 6308878, 13461486, 14388945, 9431076, 6824059, 11595770, 18047286, 17763833, 11073099, 5084039, 3394816, 4139096, 6654923, 12921103, 21382120, 25509580, 21496465, 13701765, 9611502, 11547169, 15530168, 16869135, 14872646, 12276753, 11003320, 9291003, 4249302, -2823684, -6456045, -3888214, 1175775, 4511088, 7597344, 13249319, 18010204, 15720800, 7964475, 3708947, 7092290]
6955G092290M898519p12546n504509n102664k476094j63728K959055O394604O733014
6946A4117941L393830M295j403480k602703m535796n330128m045126k003675K57455
6937b147387K990200M193347J750285j278458N24256O025612P860037L345141
6929B3263033j378772p73824K614640L475973J092828k267947n370380o697501
6921A3958050l864775J762361M377994J568969j786082j513348p89556l529799
6913A0183814o340674m063441M99226L33057m312934o088367j811716L582795
6905h018240N071222L332164J375288P68686K432947O196118Q279398M164004
6897B3601587m318625r409618p050632j837486l556j616436k866753k519311k095421
$$ y = [7092290, 11990809, 11278263, 5773754, 671090, -1805004, -1968732, 990323, 7384927, 14117941, 17511771, 17516066, 16112586, 13509883, 8974087, 3643959, -401167, -2404842, -2147387, 842813, 5036160, 6786445, 5507987, 6032243, 12057855, 19917892, 23263033, 21884261, 21110437, 23725077, 27201050, 28293878, 26025931, 20655551, 13958050, 10093275, 11855636, 16233630, 17802599, 16016517, 14503169, 13713613, 10183814, 3843140, -220301, 278925, 611982, -3700952, -9789319, -11601035, -8018240, -2947018, 385146, 1760434, 2529120, 4962067, 11158185, 19437583, 23601587, 19282962, 9873344, 2822712, 985226, 981670, -634766, -3501519, -6020830, -8116251]
6888h116251j782933r1553L075367N755988O080493L581713o91787m121328m200231
6879e10522j876367j258666l863238n463014k011438L230508L309827k045492
6871a0488402n214504j584570L647715L434307n93589j270990K695278N270944
6863d103811L182538N57386J036905J525390j641504n113380l091523L284369
6855d363630P185569N407018R18434k815796m331131j843466M931326J0447082
6847A5535406P880937o03082n166914j933211K187316J394162o01500N95040R74465
6838B0262619m107891r405824o729547J431402N173472J993558j570825k326655
6830D720309m094117p704327p362439o33810O172414P125880M582655L499489
$$ y = [-8116251, -9899184, -9990737, -6915370, -1159382, 4921111, 8502824, 7811037, 3689709, -510522, -2386889, -3645555, -7508793, -12971807, -14983245, -11752737, -8442910, -10488402, -15702906, -17287476, -13639761, -10205454, -10799043, -12070033, -9374755, -4103811, -921273, -363887, 673018, 2198408, 556904, -4556476, -7647999, -4363630, 2821939, 8228957, 9147391, 6331595, 2000464, 156998, 5088324, 15535406, 23416343, 22813261, 17646347, 15713136, 17900452, 19294614, 18693114, 19288154, 20262619, 16154728, 6748904, 19357, 1450759, 6624231, 8617789, 7046964, 4720309, 626192, -7078135, -14440574, -15074384, -8901970, -1776090, 2806565, 6306054]
6822F306054L765293L054655K168557K260639R01484l774784q310425q447852
6814b076379n668786m254377m295200k824685L8304J568137J961776L986413P367221
6805d197576Q596775O664124M250315K596659N946l268009l670929m88803J237991
6796A1726493k044577n758521l095395M182207O912760J053516o846835r287303
6788c157655p596273p248957p513095l112575M886746Q185889L630166r56614
6780a2882368J776686P355608O353727j307289o748678n130097m61321K506044
6772h537688L698315L839336K217756N46172K585524P134257P560571J664131
6764B0708374m099772m357572k645122m044948n663976j802626N009974O217125
$$ y = [6306054, 10071347, 13126002, 15294559, 17555198, 18456682, 14681898, 6371473, -2076379, -7745165, -11999542, -16294742, -19119427, -19081123, -17512986, -15551210, -11564797, -4197576, 4399199, 11063323, 15313638, 17910297, 17916243, 14648234, 10977305, 10488502, 11726493, 9681916, 3923395, 828000, 5010207, 11922967, 12976483, 6129648, -3157655, -10753928, -18002885, -25515980, -28628555, -23741809, -15555920, -11925754, -12882368, -11105682, -3750074, 2603653, 1296364, -5452314, -10582411, -11043732, -8537688, -4839373, -1000037, 1217719, 1763891, 4349415, 11483672, 19044243, 20708374, 16608602, 12251030, 9605908, 5560960, -103016, -1905642, 3104332, 9321457]
6756I321457n07226p990409q826500k791038N058361R209422O751086j94227n145795
6747D885131l910457J67179J060649j577220l499226l471073l784879l975086
6739a4104982p73408M967970P784309N645295K540869J194203n79607l611698
6731C062951m013584k62660K239930p88650m671119k434675M077849O894838L905710
6722H010590O60484J62475j555632p176899j1844969r767793l014129J593056
6714b2932817K362728L915888Q376927J0893874O707985j170135n614127m738678
6706b198355k673861j458475J901516Q156676J1379884O815391o62548k397647
6698A8862581J461365K371512l139368p724757m115335M058653P273813K526117
$$ y = [9321457, 8814231, 823822, -8002678, -10793716, -5735355, 3474067, 10225153, 10030926, 4885131, 974674, 1141853, 2202502, 625282, -2873944, -6345017, -10129896, -14104982, -14878390, -9910420, -2126111, 3519184, 6060053, 7254256, 6674649, 3062951, -950633, -1213293, 1026637, 237987, -4433132, -6867807, -2789958, 4104880, 8010590, 8671074, 8833549, 7277917, 101018, -11743951, -21511744, -24525873, -22932817, -20570089, -16654201, -8277274, 2616600, 9324585, 8154450, 2540323, -2198355, -4872216, -6330691, -4429175, 3727501, 15107385, 21922776, 21260228, 18862581, 20323946, 22695458, 19556090, 11831333, 7715998, 11774651, 19048464, 21574581]
6690B1574581m242318o483512l469079J050959K997574N48658m785677r068975
6682a877789r334448o217824k494351K55420K486597M979263P398396Q239688
6674C434952O049662J596088j652815j264780L10434j284496n428810o815902
6666e055667l820623j682386m458379q357945p287136j390104M628264Q583906
6658a8840070J1009122J0884449P042534K214296j07423j515105n336211q692432
6650c340840n243882L811797R022798N046416k715936o351351m431363j39177
6642d341538L743051M779463J392681l009769j843637M918837Q573516L825068
6634A8037672k988099l896171j650420l882398r195835q935272j538771M430206
$$ y = [21574581, 17332263, 10848751, 7379672, 8430631, 11428205, 11976863, 7191186, -1877789, -11212237, -17430061, -19924412, -19668992, -17182395, -12203132, -4804736, 3434952, 9484614, 11080702, 9427887, 8163107, 8473541, 7189045, 1760235, -5055667, -8876290, -10558676, -15017055, -23375000, -30662136, -32052240, -27423976, -18840070, -7830948, 3053501, 10096035, 12310331, 12202908, 10687803, 5351592, -3340840, -8584722, -4772925, 4249873, 9296289, 6580353, 229002, -4202361, -4341538, -598487, 4180976, 5573657, 2563888, 720251, 5639088, 14212604, 18037672, 15049573, 11153402, 9502982, 5620584, -3575251, -12510523, -14049294, -9619088]
6626i619088K831226k309061l869096k97130N093816Q500717P449593K639647
6618A0420624q65467J213510N399009L885608m249107j1250819j1538076p790612
6610a4775330l932251O71172N945331P140657K222109k279060K99614O443571
6602A735813P592591K630650j907895k218550o66093L39993J100348J159426p78255
6593H988028k991055k390971m00493j421245m803550m600833R38074N708668M463040
6584C489663j1233j938450n82654O27408M9526o85608N01275L971444P421116
6575A2842487O481343o40298q543662r163753k441218K716176O81043l513762
6567a581644l208970n31207j200917l551736j204126N243814P940608L781670
$$ y = [-9619088, -6787862, -9096923, -12966019, -13263149, -8169333, 331384, 7780977, 10420624, 9555157, 10768667, 16167676, 20053284, 15804177, 4553358, -6984718, -14775330, -18707581, -18036409, -12091078, -4950421, -2728312, -5007372, -4707758, 1735813, 9328404, 11959054, 10051159, 7832609, 7166516, 7506509, 8606857, 9766283, 8988028, 5996973, 3606002, 3205509, 1784264, -3019286, -7620119, -6682045, -973377, 3489663, 3478430, 1539980, 957326, 1584734, 1634260, 948652, 1449927, 5421371, 12842487, 19323830, 18683532, 10139870, 976117, -1465101, 1251075, 1932118, -1581644, -4790614, -5321821, -6522738, -10074474, -11278600, -6034786, 1905822, 5687492]
6559E687492j089640r86312J713067J966023l06638k189920l452664n525702o951129
6550a1135423m461741J685904O880396P248011L449367j136338m162603n050927
6542f683354l257622J708995P600452Q983609K730953o291228q975189l044920
6534g228304L401759K413824l357798n397926j830206J065787q50253m365624
6526a6148741n274827m033368k589984o80967J519716J447290j390974k638538
6518b9790393J086195O477961P959785N482999L371853L133740K375311J17245
6510B14696j803694k876107m739024o779282n339643M33367N444827M394061j396079
6501a2446878n793169n281132j747595J616405M064064N942212O144443L500141
$$ y = [5687492, 4597852, 3611540, 5324607, 7290630, 6983992, 4794072, 1341408, -4184294, -11135423, -15597164, -13911260, -7030864, 217147, 3666514, 2530176, -1632427, -6683354, -9940976, -8231981, -631529, 8352080, 11083033, 4791805, -4183384, -7228304, -3826545, -1412721, -4770519, -10168445, -11998651, -10932864, -11783117, -16148741, -21423568, -25456936, -28046920, -28727887, -27208171, -25760881, -27151855, -29790393, -28704198, -22226237, -14266452, -8783453, -5411600, -2277860, 97451, 214696, -1588998, -4465105, -9204129, -15983411, -21323054, -20889687, -15444860, -11050799, -12446878, -18240047, -23521179, -25268774, -23652369, -19588305, -13646093, -7501650, -4001509]
6493d001509k6141m65757K792273N226632L024798j195631k004070M83360P27780
6484D561735k830103m018138J806639R272558R438066K228593l966381m354866
6476A2138103k572953k419615j791622J601383M281366K090948k520642m041295
6468F765673k392472j887667k867386r55353M526496P640409M067503k539403
6460A2357800n901366n067461l126326j060365K249586N452614N260801J738856
6452A1904139j103821r28420M1478j091298l792127n113626k884960K665696Q398618
6443H095679R342314L217370n637768r999744q004400m105757j371901J965843
6435f498364O261266O839725J283376m619084m283529o6282J167506o34198K10402
$$ y = [-4001509, -4027650, -4493407, -1701134, 3525498, 6550296, 5354665, 3350595, 3833955, 4561735, 1731632, -2286506, -479867, 8792691, 18230757, 20459350, 16492969, 12138103, 9565150, 7145535, 5353913, 6955296, 11236662, 13327610, 10806968, 6765673, 4373201, 2485534, -381852, -1337205, 3189291, 10829700, 14897203, 12357800, 6456434, 1388973, -1737353, -2797718, -548132, 4904482, 10165283, 11904139, 10800318, 9871898, 9913376, 8822078, 5029951, -83675, -2968635, -302939, 8095679, 17437993, 20655363, 15017595, 5017851, -2986549, -7092306, -8464207, -6498364, -237098, 6602627, 7886003, 3266919, -1016610, -1082892, 84614, -549584, -339182]
6426c39182M046416M749891N26968k790728j840458j017194l647890n434801k398540
6417h145518J025393j071787n661172n087298R78776N702637N956438N308064
6409i94467N825311M345609p30852m974306l953339J95558J956483j76988k875767
6400a382758l293050k130533j325788r72792J59671J846528J982284j08160j507725
6391f732323N95674L766739K744442k302536m658332p63949L767881K407918k106733
6382c281219k273406J917573K793898l000587r540285j0236206n198348K083730
6374b6734850R351629J3915081J2219633N327166R8137K79777O58044m583220
6366A0531397j1517446j1335171l494217L489579M503731L744790N905539Q041090
$$ y = [-339182, 3707234, 8457125, 8984093, 6193365, 4352907, 3335713, -312177, -5746978, -8145518, -7120125, -8191912, -13853084, -18940382, -17961606, -12258969, -6302531, -994467, 4830844, 9176453, 8445601, 3471295, -482044, -286486, 1669997, 1493009, -1382758, -4675808, -6806341, -8132129, -9104921, -8945250, -7098722, -5116438, -5224598, -6732323, -6136649, -2369910, 374532, -1928004, -6586336, -7350285, -3582404, -1174486, -3281219, -5554625, -3637052, -843154, -3843741, -13384026, -23620232, -28818580, -26734850, -17383221, -3468140, 8751493, 14078659, 14176796, 14456573, 15114617, 10531397, -986049, -12321220, -15815437, -12325858, -7822127, -4077337, 1828202, 9869292]
6358I869292M896967j948520o040491n423353m414935n687577n839023j439388
6350a6027028M344217N378366J192415k531535k196784n30502q63170j370039
6342a2604060J345535N708488O882182M040055J376085J651961K902430K519131
6334A3821807Q39193p79417k051137k259451O708L545097M194224L44863m153662
6325A3508225n358035m380941l776356k246586J856799M270987r49146j0868067
6317g943120j4448248o600007M306736P182044K086066k024560n51180K462906
6309a5529363L105307L706174P044018R521235N484627l539951r226221o523579
6301e957753P24274N538815N682569L649909J756006M37245j28966M9405k68787
$$ y = [9869292, 14766259, 12817739, 6777248, 1353895, -3061040, -8748617, -14587640, -16027028, -11682811, -6304445, -5112030, -7643565, -9840349, -10370851, -11234021, -12604060, -11258525, -5550037, 1332145, 5372200, 6748285, 8400246, 11302676, 13821807, 14661000, 13881583, 11830446, 9570995, 9577703, 13122800, 17317024, 17661887, 13508225, 8150190, 3769249, -7107, -2253693, -396894, 3874093, 2924947, -7943120, -22391368, -28991375, -24684639, -17502595, -15416529, -17441089, -17992269, -15529363, -12424056, -8717882, -1673864, 7847371, 13331998, 9792047, 565826, -5957753, -5233479, 305336, 5987905, 9637814, 11393820, 11831065, 11702099, 11751504, 11482717]
6292A1482717k089120m022227l920963k217812j177961j255896q71964N16233
6284c556993K061411L949338O672206P816494L806591l941641q705247o388844
6276A713315m15098L288111K731696p31724n325912q136199n624548J001121M549395
6267f949843P81406m662395l821621K041934N247158L990399L629111N700011
6259E956160M488115k670352r316922q654468k659034K404233M788901O370839
6251G07472O914569N125123K901079K781265K632569j634431q661875j2006671
6243a240900q125630m8033O812274Q870050N125132j857863n956827l171163K421741
6234B828781L078065j858139m943767j541591M043284N751163L539142N40638
$$ y = [11482717, 9393597, 5371370, 1450407, -767405, -1945366, -3201262, -4073226, -3556993, -1495582, 2453756, 9125962, 16942456, 20749047, 16807406, 8102159, 1713315, 1298217, 4586328, 7318024, 6586300, 1260388, -6875811, -12500359, -11499238, -6949843, -6168437, -10830832, -14652453, -12610519, -7363361, -3372962, 256149, 5956160, 10444275, 7773923, -1542999, -10197467, -12856501, -10452268, -5663367, 707472, 7622041, 12747164, 15648243, 18429508, 21062077, 19427646, 10765771, -1240900, -9366530, -9414563, -2602289, 6267761, 11392893, 9535030, 3578203, 407040, 2828781, 5906846, 4048707, -895060, -2436651, 1606633, 7357796, 10896938, 11437576]
6226A1437576k380271m874619m446066n88777K250560J185979O25639N215009
6218H425030J0416785P914668j406606q288697q562698p059870o973051m548398
6210a0082837K028043O707313M067614k386655o011162o017951n109177k943934
6202a9748746J556611N086586L996085J002686J291440L774565K970105j360545
6194a431213l209260O35709O197351P826034L768596l838609j0322416j0336217
6186a0710025l076786M738196N767530J183395k067794j686467j124065j153997
6178h130013J491107N991239O290146R19668l610247k970936j442641l546813
6170e008490n880760l198132K577802N702128N174024M061282L257060J468222
$$ y = [11437576, 9057305, 4182686, -263380, -852157, 1398403, 2584382, 3210021, 8425030, 18841815, 26756483, 25349877, 17061180, 8498482, 1438612, -5534439, -10082837, -8054794, -1347481, 2720133, 333478, -5677684, -11695635, -16804812, -19748746, -18192135, -13105549, -9109464, -8106778, -6815338, -3040773, -70668, -1431213, -4640473, -4004764, 2192587, 10018621, 13787217, 9948608, -373808, -10710025, -13786811, -9048615, -3281085, -2097690, -4165484, -5851951, -6976016, -8130013, -6638906, -647667, 5642479, 6562147, 2951900, -19036, -1461677, -5008490, -10889250, -14087382, -11509580, -5807452, -633428, 3427854, 6684914, 8153136]
6162H153136p98014k085496k887629l721694k736604R59667M379033M798151L594113
6153I654663K261013j088968o529062q555101m008072O53198j983715p594603
6145a7190647n343008N506159J3734137J1722962M162057q41200j508500j48651
6137A0093309K079233M136587L711204N00904k555487l589771l780775l527405
6129G067799j090637K862386L855136l83769o092751q348438o672878l562737
6121a2365889o85427J044635O19278j231927j688620O07182L706827N398995N652352
6112A057406M959335L137724R46086j21474p03309k949461o138397o815567m476659
6103a1104316k663163k693186j243516L181345O408132N017052K190913K616142
$$ y = [8153136, 7355122, 5269626, 2381997, -1339697, -4076301, -3116634, 1262399, 6060550, 9654663, 11915676, 10826708, 4297646, -4257455, -8265527, -7612329, -9596044, -17190647, -22533655, -17027496, -3293359, 8429603, 12591660, 11750460, 10241960, 10093309, 12172542, 16309129, 20020333, 20521237, 17965750, 14375979, 10595204, 7067799, 5977162, 8839548, 12694684, 12310915, 6218164, -2130274, -8803152, -12365889, -13051316, -12006681, -11387403, -12619330, -14307950, -13700768, -9993941, -4594946, 1057406, 6016741, 9154465, 10100551, 9979077, 9275768, 6326307, 187910, -6627657, -11104316, -13767479, -16460665, -17704181, -14522836, -8114704, -3097652, -906739, 1709403]
6095A709403N104094N173713K298949l09912j226135j509642j409568p35102j278863
6086G816937m558364p965166p316519k891510P87758R96890p27586j948956j888981
6077a7695497o07678J382205K437332J205512j100120j846284k47083K142724
6069a4328889L438667K346964j350124n061274m228373J888723P184481N547361
6061d562464p08900m057798k528180j432615l826787n686002l241141P73187K684157
6052b2586543M871105J0854699J6190193J2094389j144808j1602040j0186025
6045a509030k396641l01235o100362j0450129o514869J511263O198314O864191
6037a2698498P132629P149119M440758K01984j653075j012746j209974k265063
$$ y = [1709403, 6813497, 11987210, 14286159, 13976247, 12750112, 11240470, 9830902, 9095800, 7816937, 3258573, -4706593, -12023112, -14914622, -14126864, -13129974, -13857560, -15806516, -17695497, -18303175, -16920970, -14483638, -13278126, -14378246, -16224530, -16471613, -14328889, -10890222, -8543258, -9893382, -14954656, -19183029, -17294306, -10109825, -4562464, -5271364, -9329162, -11857342, -13289957, -17116744, -22802746, -26043887, -25270700, -22586543, -17715438, -6860739, 9329454, 21423843, 20279035, 8676995, -1509030, -3905671, -4206906, -10307268, -20757397, -27272266, -25761003, -19562689, -12698498, -5565869, 1583250, 6024008, 6225992, 4572917, 3560171, 2350197, 85134]
6029H5134p20029K986989L585434m25841l590392k112210M44203K49272n3682
6020D48878K605585M458842J191133k562344Q97974Q563763Q596487k501853j3380662
6011H317803j2586177l122769L216093J617094j988244j221405K740758M639197
6003A612350K585099m95650j212372Q71699L949671O084843N840836K491068k635272
5994A9092272n981180n148198k061781m31992m78996P04766L478970M223754P46697
5985A4144312m555810q394541r608903p079101K86784Q676850J0106172K758120
5977F333883m337302k859406K959667L287688k009673l966118P37751M914958
5969E061448K292394l985804o994782m235846K118297P965451Q525092K240205
$$ y = [85134, -634895, 2352094, 5937528, 5511687, 1921295, -190915, 253288, 502560, 448878, 3054463, 7513305, 8704438, 6142094, 7040068, 15603831, 24200318, 21698465, 8317803, -4268374, -7391143, -4175050, -2557956, -4546200, -5767605, -3026847, 1612350, 4197449, 3701799, 2489427, 3361126, 7310797, 13395640, 19236476, 21727544, 19092272, 13111092, 7962894, 5901113, 5469121, 4990125, 5694891, 9173861, 13397615, 14144312, 9588502, 1193961, -8414942, -15494043, -15207259, -6530409, 3575763, 6333883, 1996581, -862825, 2096842, 5384530, 3374857, -591261, 146490, 5061448, 7353842, 3368038, -3626744, -7862590, -5744293, 2221158, 10746250, 12986455]
5961A2986455m940684m936526J099280L330859k363996p947562n514851J096213
5953g190812L243004K12284k401312k755792l077511k606181J247124N558051
5945g771145M101493k206925m856347n7900N490008M811714N04762p76164R92695
5936B32191O02183k605382l373719O20600M661962M077181P09524j093404j301367
5927B529769k441767l328353k61916N630672Q094799M747590J156229K240955
5919A8367978L934563r95106j1006029j6095980j0627487m55448M967951L664642
5911h244916J174798J854462L854735L053658m65624k086383P82869L901829J101416
5902D926844o177837q874323k345614O127224O855318J374966m14416M494941
$$ y = [12986455, 8045771, 3109245, 4208525, 7539384, 5175388, -2772174, -8287025, -7190812, -3947808, -3735524, -6136836, -8892628, -11970139, -14576320, -13329196, -7771145, -3669652, -5876577, -10732924, -10790824, -5300816, -489102, 15660, -760504, 232191, 834374, -1771008, -5144727, -4524127, 137835, 4215016, 4924540, 3831136, 2529769, 88002, -3240351, -3502267, 2128405, 10223204, 14970794, 16127023, 18367978, 22302541, 21307435, 10301406, -5794574, -16422061, -16877509, -11909558, -8244916, -7070118, -5215656, -1360921, 1692737, 1227113, -859270, -76401, 3825428, 4926844, -1250993, -10125316, -12470930, -6343706, 511612, 1886578, 1472162, 5967103]
5894E967103P905811L106654n418274q933519n657797l00388L549589N287165
5886E506344M066682p77781o594197r046376p260913m206995j699679J773879
5878a8239036P001682J0502527P892911M66802m421307j546057N115905O871083
5870A3644510J844263k512937n47321L084945J068353m455912m961487P52354
5862G916768M339436O62137n010635n710638k145036P49563J311534O71898j013696
5853A771331l282171l597184j066025Q38784r89562m426146n283639k628986K033753
5844a6629845P560119J1796805J1101173N436801P60057J822781N318856M712449
5836C1879196o14057n677708p191864n916205l465371j120199l93109j131962
$$ y = [5967103, 13872914, 16979568, 11561294, 2627775, -3030022, -3330410, 219179, 5506344, 9573026, 8795245, 2201048, -6845328, -14106241, -18313236, -20012915, -18239036, -11237354, -734827, 7158084, 7624886, 3203579, 1657522, 6773427, 13644510, 15488773, 12975836, 12428515, 15513460, 16581813, 12125901, 7164414, 7916768, 12256204, 12918341, 7907706, 2197068, 52032, 801595, 2113129, 2785027, 1771331, -1510840, -5108024, -6174049, -5335265, -6324827, -10750973, -16034612, -18663598, -16629845, -9069726, 2727079, 13828252, 19265053, 20025110, 21847891, 27166747, 31879196, 31265139, 25587431, 18395567, 12479362, 9013991, 7893792, 7500683, 6368721]
5828F368721p82045J538041L098665K660245L190100N486064M564452j658464
5820B4465779n844142j617123M505487J852068p113601j0045017l979435J388108
5812C612124Q35528Q52531N624142Q098021J981973p253616j1149863r838726
5804g237886o975942j005050Q992817J5148807R633636j903515o540731k002590
5796H109546K119500N99676j095575J041916J793141l221034p828924l533429
5788b015183O934632J2212433P190157j514928n667436n097122m504912m976593
5780B561048l539097J56526J829337j166384n286521n540505k413468k57750j84827
5771a3841641P18853L099621L570315R91577o31472J119673K089118j813570o690104
$$ y = [6368721, 5586676, 7124717, 10223382, 12883627, 16073727, 21559791, 26124243, 24465779, 18621637, 17004514, 21510001, 23362069, 16248468, 6203451, 2224016, 3612124, 4447652, 5300183, 10924325, 19022346, 21004319, 13750703, 2600840, -7237886, -14213828, -15218878, -6226061, 8922746, 18556382, 16652867, 10112136, 8109546, 10229046, 10828722, 9733147, 10775063, 12568204, 9347170, 1518246, -2015183, 4919449, 17131882, 24322039, 22807111, 17139675, 12042553, 7537641, 2561048, -978049, -821523, 1007814, -158570, -5445091, -10985596, -13399064, -13656814, -13841641, -13122788, -10023167, -6452852, -5461275, -6092747, -4973074, -2883956, -4697526, -11387630]
5762a1387630n804455o37217O44980m078561p346835l746158K085597L688899
5754b6581380K978452N530585R700086Q623558J984718k386415m7060M206750
5746D009294M997699M241168N558927O280928J686567n845934r005446n937628
5738E985575k048150j279461j648083n40385J293724K972506N428860P563576
5730A7728162N371288j761572q068893q371435m579134j846463j769931k966201
5722f264179m582790m976875q44203O995838J0547702L976365o479923r275019
5714a0903084l039168K474719J147629j881163K77004O133448R160732O422737
5706I792854K17045n252325o010144p55290O113619P494823K269681k736012k244470
$$ y = [-11387630, -17192085, -17829302, -17184322, -21262883, -28609718, -32355876, -30270279, -26581380, -23602928, -18072343, -8372257, 251301, 2236019, -150396, -197456, 4009294, 9006993, 13248161, 18807088, 25088016, 26774583, 20928649, 11923203, 5985575, 3937425, 2657964, 1009881, 469496, 1763220, 4735726, 10164586, 17728162, 23099450, 21337878, 13268985, 4897550, 318416, -1528047, -3297978, -6264179, -10846969, -15823844, -16668047, -9672209, 875493, 4851858, -1628065, -10903084, -13942252, -11467533, -10319904, -12201067, -11924063, -5790615, 3370117, 9792854, 10009899, 4757574, -1252570, -2007860, 4105759, 11600582, 13870263, 11134251, 8889781]
5697H889781M38069o3979k004726L1151M925828N411917r25735p312641p028571
5688B361094k476533j159175m952000p762857m156895L088805O259347K176333
5680f621881m161399n692592r68689N379876Q191105O110873J516332j913704
5672A839921j968970J51517R43189j292408m318878n153294l943314k797861k202290
5663a8742388j010622J089535L509175O031284P850096P013316L565015J032663
5655A0338074J171148r6182o257586j2045971q851388K129102R937161Q457056
5647D781414L251750R09717n49111n141188r156797n588088M508145J2039853
5639E055695J0843806L669109k696736m270886j627349J850478K592289l10551
$$ y = [8889781, 9327850, 9263871, 7259145, 7290296, 12216124, 17628041, 16702306, 9389665, 2361094, -115439, -1274614, -6226614, -13989471, -18146366, -15057561, -8798214, -6621881, -10783280, -16475872, -17444561, -12064685, -3873580, 2237293, 3753625, 1839921, -129049, 22468, 965657, -326751, -4645629, -9798923, -13742237, -16540098, -18742388, -19753010, -18663475, -15154300, -9123016, -1272920, 5740396, 9305411, 10338074, 11509222, 11413040, 5155454, -6890517, -15741905, -13612803, -3675642, 4781414, 8033164, 8942881, 8393770, 3252582, -5904215, -11492303, -6984158, 5055695, 15899501, 19568610, 16871874, 12600988, 10973639, 12824117, 15416406, 15105855]
5631A5105855m164550n433352l496082j247448k139747o388375r665301o846081
5623b4275081J499330Q244650P947847L731761J977411K558509L59707m798642
5615b754508p212720m795037j941580j212277K65151L539745M722063K572796
5607f816367J500646K921600J747167l445168n405304j67735M501677J249729
5599c913755m033961j861431M845679O014291Q30382l359827m851364p135228
5591a3465214p179562J105423J1673636J0186478l558626j1921002m419834P143737
5583a0434964P539372K98028r24916N050944O818127k68524p504502o719309q46190
5574f991934K614738J781260o2540q55551j360010j900729j030475J891630M647838
$$ y = [15105855, 10941305, 5507953, 2011871, 764423, -1375324, -7763699, -17429000, -24275081, -22775751, -14531101, -6583254, -2851493, -874082, 1684427, 2044134, -2754508, -9967228, -14762265, -16703845, -17916122, -17650971, -14111226, -9389163, -6816367, -5315721, -2394121, -646954, -4092122, -9497426, -9665161, -5163484, -3913755, -7947716, -9809147, -4963468, 1050823, 1881205, -1478622, -6329986, -13465214, -20644776, -19539353, -7865717, 2320761, -1237865, -13158867, -17578701, -10434964, -2895592, -2597564, -3522480, 1528464, 8346591, 8078067, 573565, -6145744, -6991934, -4377196, -2595936, -2658476, -3514027, -4874037, -6774766, -7805241, -5913611, -1265773]
5565a265773M344296J292148j254510j780657k355628m061916l734160J039806
5557g776394O244346O012096J532443o02107J324484K162799p91263l528676l071444
5548A506284k767900n542295p585818m293463J745966M605633L916427L895953
5540d519213N269273M313993o1241l572997k264616K488400O000955N154223N58142
5531A3366919m425961o358741m687327k237048j951105l488844l869865j013286
5523a4665258L979069P492550O303514J084415l128807k128921J679902J766766
5515B383230l310918o968837l481869L487301N316118k66331o557835o522965
5507a5922106n62787N229871O126953K758671o79090r48609J498026L885680M461620
$$ y = [-1265773, 3078523, 4370671, 3116161, 1335504, -1020124, -5082040, -8816200, -7776394, -1532048, 4480048, 6012491, 5410384, 6734868, 8897667, 8106404, 4577728, 1506284, -1261616, -6803911, -14389729, -18683192, -16937226, -12331593, -8415166, -4519213, 750060, 5064053, 5002812, 1429815, -834801, 1653599, 7654554, 12808777, 13366919, 8940958, 2582217, -2105110, -4342158, -6293263, -9782107, -13651972, -14665258, -10686189, -3193639, 3109875, 4194290, 1065483, -1063438, 616464, 2383230, -927688, -7896525, -11378394, -7891093, -2574975, -2841306, -9399141, -15922106, -16484893, -11255022, -5128069, -2369398, -3048488, -3997097, -2499071, 1386609, 5848229]
5498E848229L583109K001010q7692k006143k603472k065094j885311k187303j043891
5489d46558K413529O131009P586380O231977K536432k785621p005993n960706
5481H700449O16600O583094N661223j130626p512464r980430r921624q540266
5473a5524044m544636J875188O816719P015963M086316J904492J284574j10975
5465B803597l132912n135309l548700J26363J589417j005891m370870l746833
5457a6421138J082239M974342L475888j582243m430910k841261m65973n89249
5449a6798305n84291L852296J0378528J1030032K988751o255970p940570k894227
5441f223756J055061K04793j876737j375228J301032M380101O651147N804961
$$ y = [5848229, 9431338, 11432348, 11344656, 9338513, 6735041, 4669947, 2784636, 597333, -446558, 1966971, 8097980, 15684360, 21916337, 24452769, 21667148, 14661155, 8700449, 9317049, 15900143, 21561366, 20430740, 12918276, 2937846, -6983778, -15524044, -20068680, -18193492, -11376773, -4360810, -274494, 1629998, 2914572, 2803597, -329315, -5464624, -9013324, -8886961, -7297544, -8303435, -12674305, -16421138, -15338899, -10364557, -6888669, -8470912, -12901822, -15743083, -16209056, -16798305, -17382596, -13530300, -3151772, 7878260, 10867011, 4611041, -3329529, -6223756, -5168695, -4963902, -6840639, -8215867, -6914835, -2534734, 4116413, 9921374]
5433I921374M12693n376317n230634l69596R34970l925679p470348m445071j30918
5424a5679526k07086p35653L263128O881484L660134j267157J209633P584858
5416D709815O446725k089313n968573p98635M304202L143664R69160J910368R19245
5407A3546658m957473q661357m644788R66761R2703n091891p697492p158939o894648
5398c0500466o682694m679851k046791N62380N595471J2081582J3197719O711387
5390e761263P58978J950311M909515J907656m195905o069381m442645m107933
5382a5050667l074601K903197R279610P955827P96446l235785k221537j666234
5374d313744k759392j510131J541621J838079M38925K367107N893638M622926
$$ y = [9921374, 10334067, 4957750, -272884, -642480, 292490, -3633189, -11103537, -15548608, -15679526, -15886612, -16622265, -13359137, -6477653, -2817519, -4084676, -2875043, 4709815, 11156540, 9067227, 3098654, 2300019, 6604221, 9747885, 10717045, 12627413, 13546658, 8589185, -72172, -4716960, -3750199, -3657496, -8749387, -16446879, -23605818, -30500466, -37183160, -41863011, -43909802, -43347422, -37751951, -25670369, -12472650, -5761263, -5002285, -3051974, 1857541, 3765197, -430708, -6500089, -10942734, -15050667, -18125268, -15222071, -5942461, 2013366, 2809812, -425973, -2647510, -4313744, -7073136, -8583267, -7041646, -5203567, -4764642, -2397535, 3496103, 8119029]
5366H119029O9437L57113N594050O634688M31415n243477n325050m060669m302400
5357B274136j785177M567151P197419J294689o986191r657177o521174p03853
5349a0320177O909910J3159549J1272029J032618p225495n922487p44319q93502
5341G268126n637917q330412p694721o561940m143251J761529Q035521R499304
5333e803761O594336L433127Q98746k224830m149097k338787J427512L569005
5325A406251L692753K727863J92011j955611J543188R730235J1436869l2068j3610041
5316A5131450j3285556r58862O278693J035965n746584l714132K362477L213329
5308D316780l20668j848619j317231l053445o072965n210164l22488L300728L569329
$$ y = [8119029, 8188466, 8545579, 14139629, 20774317, 21205732, 15962255, 10637205, 6576536, 2274136, 488959, 5056110, 12253529, 13548218, 6562027, -3095150, -9616324, -10320177, -3410267, 9749282, 21021311, 22053929, 14828434, 8905947, 8161628, 7268126, 1630209, -6700203, -14394924, -20956864, -25100115, -23338586, -15303065, -5803761, 790575, 4223702, 5122448, 2897618, -1251479, -3590266, -2162754, 1406251, 5099004, 7826867, 8018878, 6063267, 7606455, 17336690, 28773559, 28741491, 15131450, 1845894, 887032, 7165725, 8201690, 2455106, -1259026, 1103451, 4316780, 3996112, 2147493, 830262, -2223183, -8296148, -13506312, -13828800, -10528072, -6958743]
5299f958743L832046N462536M587575q07641n537884l685076K284598M092751
5291C270162j182138p487695q426815m785648q11878K679355O963724J0180365
5283C99432R129585N032010J868793l39696m375110q008272m927065M408410J0358494
5274A3546581O653931j106330m479434l712186m008344n356090l801205J6804
5266b246273J317893p45495k001613k29433K018542J761159j104752m393777m738252
5257a0362001j82452N456634M712714k838156p186179j669708N427137K582155
5249d059856o087329o236013L762278R499107K920785n734998m792317J951071
5241h777272M166544J527316O51109J849358J08531l977998m602308r02907K120563
$$ y = [-6958743, -3126697, 2335839, 6923414, 6115773, 577889, -3107187, -822589, 3270162, 2088024, -5399671, -13826486, -18612134, -19424012, -16744657, -9780933, 399432, 9529017, 14561027, 16429820, 16090124, 11715014, 3706742, -1220323, 3188087, 13546581, 20200512, 19094182, 14614748, 10902562, 6894218, 1538128, -2263077, -2246273, -928380, -1673875, -3675488, -3904921, -1886379, -125220, -1229972, -5623749, -10362001, -10544453, -5087819, -375105, -3213261, -10399440, -12069148, -6642011, -4059856, -10147185, -16383198, -12620920, -3121813, -201028, -5936026, -10728343, -8777272, -4610728, -3083412, -2432303, -582945, -474414, -4452412, -9054720, -9957627, -7837064]
5232g837064K485817L015652M108879K469043j792198l865501k029345m68714
5224c913431j831484k611310P82028N815671P171524L160429l812722j0111855
5216e351150j1838658o392430L683876J0873352R839695K864726l816409o719936
5208f856934o004654k732649J363540L579058L102835K379745K721615J396719
5200a050725k885219m843458Q24289R607502J1332545M246293k790724l917982
5192A0522521l889006p880843j1353289p221168J853877O554351M088325N80169
5184f745063P39903K220625J387883j152760k767866k240239N36554M573727O493351
5175C046115L279132k441047m130389j95422L061131j28041p303213j1558686
$$ y = [-7837064, -5351247, -2335595, 1773284, 4242327, 2450129, -1415372, -3444717, -3913431, -5744915, -8356225, -7574197, -1758526, 5412998, 8573427, 4760705, -5351150, -17189808, -23582238, -19898362, -9025010, 814685, 3679411, -136998, -6856934, -12861588, -15594237, -14230697, -10651639, -7548804, -5169059, -2447444, -1050725, -3935944, -8779402, -7955113, 1652389, 12984934, 17231227, 14440503, 10522521, 6633515, -1247328, -12600617, -19821785, -17967908, -11413557, -7325232, -6745063, -6005160, -3784535, -2396652, -3549412, -6317278, -8557517, -8020963, -3447236, 3046115, 6325247, 3884200, -246189, -441611, 2619520, 2491479, -4811734, -16370420]
5167a6370420r976988n039602j73899K485150J672521j795762l978470j347091
5159c4524561M367465P433900M924892M29511j55834M238007Q148588N642957
5151E04925k286023p896213n287435K544853P192298M532240j416200m014148
5143f125703r61022M369474O514019K906129l007748m523123L26605N271717L669245
5134H439593k115069m205541q10529K168330J365084N08249K446316L560886K92931
5125A1650250m279259n160564k524809L74481K469842L520834J365595m124420
5117C291950p346476l006499N757634J0444295P432283P79705m227814n971398
5109G153680n381140l907728k975388k889476k351894o55356P75068N92450m96735
$$ y = [-16370420, -26347408, -31387010, -31560909, -29075759, -27403238, -29199000, -33177470, -34524561, -30157096, -22723196, -17798304, -17368793, -17524627, -13286620, -5138032, 504925, -1781098, -9677311, -14964746, -12419893, -5227595, -695355, -2111555, -6125703, -7086725, -2717251, 3796768, 6702897, 3695149, -827974, -501369, 4770348, 8439593, 6324524, 2118983, 1308454, 3476784, 4841868, 5350117, 7796433, 11357319, 11650250, 7370991, 2210427, -314382, 60099, 2529941, 6050775, 7416370, 3291950, -4054526, -7061025, -1303391, 9140904, 16573187, 17352892, 13125078, 7153680, 1772540, -2135188, -5110576, -8000052, -10351946, -11007302, -10232234, -9639784, -10136519]
5100a0136519j560092k868179l774752k266669J062895K060412r79821l841562
5092b2304287k408606J328205L279682L780383N303629O632986M793166J007038
5084A412196n03634J169118K784982J814284j150933l934885m396136k238094
5076e043102p53792l497556p679083n978106K422437Q921709P654735L495363
5068d57395K370783J450708l034918n804848q89588N965729N150932q57722j996747
5059A896934K040736K566270j476029k062297K034560K374593l297165o066895
5051a989293j225265M013836L600942J611522J971506P18747m086065n476719
5043h60789O40070O153865K709744m821125o572556k716988k35950j43644J670173
$$ y = [-10136519, -11696611, -14564790, -18339542, -20606211, -19543316, -17482904, -18462725, -22304287, -24712893, -23384688, -20105006, -16324623, -11020994, -4388008, 405158, 1412196, 908562, 2077680, 4862662, 6676946, 5526013, 1591128, -2805008, -5043102, -5796894, -9294450, -16973533, -22951639, -20529202, -11607493, -3952758, -457395, 1913388, 3364096, 329178, -5475670, -6365258, -399529, 4751403, 3893681, 1896934, 3937670, 6503940, 5027911, 2965614, 5000174, 7374767, 4077602, -1989293, -3214558, 799278, 4400220, 6011742, 7983248, 8701995, 4615930, -860789, -220719, 5933146, 8642890, 3821765, -2750791, -5467779, -5703729, -5847373, -4177200]
5034d177200M611901M358562J283422r34320k938893p299155j0402422n989758
5026b1487863L555275Q257373M011864k568828m422473k276693j87964J075796
5018a4043513K605763L597922K808761J258939M75638j80836j797377k933620
5010h208323j418623J212800N23804m040677o276422r00997P562777R222282K690351
5001C66972k320938M20215L947160j30860o582714l846516O840640J1856721N322978
4992A5873658l056634l726575j23799o5382l096295l702823j206441N29557l09461
4983A115805k415480m121756l910325j272795J031971k47110k830743j483338
4975a4133771K488049K050596l277636n084778L01122N434563M385896K047394
$$ y = [-4177200, 434701, 4793263, 6076685, 5142365, 2203472, -5095683, -15498105, -21487863, -17932588, -9675215, -5663351, -8232179, -12654652, -14931345, -15119309, -14043513, -11437750, -7839828, -5031067, -3772128, -3296490, -3477326, -5274703, -8208323, -9626946, -8414146, -7890342, -11931019, -18207441, -19108438, -11545661, -2323379, 366972, -1953966, -1533751, 2413409, 2282549, -4300165, -8146681, -1306041, 10550680, 15873658, 12817024, 9090449, 8966650, 8901268, 5804973, 2102150, 895709, 1425266, 1115805, -1299675, -5421431, -9331756, -10604551, -9572580, -9819690, -12650433, -14133771, -11645722, -9595126, -12872762, -17957540, -17656418, -12221855, -7835959, -5788565]
4967e788565L627748M251384j535620p690657n045568L568499P463357M016170
4959B866748L12876R03859L150235L866748K805496J29732l245356l986558n86736
4950F217044K662979J274210k365109k840791J94144L030129L868715K751390
4942A4792711o92429m389657l374859K330122M921237K44386m345446j583693
4934G902372K718596j386670j0939965j3644324o188239K159265L825739R71284
4926a4581942j258328j160700Q23858L424245M170715K388921J185928K387851
4918b619452K823439J39204k460388k487026l182255o115319n937036j59725L659717
4909a6338841j80046m465716q91152M895693K815009l966146m807364N53323M061618
$$ y = [-5788565, -2160817, 2090567, 554947, -7135710, -12181278, -8612779, -1149422, 2866748, 3179624, 4083483, 7233718, 11100466, 13905962, 14035694, 10790338, 6803780, 6217044, 8880023, 10154233, 7789124, 4948333, 5142477, 8172606, 12041321, 14792711, 14100282, 9710625, 6335766, 8665888, 13587125, 13831511, 9486065, 7902372, 10620968, 9234298, -1705667, -15349991, -21538230, -19378965, -15553226, -14581942, -15840270, -17000970, -16177112, -12752867, -8582152, -6193231, -5007303, -2619452, 203987, 343191, -2117197, -4604223, -7786478, -13901797, -19838833, -19998558, -16338841, -16518887, -20984603, -21875755, -16980062, -14165053, -18131199, -22938563, -22385240, -18323622]
4900a8323622M322813N383866N438393J120587k064370J582150M746770j385849
4892H20738r025377n453766L414406J651165r272482j3284319o436323P90781
4884c6795177M181129O661151L817585p206352j1767709R19856J0190069o563770
4876c6563218k7753634j9326586n860395m4106160j14008554j12442092K957180
4869c57103459J30313026J46389858O4769574r71599J051338J9056950O558672
4862A0064360j2640424o543767P885277L539963r362409r167818j571575j533287
4854a9329680l199731M180037J1807657P856756L71280J197736L504188l213565
4846C174678j0753432o432011L046907L296291k541196j253079N727265N702356
$$ y = [-18323622, -14000809, -8616943, -3178550, -2057963, -4122333, -2540183, 2206587, 820738, -8204639, -13658405, -10243999, -8592834, -17865316, -31149635, -37585958, -36795177, -32614048, -25952897, -22135312, -29341664, -41109373, -40189517, -29999448, -36563218, -64316852, -83643438, -89503833, -133609993, -247618547, -360060639, -357103459, -226790433, -80400575, -15631001, -16602600, -15551262, 3505688, 10064360, -2576064, -9119831, -1234554, 2305409, -7057000, -16224818, -17796393, -19329680, -22529411, -18349374, -6541717, 1315039, 1686319, 2884055, 6388243, 3174678, -7578754, -14010765, -10963858, -7667567, -10208763, -11461842, -5734577, -32221]
4838c2221k051316n618670r49679L675591L207742J652985K024101K307291J897836
4829F113660K366299K129584j179203m338732k745641Q55311K79257l218131k755201
4820b492797K392053N472663L044519n68522p68380J481852K646986J044828k287501
4811I965701m046239j034148M831871O393195L58783o310277m700357L471022
4803H929551P957079L930777k574945l964132k56099L010927K066960k155804
4795A6944314n921497n746848j161057M152636M882201q83826q881963j1660997
4787h277037n690620M114952Q839832N841641J996507L982281Q561792P702408
4779B7071756J053124l794433l130674j399846k179222k794433j217195r94367
$$ y = [-32221, -2083537, -7702207, -8651886, -4976295, -1768553, -115568, 1908533, 4215824, 6113660, 8479959, 10609543, 9430340, 5091608, 2345967, 3201278, 3480535, 262404, -2492797, -100744, 5371919, 8416438, 7847916, 7079536, 8561388, 11208374, 12253202, 9965701, 5919462, 4885314, 9717185, 16110380, 16469163, 10158886, 5458529, 8929551, 16886630, 20817407, 18242462, 14278330, 14022231, 17033158, 19100118, 16944314, 11022817, 5275969, 4114912, 8267548, 13149749, 12265923, 3383960, -8277037, -13967657, -9852705, -1012873, 4828768, 6825275, 10807556, 19369348, 27071756, 28124880, 24330447, 21199773, 19799927, 17620705, 14826272, 13609077, 12614710]
4771A2614710m515439p533726n922132k818079l131238n011104l001124L025069
4763a6293063P840391Q133282N202231J908367O02733K159019L985838J731070
4755A5269868m049229o777796l216665O68430j414979n825742m799771P44492
4747i401392K811928m09973j970498J808994N120674K213149l373220m239344
4739g439682K93132M286685L798147O40427j839914k621646k076497n54729N92909
4730d921168p82119m094850m718539M16117O924074P089088M21896m857886l025803
4721g549190J741519L067423K035728K833580L329233j288063p886903q236201
4713a1952874k203665J881605J160459J913101O431836P456562J301659l924396
$$ y = [12614710, 8099271, 565545, -5356587, -8174666, -11305904, -16317008, -19318132, -16293063, -8452672, -319390, 4882841, 6791208, 7393941, 9552960, 13538798, 15269868, 11220639, 4442843, 1226178, 1894608, 479629, -5346113, -10145884, -9401392, -6589464, -6999437, -8969935, -7160941, -2040267, 172882, -3200338, -7439682, -7146550, -2859865, 938282, 1578709, -261205, -2882851, -4959348, -5514077, -4921168, -5703287, -9798137, -14516676, -14100559, -7176485, -87397, 334499, -4523387, -7549190, -5807671, -2740248, -704520, 2129060, 5458293, 4170230, -3716673, -11952874, -14156539, -12274934, -11114475, -9201374, -2769538, 4687024, 5988683, 2064287]
4705B064287r70264M711650M745244J431858J215006J562376l292895q401922
4697C065340l814661P393563J0819644J990787o970897n852200O613O92353l164679
4688D165863m250514j120527J476303J423091J080906J810513K502530K896382
4680I984547L532841K727476j884821q278372j0541539o040304P91255L790492
4672e918425K144536k30789r69870j584843l272638l900384j415328K096485K879287
4663a0171969Q23247q80961o55554K97191J269827K700313L638048K613690J109217
4654G43049J653190K424460n46599n084381l839644L919658Q897827M629279l069739
4645I727100n328424k754214j630044k660662j723249J411672L189840L144525
$$ y = [2064287, 1094023, 5805673, 10550917, 11982775, 13197781, 14760157, 11467262, 3065340, -749321, 6644242, 17463886, 19454673, 12483776, 6631576, 6638189, 7330542, 4165863, -84651, -1205178, 271125, 1694216, 2775122, 4585635, 7088165, 9984547, 13517388, 16244864, 14360043, 6081671, -4459868, -10500172, -9708917, -5918425, -3773889, -4004678, -4974548, -6559391, -9832029, -13732413, -15147741, -13051256, -10171969, -9348722, -10229683, -10885237, -10588046, -9318219, -6617906, -2979858, -366168, 743049, 2396239, 4820699, 4274100, -810281, -4649925, -730267, 8167560, 12796839, 9727100, 4398676, 1644462, 14418, -2646244, -4369493, -2957821, 232019, 3376544]
4637C376544L458186L447710J209499j405100k288019m627654j0927214j4545900
4629b2301948p357323N622905J0503187L951499k936086k172048J384836J761156
4621a1543822J671311M044243M110646j372656n194538J64488R281786J0798801
4613A1960259L893980k209172l073493l379660o318100p886347m295699J772252
4605i535980N445542N469656L229819p7058k938346l518079k476198l106401o484753
4596a3991798q839877o166988K30039N277465O302858N389857N749393P675414
4588A626363Q706440O745920K317461j941683l725079l231472k934725m689163
4580B874062o977369n991094k59702O543657Q742221M413098l135212r168748
$$ y = [3376544, 6834730, 10282440, 11491939, 10086839, 7798820, 3171166, -7756048, -22301948, -29659271, -24036366, -13533179, -9581680, -12517766, -14689814, -13304978, -11543822, -9872511, -5828268, -1717622, -3090278, -8284816, -8120328, 1161458, 11960259, 15854239, 13645067, 10571574, 7191914, 873814, -7012533, -11308232, -9535980, -4090438, 1379218, 4609037, 4531979, 1593633, -1924446, -4400644, -7507045, -13991798, -22831675, -28998663, -28768624, -23491159, -17188301, -11798444, -6049051, 1626363, 10332803, 17078723, 19396184, 17454501, 13729422, 10497950, 7563225, 2874062, -4103307, -10094401, -10354103, -3810446, 4931775, 9344873, 6209661, -2959087]
4572b959087j1064731q404669k289469M396470Q156519P689095M303862n23792
4564f95802n533522p603646l563815M081320P628763L694669j534231o46524M831872
4555F59084P593498N069548J021315j637373l525296m888228m686580l654693
4547d048725l380428k685978P6199J958675j263436o922591p362984q71444N999091
4538a8501621Q452739Q787919R351383P417250J252265m731357n824391l568757
4530B635430j992065j268488L92158J859220N55146l296350p045415q226528n212189
4521b1599081J297639O118321L900807k342124l122680L873078Q955089M363066
4513A444115l923285n599667j402559L3532l148780m495143j126128K294229K247739
$$ y = [-2959087, -14023818, -22428487, -24717956, -20321486, -12164967, -4475872, -172010, -695802, -6229324, -13832970, -17396785, -13315465, -5686702, -1992033, -3526264, -4172788, 659084, 8252582, 13322130, 14343445, 12706072, 9180776, 4292548, -394032, -4048725, -7429153, -10115131, -10038932, -8080257, -9343693, -16266284, -23629268, -24500712, -18501621, -10048882, -1260963, 8090420, 15507670, 16759935, 12028578, 6204187, 2635430, 643365, -625123, -232965, 1626255, 2181401, -1114949, -8160364, -16386892, -21599081, -20301442, -14183121, -10282314, -12624438, -15747118, -11874040, -2918951, 1444115, -2479170, -8078837, -9481396, -9447864, -12596644, -17091787, -18217915, -15923686, -13675947]
4504a3675947J075217J393337K252550K403178J945046j06339m383562o860516
4496a5957036k361082O325666R454475L080144n022675n556995J009602O935025
4488b092876O989468K142134l323937m944647q94841N198973O365344l7647q478228
4479I23743j1255329o539508J397980P651505R903479Q092582L931371M90123
4471A4595946L74788L783146Q108634Q923366K873091p855358j5158948j3004900
4463B639765n336937j308686k645177j966381M666550J0764021R376183L698236
4455A9887574J242557K115393Q49189k845914l604355k09975K113871N39321j256186
4446A8831475k46311P77188j426331m937281o303078n961598o000233n390445
$$ y = [-13675947, -12600730, -11207393, -8954843, -6551665, -4606619, -4712958, -9096520, -15957036, -18318118, -11992452, -2537977, 542167, -4480508, -10037503, -9027901, -2092876, 4896592, 7038726, 3714789, -1229858, -2124699, 3074274, 9439618, 9401971, 923743, -10331586, -16871094, -15473114, -7821609, 2081870, 10174452, 14105823, 14595946, 14970734, 18753880, 26862514, 35785880, 38658971, 30803613, 15644665, 2639765, -2697172, -4005858, -6651035, -8617416, -3950866, 6813155, 16189338, 19887574, 21130131, 23245524, 24094713, 21248799, 17644444, 17434469, 19548340, 20087661, 18831475, 18585164, 19362352, 17936021, 12998740, 6695662, 734064, -5266169, -10656614]
4438a0656614j746784L715452O799071N461881J777624p52796m5799L434901O556136
4429A4543072N495763l09597o785658q976891n447108J377756P296144Q205541
4421A5399022K887287m459012p374641m723086j878178k273292k259229J802002
4413b879127O069871M928639O55612o6200K595194K066824l102443o664048n292351
4404a688029l654789n562648p302235m336705J297227N295219P802443J0527831
4396B378314J1266360O949084n92414o830689j0177767j1158481q678124j949660
4388a8793377N714609R494464Q299956M358582k94500l914498m506444k642633
4380b283841j888939l168706k505761J903339N175177L384446P36549K563819
$$ y = [-10656614, -12403398, -8687946, -1888875, 3573006, 5350630, 4597834, 4552035, 7986936, 14543072, 20038835, 19729238, 12943580, 3966689, -1480419, -102663, 7193481, 15399022, 18286309, 13827297, 6452656, 1729570, -148608, -2421900, -4681129, -2879127, 3190744, 8119383, 8774995, 8708795, 11303989, 13370813, 10268370, 3604322, -1688029, -5342818, -10905466, -18207701, -22544406, -21247179, -15951960, -8149517, 2378314, 13644674, 20593758, 20001344, 13170655, 2992888, -8165593, -16843717, -18793377, -13078768, -3584304, 4715652, 9074234, 8779734, 4865236, 358792, -2283841, -4172780, -7341486, -9847247, -7943908, -2768731, 615715, 1352264, 3916083]
4372C916083N730178L881863j344498l061510o21976N67441q57884j359823q60973
4363E988901k818131o057336n515683j482640O15587p5025O41563K563259J047488
4354e092017k706739j854062L764011O148826K541268n54637L07332O85118n73588
4345B665512K165432Q447658Q554363M15112l650431L434151J0161452M787599
4337C6980848m871313m711211K149960J844949o517299j0893650p180848l557698
4329C243738m308719m399526j599907n17921k113634j180635K873739L673350
4321d329515m74989k499207K228396R061337J1603905Q583098J243288q195375
4313A7220938j3742442r795111l56871M215015J865814J371733P412369J2637150
$$ y = [3916083, 9646261, 13528124, 12183626, 9122116, 8500140, 9067581, 8209697, 6849874, 5988901, 3170770, -2886566, -8402249, -9884889, -9269302, -9344327, -8702764, -6139505, -5092017, -7798756, -9652818, -5888807, 260019, 2801287, 2246650, 2553982, 3239100, 2665512, 4830944, 13278602, 21832965, 22248077, 18597646, 22031797, 32193249, 36980848, 32109535, 27398324, 29548284, 31393233, 24875934, 13982284, 6801436, 3243738, -1064981, -5464507, -7064414, -7582335, -9695969, -10876604, -8002865, -4329515, -4804504, -7303711, -5075315, 3986022, 15589927, 24173025, 25416313, 17220938, 3478496, -6316615, -6673486, -2458471, -592657, 779076, 8191445, 20828595]
4305B0828595R376711R57363m363724m272222k033256p36075k228910o763397
4297A0765085j0438218q386185k863972j469437m880005m711215K518937Q458840
4289a1006170N965966L03037o11576O48503k640036p802091o634186L32302M372624
4280a7071627K591550J328731M481441P465130N792080K459591K458908M622781
4272A4128585L560178k362795q639867j0034973o279782j569762R28765K377518
4264g892133M802652O192420K862594l426827n641239p55912N551100O512131
4256H204786K621187j235889l090400l606248j856739K603868N340749J275393
4248A0256707o785344j0068960n496355L09677J072539m39160J952607P363271
$$ y = [20828595, 30205306, 31162669, 26798945, 22526723, 20493467, 19757392, 17528482, 10765085, 326867, -8059318, -10923290, -12392727, -17272732, -21983947, -19465010, -11006170, -5040204, -4737167, -5348743, -4700240, -7340276, -15142367, -21776553, -21444251, -17071627, -14480077, -13151346, -8669905, -1204775, 4587305, 7046896, 9505804, 14128585, 17688763, 15325968, 6686101, -3348872, -9628654, -11198416, -10269651, -7892133, -3089481, 3102939, 5965533, 2538706, -3102533, -3858445, 1692655, 8204786, 10825973, 9590084, 6499684, 2893436, 1036697, 3640565, 8981314, 10256707, 3471363, -6597597, -12093952, -11784275, -10711736, -11150896, -9198289, -1835018]
4240a835018Q944551M370114p93773j628470n01611j682790l543551j712507K238914
4231C855859K199651k269533m444997j319734J497991p1719j088892L046879O502755
4222G908260J585006p304468r105189l032284J369408M30926M55957M098022N101451
4213A507089Q37932j464189K751258O736904L857724j057840k46968M232743N183580
4204B2338233K081304o33972k542863n757224p975560n587174j219063l45165
4196C58516k497727l130236j944990j989404k675387j395714j62758k468541m900419
4187b0806660p30541Q143542J1707565N908447j670511k895104Q33522K921522
4179C411782P90153k797806m111429j400420M083372Q347967P937055L611293
$$ y = [-1835018, 7109533, 11479647, 10685874, 9057404, 8555793, 6873003, 3329452, 1616945, 3855859, 6055510, 3785977, -659020, -1978754, -480763, -552482, -1641374, 1405505, 7908260, 9493266, 2188798, -6916391, -9948675, -8579267, -8148341, -7692384, -3594362, 1507089, 2345021, 880832, 3632090, 10368994, 14226718, 13168878, 12921910, 17154653, 22338233, 24419537, 23785565, 21242702, 15485478, 7509918, 1922744, 703681, 358516, -2139211, -5269447, -7214437, -9203841, -11879228, -13274942, -13437700, -15906241, -20806660, -21537201, -13393659, -1686094, 4222353, 2551842, -343262, 490260, 3411782, 4201935, 1404129, -2707300, -4107720, -24348, 8323619, 16260674, 19871967]
4171A9871967r80646l626486m158415k325976J213772L054517O07075l216455
4163A0439353l414656l24223J449408J147089K717655O366304N767453k462594
4155B1685789j1264396j0589631o28680P710863O399279r8105k142443J262408
4147A2335084K467953r10627j142293N298035Q485981K079329J242374K3185308
4139E3041144N0887705M2522121j1206879o2608530o1469295j8064635J4185583
4132G287214R277529q354065j0174225p49665K170232j377797q22614L081874
4124C38483K247228k239529l409990k093917l750134o167579k647937N489145
4116a2234230J0392342R504967O372156J880300n530102j2013442j0505890j886075
$$ y = [19871967, 18891321, 15264835, 11106420, 8780444, 9994216, 13048733, 13655808, 10439353, 7024697, 6700474, 8149882, 9296971, 12014626, 18380930, 24148383, 21685789, 10421393, -168238, -796918, 6913945, 13313224, 13215119, 11072676, 12335084, 14803037, 13892410, 12750117, 18048152, 26534133, 28613462, 29855836, 53041144, 103928849, 146450970, 135244091, 72635561, 11166266, -6898369, 7287214, 16564743, 8210678, -1963547, -2713212, -542980, -1920777, -2743391, 338483, 2585711, 346182, -3063808, -5157725, -8907859, -15075438, -17723375, -12234230, -1841888, 7663079, 14035235, 15915535, 10385433, -1628009, -12133899, -14019974]
4108a4019974M099062J275808n505544p461198j950914O323699J0810762Q265935
4100A837636P69762o083170p843315m290662J770922O911268Q093873M373780
4092E540094j157029l918836l317717k475698k163439K4406L196676K200039l581467
4083e652971o601887j327867O908392Q907099L753475j603771k088443J310809
4075C604836M742919M538022m56476n991031n421675O81723K832773m332817j2657934
4066a2459660j1149263j502425N454028N427145L291325J937055j077385n060930
4058a5140110m378143J767517N837431K457983l707462m893092l54300M632027
4050a3778149O452299N846251M868466M271312L230345M07053l916287o951478
$$ y = [-14019974, -9920912, -8645104, -14150648, -21611846, -23562760, -17239061, -6428299, 1837636, 2607398, -3475772, -11319087, -15609749, -13838827, -6927559, 1166314, 5540094, 4383065, 464229, -2853488, -5329186, -7492625, -7468219, -4271543, -2071504, -5652971, -12254858, -13582725, -6674333, 2232766, 5986241, 4382470, 2294027, 3604836, 8347755, 12885777, 12429301, 6438270, 1016595, 1698318, 4531091, 198274, -12459660, -23608923, -25111348, -19657320, -14230175, -10938850, -9001795, -10079180, -15140110, -19518253, -17750736, -11913305, -9455322, -13162784, -18055876, -18410176, -13778149, -7325850, -1479599, 3388867, 7660179, 10890524, 11297577, 7381290, 429812]
4042D29812o464024m123936l184027l434401j822041K108709N145270N217448
4034f127190L693453K084978j18162l134575n366978n547838m188562k051459
4026b0756333O81073L138926L851522K762608J470611J269999K311974L957285
4018a312335M264581Q00116n257075p784661k760460M531235M596949l624501
4010f546151j0443985p485192K312787R300134Q439977L084909o39478l72699
4002b349698J395128J315634o26722j779230j368935j677655l336183k878610
3994a1306271J867882P066546P794736N008803K665334N92244l510575p073682
3986C105017n339632m32506M24268l508199n041758j140805K125416K38608k354242
$$ y = [429812, -6034212, -10158148, -13342175, -16776576, -18598617, -16489908, -11344638, -6127190, -2433737, -348759, -466921, -3601496, -8968474, -14516312, -18704874, -20756333, -20075260, -16936334, -13084812, -10322204, -8851593, -7581594, -5269620, -1312335, 2952246, 3752362, -1504713, -9289374, -12049834, -7518599, -2921650, -6546151, -16990136, -24475328, -22162541, -12862407, -4422430, -1337521, -1976999, -2349698, -954570, 361064, -265658, -2044888, -3413823, -5091478, -8427661, -11306271, -9438389, -2371843, 5422893, 10431696, 13097030, 13689274, 10178699, 3105017, -2234615, -2667121, -2242853, -5751052, -10792810, -11933615, -9808199, -9569591, -11923833]
3977a1923833n57332K788523K641820J23993j113144j605899k662220j250117
3969a3558209M381969Q365233M716592k145659l240419R35213J914960j988754
3961f19074l087861J681232M523455p09488q271438r216039m040813M47968K254852
3952a7037206M351421O462581N034264J059467L3810K492077J874303m649064
3944c78347r678124n685527K930790N400971K69703k900466J296432N608116J557062
3935a579390p069426r480331l321560L137117L680714J264177O91428J060910
3927a1616361n96564k988224k474895J398275N948987Q754095Q101136K850275
3919I376724m597101p884170l653241K970490M438180P92001j567810k09437M89885
$$ y = [-11923833, -12481165, -9692642, -7050822, -6926829, -8039973, -9645872, -12308092, -13558209, -9176240, -811007, 3905585, 1759926, -1480493, -545280, 1369680, -619074, -3706935, -2025703, 2497752, 1788264, -6483174, -15699213, -19740026, -19292058, -17037206, -12685785, -6223204, -1188940, -129473, -95663, 2396414, 4270717, -378347, -10056471, -15741998, -12811208, -7410237, -7140534, -10041000, -8744568, -3136452, -1579390, -8648816, -18129147, -21450707, -18313590, -14632876, -13368699, -12677271, -11616361, -12212925, -15201149, -17676044, -16277769, -10328782, -1574687, 6526449, 9376724, 4779623, -3104547, -6757788, -3787298, 650882, 1442883, -124927, -334364, 155521]
3910A55521k180951m124704r48768M840555P103780L912629j214729l986970k467234
3901A089129K458865O852950N949481j06840m500849j480574N490063P583100
3893B3335325J880068n952441j0249379j1180578j0622064p898022l058309J93980
3885b3551420n67320j813698Q68826N430601O339353L373551J643177L033545
3877e243385L482693J53383l704778l479359P12307M829637N290956J290699m670067
3868a337914p809714n484459r31513O75149m43653M8715K309389J920879j036244
3859a2089365l54829N476217Q774074M420680j328881j023400J674546r83711
3851D565331o585832o096642Q36170N002809J956854k582785k747053O94390M836943
$$ y = [155521, -2025430, -6150134, -7098902, -2258347, 4845433, 8758062, 7543333, 3556363, 1089129, 3547994, 10400944, 16350425, 16243585, 11742736, 10262162, 15752225, 23335325, 25215393, 19262952, 9013573, -2167005, -12789069, -20687091, -23745400, -23551420, -24118740, -25932438, -25063612, -19633011, -13293658, -9920107, -8276930, -5243385, -1760692, -1607309, -5312087, -8791446, -8079139, -3249502, 2041454, 3332153, -1337914, -9147628, -14632087, -15563600, -14888451, -15332104, -15283389, -12974000, -11053121, -12089365, -12444194, -6967977, 1806097, 6226777, 4897896, 3874496, 5549042, 4565331, -2020501, -8117143, -7280973, -2278164, -321310, -2904095, -5651148, -4956758, -119815]
3842a19815P780785O051951k595261j1936630j1619630j699904N632708K588357
3834e917439m273242n402297j667832j76501k929519o152367o411439k051885
3826c4982521O983337J5918892J6669405P848920j472577l222641m22112r6830
3818G223873j736368m12367K923683K790807j411029m984613n519371m237419
3810e362804j368686L210799O174324M203394J60681m74156J931534K682296J279587
3801A2436969J251468K299873K26379n101304q930262r334290q761860p334645
3793b3247672k169256N172714Q229328N213147K025849K655224L301199j28726
3785A051807m925968o604792n736963m779430k488752L067574R014465J0525306
$$ y = [-119815, 7660970, 13712921, 11117660, -818970, -12438600, -14138504, -8505796, -5917439, -10190681, -15592978, -17260810, -17437311, -20366830, -26519197, -32930636, -34982521, -27999184, -12080292, 4589113, 12438033, 10965456, 7742815, 7320703, 7223873, 5487505, 5075138, 7998821, 10789628, 9378599, 4393986, -1125385, -5362804, -6731490, -3520691, 2653633, 6857027, 7017708, 6543552, 8475086, 11157382, 12436969, 13688437, 15988310, 16214689, 11113385, 2183123, -7151167, -15913027, -23247672, -25416928, -20244214, -12014886, -6801739, -4775890, -2120666, 1180533, 1051807, -3874161, -10478953, -16215916, -20995346, -23484098, -20416524, -11402059, -876753]
3777h76753P575345M521277L850550L742867J465928l031844o707828n958703
3769D580839p16710M190480M097644M29506j826212j824457k945236n212073m341706
3760c567925j72378J164986k817273n773971k509755K174383J374813k343499
3752a2470619j226676N189779R977598R226140M924157r99797p552389j0452459
3744c384266n608525K556619M572919p13735m452429j797820J228409p76451k975427
3735a1350706P06803N809585L738610l848572o643285q43967N955909O284480
3727a91143J894665j212579j023825N73642J838039J799992n528j684390L6862
3718B025735M258301M899483r17288o798735m864472K275221M016472l160195
$$ y = [-876753, 6698592, 11219869, 15070419, 18813286, 20279214, 17247370, 10539542, 4580839, 3864129, 8054609, 12152253, 12581759, 10755547, 8931090, 5985854, 773781, -3567925, -3740303, -2575317, -5392590, -11166561, -13676316, -11501933, -10127120, -12470619, -13697295, -8507516, 1470082, 10696222, 15620379, 14620582, 7068193, -3384266, -8992791, -6436172, -1863253, -2576988, -7029417, -8827237, -7598828, -8375279, -11350706, -10643903, -4834318, -1095708, -4944280, -11587565, -12431532, -6475623, -191143, 1703522, 490943, -532882, 40760, 1878799, 3678791, 3673263, 1988873, 2025735, 6284036, 11183519, 10266231, 3467496, -1396976, 878245, 4894717, 1734522]
3710A734522r840476o341563L966198R541138O264734J697095L226921P835141
3702A8083710P239699j88520p686795r791673q751832q931900q686092k852072
3694b1565475P384081J2772984O926507m673919j0600169o616212J153612N229783
3686i988808M378748J820865L52603J066514L449994M683889J796865l488557
3678D072113n259637j344413K551240L41869n448181o917164j776441L847539
3670i933075L968697j43298k855971j173425K931343N439500M146415M27151k247530
3661E59807j908036K25356K068246L164501L584499K356644n72718k485601j062090
3652E930608J761632K314059M93304j010276j713906l162854m255524j904010
$$ y = [1734522, -8105954, -14447517, -10481319, -940181, 5324553, 7021648, 10248569, 18083710, 25323409, 25134889, 17448094, 7656421, -1095411, -10027311, -18713403, -21565475, -14181394, -1408410, 5518097, 844178, -9755991, -16372203, -15218591, -9988808, -5610060, -3789195, -3436592, -2370078, 1079916, 5763805, 7560670, 4072113, -1187524, -2531937, 19303, 361172, -5087009, -12004173, -13780614, -9933075, -5964378, -6107676, -8963647, -10137072, -7205729, -1766229, 2380186, 2807337, 559807, -1348229, -1122873, 945373, 4109874, 7694373, 10051017, 9478299, 6992698, 5930608, 7692240, 10006299, 10499603, 9489327, 7775421, 4612567, 357043, -1546967]
3644a546967K949497N149308K797882l3086l38815q01046l726927n063522O0792
3635e52884Q474353J1538403O099046k088407o402735o516045o002433o344642
3627a795344o128801m551796k816126j869612p80843J491298L787186L895611
3619h768427J852311J73658K23326M78492k24969n3403K727017N915240N932875
3610H256120L015631L09099j256180l075272m418285k773879Q04697J681187j449067
3601A094051m103852k473033J717514M774550N389179L451810r21675m697649
3593D230895l166187K865290O056144K542446k292984k751189j571451k986577
3585B926387k802810M761953J3652376J1083844l420999j5207697j3923811n895437
$$ y = [-1546967, 1402530, 6551838, 9349720, 9316634, 8977819, 8176773, 4449846, -613676, -552884, 7921469, 19459872, 25558918, 23470511, 17067776, 10551731, 4549298, -1795344, -7924145, -12475941, -15292067, -17161679, -17942522, -16451224, -12664038, -8768427, -6916116, -6742458, -6519132, -6040640, -6265609, -6319012, -3591995, 2323245, 8256120, 11271751, 11580850, 10324670, 7249398, 2831113, 57234, 861931, 2543118, 1094051, -3009801, -5482834, -3765320, 1009230, 6398409, 9850219, 8928544, 4230895, 1064708, 3929998, 9986142, 12528588, 10235604, 7484415, 5912964, 2926387, 123577, 4885530, 18537906, 29621750, 26200751, 10993054, -2930757, -8826194]
3577h826194k026848k476118j183996J337551k9407l474290j369393O480307J0260187
3568a308201M409680l314078l036996K490852K552547m283450p000706J320543
3560h169809J1943076J1713585R03550p998314p250472j279311L128280N240566
3552H231151N812056K315094n202712r639015n708505Q02631O63093m666369n435271
3543a2827847O94798M880797R31623n701376o716537j839028L889628Q014310
3535h673632J0228421Q337423J113223o810978q642447l634907K532376N105287
3527d45234M338073K662474J470678J172254J663404J978570J052078j067197
3519A2825100l724603o458859q159396p173356m078083k239944l027573k810741
$$ y = [-8826194, -10853042, -13329160, -14513156, -13175605, -13205012, -16679302, -18048695, -11568388, -1308201, 3101479, -212599, -3249595, -758743, 1793804, -2489646, -9490352, -8169809, 3773267, 15486852, 16390402, 8392088, 1141616, -137695, 2990585, 8231151, 14043207, 16358301, 11155589, 1516574, -4191931, -3389300, -2726207, -7392576, -12827847, -12133049, -7252252, -6320629, -12022005, -18738542, -20577570, -16687942, -8673632, 1554789, 9892212, 11005435, 4194457, -4447990, -8082897, -5550521, -445234, 3892839, 6555313, 8025991, 9198245, 10861649, 12840219, 13892297, 12825100, 9100497, 2641638, -5517758, -12691114, -16769197, -19009141, -22036714, -24847455]
3511b4847455J579692O556252O042001R97302j333080J790301M920210L707902
3503e86875J551449K786995M652071K069123l072318m289667o93943J973464N75601
3494D965900j593598j582649j296888k464845k347221J459353N638861N074366
3486G853279J30036l796474k823947K077325O877209P290359J838401n269767
3478A4176421o699557n88898N867359N103598j103375n032770l578011J39775
3470H284542L629228O596294O324663q07439j1624837j6749126j1629184j734071
3462a7709930N347775P536685N948637J328131l619764m009729P57202M861481
3454D40488M234302K099111K380579K846656m0496m080822m878048k739641o68481
$$ y = [-24847455, -23267763, -16711511, -10669510, -9672208, -11005288, -9214987, -4294777, -586875, 964574, 3751569, 8403640, 10472763, 7400445, 3110778, 2416835, 4390299, 4965900, 3372302, 1789653, 492765, -1972080, -4319301, -2859948, 2778913, 7853279, 7983315, 4186841, 1362894, 3440219, 10317428, 17607787, 19446188, 14176421, 7476864, 6887966, 12755325, 17858923, 16755548, 11722778, 8144767, 8284542, 11913770, 18510064, 24834727, 24027288, 12402451, -4346675, -15975859, -17709930, -12362155, -4825470, 1123167, 2451298, -1168466, -5178195, -4420993, 440488, 4674790, 6773901, 9154480, 12001136, 11960640, 7879818, 3001770, 262129, -406352]
3445d06352R46901K395627J318955k982897n798592l533145M6814L73836J30205
3436g508648L133746N133063L25187o838596p435360l192514l633698q781818
3428b8798638p840708K791224J2740827J3066970P326616K259921k017505o260615
3420f731908o282822p30279L098028o16422o287380m944640K744815Q858569R495149
3411a396890O748783K990925k72599q29864J097307J043010l163304o436674l373032
3402c592338L273572O521408M350599j63504m229607n560518j448267O221518
3394E372863R104993K376352p041540r225484m580012q40273n09305k62237j48206
3385e752849l400681p964462p827365k978745Q43181K432161N749922R658328
$$ y = [-406352, 540549, 2936176, 4255131, 1272234, -4526358, -8059503, -8012689, -7638853, -7508648, -4374902, 758161, 1083348, -5755248, -13190608, -16383122, -20016820, -28798638, -36639346, -33848122, -21107295, -8040325, -713709, 1546212, -471293, -6731908, -13014730, -13745009, -10646981, -11263403, -17550783, -22495423, -19750608, -10892039, -1396890, 5351893, 8342818, 8070219, 7240355, 8337662, 9380672, 6217368, -219306, -3592338, -318766, 6202642, 10553241, 10389737, 6160130, 599612, -848655, 5372863, 14477856, 16854208, 9812668, 587184, -3992828, -4833101, -5342406, -5604643, -5752849, -9153530, -17117992, -24945357, -27924102, -27080921, -24648760, -18898838, -9240510]
3377i240510P396136j067050o150211k453751L414776L970438J639557J990097
3369e00518L167676n83n790726p359114k853460K533359L869718J286665j781154
3360g428137j702094K830009Q372436Q457862R56820p772520r478006l772183
3352i535813J941962J817963k220231l952828k77535N792729Q587702N497451
3344G651400q30068n682044o601940m007684O03237M986996O238884L609537N35098
3335F503416P96126L187541L166235q08521n989527r533174r984761n663851L181183
3326a5145333J0886793J0928460M666828k26590q07177j599588m735783n170417
3318a202807L70478O677453P539813M241882J186536j552877n108740o110676
$$ y = [-9240510, -1844374, -2911424, -9061635, -11515386, -8100610, -4130172, -2490615, -500518, 2667158, 2666575, -3124151, -10483265, -13336725, -10803366, -6933648, -5646983, -7428137, -9130231, -6300222, 2072214, 10530076, 11486896, 3714376, -5763630, -9535813, -7593851, -5775888, -7996119, -11948947, -12226482, -6433753, 2153949, 7651400, 6821332, 1139288, -5462652, -9470336, -8867099, -3880103, 2358781, 5968318, 6503416, 7299542, 10487083, 13653318, 12844797, 6855270, -2677904, -12662665, -18326516, -15145333, -4258540, 6669920, 11336748, 11110158, 10302981, 8703393, 3967610, -1202807, -832329, 5845124, 13384937, 17626819, 18813355, 17260478, 12151738, 6041062]
3310F041062j462549M370406M235750j325921n265960m366837k001397j146264
3302i21710p36020O24556K259204L337112L666208K869559J526496J312481J076210
3293A5014096l513363j1735551j4007305m000510R067398J0218143n95165q542341
3285h094598n404757Q07272J310116k70335K609471O668591N406037J610287K487501
3276G129585O398075N427413n81998l494033q65958J23292m334710p488950l351775
3267a039059K663523K047550l070383l346535K673139N904306N44248p073806
3259f97017p400210l43473N898808N823702J436512k726498m483613l455980Q5996
3250e861773L925060M397044O26207l405659l298496J78393K083685l00068l972056
$$ y = [6041062, 4578513, 8948919, 13184669, 11858748, 6592788, 2225951, 224554, -921710, -1657730, -1033174, 1226030, 4563142, 8229350, 11098909, 12625405, 13937886, 15014096, 11500733, -234818, -14242123, -18242633, -9175235, 1042908, 447743, -8094598, -13499355, -12692083, -11381967, -11652302, -9042831, -2374240, 3031797, 4642084, 7129585, 13527660, 18955073, 18373075, 14879042, 14013084, 14136376, 9801666, 2312716, -1039059, 1624464, 3672014, 601631, -2744904, -71765, 5832541, 6376789, -697017, -8097227, -8440700, -2541892, 3281810, 4718322, 1991824, -2491789, -5947769, -5861773, -1936713, 2460331, 3086538, -319121, -3617617, -3439224, -1355539, -1655607, -5627663]
3241e627663l898043O96416M926780L741082j762441n124934k229887L727152
3233e551538O668951M978749J422024k413932o829554r557533o438546J535536
3225a6185843P038356N429817O96687j053916K20839J099702J382519K641716
3217A269877L267025J244996l07107K819778P635742P053931J208166k041622
3209B2150786P03523L447536J144814k260453j084164K521410K313062k369198
3201B6567316o662865p789175p123445n817299l375718m10695J320898J784461
3193a506522K249961K141695l20354m158627n583409k639764K549562O507379
3185g60079O941393K749792m987995j1256460j0278731k721855L541280K935671
$$ y = [-5627663, -9525706, -8829290, -3902510, -161428, -1923869, -7048803, -9278690, -5551538, 1117413, 6096162, 7518186, 5104254, -1725300, -11282833, -17721379, -16185843, -9147487, -3717670, -3020983, -4074899, -3854060, -2754358, -1371839, 1269877, 4536902, 5781898, 5474791, 8294569, 15930311, 22984242, 24192408, 22150786, 22854309, 26301845, 27446659, 25186206, 24102042, 26623452, 28936514, 26567316, 19904451, 12115276, 4991831, -825468, -4201186, -4611881, -3290983, -1506522, 743439, 2885134, 2564780, -1593847, -7177256, -9817020, -7267458, -760079, 6181314, 8931106, 3943111, -7313349, -17592080, -20313935, -16772655, -13836984]
3177a3836984n19545K15018L711920J908869o078827r765267j653316J0268224
3169a5749908J2227575L851769j895461J571768N079587j072473j1111856j1598804
3161a8697803n32959J0612600J2437798O728796j15718m732018n933271l141873
3153c374448J064498J905515j123278k906662j81648M031734N865939N703611
3145A0985261M709074J057393n968197j1757541j1096490m974948J203613M181283
3137a1660552M223395K464573Q34250K385568P239089R709165M100025p105831
3129A2189682j4859103j3381610n249802L058539P406639P549780N416068L030181
3121E160374J034941r74105k495159j974260N22235K439011J925429j694j684963
$$ y = [-13836984, -14356529, -14141511, -10429591, -8520722, -14599549, -24364816, -26018132, -15749908, -3522333, 329436, -1566025, 5743, 5085330, 4012857, -7098999, -18697803, -19230762, -8618162, 3819636, 10548432, 10432714, 5700696, -232575, -3374448, -2309950, -404435, -1527713, -4434375, -4616023, -584289, 5281650, 10985261, 15694335, 16751728, 10783531, -974010, -12070500, -17045448, -15841835, -11660552, -7437157, -4972584, -4138334, -1752766, 5486323, 15195488, 19295513, 12189682, -2669421, -16051031, -21300833, -18242294, -10835655, -3285875, 2130193, 5160374, 6195315, 5221210, 2726051, 751791, 1274026, 3713037, 5638466, 5636772, 3951809]
3112C951809k752590k549353L0498L131191K151168l599194q113121o337874j302630
3103a5390096O60821j120204k143570J13388L983612O594506N356841p22087p459020
3094a0125809p214120R70989P508096M658178k115204k997247Q90784J262098
3086g162235j903302j033117L970373M435963j627462n383498k049044J901921
3078h850401J286954O09418L549360M719396o8303m498780j733027L844219M107142
3069B965978J40026j564777n06995m50464p66458J275031L351268K201887J243061
3060G888557M788348Q156850L819998n003673p779202k719941J441685O5017j798772
3051H858867k51289J240441r6923q89033J528785L936901K986553J07350k750846
$$ y = [3951809, 1199219, -1350134, -1319636, 1811555, 3962723, 363529, -7749592, -14087466, -15390096, -14729275, -15849479, -17993049, -17879661, -13896049, -7301543, -1944702, -2666789, -10125809, -17339929, -16368940, -8860844, -4202666, -6317870, -9315117, -8424333, -7162235, -9065537, -10098654, -6128281, -1692318, -3319780, -8703278, -10752322, -8850401, -7563447, -6954029, -3404669, 1314727, 1246424, -3252356, -4985383, -1141164, 2965978, 3106004, 1541227, 1034232, 583768, -182690, 1092341, 4443609, 6645496, 7888557, 12676905, 20833755, 24653753, 19650080, 11870878, 9150937, 10592622, 10657639, 8858867, 8607578, 9848019, 9751096, 8862063, 10390848, 14327749, 17314302, 17421652, 14670806]
3042A4670806o389584j0029137r606106m326316K43678l48316l275928l371090
3034b2431993l3241M249205Q066263J0040801P604548J132076l671120j749135
3026C207404M718315Q921525P134953J509065l246007m130559k229609j688424
3018A4196663m641231p574486n808789q23071J572027J35681o38990R56837R33256
3009a692103k484708m792071k727605K08202J21761p68347J310762N283238P825255
3000B284384P972222N358230p76654o727952n087970L913999Q669495J332799
2992A6938553r556445j0730103l184160J191407j654699m472304k757038k55257
2984a4480046P02511L197776P151924O622628k53865o773806p201275l633262
$$ y = [14670806, 8281222, -1747915, -11354021, -15680337, -15436659, -15784975, -19060903, -22431993, -22465234, -18216029, -10149766, -108965, 7495583, 8627659, 4956539, 3207404, 7925719, 16847244, 23982197, 25491262, 22245255, 18114696, 15885087, 14196663, 9555432, 1980946, -3827843, -4650914, -3078887, -2943206, -3582196, -2625359, -1692103, -4176811, -8968882, -11696487, -11488285, -11366524, -12134871, -10824109, -5540871, 2284384, 10256606, 15614836, 14838182, 8110230, 3022260, 6936259, 15605754, 16938553, 7382108, -3347995, -6532155, -5340748, -6995447, -11467751, -14224789, -14480046, -13777535, -10579759, -3427835, 3194793, 2940928, -3832878, -11034153, -14667415]
2976a4667415K93960N086234J0256914J0631012L672278m745480p472133m895721
2968a840351k007301r35473j158656l044587n969899o193904j667280L565363
2960a9252088M151901K86624l841617n581194m309190R3119N256465O391995K543013
2951a4260972j040096r81526j187962m565007n297763K010354J0311530Q394037
2943f617405r95928l788845L833181R490686M577302k183774O14647Q618067R001189
2934B2549120M78642n884005m094768k73391p71890k853825j433784J847905J928620
2925A1492624j278310l353486k533949j507886k135936k554820j021217L18474
2917b574506j762665o047235p184276k429396M216283O707614M329271J362154
$$ y = [-14667415, -14373455, -9287221, 969693, 11600705, 15272983, 10527503, 3055370, -1840351, -3847652, -4783125, -5941781, -8986368, -14956267, -21150171, -22817451, -19252088, -15100187, -14813563, -18655180, -24236374, -28545564, -28452445, -23195980, -16803985, -14260972, -15301068, -16282594, -17470556, -22035563, -27333326, -25322972, -15011442, -6617405, -7613333, -11402178, -7568997, 1921689, 6498991, 4315217, 4929864, 13547931, 22549120, 23027762, 17143757, 13048989, 12775598, 12003708, 9149883, 7716099, 9564004, 11492624, 10214314, 6860828, 4326879, 2818993, 683057, -1871763, -2892980, -2574506, -4337171, -10384406, -17568682, -19998078, -15781795, -9074181, -4744910, -3382756]
2909c382756P2241j655650m527448m581935N32355N888835N457561J635890J798107
2900A237200N905348N575498k327685r234682p071607k12387J916230q24082j137198
2891f173365K373399L674465R12880m66953J681139K133133j149553j680166M099682
2882E404661Q439348L841665l832364m236040L16600j169342r091333j1291149
2874a1617954k521918O603508N730303m31243j277012L296453M918009Q01114
2866E501260l408457l433960j287654j10563p7456l82541q14539m20388J892897
2857b541401M604583M148078j043274q629239j4171764j3614103n669484N857979
2849c1058625J3525413J2668941N627667j792656n814110n071291M30351P018639
$$ y = [-3382756, -3310515, -4966165, -9493613, -14075548, -13543193, -7654358, -2196797, -560907, 1237200, 7142548, 12718046, 10390361, 1155679, -5915928, -6128315, -4212085, -5036167, -6173365, -3799966, -125501, 787379, 320426, 2001565, 4134698, 2985145, 1304979, 5404661, 13844009, 17685674, 13853310, 9617270, 9933870, 8764528, -326805, -11617954, -14139872, -7536364, -1806061, -2237304, -3514316, -217863, 4700146, 5501260, 2092803, -1341157, -2628811, -2739374, -2816830, -3199371, -4013910, -4434298, -2541401, 2063182, 6211260, 5167986, -3461253, -17633017, -31247120, -36916604, -31058625, -17533212, -4864271, 763396, -1029260, -6843370, -11914661, -11484310, -4465671]
2841d465671P918751J372445m904992l302201K611217L743794l60463k158949
2833D53931l2221q53704o542583q814888k521798N048609N272109J060461L68197
2824f561887K755943J920683k052500k967196J66574J600449n42225p88262L812245
2815b656176P555465M259573l175071o256867j884084M057434L977094k577941
2807C299427q258748o412782L97035L035255j995516p129126m339911K803798
2799a8600568M356897p97503l459805J208571O158132L657973k998572m989126
2791a5464001m96799M718195O554218O036679M680289K244922n49754j753443
2783E970306j464576j682152k264876p81222K550391L617317L13835l417047k550294
$$ y = [-4465671, 3453080, 4825525, -79467, -3381668, -770451, 2973343, 2612880, 453931, 421710, -431994, -6974577, -15789465, -18311263, -13262654, -7990545, -6930084, -6561887, -3805944, -1885261, -3937761, -6904957, -6738383, -5137934, -5680159, -6468421, -2656176, 4899289, 9158862, 5983791, -273076, -2157160, 1900274, 5877368, 3299427, -4959321, -11372103, -10975068, -7939813, -9935329, -17064455, -21404366, -18600568, -14243671, -15041174, -18500979, -17292408, -11134276, -7476303, -10474875, -15464001, -15960800, -11242605, -4688387, 1348292, 6028581, 8273503, 7723749, 5970306, 4505730, 2823578, 558702, -222520, 2327871, 5945188, 6259023, 2841976, 291682]
2774B91682J913157M303569K033811j707331l532383m171671m809826k654201
2766h333193M977268J3534992J4328406O136258k023282k926901m63778j838162
2758B3391608n558693m968150p05600j60738m641673o659643k186191L263570
2750A774490M316843L079622K248275n74364n442673n218037L463268J1302960
2742A4950384Q298421p48877l539003P87850J989238l709963q690437p256839
2734B080774k542902J678823N397708O264908l213r536256j1287105k903278M499688
2725f350853K929987j425424o66421J690930n60085l476939l11404M847103L080905
2716b42201l706483n400769j54112L404414O10195l111181k312698J068232K877394
$$ y = [291682, 2204839, 6508408, 8542219, 6834888, 3302505, -869166, -5678992, -8333193, -3355925, 10179067, 24507473, 30643731, 28620449, 25693548, 25229770, 23391608, 17832915, 12864765, 12159165, 11998427, 7356754, 697111, -1489080, 1774490, 6091333, 9170955, 11419230, 10844866, 5402193, 184156, 3647424, 14950384, 23248805, 22499928, 18960925, 19748775, 21738013, 18028050, 9337613, 2080774, -462128, 1216695, 6614403, 12879311, 12876098, 3339842, -7947263, -10850541, -6350853, -3420866, -4846290, -5512711, -3821781, -4381866, -7858805, -8170209, -3323106, -242201, -3948684, -9349453, -9503565, -6099151, -5488956, -8600137, -10912835, -9844603, -6967209]
2707f967209K487808J184168J28228J075176M449455O789756M914160J506005
2699A5567547J029861J948113j50856l516840k602531J542636K381959o32540
2691A5567349j471435N61262j169624p932721j1336273o289823J100028L930236
2683g041001M103704N489320N644520J451639l798228o022724p001214q770125
2675a5944109p786227k044666K350394K00138k928684P67171P888071R330418
2667h167494N463774M416460P209706O638852J281925j260741K159130M324255
2659B2065867r164m899653k661787M196592P432675N087152K118694J224852l81221
2650C4174007m640286q111236o266933k53288L393530L15525o111725q775277
$$ y = [-6967209, -4479401, -3295233, -3167005, -2091829, 2357626, 9147382, 14061542, 15567547, 16597408, 18545521, 18394665, 14877825, 12275294, 13817930, 16199889, 15567349, 14095914, 14657176, 13487552, 5554831, -5781442, -12071265, -10971237, -7041001, -2937297, 2552023, 8196543, 9648182, 5849954, -172770, -7173984, -15944109, -23730336, -25775002, -23424608, -23224470, -26153154, -25385983, -17497912, -8167494, -2703720, 1712740, 8922446, 15561298, 16843223, 15582482, 17741612, 22065867, 22056703, 17157050, 14495263, 18691855, 26124530, 31211682, 33330376, 34555228, 34174007, 29533721, 21422485, 15155552, 14902264, 18295794, 18611319, 12499594, 3724317]
2642C724317n626719j377484n1483m896J493668K965266J806316p22226k020865
2633A85894k752547m056319l051866K868486R290412R051761K476862l236228
2625A0776455m508067m309040m334123k080187K062824K309880l681046r211645
2617a2974949o885410J163169O200762L853315j968616m978924l146435L94366
2609a8342722J295931j253475l744735l062682q33204p39410k569486k490653
2601c1740436R04660M588691N637863M366959K393679Q76036J112367L536519
2593h323662N739338M842068J868916P6757o22963k746954m792529j780469O035596
2584B96098J0820074O784635k120888p425078n703422m6203M985573O750263M860622
$$ y = [3724317, -1902402, -3279886, -3331369, -3336265, -1842597, 1122669, 2928985, 2206759, 185894, -2566653, -6622972, -9674838, -6806352, 2484060, 11535821, 14012683, 10776455, 6268388, 1959348, -2374775, -4454962, -2392138, -82258, -3763304, -12974949, -19860359, -18697190, -12496428, -8643113, -10611729, -15590653, -18737088, -18342722, -17046791, -18300266, -22045001, -25107683, -25940887, -26680297, -29249783, -31740436, -30835776, -26247085, -20609222, -16242263, -13848584, -12972548, -11860181, -8323662, -2584324, 2257744, 4126660, 4203417, 3580454, 833500, -3959029, -5739498, 296098, 11116172, 17900807, 15779919, 8354841, 2651419, 2605216, 7590789, 14341052, 19201674]
2575A9201674Q42133l079000n544856n838047l521254m65910q55499n216037p023415
2566a1500211r91285P416137Q115859R36699m480093l436065j412448k728649
2558h080056l672084p85738K666217L205107K566756K267530K89685k517490q58740
2549d918813N261234P668425K566871k786660k479401j711564n886623r024467
2541a1310998l592066N299919O872420P19523m735649n391305l061802J508943
2533a3691015P090752Q035587K255860j859785K449727P056808R57171r824680
2525B470425j0206806p26195L407975k236796n191882J212930O697331K391083
2517b181935m908111n598903k017636j086987k170980j120581J515864L818242
$$ y = [19201674, 20043807, 16964807, 11419951, 5581904, 2060650, 1594740, 739241, -4476796, -11500211, -12491496, -5075359, 3040500, 3977199, -502894, -3938959, -5351407, -8080056, -11752140, -12537878, -9871661, -6666554, -4099798, -1832268, -1542583, -4060073, -4918813, 342421, 8010846, 10577717, 7791057, 5311656, 3600092, -2286531, -11310998, -14903064, -9603145, -2730725, -2011202, -6746851, -12138156, -15199958, -13691015, -6600263, 1435324, 3691184, 1831399, 4281126, 11337934, 12295105, 2470425, -7736381, -8462576, -5054601, -7291397, -12483279, -11270349, -4573018, -2181935, -7090046, -12688949, -14706585, -15793572, -17964552, -19085133, -17569269, -13751027]
2509a3751027O730957Q907756N442701k234295m156839L503116J0601732P856973
2501B2901074O10701j500421j67764k665769p347853p139793l006696j647198
2493C6281k425688J142577P548172O942331l294888j2745560j1637767k988889
2485a7423431L215711K865996L66444J006757M325552N318053J285147l860117
2477b899888m227505k89824J648060q43353k709148j68655K933558K006619p03391
2468e253527j156288j017454l259552m667291o54315N550840O811086L182115
2460d64386Q81258J496103P84700k060835k701861k74830N26000j911596l009260
2451f734707m31883J423166p66758l173526j450342J431810k27658n165030n887527
$$ y = [-13751027, -7020070, 1887686, 7330387, 5096092, 939253, 4442369, 15044101, 22901074, 23511775, 22011354, 21843590, 19177821, 11829968, 4690175, 1683479, 36281, -2389407, -1246830, 6301342, 13243673, 9948785, -2796775, -14434542, -17423431, -14207720, -11341724, -10975280, -9968523, -5642971, -324918, 960229, -2899888, -7127393, -7417217, -5769157, -6612510, -9321658, -9490313, -6556755, -4550136, -5253527, -6409815, -7427269, -10686821, -15354112, -16008427, -10457587, -3646501, -464386, 416872, 1912975, 2697675, 636840, -2065021, -2339851, -1813851, -3725447, -6734707, -7166590, -5743424, -6510182, -9683708, -11134050, -9702240, -9929898, -15094928, -20982455]
2442b0982455R85064R374121J0426276K859007n206869n225669K110761Q198780
2434B539016P252065K235200j208085k255213k713750j589470K275912M851184
2426A1386859J281637n196392n954296O19056O302025M666476q38605l525574
2418H741186k537057j129450l65345O47164J107163k08728j687884r71227P92841
2409D388663O18763r74196l17551L081869M415245J94876n485041n136493J854383
2400B640518P253723M522130k095483l482068J264265L928169q3055n069033m475257
2391D403909p40604j35643k475725k830234n42941P09804L97986J478152L590141
2382C854845K890567o58940k360535m95454R78885q53275l945256n831853o631917
$$ y = [-20982455, -19997391, -10623270, -196994, 2662013, -2544856, -7770525, -5659764, 2539016, 9791081, 12026281, 10818196, 8562983, 5849233, 4259763, 6535675, 11386859, 12668496, 7472104, 1517808, 2136864, 8438889, 13105365, 12266760, 8741186, 6204129, 5074679, 4709334, 5356498, 6463661, 6254933, 4567049, 3595822, 4388663, 5007426, 4033230, 3715679, 6797548, 11212793, 11407669, 5922628, 786135, 2640518, 9894241, 14416371, 12320888, 8838820, 10103085, 14031254, 13948199, 8879166, 4403909, 3663305, 3527662, 1051937, -1778297, -2321238, -1611434, -1213448, 264704, 3854845, 6745412, 6086472, 3725937, 3230483, 4209368, 3356093, -589163, -6421016, -13052933]
2373a3052933n565084k70386P452214J0668383O070141n20529j528257K733948
2365E987497N672650L154383k865890p648428p909018m312535j342485k562335
$$ y = [-13052933, -18618017, -18888403, -11436189, -767806, 5302335, 4781806, 3253549, 5987497, 11660147, 14814530, 11948640, 4300212, -3608806, -7921341, -9263826, -11826161]
$$ [...]
##END NTUPLES=NMR SPECTRUM
##END=
