##TITLE=31P_DE-80H_X3
 64 sc D2O
 26.2.2025
##JCAMPDX= 6.0         $$ Bruker NMR JCAMP-DX V2.0
##DATA TYPE= NMR SPECTRUM
##DATA CLASS= NTUPLES
##ORIGIN= UXNMR, Bruker Analytische Messtechnik GmbH
##OWNER= root
$$ XWIN-NMR		Version 3.5
$$ Thu Jun  5 11:07:48 2025 Russian Standard Time (UT+4h)  Yarkov@DPX200
##.OBSERVE FREQUENCY= 81.013821
##.OBSERVE NUCLEUS= ^31P
##.ACQUISITION MODE= SIMULTANEOUS
##.ACQUISITION SCHEME= undefined
##.AVERAGES= 64
##.DIGITISER RES= 17
##SPECTROMETER/DATA SYSTEM= spect
##.PULSE SEQUENCE= zgpg30
##.SOLVENT NAME= CDCl3
##.SHIFT REFERENCE= (INTERNAL, CDCl3, 0, 198.062)
##AUDIT TRAIL= $$ (NUMBER, WHEN, WHO, WHERE, WHAT)
$$ ##TITLE= Audit trail, XWIN-NMR		Version 3.5
$$ ##JCAMPDX= 5.01
$$ ##ORIGIN= Bruker BioSpin GmbH
$$ ##OWNER= Yarkov
$$ C:/Bruker/XWIN-NMR/data/yarkov2/nmr/P31/2/pdata/1/auditp.txt
$$ ##AUDIT TRAIL=  $$ (NUMBER, WHEN, WHO, WHERE, WHAT)
(   1,<2025-06-05 11:07:15.67 +0400>,<Yarkov>,<DPX200>,
      <created by zg, POWCHK disabled, PULCHK disabled
       configuration hash MD5:
       00 E9 B6 7A A2 85 ED C7 34 08 36 98 17 FE 4E 26
       data hash MD5: 32K
       FE 5E B1 F2 E7 0E 06 2A E4 D4 DF 1C AD A3 A7 41>)
(   2,<2025-06-05 11:07:22.25 +0400>,<Yarkov>,<DPX200>,
      <Start of raw data processing
       efp BC_mod = 2 LB = 1.5 FT_mod = 6 PKNL = 1 PHC0 = 1669.046 PHC1 = 70.95951 SI = 64K 
       data hash MD5: 64K
       7E D7 1A C8 29 CA DD 7D D9 87 E5 AF B0 38 47 34>)
$$ ##END=
$$ 
$$ hash MD5
$$ 8C AF 8C 49 4A 3F EE 60 52 29 D1 BF DE 0F C5 64
##$RELAX= 
##$RELAX= 
##$RELAX= 
##$RELAX= 
##$RELAX= 
##$RELAX= 
##$RELAX= 
##$RELAX= 
$$ Bruker specific parameters
$$ --------------------------
##$DU= <C:/Bruker/XWIN-NMR>
##$EXPNO= 2
##$NAME= <P31>
##$PROCNO= 1
##$TYPE= <nmr>
##$USER= <yarkov2>
##$AMP= (0..31)
100 100 100 100 100 100 100 100 100 100 100 100 100 100 100 100 100 100 
100 100 100 100 100 100 100 100 100 100 100 100 100 100 
##$AQSEQ= 0
##$AQ_mod= 1
##$AUNM= <au_zg>
##$AUTOPOS= <>
##$BF1= 81.014009
##$BF2= 200.13
##$BF3= 200.13
##$BF4= 200.13
##$BF5= 200.13
##$BF6= 200.13
##$BF7= 200.13
##$BF8= 200.13
##$BYTORDA= 1
##$CFDGTYP= 0
##$CFRGTYP= 5
##$CHEMSTR= <none>
##$CNST= (0..31)
1 1 145 1 1 1 1 1 1 1 1 1 1 1 1 1 1 1 1 1 1 1 1 1 1 1 1 1 1 1 1 1 
##$CPDPRG= <waltz16>
##$CPDPRG1= <>
##$CPDPRG2= <waltz16>
##$CPDPRG3= <>
##$CPDPRG4= <mlev>
##$CPDPRG5= <mlev>
##$CPDPRG6= <mlev>
##$CPDPRG7= <mlev>
##$CPDPRG8= <mlev>
##$CPDPRGB= <>
##$CPDPRGT= <>
##$D= (0..31)
0 1 0 0 0 0 0 0 0 0.06 0 0.03 2e-05 3e-06 0 0 0.0002 0 0 0 0 0 0 0 0 0 
0 0 0 0 0 0 
##$DATE= 1749107235
##$DBL= (0..7)
120 120 120 11 120 120 24 19 
##$DBP= (0..7)
150 150 150 150 150 150 150 150 
##$DBP07= 0
##$DBPNAM0= <>
##$DBPNAM1= <>
##$DBPNAM2= <>
##$DBPNAM3= <>
##$DBPNAM4= <>
##$DBPNAM5= <>
##$DBPNAM6= <>
##$DBPNAM7= <>
##$DBPOAL= (0..7)
0.5 0.5 0.5 0.5 0.5 0.5 0.5 0.5 
##$DBPOFFS= (0..7)
0 0 0 0 0 0 0 0 
##$DE= 6
##$DECBNUC= <off>
##$DECIM= 4
##$DECNUC= <off>
##$DECSTAT= 4
##$DIGMOD= 1
##$DIGTYP= 9
##$DL= (0..7)
0 0 52 120 120 21 21 25 
$$ [...]
##$SUBNAM2= <"">
##$SUBNAM3= <"">
##$SUBNAM4= <"">
##$SUBNAM5= <"">
##$SUBNAM6= <"">
##$SUBNAM7= <"">
##$SUBNAM8= <"">
##$SUBNAM9= <"">
##$SW= 400.765351723535
##$SWIBOX= (0..15)
0 1 3 0 0 0 0 0 0 0 0 0 0 0 0 0 
##$SW_h= 32467.5324675325
##$TD= 32768
##$TD0= 1
##$TE= 0
##$TE2= 300
##$TE3= 300
##$TEG= 300
##$TL= (0..7)
0 120 53 12 22 120 120 120 
##$TP= (0..7)
150 150 150 150 150 150 150 150 
##$TP07= 0
##$TPNAME0= <>
##$TPNAME1= <>
##$TPNAME2= <>
##$TPNAME3= <>
##$TPNAME4= <>
##$TPNAME5= <>
##$TPNAME6= <>
##$TPNAME7= <>
##$TPOAL= (0..7)
0.5 0.5 0.5 0.5 0.5 0.5 0.5 0.5 
##$TPOFFS= (0..7)
0 0 0 0 0 0 0 0 
##$TUNHIN= 0
##$TUNHOUT= 0
##$TUNXOUT= 0
##$USERA1= <user>
##$USERA2= <user>
##$USERA3= <user>
##$USERA4= <user>
##$USERA5= <user>
##$V9= 5
##$VALIST= <valist>
##$VCLIST= <CCCCCCCCCCCCCCC>
##$VD= 0
##$VDLIST= <DDDDDDDDDDDDDDD>
##$VPLIST= <PPPPPPPPPPPPPPP>
##$VTLIST= <TTTTTTTTTTTTTTT>
##$WBST= 1024
##$WBSW= 4
##$XGAIN= (0..3)
0 0 0 0 
##$XL= 0
##$YL= 0
##$YMAX_a= 1609
##$YMIN_a= -325
##$ZGOPTNS= <>
##$ZL1= 120
##$ZL2= 120
##$ZL3= 120
##$ZL4= 120
##$ABSF1= 0
##$ABSF2= 0
##$ABSG= 0
##$ABSL= 0
##$ALPHA= 0
##$AQORDER= 0
##$ASSFAC= 0
##$ASSFACI= 0
##$ASSFACX= 0
##$ASSWID= 0
##$AUNMP= <proc_1d>
##$AZFE= 0.1
##$AZFW= 0.5
##$BCFW= 0
##$BC_mod= 2
##$BYTORDP= 0
##$COROFFS= 0
##$CY= -3
##$DATMOD= 1
##$DC= 0
##$DFILT= <>
##$DTYPP= 0
##$F1P= 0
##$F2P= 0
##$FCOR= 1
##$FTSIZE= 65536
##$FT_mod= 6
##$GAMMA= 0
##$GB= 0
##$INTBC= 1
##$INTSCL= 9.790993e-09
##$ISEN= 30
##$LB= 1.5
##$LEV0= 0
##$LPBIN= 0
##$MAXI= 10000
##$MC2= 0
##$MEAN= 0
##$ME_mod= 0
##$MI= 50
##$NCOEF= 0
##$NC_proc= -11
##$NLEV= 6
##$NOISF1= 182.463
##$NOISF2= 159.3651
##$NSP= 0
##$NTH_PI= 0
##$NZP= 0
##$OFFSET= 198.0616
##$PC= 4
##$PHC0= 1669.046
##$PHC1= 70.95951
##$PH_mod= 1
##$PKNL= yes
##$PPARMOD= 0
##$PSCAL= 0
##$PSIGN= 0
##$REVERSE= no
##$SF= 81.0140089999434
##$SI= 65536
##$SIGF1= 159.3651
##$SIGF2= -187.1042
##$SINO= 113.3802
##$SIOLD= 16384
##$SREGLST= <1H.CDCl3>
##$SSB= 0
##$STSI= 65536
##$STSR= 0
##$SW_p= 32467.5324675325
##$SYMM= 0
##$S_DEV= 0
##$TDeff= 32768
##$TDoff= 0
##$TI= <>
##$TILT= no
##$TM1= 0
##$TM2= 0
##$TOPLEV= 0
##$USERP1= <user>
##$USERP2= <user>
##$USERP3= <user>
##$USERP4= <user>
##$USERP5= <user>
##$WDW= 1
##$XDIM= 65536
##$YMAX_p= 529856311
##$YMIN_p= -53114158
$$ End of Bruker specific parameters
$$ ---------------------------------
##NTUPLES= NMR SPECTRUM
##VAR_NAME=  FREQUENCY,     SPECTRUM/REAL,   SPECTRUM/IMAG
##SYMBOL=    X,             R,               I
##VAR_TYPE=  INDEPENDENT,   DEPENDENT,       DEPENDENT
##VAR_FORM=  AFFN,          ASDF,            ASDF
##VAR_DIM=   65536,         65536,           65536
##UNITS=     HZ,            ARBITRARY UNITS, ARBITRARY UNITS
##FACTOR=    0.49542278885378, 1,            1
##FIRST=     16045.7642231865, 0,            0
##LAST=      -16421.768244346, 0,            0
##MIN=       -16421.768244346, -53114158,    0
##MAX=       16045.7642231865, 529856311,    0
$$ Real data points
##PAGE= N=1
##DATA TABLE= (X++(R..R)), XYDATA
$$ [...]
40596A106313J60062q3048k08602j84685o5554k6555j00490q3974P6041R1756
40586F81264j57058k59444R4202M08877J4318p33110p63514M7372N23628l456
40576a46921n21443R2876J124409R92571k12225p60837K4040P56504K98831m52362
40566A195443k04298N61981N35688j74014m05410q1138k02750q10242p51076K16861
40556a18955P97410K49743m29475k65511J46859o5650m20266k6632P48751R23777
40546A540051N17749J91058j18126p54169j050282j25355J251551J338014M7388
40537B837879q42715m62783m5393o09490j171797m95936P38395J032749M17481
40528A398390J12582L92712L80297k43097q19458j037969j272098j387130o02245
$$ y = [1106313, 1266375, 1183327, 974725, 790040, 724486, 697931, 597441, 513467, 589508, 681264, 524206, 264762, 358964, 767841, 782159, 49049, -714465, -667093, -143465, -146921, -668364, -575488, 548921, 1541492, 1329267, 568430, 592470, 1348974, 1647805, 1195443, 991145, 1553126, 2088814, 1914800, 1509390, 1428252, 1225502, 415260, -335816, -118955, 678455, 928198, 498723, 233212, 380071, 314421, -105845, -132477, 616274, 1540051, 2057800, 2248858, 2130732, 1376563, 326281, 200926, 1452477, 2790491, 2837879, 1995164, 1532381, 1486988, 877498, -294299, -790235, -51840, 980909, 1398390, 1510972, 1903684, 2283981, 2040884, 1221426, 183457, -1088641, -2475771, -3078016]
40519c078016R52038J788956R62978n41537j179188q29141m55081l78762k4546
40510b782299Q22673J555590J640684J192149N12701k68274r18593j064226o91943
40501a538k60121j03361r5426k9609Q4615K49262N59229Q63770P81839K93138
40491B341798r5424l8479J74541J05139k50773o41434r36008j035413q17777m80583
40481a674413m76437p54657o10144K32746R72866Q28325K34085J16539M32994
40472f98096M32358N8928m9028J27470j14100q19456j059084l74720M77007P05314
40462a313407M81541K33249j27369n98509n71396K43854J039478R19900J68699
40453D76040l14812l44726l35628l12423k9091K13716r1205o06247m44399M29416
$$ y = [-3078016, -2125978, -337022, 625956, 84419, -1094769, -1923910, -2378991, -2757753, -2782299, -1959626, -404036, 1236648, 2428797, 2941498, 2673224, 1754631, 690405, -1538, -261659, -365020, -460446, -490055, -405440, -156178, 403051, 1266821, 2048660, 2341798, 2246374, 2207895, 2382436, 2487575, 2236802, 1595368, 659360, -376053, -1193830, -1674413, -2150850, -2905507, -3515651, -3282905, -2310039, -1481714, -1247629, -1131090, -698096, -265738, -206810, -255838, -128368, -242468, -1061924, -2121008, -2495728, -2018721, -1313407, -831866, -598617, -725986, -1324495, -1895891, -1652037, -612559, 307341, 476040, 161228, -183498, -519126, -831549, -860640, -646924, -738129, -1344376, -1788775, -1359359]
40443a359359J016743O79790r3508n47063n47372l28494J2794M13206O97764Q06462
40433G50963P91454M91634k82999j134064j274515o09407p664j22023n09342m22017
40423b327980K2412J18086k66648m99985j32444N42610R82988J012198P69436
40414B20673L93576R253j82288q2902R4361M3841j81457j70043K68817P21556
40404A135387O05936j02925q51112j164554j005207m69363M17232J384372J793702
40395A743468J233085Q2361q16676r68464n29203J1281K44333J13496m3014J12206
40385A182873M05767L60872k1938k20754j17365k60146p73104q00509J82481J196017
40375A134194R59057j75275o95299j50417L78493R1206n20658p92287q35648q52202
$$ y = [-1359359, -342616, 337174, 243666, -303397, -850769, -1179263, -1166469, -753263, -55499, 750963, 1542417, 2034051, 1751052, 616988, -657527, -1266934, -1274598, -1396621, -1905963, -2327980, -2305568, -2187482, -2454130, -2954115, -3086559, -2543949, -1560961, -548763, 220673, 614249, 623502, 441214, 358312, 452673, 496514, 315057, 145014, 413831, 1135387, 1741323, 1638398, 787286, -377268, -1382475, -1851838, -1434606, -50234, 1743468, 2976553, 3058914, 2242238, 1273774, 744571, 755852, 1000185, 1113681, 1070667, 1182873, 1588640, 1949512, 1927574, 1706820, 1589455, 1329309, 556205, -244304, -61823, 1134194, 2093251, 1917976, 1222677, 1072260, 1450753, 1541959, 1021301, 229014, -606634, -1458836]
40365a458836n39020J47043M96517O5061n00662l95685J52188L59348Q8434j54023
40355a739635p1798K29212O09735Q70113O55408m0330n73912m28234J3857O4178
40345d11406k10528k03671J75511L85263J17653l62025p21697q35619n74154J07893
40335b532780Q32046J050412P05609K34984n8188k10022k45354j36138r4460l64482
40325h18373o76144m61254K61549P54006N16677q3055l68126j18396M47151J024261
40315D78296J264029Q64949J3543n73598m59409q7907j29114m53512l69695J66913
40305G14495L22929l38233j008470o99171K36909N04865k34267p99521k25680
40296a526144P60455P90917j36343p22751l08211L23532L19260k9525m209L30547
$$ y = [-1458836, -1997856, -1850813, -1354296, -1289235, -1789897, -2185582, -2033394, -1674046, -1585612, -1739635, -1811433, -1582221, -972486, -102373, 553035, 512705, -61207, -489441, -475584, -411406, -621934, -825605, -650094, -264831, -147178, -509203, -1230900, -2066519, -2640673, -2532780, -1700734, -650322, 55287, 290271, 232083, 22061, -223293, -359431, -453891, -818373, -1494517, -1955771, -1694222, -940216, -423539, -506594, -874720, -993116, -545965, 478296, 1742325, 2607274, 2620817, 2047219, 1587810, 1499903, 1370789, 917277, 547582, 714495, 1037424, 699191, -309279, -1008450, -771541, -266676, -500943, -1300464, -1526144, -765689, 25228, -111115, -833866, -1142077, -818545, -499285, -528810, -533019, -202472]
40286b02472L71959K9133k02595o7384J55881J74719M4103m1316l298J16600K20959
40275E96289K29490J85291K02609K64396K40341J16426m0951l00756o53727o59215
40265A80193O5124R55506R27538m2461o81893k71022K64000p3223o54506l39792
40255C29464M37025K57584q68552j321814l05660J028137J392121R87920N84368
40246B520593J29456o74308j215025o22514P18024J392647P60736k93316o23517
40237B092776j95380J78117M9455k53397l61107m52268p70936r14303k60215Q84958
40227b300J329313N65876l97737m31239R9942L2837o89867r88163m52326N4381
40217h79283r9324l29192O4701P17254Q46093M40784Q3686L6261J47430K98399
$$ y = [-202472, 169487, 198620, -3975, -71359, 84522, 259241, 303344, 262028, 258730, 375330, 596289, 825779, 1011070, 1213679, 1478075, 1718416, 1834842, 1793891, 1493135, 839408, 180193, 245317, 1200823, 2128361, 2085900, 1404007, 1132985, 1396985, 1323762, 669256, 329464, 766489, 1024073, 155521, -1166293, -1471953, -443816, 948305, 1936225, 2520593, 2650049, 1975741, 760716, 138202, 856226, 2248873, 3009609, 2716293, 2092776, 1897396, 2075513, 2124968, 1871571, 1510464, 1058196, 287260, -627043, -887258, -2300, 1327013, 1892889, 1495152, 1063913, 1163855, 1196692, 506825, -481338, -933664, -879283, -978607, -1307799, -1243098, -525844, 320249, 761033, 844719, 880980, 1028410, 1326809]
40207A326809L46870k0972p77873j199692o68172L65862Q59212N21935O5208Q2161
40197I01348K89482J27354l14248l77690K38054R69497R99800K63127m73188o03604
40187B019932l59841k00185P679N66669J048925P12981k20554o75831l01293J5026
40177B613508l98694r52751q01829r8299M55392O17524M40496k18681j144327
40168E12339j337278k16425J157214J210393L9999o90372p6333R41315J111569
40159B652421M70302j56417m77842q19410j230053j209147m02927P64281J363855
40150I55063R11970l5742m62057q2741M18447M96204M99615Q43656J006007K11934
40140D762356j142258j721080r90041R7521L86468j78397q20046r31453m72852
$$ y = [1326809, 1673679, 1652707, 874834, -324858, -993030, -627168, 232044, 753979, 819187, 901348, 1190830, 1318184, 1003936, 626246, 864300, 1833797, 2833597, 3096724, 2623536, 2019932, 1660091, 1459906, 1467585, 2034254, 3083179, 3796160, 3575606, 2899775, 2598482, 2613508, 2214814, 1262063, 460234, 361935, 817327, 1434851, 1875347, 1656666, 512339, -824939, -1041364, 115850, 1326243, 1366242, 675870, 599537, 1540852, 2652421, 3122723, 2966306, 2488464, 1669054, 439001, -770146, -1173073, -408792, 955063, 1867033, 1831291, 1369234, 1286493, 1704940, 2201144, 2700759, 3544415, 4550422, 4762356, 3620098, 1899018, 908977, 1006498, 1392966, 1214569, 394523, -536930, -1009782]
40131a009782K14154O63580O01064J84823k30068n16904o93908o08163j96098
40122a591302R6401j99054p24169o61141K1545N02338M27128L94637P83108J005796
40112E5287N22755j80245l60145j73706k78637p01738q91230o23386j44684L58966
40102b416763P52115O49254j05272p91387m74130O43000J295912P68669k55635
40093F5763p10588m06404P5149K52351R8750j38391j09841L89567J045635J163632
40083A725623N03916k81335m21790j2624K28201L4383j31524R2112M09856L64892
40073B511710m6390n51784j018696j319614j126705l60343L72603L93847p4311
40064a219683k08404J29632J94174l17682o05058q12Q76311J031931O01157M46361
$$ y = [-1009782, -795628, -132048, 469016, 653839, 423771, -93133, -787041, -1395204, -1591302, -1494901, -1693955, -2418124, -3079265, -3057720, -2555382, -2128254, -1733617, -950509, 55287, 578042, 397797, 37652, -136054, -414691, -1116429, -2007659, -2631045, -2775729, -2416763, -1664648, -1015394, -1120666, -1912053, -2386183, -1743183, -447271, 321398, 65763, -644825, -1051229, -976080, -723729, -624979, -763370, -873211, -483644, 561991, 1725623, 2229539, 1948204, 1526414, 1513790, 1741991, 1776374, 1644850, 1736962, 2146818, 2511710, 2465320, 1913536, 894840, -424774, -1551479, -1911822, -1539219, -1145372, -1219683, -1428087, -1298455, -1104281, -1421963, -2027021, -2027833, -1151522, -119591, 481566, 927927]
40054I27927O12449L50702l91939p48638m31752k49026o12423o68629K66487J345526
40044D00684J313228L51291l27507l24274l04204n52861n04279R4734O06256N05046
40034A258114J45304M7538P7107j39158m78443n46317l00493J0755K59218L81504
40024G15129J92573l07012o60591m51018P5959L20039J54454l27J13828K74242
40014D27276K33026P4002l1529q6412j07900P721K49606L45850Q8382l34763n32264
40003C32995l32064J35080O23058Q59906O32141O8050k76755L1025O77088Q82045
39993C632569L75854k80645n03692m26467n22351q11843r01327o54633l29994
39984d22529o5135K68571N79120M26533k97754r30502p17409K14397R65179R20558
$$ y = [927927, 1540376, 1891078, 1499139, 750501, 318749, 69723, -542700, -1211329, -944842, 400684, 1713912, 2065203, 1737696, 1413422, 1109218, 556357, 52078, 146812, 753068, 1258114, 1403418, 1450956, 1528063, 1388905, 910462, 364145, 63652, 74407, 333625, 715129, 907702, 600690, -59901, -510919, -434960, -114921, 39533, 39206, 153034, 427276, 660302, 734304, 702775, 616363, 508463, 516184, 765790, 1111640, 1200022, 865259, 332995, 931, 136011, 759069, 1618975, 2251116, 2319166, 2042411, 2073436, 2750524, 3632569, 4008423, 3727778, 3224086, 2797619, 2275268, 1463425, 562098, -92535, -422529, -487664, -219093, 360027, 786560, 488806, -441696, -1159105, -944708, 20471, 941029]
39974I41029L64289j4768O6031L15097L37327Q4558j63344j81739q0094j13665
39964A554721k51736j52934K96832O42584L63624l59702p47453l75648K85261
39955A255549M85427J12531k91367l13116j30994j25830k99809l12726k7519K14120
39945E66266j6621o50202j086622q15859O483P03972P85221M07003J04785J60564
39935A64990L51079L20754P9099j4458K19878M34749J52107n00975p40931l8281
39925D28011J085846J524532Q72512r3014l92722j5857K08057k44408r66596j191234
39915A215127o71581J43234N97873L56218l73774r67638q75864j67030N11049
39906b32386O44962L93773K51156L54785M24073K83863Q8559j9298j67496n42121
$$ y = [941029, 1305318, 1290550, 1356581, 1671678, 2009005, 2093563, 1930219, 1748480, 1668386, 1554721, 1302985, 1150051, 1446883, 2089467, 2453091, 2093389, 1345936, 970288, 1255549, 1740976, 1853507, 1562140, 1249024, 1118030, 992200, 692391, 379665, 352146, 566266, 549645, -100557, -1187179, -2003038, -1996555, -1292583, -507362, -100359, 4426, 164990, 516069, 836823, 915922, 901464, 1121342, 1556091, 1708198, 1207223, 466292, 428011, 1513857, 3038389, 3910901, 3817887, 3425165, 3409308, 3617365, 3372957, 2406361, 1215127, 543546, 686780, 1284653, 1640871, 1267097, 299459, -576405, -743435, -232386, 412576, 806349, 1057505, 1412290, 1836363, 2120226, 2208785, 2189487, 2021991, 1479870]
39896A479870j090309j496175j336899l76151J003532J778591J207033j45817
39888A023675q56829l54021L95972L00945l61982n44852p2100K34334o1521m65778
39878g62157n42533n26138n56381j45491R17763J744846J290956j39188j143386
39869A38291r42233j31263L57031L34184J37016m7959j77081p3155L16989N91772
39859E03592L15834l00456n86306k80019J98095L95340L25952J89070L3138l3918
39849G60322K75975R14865J183938M91152p25405j407173j166208n66529r3587
39840c32650M06861R72787R73727k6754j315798j696557r49081K0735M18277L12326
39830a216127J22720K865m3652N7543K35499J84166j96336n09346l17585K48023
$$ y = [1479870, 389561, -1106614, -2443513, -2819664, -1816132, -37541, 1169492, 1023675, 166846, -187175, 208797, 509742, 147760, -397092, -469192, -234858, -296379, -762157, -1304690, -1830828, -2387209, -2532700, -1614937, 129909, 1420865, 1281677, 138291, -803942, -935205, -578174, -243990, -106974, -154933, -332014, -405169, -88180, 503592, 819426, 518970, -67336, -347355, -149260, 246080, 572032, 761102, 794240, 760322, 1036297, 1951162, 3135100, 3626252, 2900847, 1493674, 327466, -239063, -332650, 74211, 1046998, 2020725, 1993971, 678173, -1018384, -1967465, -1946730, -1528453, -1216127, -1093407, -1090542, -1134194, -1076651, -841152, -656986, -853322, -1362668, -1680253, -1432230]
39820a432230O08254M32196J7411p6152L10692P36393O94324K76388O2576K95567
39810A925419N15685K69842j68073k38714j4115p1573m98489o53456q8534P93368
39800A771360J253434J029590M15030j75689n11714o35558p79147j018399j037541
39791C11366n32315K12305N75752M35531K62035L36943M34113L94398L90621L85858
39781C206607j3654p80719j166245p04344l12R8797k88032l77502M1609L95003
39771D11208K62894j23507l94273n21590o30547o91129n65875j78481M13240R69044
39761a049016J138850P74365J47630k91970l56700k21174j41633j63561j01621
39752b64830J64176L74425J16728m67230n99096O9396P40368N61808M2359K71026
$$ y = [-1432230, -823976, -391780, -374369, -450521, -139829, 596564, 1290888, 1567276, 1629852, 1925419, 2441104, 2710946, 2542873, 2304159, 2290044, 2218471, 1719982, 1066526, 977992, 1771360, 3024794, 4054384, 4469414, 4293725, 3782011, 3146453, 2367306, 1348907, 311366, -220949, -8644, 567108, 1002639, 1264674, 1601617, 2035730, 2430128, 2820749, 3206607, 3192953, 2412234, 1245989, 541645, 541333, 640130, 352098, -25404, 16205, 411208, 674102, 550595, 156322, -365268, -995815, -1686944, -2252819, -2431300, -2018060, -1049016, 89834, 864199, 1011829, 719859, 363159, 141985, 352, -163209, -264830, -100654, 273771, 390499, -76731, -675827, -606431, 133937, 695745, 738104, 1009130]
39742A009130R21703N19961j042205j908078r78388L20391K67663m67476p5354
39733a432653J346099J936140R37735m37481j056159j076438q29327p8967J003872
39724C12821J430339P09576l40210p07954l45940K44278P52765Q91113K99968
39715C246756p63590j309805p90326J33486N02433K50377J7809K19914P30689
39706B237743J135332R97248K44490n42669p00442m21303m87842r78264j086950
39697C97343n01127l126j81591m37971n524P69670R99439N79686J19665q9295
39687A647169k54725m55871n16029l89686j72956J41177N27620P35488N64427
39678A826614J34208l41329p45371q77768n65062j48758k65098q55116j070080
$$ y = [1009130, 1930833, 2450794, 1408589, -499489, -1477877, -1157486, -889823, -1357299, -1432653, -86554, 1849586, 2787321, 2349840, 1293681, 217243, -612084, -691051, 312821, 1743160, 2452736, 2112526, 1404572, 1058632, 1302910, 2055675, 2946788, 3246756, 2483166, 1173361, 383035, 516521, 1018954, 1269331, 1287140, 1507054, 2237743, 3373075, 4370323, 4614813, 4072144, 3371702, 2950399, 2462557, 1484293, 397343, -103784, -106910, -288501, -726472, -731996, 37674, 1037113, 1616799, 1736464, 1647169, 1392444, 936573, 420544, 30858, -142098, -921, 526699, 1262187, 1826614, 1960822, 1619493, 874122, -3646, -568708, -717466, -982564, -1837680, -2907760]
39669b907760n31401P2657J41476R0505M32089P10967K58057n87076r47202o52043
39659c919731j35347M49906J074151J226308N28472l33040l70777J84870K20595
39650a074593m63672q05104p8575J119983J750441J424299M30663o25617j034822
39641F43003m88460M42048Q68007O65335M17479L32774k6079q32760j548153j604360
39631a131166r92928n8089P67492R98731M80538k04834k93992J72522N04490M32885
39621F75649L09898K64076k3552n76981r26993q38654n71451l03277L5316L13155
39611a642814L20687L31440P03115R67509L62593o82235q26973J48562Q93208
39602E75092N35705j30762j93531k3439j89412k15916L50944O76590j27776j254570
$$ y = [-2907760, -3439161, -3366504, -3225028, -3134523, -2702434, -1991467, -1733410, -2320486, -3267688, -3919731, -4055078, -3605172, -2531021, -1304713, -776241, -1109281, -1480058, -1295188, -1074593, -1538265, -2343369, -2421944, -1301961, 448480, 1872779, 2303442, 1677825, 643003, 154543, 596591, 1464598, 2129933, 2547412, 2880186, 2854107, 2021347, 473194, -1131166, -2124094, -2182183, -1414691, -415960, 64578, -140256, -434248, -261726, 242764, 675649, 985547, 1249623, 1226071, 649090, -277903, -1116557, -1688008, -1991285, -1955969, -1642814, -1322127, -990687, -287572, 679937, 1042530, 360295, -466678, -318116, 575092, 1110797, 980035, 786504, 763065, 573653, 357737, 708681, 1385271, 1257495, 2925]
39592B925j199920l8502Q11302Q13343P49310R56108P07519k79715j080324r15614
39582E26432k41967J54176K89599N09397N72252L9291p76291j000725k99849O79506
39572D51821J001727L62174o28559r73670k59712Q11466J080145K37395p71271
39563A311516q27628R5027R76402R11242j0963r31743j117889n82254P5409L34541
39553B33660K02873L1338K2653L9715j51289n60760r04475q33832l00757L08402
39543a912472N39658L83041K09440J59976o8642o29184j052270p62904R3964P49864
39533b289529P02129J77521k71690l07755P0120O05349Q84371O27853K0536m26075
39523b07170m21424j25931K10699N61714Q96738R00881K75144p20097j355091
$$ y = [2925, -1196995, -1235497, -424195, 389148, 1138458, 2094566, 2802085, 2522370, 1442046, 526432, 284465, 438641, 728240, 1237637, 1809889, 1849180, 1072889, 72164, -227685, 451821, 1453548, 1815722, 1187163, 213493, -46219, 765247, 1845392, 2082787, 1311516, 483888, 578915, 1555317, 2466559, 2455596, 1523853, 405964, -176290, -100881, 233660, 436533, 467871, 490524, 530239, 378950, -181810, -1086285, -1920117, -2220874, -1912472, -1372814, -989773, -780333, -620357, -688999, -1318183, -2370453, -3133357, -3039393, -2289529, -1587400, -1409879, -1681569, -1989324, -1919204, -1313855, -429484, 198369, 218905, -207170, -628594, -754525, -543826, 17888, 914626, 1815507, 2090651, 1370554, 15463]
39514A5463j195381n67047j03069j6047n5520j7972Q0784K92096P08461J027017
39504A68785O72669l06680r64478o03402J99448L88776n0273k27257J12942K12715
39494c96755k90337n72042J45245J277954J580332P94288j24494l11552O3564
39485B166203K22812k17328q22098q74432l06687J21846j40352n20571r6209Q57324
39475C90508J043192O3071q54889n66151M58278J004179P18126L5892p48249j388767
39465A55190j307228l85533L58841M1696n58204l3052J341612J791659O34526
39456B039507p46189r28140j99505L33668L37449J65761n3378m21749p77733q38401
39446a088710n97141k11228K16560N03245M12724M0220k20849k51415k95667l77515
$$ y = [15463, -1179918, -1746965, -1850034, -1866081, -1921601, -1939573, -1858789, -1566693, -858232, 168785, 841454, 534774, -429704, -1033106, -833658, -444882, -495155, -722412, -609470, -396755, -687092, -1259134, -1113889, 164065, 1744397, 2538685, 2414191, 2102639, 2166203, 2389015, 2171687, 1349589, 475157, 168470, 290316, 149964, -370607, -466816, 390508, 1433700, 1496771, 641882, 75731, 534009, 1538188, 2256314, 2292206, 1543957, 155190, -1152038, -1537571, -1178730, -1137034, -1695238, -1728290, -386678, 1404981, 2039507, 1293318, 365178, 165673, 499341, 836790, 1002551, 949173, 527424, -250309, -1088710, -1685851, -1897079, -1680519, -1177274, -764550, -724330, -945179, -1196594, -1492261, -1869776]
39436a869776k06679J80433L35748J74100J48323L90822M39311J68586J52979
39427h6153N69592N95626l24914j324483j170485j9621Q41810P37135J64222k34616
39417b51887l73247l55394j81373J3234p694j76620j97969o0960k1833o5517J12963
39406a566297N09401O77757L74824m2521r1238J98050L19256r5419p78096j001333
39396a495616m10117L53137K45616q01863j603494j178192J2014Q45993J080233
39387b952289J263577J424353R44316j32447p23366j52171P94525Q96978Q0359
39378A443835o85493p20595k12645L40861N97420L10262n23351j275001j045414
39369a770121J82513J168146P55520n82817j187410k95847R60922J058100N7792
$$ y = [-1869776, -2076455, -1896022, -1560274, -1386174, -1237851, -847029, -407718, -239132, -86153, 483439, 1079065, 754151, -570332, -1740817, -1760438, -918628, -181493, -17271, -251887, -625134, -980528, -1161901, -1148667, -1156361, -1332981, -1530950, -1591910, -1613743, -1679260, -1566297, -1056896, -379139, -4315, -46836, -138074, 59976, 379232, 283813, -494283, -1495616, -1905733, -1552596, -1306980, -2108843, -3712337, -4890529, -4878515, -4032522, -2952289, -1688712, -264359, 679957, 547510, -175856, -328027, 466498, 1363476, 1443835, 758342, 37747, -174898, 165963, 763383, 1073645, 550294, -724707, -1770121, -1587608, -419462, 336058, -246759, -1434169, -1730016, -769094, 289006, 346798]
39360C46798o17414j82409N87865O22038m108l72807p070O93079J050419O92318
39350B808709k70785j216598j333581m39671O06578P51442l7335q09058q45549
39341g85848l65521O1270L17960O55837J069499J143898O08560j37569l29235
39332B238851J93044N73089n0493j216154j498304l95505Q80379R92656J61713
39323A879276m76293n76407o26784o64780j91297O13194P82420P616q00043q23084
39313h76182l60540p0989p199L1687p0554l06488j74531N33856J117530Q87329
39303G03919K42958M0757K83786L11136J3391q3487J39604J86238j31763l70627
39293A335912k39570r217Q3612J97700L85765L13430j83488p17460q36797n25350
$$ y = [346798, -270616, -453025, 134840, 756878, 752770, 379963, 372893, 1065972, 2116391, 2808709, 2537924, 1321326, -12255, -451926, 154652, 906094, 868759, 59701, -785848, -1151369, -1090099, -772139, -116302, 953197, 2097095, 2705655, 2568086, 2238851, 2431895, 3004984, 2954491, 1738337, 240033, -155472, 724907, 1717563, 1879276, 1402983, 826576, 199792, -464988, -656285, -43091, 739329, 746945, -53098, -876182, -1236722, -1307711, -1314910, -1283223, -1353777, -1660265, -1834796, -1300940, -183410, 703919, 946877, 987634, 1271420, 1582556, 1595947, 1512460, 1652064, 1838302, 1706539, 1335912, 1096342, 1087125, 1170737, 1368437, 1754202, 2067632, 1884144, 1166684, 329887, -195463]
39283a95463p465N08295O79549J70233o90045r06315p410J146965J336903M94496
39273B529743l82307o57272o65190q27688q82612l80448M89402J025312Q09771
39264A058711P2719o29436q43262m33761L18946Q14887N95158j47612o56643l66489
39254b16782M67626J021686P87879Q5391l75267l18379j17564j98715m67606n12450
39244A55819k38904o922q7628k64765j86959O1420O1979k70574m56270p6717N70885
39233g38636P38067J28569p02830r51256m21006L34655O55824M18203K4427j21898
39223f35881j2404R5091O6452J0024L6341Q5701P5741N8927Q2680J8762k60707
39212c79273o06356p21064n42183k50633R7497O33032J260813J508948J052978
$$ y = [-195463, -202928, 305367, 984916, 1155149, 465104, -441211, -448621, 698344, 2035247, 2529743, 2147436, 1490164, 824974, -2714, -885326, -1265774, -776372, 248940, 1058711, 1131430, 501994, -341268, -775029, -456083, 358804, 953962, 806350, 149707, -216782, 250844, 1272530, 2060409, 2145800, 1770533, 1452154, 1334590, 1135875, 668269, 155819, -83085, -90007, -177635, -442400, -629359, -567939, -505960, -776534, -1232804, -1309521, -738636, -569, 128000, -574830, -1526086, -1947092, -1612437, -956613, -538410, -513983, -635881, -648285, -553194, -486742, -476718, -440377, -354676, -278935, -220008, -137328, -118566, -379273, -985629, -1706693, -2248876, -2499509, -2402012, -1768980, -508167, 1000781, 2053759]
39203B053759K00739m27270o02946o10670p15604q08779o65107l39949j28251
39194b044078j67778k23331L1990N35729Q05528N39665R7820O8792M08716M53625
39184E06678q3831o26293n76665k05603j65198m24787l61872J78920O06954M76262
39174f75435O4488j43470n3925J82447M57068N81748L16120j75937k98655K01128
39164D55577P94428Q62440M58971k1362n25428j121671j422979r67885r7725K81595
39154a304039n2725k73337L16723J230809J364829L90130q16502j128460l24460
39145e97032P81826J261716R68909M31686K6307l55351p60030q17243l19721K18392
39135H39459J29386m71699q55464o70686k37210P2705J81984O9573k22723l18205
$$ y = [2053759, 2254498, 1827228, 1224282, 613612, -101992, -910771, -1575878, -1915827, -2044078, -2211856, -2435187, -2403197, -1867468, -1061940, -522275, -424455, -355663, 53053, 506678, 422847, -203446, -780111, -985714, -1150912, -1575699, -1937571, -1758651, -1151697, -675435, -610947, -754417, -808342, -625895, -168827, 412921, 729041, 553104, 254449, 455577, 1250005, 2112445, 2571416, 2550054, 2024626, 902955, -520024, -1487909, -1585634, -1304039, -1356764, -1630101, -1313378, -82569, 1282260, 1672390, 855888, -272572, -597032, 184794, 1446510, 2415419, 2847105, 2873412, 2518061, 1758031, 940788, 621067, 839459, 968845, 497146, -358318, -1029004, -1266214, -1193509, -1011525, -941952, -1164675, -1482880]
39125a482880J49706Q43063R96108N06089Q4851J38643K15154j12394n06236m62259
39115C69845o7619L04879N36963N52267J17313o24050r45158m57362K17902K88709
39105B93689j36711m25510m00938k55143P4044O34877R14559M21561l99445o62278
39095E8705k86694N6772R6798J92448M70128N81910L74877O5160k63691o38038
39085G08375p54445l41292J35533j0135n37069n85150q1507K05762L5009l9600
39075a264519J15382j8691l59902p5265Q55218J277113P10370J91064M04903L70597
39065B206270p92691j997478j642207j22154P49319L84406j01066R8927M85921
39056g30753M35879J30035l0026l3760N683O3455k41k92193n33984m04732j16886
$$ y = [-1482880, -1333174, -490111, 505997, 1012086, 1096937, 1235580, 1450734, 1338340, 832104, 369845, 302226, 607105, 1144068, 1696335, 1813648, 1189598, 244440, -212922, 4980, 293689, 156978, -268532, -669470, -924613, -850569, -215692, 698867, 1120428, 720983, 58705, -227989, -171217, -74419, 118029, 588157, 1170067, 1544944, 1610104, 1346413, 708375, -46070, -387362, -251829, -261964, -799033, -1384183, -1465690, -1259928, -1224919, -1264519, -1149137, -1167828, -1527730, -1602995, -747777, 529336, 1239706, 1430770, 1835673, 2206270, 1413579, -583899, -2226106, -2348260, -1598941, -1214535, -1315601, -1216674, -730753, -294874, -164839, -194865, -228625, -222942, -159487, -159728, -451921, -985905, -1390637, -1507523]
39045a507523o4339j09892Q9705K89809M944n14107n22160N4295N25547N08211
39035a245510L06460K29457K71399M45687P26507P52705L14262o0385J79721N72039
39025B492342K96687l99017n81392k24380j05680k32968J11429P03044M51440
39016B511505n29088p19637K84837Q61762m5883j148681r52421j26008q1879m85309
39006d30802j16697O90787N87250k68537l36041O56156J173467L77670n87740
38997A745513n15115R9651J16912m72222q10360n57046j34524N0512l3624k46192
38987g56495l65592j50111L58885P49455O78113K35169k52386n58483n91253l52943
38977a005641k2635J19286j6017k31406k83835r9684K22326M90387N68295N52858
$$ y = [-1507523, -1571862, -1681754, -1592049, -1302240, -1297296, -1811403, -2333563, -2279268, -1753721, -1245510, -939050, -709593, -438194, 7493, 734000, 1486705, 1800967, 1740582, 1920303, 2492342, 2789029, 2390012, 1808620, 1584240, 1478560, 1245592, 1357021, 2060065, 2511505, 1982417, 1262780, 1547617, 2409379, 2363496, 1214815, 262394, 136386, 54507, -430802, -547499, 143288, 730538, 462001, 125960, 782116, 1955583, 2333253, 1745513, 1230398, 1330049, 1446961, 974739, 164379, -392667, -527191, -476679, -510303, -756495, -1122087, -1272198, -913313, -163858, 514255, 749424, 497038, -61445, -652698, -1005641, -1028276, -908990, -925007, -1156413, -1440248, -1539932, -1317606, -827219, -258924, 293934]
38967B93934O49233P71589N74000O7495k25620q6170p1074o09447j105708p49588
38957d91356J09577L70626j51040m99287j21108M05911M91435L76316L62553J23310
38947I76937n13187q43624k11710Q44797J220129O96144j8287m42823o75206p12141
38937C21029l22407K85549M67027P6447k61002j13878J56836J68910K53701P78993
38927A811205J211603P10174m95464j190120p76227j1740J77280r3053j74349
38918A169309r437N277p9292J43221N45151N10013m4162m81628n07970o26099
38908F24383j136417j409620p72818L86895J071902R20233M08634M4053q0123
38899E7122p0655p6904k37254m02331j35421N97164J056327O21041k26195m98500
$$ y = [293934, 943167, 1714756, 2288756, 2356251, 2130631, 2044461, 1973387, 1363940, 258232, -491356, -381779, -11153, -162193, -661480, -782588, -376677, 114758, 491074, 853627, 976937, 463750, -379874, -591584, 253213, 1473342, 2169486, 2151199, 1708376, 1033170, 321029, -1378, 284171, 751198, 827645, 566643, 452765, 609601, 778511, 1032212, 1811205, 3022808, 3732982, 3237518, 2047398, 1271171, 1259431, 1436711, 1343658, 1169309, 1159872, 1165149, 1085857, 1229078, 1774229, 2284242, 2240080, 1758452, 1250482, 624383, -512034, -1921654, -2694472, -2307577, -1235675, -315442, 93192, 137245, 57122, -13533, -90437, -327691, -730022, -865443, -268279, 788048, 1409089, 1182894, 684394]
38889F84394j17007P0930l12696o06571k11471M34220M61566k24751q03253n04358
38879a128997N08256J240901Q87344k08323q28035l20497N56054O35828j20068
38870A222463p03195n18764o2016o2434n61598j034513r97491l58387N00691R62903
38860a612341Q20604N79814P42410J018564Q18952K81097K9415N5925k27230p81823
38850A725387q08771j00872M31564P3861o44953p75055j94887M88526P68891N16463
38840A480154q6349m93183j76122O01494R44328N56992J43552K16385L02544j16795
38830C373000o63547p71374o42498o89115o25985k9860O49119N76227k31029r66149
38820b1211j101122o86214Q4947Q39982R02071O4909p75601o46347R6515L27400
$$ y = [684394, 567387, 638317, 325621, -280950, -492421, -58201, 403365, 178614, -624639, -1128997, -620741, 620160, 1507504, 1299181, 471146, 150649, 706703, 1342531, 1222463, 519268, 504, -61512, -123946, -685544, -1720057, -2717548, -3075935, -2575244, -1612341, -791737, -211923, 530487, 1549051, 2368003, 2649100, 2678515, 2734440, 2507210, 1725387, 916616, 815744, 1247308, 1321169, 676216, -98839, -293726, 194800, 963691, 1480154, 1393805, 900622, 724500, 1325994, 2270322, 2827314, 2970866, 3187251, 3489795, 3373000, 2709453, 1938079, 1295581, 606466, -19519, -49379, 599740, 1175967, 944938, -21211, -1122333, -1808547, -1723600, -883618, 18453, 83362, -692239, -1338586, -1242071, -914671]
38810i14671j19193l78402j30993l0911l57088m13400K40115R21020Q26630K05588
38800a51305j14794J06689M10212L77304L1521l11833l14610Q0432M81814M44774
38790A040204Q5345o7971J23173K26040l7859m05071n77709n85936m31228M5467
38780e85545O14964N88756j90606p87153k59270R78005J563117Q74959l20417
38771B476810r77306r44996p66218p30468n95674j61251L14994M67285L59895
38762e56929L79096O39450Q04827N73053O5690l80460n37521k83589L59144R65025
38752B027786R05183J70110m14873k67915O7925k44784r87721j201659o77537
38743f23485k00131k48921l78466j48069J67326J90487O7935M8529L4345k4841
$$ y = [-914671, -1033864, -1412266, -1543259, -1574170, -1931258, -2344658, -2104543, -1183523, -356893, -151305, -266099, -159410, 250802, 628106, 659627, 347794, 33184, 113616, 595430, 1040204, 1125549, 1057578, 1180751, 1406791, 1368932, 963861, 386152, -199784, -631012, -585545, 29419, 618175, 427569, -359584, -618854, 359151, 1922268, 2797227, 2476810, 1499504, 554508, -211710, -942178, -1537852, -1699103, -1384109, -916824, -556929, -177833, 461617, 1266444, 1839497, 1905187, 1524727, 987206, 703617, 1062761, 2027786, 2932969, 3103079, 2688206, 2420291, 2488216, 2243432, 1255711, 54052, -623485, -823616, -1072537, -1451003, -1599072, -1431746, -1241259, -1173324, -1124795, -1090450, -1115291]
38733a115291J34153N06913N45694n004n19232l44527J93589L12020m0362k33602
38723e65649j3798J95705L3733l39231n72553m73054o432O53031J077302R53709
38713I42763M79859O3468k65166p15293j099820r01044q8150O33216O45528J40244
38703a64395k50331k49148m3509J91125M57577O21260L29640m79469j173220r29718
38693a690188K34128J259874J171697K15196n08180m32138l9945N2885r0706j54449
38683A8174k42966n52283p14414j94371P11863R82939K02271p54618p56508J73688
38673a126225R42085P92887J85180P8133O30690J004641M91224n37678j101399
38664A359538q34820l05256r0038j7764L81739R95598J150695M98576m62916q97429
$$ y = [-1115291, -981138, -474225, 71469, 66465, -452767, -797294, -603705, -291685, -332047, -565649, -579447, -383742, -350009, -689240, -1261793, -1734847, -1741279, -1088248, -10946, 942763, 1422622, 1486090, 1220924, 505631, -594189, -1495233, -1583383, -950167, -304639, -164395, -414726, -663874, -707383, -516258, -58681, 562579, 892219, 412750, -760470, -1690188, -1456060, -196186, 975511, 1190707, 682527, 250389, 210444, 263329, 172623, 18174, -224792, -777075, -1491489, -1685860, -973997, 8942, 211213, -543405, -1299913, -1126225, -184140, 608747, 793927, 872060, 1502750, 2507391, 2998615, 2460937, 1359538, 524718, 219462, 129424, 111660, 493399, 1488997, 2639692, 3138268, 2675352, 1777923]
38654A777923n27925J09148L21615P9941n207M03249P56047K80964q72321j665301
38644F58133j437614o33578l5433K20399M49617O61135N76678K29893j4942k4508
38634F49780j2451o6019P433K51695L57245Q4589l49977n10433k47398J50777
38624C15241K52760r5224n67229o05241N877Q24318J129847O04411m35440j374131
38614E5189j710070j267894k98772N94073Q66918M97132m6949l09370k13141M7331
38604a785553K86994M26037M38274L28086J45873j5861m8337J15267M07568O05420
38594I03768M85760N9936l73700m87456k74301o4115q3674r8592K38410O99865
38584A005901N98820j70944p03721k27735O86416Q31391J19438l02994J62783
$$ y = [1777923, 1249998, 1359146, 1680761, 1760702, 1755495, 2158744, 2914791, 3195755, 2323434, 658133, -779481, -1413059, -1448492, -1228093, -778476, -117341, 459337, 689230, 674288, 649780, 637329, 571310, 578743, 830438, 1187683, 1272272, 922295, 411862, 164464, 315241, 568001, 472777, -94452, -699693, -693816, 130502, 1260349, 1864760, 1429320, 55189, -1654881, -2922775, -3221547, -2627474, -1760556, -1263424, -1310373, -1619743, -1832884, -1785553, -1498559, -1072522, -634248, -306162, -160289, -176150, -224487, -109220, 298348, 903768, 1389528, 1449464, 1075764, 588308, 314007, 249892, 166218, 67626, 306036, 1005901, 1604721, 1433777, 730056, 502321, 1188737, 2020128, 2139566, 1836572, 1999355]
38575A999355O68942L16189m14950m53344J92244N01255k1454p54017r54333o35160
38565D44727k53647o4062m1333j03339j50145l8443L09968P74432J014518O64190
38555B556866k23689r45101p71678N5276M64804j5779n44863j90212O71278R19857
38545A976759K90851m46656p20948o71678m55085M5372O19066O60390M8088n55458
38535G90701o34787m71705m90138n08161j51897L75170M96041Q2371l61796l21336
38525a195537J85876O91270P67276M23978J8970k23818m20079o17426m99530J12761
38515g56259P18603O62509J06828j26606K97325Q42952R54623O90836L49652L6391
38505C776854j84603k32043l00184o86986j159418j083848m04457J60376J85414
$$ y = [1999355, 2668297, 2984486, 2569536, 2116192, 2308436, 2809691, 2788237, 2034220, 1079887, 444727, 191080, 127018, 85685, -17654, -167799, -206242, 103726, 878158, 1892676, 2556866, 2333177, 1388076, 616398, 671674, 1136478, 1120699, 575836, 385624, 1056902, 1976759, 2267610, 1820954, 1100006, 428328, -26757, 18615, 637681, 1298071, 1346159, 790701, 155914, -315791, -805929, -1314090, -1465987, -1090817, -594776, -512405, -874201, -1195537, -1009661, -318391, 448885, 872863, 891833, 668015, 247936, -369490, -869020, -756259, -37656, 624853, 731681, 605075, 902400, 1745352, 2699975, 3390811, 3740463, 3776854, 3592251, 3360208, 3060024, 2373038, 1213620, 129772, -274685, -114309, 71105]
38496G1105R3584K44984K37131k56966o24052j22506Q57392J216075O53094k6045
38486B343796r1661K80827M61443J57498l94257p55430p22223n10264m07364k91858
38476G0507J05490M56743P4093q14327q96466M14735J765975J474775j44810j232476
38466A274239r09042j06456J49268N122l4711o6453k97476m25169j82192Q9964
38456e02906K3112j13233R7624M94099O57083N73766M41205J86815k29536l95421
38446A232608j1934L86702M2369q17400j164681n96099J97095N39444N75385O20916
38436A004405M41288k29178r38107r72201l35827L14650N60966M89507K02603
38427E38106k86148o52600m23364K79038P34417O17762M34156O36129Q81645O63788
$$ y = [71105, 164689, 409673, 646804, 389838, -234214, -356720, 500672, 1716747, 2369841, 2343796, 2252135, 2532962, 2994405, 3151903, 2757646, 2002216, 1279993, 769729, 362365, 70507, 175997, 632740, 706833, -107494, -1003960, -589225, 1176750, 2651525, 2506715, 1274239, 365197, 258741, 408009, 413131, 378420, 311967, 14491, -410678, -592870, -502906, -479794, -593027, -495403, -1304, 655779, 1229545, 1670750, 1857565, 1628029, 1232608, 1220674, 1607376, 1649745, 832345, -332336, -928435, -731340, -191896, 383489, 1004405, 1445693, 1216515, 278408, -693793, -1029620, -714970, -154004, 335503, 538106, 251958, -400642, -824006, -544968, 189449, 807211, 1241367, 1877496, 2759141, 3422929]
38417C422929J86045k1217n762k13835o10241p02636l91991j22883j47472k48605
38407A144332k55109k48645j93074N3238K92425J80112p4452Q3595N33584M96683
38397B012689j75773o31297l65205l3005k90456o86787n43325j86465l00175o21797
38387a821596m06134J77540K95298o1625l7409N65436Q84937M38110o6656J21179
38377H9080O35031O18848j0650n47867m69539O0486N30493O01615L31017J7529
38367A856043j86932m25679p68477r27017o63304k42650k1351J77069O65228J077143
38357E40073P51663j00608m98453j17639K66424P3972k22339l8615L18769K71811
38347A245058k5109n0157J53670J57509l7519p0961Q0715J28222O1377J13255
$$ y = [3422929, 3608974, 3587757, 3581995, 3368160, 2757919, 2055283, 1663292, 1540409, 1392937, 1144332, 889223, 640578, 447504, 500742, 793167, 973279, 898827, 982422, 1516006, 2012689, 1836916, 1205619, 840414, 807409, 516953, -169834, -713159, -899624, -1199799, -1821596, -2227730, -2050190, -1754892, -1816517, -1853926, -1288490, -403553, 34557, -32099, 89080, 724111, 1342959, 1332309, 784442, 314903, 375389, 905882, 1507497, 1838514, 1856043, 1669111, 1243432, 474955, -452062, -1115366, -1358016, -1379367, -1202298, -537070, 540073, 1291736, 1191128, 692675, 575036, 841460, 915432, 693093, 654478, 973247, 1245058, 1219949, 1169792, 1323462, 1480971, 1443452, 1372491, 1453206, 1581428, 1642805, 1756060]
38337A756060K20719R7819j98478l26867k62690k82955l34691k5101O03897Q69744
38327B117457L33668n39343r71428q08868m82064k79474j50232j44375m81685
38318a406344r81715r05505J60343J472736J752425P08228n51643q51077k45262
38309h47814L57445M64092L50780L72200N06742N64282L87571j11485p05690q06271
38299E31852k09218L05191j23347j027742j078638q4024N93764Q5927o51467m16527
38289b074229K98621J89911o30281p51757K63165J144492Q36355k1723k50958
38280i96404Q2355K80o68642r28258r7877J123384J535236R49594K35650p540
38270A227778j23025n07335p30773k11789O24818P68564J63948j26557M27145
$$ y = [1756060, 1976779, 2074598, 1876120, 1549253, 1286563, 1003608, 668917, 643816, 1247713, 2117457, 2451125, 1911782, 940354, 131486, -350578, -630052, -780284, -924659, -1406344, -2388059, -3293564, -3133221, -1660485, 91940, 800168, 248525, -602552, -847814, -490369, -26277, 324503, 696703, 1203445, 1767727, 2155298, 2043813, 1338123, 531852, 322634, 627825, 504478, -523264, -1601902, -1685926, -1092162, -1006235, -1657702, -2074229, -1775608, -1585697, -2215978, -2967735, -2704570, -1560078, -723723, -745446, -996404, -914049, -913769, -1582411, -2510669, -2608546, -1485162, 50074, 999668, 1235318, 1227778, 1104753, 597418, -133355, -345144, 279674, 1048238, 1212186, 1085629, 1512774]
38261A512774R36012M38587o17985j033925m97549K60204O43499O94452N57161
38252B893230K20529j72300l62056l59836l46131k86108j09237n9234k89861l61150
38242G67846J37103O67959L36617o69102j192687p57404j04311J52234L42984
38233c18761P28573O87249k73810j418930j586766o60413N18795J298467J496491
38224D70895R21408m11439j657332j665881l57961J056133J456675R09659K09091
38215I31248j48828k19638k18325k49403k83877j85291J36767N03444N79307L13369
38205A158773M9040M1371R4818p8343l29460k56661J27250L00057m6247m95236
38195E65362m15229J76005O05899M06921j47188m71718l44851L4853M08872O10512
$$ y = [1512774, 2448786, 2887373, 2269388, 1235463, 737914, 998118, 1641617, 2336069, 2893230, 3113759, 2941459, 2579403, 2219567, 1873436, 1587328, 1478091, 1418857, 1128996, 767846, 904949, 1572908, 1909525, 1240423, 47736, -709668, -813979, -661745, -318761, 409812, 1097061, 823251, -595679, -2182445, -2842858, -2324063, -1025596, 470895, 1392303, 980864, -676468, -2342349, -2700310, -1644177, -187502, 722157, 931248, 782420, 562782, 344457, 95054, -188823, -374114, -237347, 266097, 845404, 1158773, 1207813, 1249184, 1344002, 1265659, 936199, 679538, 806788, 1106845, 1060598, 565362, 150133, 326138, 932037, 1338958, 1191770, 720052, 375201, 410054, 818926, 1429438]
38185A429438N42846L08138K27080M05564M04118k37577j165858j404173n72315
38176f2739N00408P22668M9639n56081l97740J31299J68048m25819q43624l81148
38166a095089N90316J030197N14746l24045p43868p66886p67287o65959j55881
38157b383756N29276P98677O26820N91708Q81908R53606M46694j71188k80491
38148A993254L0188K11310L4281k64380l85143k09313J43384K99804l9186o06543
38138A207656q06361n94588n41567p36108l95081Q07672J744950J154106m67926
38129A372753j400886r90381k41535k0364J03322O98037J236118R15244L8615
38120A710923m22439l12636l52785p67375q17459j2549R60135J075712L28287
$$ y = [1429438, 1972284, 2280422, 2507502, 2913066, 3317184, 3079607, 1913749, 509576, -62739, 437669, 1160337, 1209976, 653895, 256155, 387454, 555502, 129683, -713941, -1095089, -504773, 525424, 1040170, 716125, -27743, -794629, -1561916, -2227875, -2383756, -1854480, -1055803, -428983, 162725, 1044633, 1998239, 2444933, 2273745, 1993254, 2023442, 2234752, 2269033, 2004653, 1619510, 1410197, 1553581, 1853385, 1814199, 1207656, 401295, -193293, -734860, -1470968, -1866049, -1058377, 686573, 1840679, 1372753, -28133, -1018514, -1260049, -1280413, -1177091, -479054, 757064, 1672308, 1710923, 1288484, 975848, 623063, -144312, -961771, -974320, -14185, 1061527, 1389814]
38111A389814l51863l88235j78423l14808o74188o52121r7063M05282K53036m17868
38101a026437q60283n18448L89241J071234R33312J79893l87942k26330L92723
38092e3037P88003O77636L16437n4917m53269p63559n92195J52082Q49632P84997
38082A651810O8257m37370j24632O92121J165559P87128j60361q97495q87906
38073A857111l50038J4901j75859o14348p87271n85107k51215L7479K64178L98490
38063a91679M07849L60149L08404J93814N0845J06249M05107N49936J73849m71833
38053A892690p84592n61555j02628L24167O66326P86603M92641m6881l67735l29867
38043A969169k70131l86888l95084n5291L08796K00569k97555n23947m7726P20017
$$ y = [1389814, 1037951, 649716, 471293, 156485, -517703, -1169824, -1266887, -861605, -608569, -1026437, -1886720, -2405168, -2015927, -944693, -11381, 168512, -219430, -445760, -53037, 734966, 1412602, 1729039, 1674122, 1220853, 457294, -134901, 17181, 866813, 1651810, 1720067, 1282697, 1158065, 1850186, 3015745, 3802873, 3642512, 2745017, 1857111, 1507073, 1521974, 1346115, 731767, -55504, -640611, -891826, -854347, -590169, -191679, 216170, 576319, 884723, 1078537, 1129382, 1235631, 1640738, 2190674, 2364523, 1892690, 1108098, 546543, 443915, 768082, 1434408, 2221011, 2713652, 2666771, 2299036, 1969169, 1699038, 1312150, 917066, 861775, 1170571, 1371140, 1073585, 549638, 501912, 1221929]
38033A221929R10846K42958n09734m14829L11324M72115l99600j219620q89349
38024b73960J039Q2179n58317m67703P24913J473972O25525p41114q82975J36802
38014A20361Q63988P47500N64373P29277O39781j3322n13055k64439K26407J83287
38004C284158k64534m05182k5568M39648N78339L12391k45073p70683p47266J0914
37994B167144R24244J172001O17403j75547p74307j219241j476967j152141j24544
37985d1955R13727J074599L13707n82777j012866j090893j077398q11789r6260
37976b411905P11841J029953Q55925P11624P63606N70239p5561n88831l36969
37967A229922L86596O78100K00748m65943o79591m58917j85513J5690K71376N31610
$$ y = [1221929, 2132775, 2375733, 1865999, 1451170, 1762494, 2234609, 1835009, 615389, -273960, -272921, -190742, -749059, -1216762, -491849, 982123, 1607648, 866534, -16441, 120361, 984349, 1731849, 2296222, 3025499, 3665280, 3651958, 3138903, 2874464, 3100871, 3284158, 3019624, 2614442, 2588874, 3028522, 3606861, 3919252, 3674179, 2903496, 2156230, 2167144, 3091388, 4263389, 4880792, 4705245, 3930938, 2711697, 1234730, 82589, -41955, 871772, 1946371, 2260078, 1677301, 664435, -426458, -1503856, -2315645, -2411905, -1700064, -670111, 185814, 897438, 1661044, 2231283, 2155722, 1566891, 1229922, 1616518, 2294618, 2495366, 2029423, 1349832, 890915, 705402, 721092, 992468, 1524078]
37957A524078M96202Q998o49911r58084o26386J16762P08688P38241K66931k93109
37947A332410n42055l48151Q4609L12667M953o15923q57473l58557L29588L51502
37937c06430k93735o75429j65042P16528J032148O58701K87839L51326N04385
37928B110291K78320k19383n31689m85312k68047k3786K72802N28733M52303m5441
37918B068791n37478m34085L09910J011957R26369N6088q23363r77519m41385
37909A159285J33823K40373n2216l70761m90918m14934k10715K1010J31381Q6049
37899B32377P1349K22745L23621O9056l77383m43690J09025Q12446J048357P22825
37889B790728J78871k95579n88773o19303m19698k43373k75271l39801j84133
$$ y = [1524078, 2020280, 2029278, 1379367, 421283, -205103, -88341, 620347, 1358588, 1625519, 1332410, 790355, 442204, 526813, 839480, 844433, 228510, -628963, -987520, -657932, -306430, -600165, -1275594, -1440636, -724108, 308040, 966741, 1254580, 1605906, 2110291, 2388611, 2169228, 1637539, 1152227, 884180, 860394, 1133196, 1661929, 2114232, 2068791, 1531313, 1097228, 1407138, 2419095, 3345464, 3401552, 2578189, 1600670, 1159285, 1293108, 1533481, 1481265, 1110504, 619586, 204652, -6063, 14947, 146328, 232377, 303726, 526471, 850092, 919148, 541765, 98075, 207100, 1019546, 2067903, 2790728, 2969599, 2674020, 2085247, 1465944, 1046246, 802873, 527602, 187801, 3668]
37880C668R2541K31466K85923M85731P32510O91918L50489J7008j98691l97403
37870B295160m10788N8642P42008R59295O95139P74112J552534K151260J611531
37861A0428893K59948p87718j078550j039413j035136r94092q62585p29247n18865
37852C643235j56738K4250l41368r08814r05982j97477N49379Q09269O79313L62679
37842C557746j02003m17685r9742O60322Q74153O203j161540j439045o18284N30171
37832A790296J273543J366836P84557l01826j287896j459925p51611J33787N03125
37823B050886L63643K10641K97894L47955M2513l84288l52304K06563N96249K89300
37813C669052k49069k22402K69313M17700M4798j45400J77962M15539J58546n3662
$$ y = [3668, 96209, 327675, 613598, 1099329, 1831839, 2523757, 2874246, 2891254, 2692563, 2295160, 1884372, 1943014, 2685022, 3644317, 4339456, 5113568, 6666102, 8817362, 10428893, 10688841, 9901123, 8822573, 7783160, 6748024, 5753932, 4891347, 4162100, 3643235, 3486497, 3510747, 3169379, 2260565, 1354583, 1157106, 1706485, 2515754, 3195067, 3557746, 3455743, 3038058, 2938316, 3598638, 4472791, 4478994, 3317454, 1878409, 1260125, 1790296, 3063839, 4430675, 5215232, 4913406, 3625510, 2165585, 1413974, 1547761, 2050886, 2414529, 2625170, 2923064, 3271019, 3313532, 2929244, 2576940, 2783503, 3379752, 3669052, 3419983, 3197581, 3466894, 3884594, 3929392, 3783992, 3961954, 4377493, 4536039, 4482377]
37803D482377K36738M46462p1910p32217m87209M59047Q63473K98467l03232j29989
37793E062007M49775O71571M55822K51135L13372N42524P07295N88047J81145
37784I222693j39834O82M33117O82981P15283R07625J314264J612371J818018
37775A6567200K315206L062426L599149M039232N107589O818870Q141532Q547020
37767E8198224Q839801R699071J0592946J1301319J3305435J7920710K4052334
37760A53909840L0313396L8957255N3942050P2809428Q2777778O8950196K8196368
37753E29856311k5509034o9974014q9628614q3905383o4136814m3576729k9158886
37746A23966837k0484986j4572453j0224741q014124p868845q405285q416642
$$ y = [4482377, 4719115, 5165577, 5093667, 4361450, 3874241, 4333288, 5196761, 5495228, 5191996, 5062007, 5511782, 6183353, 6639175, 6890310, 7203682, 7746206, 8453501, 9041548, 9222693, 9082859, 9083541, 9516658, 10199639, 10914922, 11822547, 13136811, 14749182, 16567200, 18882406, 21944832, 25543981, 29583213, 34690802, 41509672, 49651204, 58198224, 67038025, 76737096, 87330042, 98631361, 111936796, 129857506, 153909840, 184223236, 223180491, 277122541, 349931969, 432709747, 501659943, 529856311, 504347277, 434373263, 344744649, 260839266, 196702452, 153125723, 123966837, 103481851, 88909398, 78684657, 70670533, 62801688, 54396403, 45979761]
37739D5979761p734163o530035m900709l394651k844148l144223l105986k120585
37731A2205261j111070j086309j561546j425968p86716p27737j449189j872405
37723B184321j250905j51701N00102N31349K78365p5101m40633o01971m91830
37714D81996l50380l17501k42069j22710k50885o05486o29090m6766N60101N27514
37704i95276P7111p0482K36218N17217M93612L59505K65142R0997k02045m33450
37694C38549m80801l73112j23583K16252M12412L13401J71218L09786N60597M56966
37684A801685o9264o20181q91311q30361l38579N75593J331022J143261O3633
37675B165498r27731j107527p54444m65058l10563o1997K49978M73711O65416
$$ y = [45979761, 38245598, 31715563, 26814854, 23420203, 20576055, 17431832, 14325846, 12205261, 11094191, 10007882, 8446336, 7020368, 6233652, 5505915, 4056726, 2184321, 933416, 781715, 1281817, 1813166, 2091531, 2016430, 1575797, 973826, 481996, 131616, -185885, -427954, -550664, -801549, -1407035, -2036125, -2082891, -1522790, -995276, -918165, -988647, -752429, -235212, 258400, 617905, 883047, 974044, 771999, 338549, -142252, -515364, -638947, -422695, -10283, 303118, 474336, 784122, 1344719, 1801685, 1732421, 1112240, 220929, -609432, -948011, -372418, 958604, 2101865, 2165498, 1237767, 130240, -624204, -1089262, -1399825, -1461822, -1211844, -738133, -72717]
37666g2717Q44261P54550L07048n8097Q8707N34874P90406Q05419Q10164P03549
37656E508164K34249l41083m55025j05239J05776o5847j20639L27829Q40431P21671
37646F650287k3494p36470r52109q23297p43225q44364r24201p10331j73720L48391
37636A067467M09458n0176n43240n37235p1399L16879K68524k8147k05656j89895
37626D36580j18321j4775J47461J94268n6070l86431m02485k10241l50051q50232
37616a610297r41695j81312O67170N84719k00138n05018J12758Q49620R58401
37607b65792O72984M93776L43596l5576m44460n56564m44871k80220M8356M87112
37597A8341M68190l17748j149351j014782O1272J109386J484171J341153R37942
$$ y = [-72717, 771544, 1526094, 1833142, 1775045, 1863752, 2398626, 3189032, 3994451, 4804615, 5508164, 5742413, 5401330, 4946305, 4841066, 4946842, 4880995, 4760356, 5088185, 5928616, 6650287, 6626793, 5890323, 4938214, 4114917, 3371692, 2527328, 1603127, 892796, 719076, 1067467, 1476925, 1426749, 883509, 346274, 274875, 591754, 860278, 832131, 626475, 436580, 318259, 303484, 450945, 645213, 589143, 202712, -199773, -410014, -760065, -1610297, -2551992, -2733304, -2066134, -1481415, -1681553, -2186571, -2073813, -1224193, -265792, 407192, 900968, 1244564, 1208988, 764528, 207964, -236907, -517127, -468771, 18341, 486531, 168783, -980568, -1995350, -1934078, -824692, 659479, 2000632, 2938574]
37588B938574K47160n92097j100867j018460o09635k34731J7363J55660J43345
37579e3688P8020J75288M21249N12222K48840k32538o56200q15849o23466k04858
37569a150980J11970J54491J31458K45871L28050K20770J96076M34280M26302
37560A098288l24741j223427j155849j31658O60456O01916L75525N60547N92967
37551A054024j45492j086762j251641o87311k17348j45930r5218J04078K12592
37542b259008K02296L41935O35497P64917O25891M27950K57794R70k95398l93840
37532C09004k09668J40566N46398Q24009O11904j79523r23927q23306O5305P95310
37522A156072O04498l14056j139859j216329n36114K64606M57151M2141j58221
$$ y = [2938574, 3185734, 2593637, 1492770, 474310, -135325, -370056, -352693, -197033, -53688, 24332, 199620, 620869, 1133091, 1381931, 1149393, 493193, -322656, -946122, -1150980, -1039010, -884519, -753061, -507190, -179140, 41630, 237706, 671986, 1098288, 773547, -449880, -1605729, -1737387, -1076931, -475015, -99490, 461057, 1054024, 908532, -178230, -1429871, -2117182, -2334530, -2480460, -2575678, -2471600, -2259008, -2056712, -1714777, -1079280, -314363, 311528, 739478, 997272, 998242, 702844, 309004, 99336, 239902, 786300, 1610309, 2222213, 2042690, 1118763, 295457, 360762, 1156072, 1760570, 1446514, 306655, -909674, -1445788, -1181182, -724031, -681890, -840111]
37513h40111M01571J071161P89407l62800j156442q45532m9933K76620Q4514l1245
37503f62790J79027M63566O27157O88955N64035O7111o66424j072976o82340L01220
37493a93459J062301R31575J17806m54946j83692M88860O38143K3253o87466q46913
37483H95462n46890k48547r2494J02464L77492N32201M61706L36747L57373M44284
37473B619798L13476r7042l96744j65678L81285M93306j39032q35877p56806m8688
37463A367998L55336N736n58616o56485k87317R8905K20616Q8086j56935k60870
37453B16454Q253M93026O47634J63178n87096r56527p33235k40286J40446L35775
37443e12378N11696P51590Q20277L43894o21827j347086j115241j54993N22542
$$ y = [-840111, -438540, 632621, 1422028, 1059228, -97214, -942746, -992679, -716059, -631545, -662790, -483763, -20197, 606960, 1295915, 1859950, 1927061, 1260637, 187661, -494679, -193459, 868842, 1800417, 1918223, 1463277, 1279585, 1768445, 2406588, 2429841, 1742375, 895462, 348572, 100025, 7531, 109995, 487487, 1019688, 1481394, 1818141, 2175514, 2619798, 2933274, 2836232, 2439488, 2273810, 2655095, 3148401, 3009369, 2173492, 1416686, 1367998, 1723334, 1729070, 1170454, 513969, 226652, 325557, 546173, 634259, 477324, 216454, 224707, 717733, 1365367, 1528545, 941449, -15078, -748313, -988599, -848153, -512378, -682, 750908, 1571185, 1915079, 1293252, -53834, -1169075, -1324068, -801526]
37434h01526L38313j96414k52466K31849N60781J97693o16761j135133q73032
37425b546696j23243L50249K23404J0217K69529O94113N56651q9618m15657q5530
37415a156581L01309K93612K68391N56015O83981J85948m62765n08800o2022K13267
37405C12355J66880J08860J1148l52188o79510m73608P961O7893j93637L6218
37395i87628Q24437J162836M87141l97244m73563J33462N84242N18192J70887
37386B022762k39797n66757m96592O8010N69434L52643m13970r05417p03506k21500
37376e34690m5035k72756n97027p00428m52251N6078N63500Q43409Q64401O82601
37366D07802L19687r4201k66754j21391m2992l56611p04395m64267K28223N16332
$$ y = [-801526, -463213, -659627, -912093, -680244, -119463, 78230, -538531, -1673664, -2546696, -2669939, -2319690, -2096286, -2086069, -1816540, -1122427, -565776, -655394, -1071051, -1156581, -855272, -561660, -293269, 262746, 946727, 1132675, 669910, 161110, 99088, 312355, 479235, 588095, 599243, 247055, -432455, -906063, -898102, -830209, -1023846, -987628, -163191, 999645, 1486786, 1089542, 615979, 749441, 1333683, 1851875, 2022762, 1782965, 1216208, 719616, 787626, 1357060, 1709703, 1295733, 390316, -313190, -534690, -579725, -852481, -1449508, -2149936, -2602187, -2546109, -1982609, -1139200, -274799, 407802, 727489, 633288, 366534, 245143, 202151, -154460, -858855, -1323122, -1094899, -578567]
37356e78567R8595j86511M21959J304297J176243m7774j002948p17560J02057
37347E69791J98149m36442p33329k46592L25869M34577M89597Q60493R20546n423
37337B377236j240712j412488m32559K81354j53239q40675n35059M98060R72979
37328d85103M96844l6819Q3092M69326M43454J1784l88144n90459o78762o07766
37318a282553l01601Q2113L58983N94308Q34693Q02696K80682l97655p15752o76894
37308d20980o05483m02162K77263J078805J051092L7902q06583m82424M73794
37299B01224P77332J23300o64838r25393p36426l10256L05012Q07410P13973R9697
37289C91035l69578l65409k44978k55088q0919M37474P76929M32787l07239p55322
$$ y = [-578567, -479972, -666483, -244524, 1059773, 2236016, 2188242, 1185294, 467734, 569791, 767940, 331498, -401831, -648423, -322554, 112023, 601620, 1462113, 2382659, 2377236, 1136524, -275964, -708523, -427169, -580408, -1421083, -1956142, -1458082, -485103, 11741, -25078, 58014, 527340, 970794, 982578, 594434, 3975, -674787, -1282553, -1584154, -1502041, -1143058, -548750, 285943, 1088639, 1369321, 971666, 255914, -420980, -1026463, -1428625, -1151362, -72557, 978535, 1016437, 209854, -272570, 201224, 978556, 1101856, 437018, -488375, -1224801, -1535057, -1230045, -422635, 291338, 391035, 21457, -343952, -588930, -844018, -924937, -487463, 289466, 722253, 415014, -340308]
37279c40308o10532k939P56694J073557L29538j131371j829480p81384J041241
37270a494984J751560Q62127l23392n97643k06443p9422m81332q98149q27383
37261b295061k48522N05172J064099J265798J176895Q72232L20330m03302j003311
37252A254330j265251j244085r69467l29619M64652P79614M05261M4843L50130
37243e09592R09949R31898M90507J80531r1321q22175j603085j390699k08974
37234b112961O79298O11933L22341M43706M60450j11672n98760k04411O10567
37225A00491P84698J69321m94993p00360m91182m5191L40025K05498m41746q28372
37215a401811l98347L10068M53765J08233o3828O8547J93126L94272R20793J341904
$$ y = [-340308, -950840, -953779, -197085, 876472, 1206010, 74639, -1754841, -2536225, -1494984, 256576, 1118703, 795311, 197668, -8775, -88197, -569529, -1467678, -2295061, -2543583, -2038411, -974312, 291486, 1468381, 2340613, 2660943, 2257641, 1254330, -10921, -1255006, -2224473, -2554092, -2089440, -1309826, -904565, -859722, -509592, 400357, 1332255, 1822762, 2003293, 1911972, 1089797, -513288, -1903987, -2112961, -1433663, -821730, -499389, -55683, 404767, 293095, -305665, -510076, 100491, 885189, 1054510, 559517, -140843, -632025, -677216, -337191, -131693, -573439, -1401811, -1800158, -1490090, -1036325, -928092, -991920, -923373, -730247, -335975, 584818, 1926722]
37205A926722R65123L6747m66630k89768j72182n18998p63670m01968J72202L42820
37195H30398J51806L313m9758k30929n25846o47445m10287N7292L83256K15571
37185b22629l88336q65614p05979o9736M34398N04840L32224J32504n1996j03645
37175a003969J49719N95064Q97865R38968Q29854N44178k34n06847n01852q4985
37165A857761M9824m41653j046098j104726o64123k83265k17053j37898L32830
37156a654401J014935J253897P05375j08073l73364j01962j08202o82630j005314
37147a059739l95889N48467Q46466N76876M57509M58418J7015o34638o67408j42311
37137D766L5584k26745r469Q24027J094951K31965o30693l85783L95192O02711
$$ y = [1926722, 2891845, 2928592, 2461962, 2172194, 2000012, 1481014, 717344, 315376, 487578, 830398, 982204, 985517, 935759, 704830, 178984, -468461, -878748, -821456, -438200, -222629, -610965, -1476579, -2182558, -2252294, -1817896, -1313056, -980832, -848328, -900324, -1003969, -854250, -259186, 638679, 1577647, 2407501, 2951679, 2951445, 2444598, 1942746, 1857761, 1907585, 1465932, 419834, -684892, -1349015, -1632280, -1849333, -1987231, -1654401, -639466, 614431, 1319806, 1211733, 838369, 736407, 628205, -54425, -1059739, -1455628, -907161, -60695, 516181, 973690, 1432108, 1449123, 814485, 147077, 4766, 40350, -186395, -195864, 628163, 1723114, 1955079, 1324386, 938603, 1333795, 1936506]
37127A936506L44581L23505L00156m02729j362847j455170o07764J21900K09779
37118e92083K19293N65084Q29777O36800K81301O6328k43459q18531j193122q49767
37108a098379m7490M28507K25065k26432l05350R1056N22461N76942L03023J9271
37098D88674j14798j22066J9629K60221K68528j46888m85180j02042O45088O48331
37088A359497k86329r53059m66591M12554M60844k37901o64595m67207j47741
37079i90528K5408K54620M89786L88134k6805m08675o88016r36736q58410k13476
37069b964698M66157M73285O4653O9775N04965O01422J62197j83933j30439j4931
37059i51547R9038N17943R13059M51259o91130j163135l57660O23133O11615m0619
$$ y = [1936506, 2281087, 2604592, 2904748, 2502019, 1139172, -315998, -923762, -801862, -592083, -372790, 192294, 1022071, 1658871, 1940172, 2006500, 1763041, 944510, -248612, -1098379, -1145869, -717362, -492297, -718729, -1024079, -933023, -410562, 166380, 469403, 488674, 373876, 251810, 271439, 531660, 800188, 653300, 168120, 66078, 711166, 1359497, 1073168, 120109, -346482, 66072, 526916, 289015, -375580, -842787, -990528, -965120, -710500, -220714, 167420, 140615, -268060, -956076, -1892812, -2751222, -2964698, -2498541, -2025256, -1960603, -1890828, -1385863, -784441, -622244, -806177, -936616, -951547, -852509, -334566, 578493, 1029752, 338622, -824513, -1182173, -559040, 52575, 11956]
37049A1956l26928j31876m767r2738j95924l49699n68946n10689q3610J53975
37039b099246j19674l34995j6338K56615k06018q99714q13369L7260Q35311J323398
37029b036770J775712J910498J144975r4165o17598k42602j12954q60071j554329
37020f87304j112482J26696R80565R84869O38651M31062L02599R812m17783o52468
37010F04217l83416K73933P04553L73200n07014j166758j155106p10917k68208
37001b235516J5345J72085K59015L99854O71494Q69848P00441K31141j90893m66840
36991D25974p70244j036907r37553m68346p4303p972n517K15558N39473O96787
36981a423050N59494J18727m06647m50025L06538J166809J018748r4481q48853
$$ y = [11956, -314972, -446848, -451615, -544353, -740277, -1089976, -1658922, -2169611, -2253221, -2099246, -2218920, -2553915, -2570253, -2313638, -2519656, -3419370, -4232739, -4195479, -3360168, -2036770, -261058, 1649440, 2794415, 2700250, 2082652, 1840050, 1727096, 867025, -687304, -1799786, -1673090, -692525, 292344, 930995, 1362057, 1664656, 1674468, 1256685, 604217, 220801, 494734, 1199287, 1572487, 1065473, -101285, -1256391, -1967308, -2235516, -2220171, -2048086, -1789071, -1389217, -717723, 152125, 852566, 1083707, 892814, 425974, -344270, -1381177, -2318730, -2787076, -2861379, -2869351, -2874868, -2659310, -2119837, -1423050, -863556, -744829, -1151476, -1601501, -1294963, -128154, 890594, 796113, -52740]
36972e2740m67209K21755J59767l75515m53390l2407K42320L13600O30563J012103
36962A198847P53070j01000o42659m59889j82259m05526q97368j182243j153104
36953c072131p64016J34500J225837J677564J160209L50540l2508j03699k37775
36944C38521k74735K6843K92567Q0858k70728j70026J68371P4206l57880l61610
36934d53613J94805N60884L30714l275k9072n3935k92799k61723L33320P93030
36924A118336L58663n24976p96007l35417K6556m6153J0742M59132O70368K10204
36914A151448l39324l13901o3144k92925p67604o30909J39722N92316K59086j43720
36904d08955J28429P23840Q05678K87880j88453k38455p3085L5236Q5385J45308
$$ y = [-52740, -519949, -298194, -138427, -513942, -967332, -999739, -757419, -443819, 186744, 1198847, 1951917, 1850917, 1208258, 748369, 566110, 160584, -736784, -1919027, -3072131, -3836147, -3701647, -2475810, -798246, 361963, 712503, 679995, 576296, 338521, 63786, 90629, 383196, 464054, 193326, 23300, 191671, 265877, -92003, -453613, -258808, 302076, 632790, 629515, 600443, 546508, 253709, -8014, 325306, 1118336, 1476999, 952023, 156016, -179401, -152845, -198998, -188256, 270876, 941244, 1151448, 812124, 498223, 435079, 142154, -625450, -1256359, -1116637, -524321, -265235, -408955, -280526, 443314, 1248992, 1536872, 1348419, 1109964, 1036879, 1072115, 1157500, 1302808]
36894A302808K29900L75565N07133L29540k65212q15724p91919l73931j75356
36885C22804k57691r6034M31188P88079P21734O54790P64518M84847m76525j346719
36875A990991j288095o31153k59161k17476R9164O62453P58825J78995m82920
36866H11623p81406q31194p11726l05916J68766K97948K28184M23604O23879J05929
36856B9691q44271r50640J25718J109648J005001M45720L15959K50585l48336
36847A139075r10414p18572m11367q46497j195824q1707J750771K008231K67395
36838A001091j218427p56166N84935R99452N77121N29395R16932P32425k56053
36829C110705j134160j205193o94869j14103K65189K81418r3733n26129n86416
$$ y = [1302808, 1532708, 1908273, 2415406, 2744946, 2479734, 1664010, 872091, 498160, 322804, 65113, -30921, 400267, 1188346, 1910080, 2564870, 3329388, 3814235, 3337710, 1990991, 702896, 71743, -187418, -404894, -305730, 356723, 1115548, 1294543, 811623, 30217, -800977, -1512703, -1818619, -1649853, -1351905, -1123721, -700117, -76238, 29691, -814580, -1765220, -1639502, -529854, 475147, 920867, 1236826, 1487411, 1139075, 228661, -489911, -901278, -1747775, -2943599, -3025306, -1274535, 733696, 1001091, -217336, -973502, -388567, 610885, 1188006, 1717401, 2634333, 3366758, 3110705, 1976545, 771352, 76483, -37620, 227569, 508987, 415254, -110875, -697291]
36820f97291k68463R1233L01432L88157L40349J43713o3343j67033k48852l39360
36810e19458k62755L616J37091l7184k02772o7611J42726J25765M4149J22337
36800e14096R0713l44780p89058o15860N0745N12977N37436N05477N75683M37870
36790D47107o354l87555m59268l75229k28994J14800N41409O00586J78789k13257
36780B12034j23597K60488M92423M62070L16590J09614j40469k71700j69624m580
36770A143249n4069l86163q38715j163386j109905n88032J31682N90413O31043
36761a643883M94676L42231J7452m89876o90043j33335Q29979J283015Q08578
36752H18794k3098l93313j78795J15338J65831J36108J45166o2300n87242r14958
$$ y = [-697291, -965754, -874521, -573089, -184932, 155417, 299130, 235787, 68754, -180098, -519458, -782213, -778597, -641506, -678690, -881462, -949073, -806347, -680582, -636433, -514096, -423383, -768163, -1557221, -2173081, -2122336, -1609359, -1071923, -566446, 9237, 447107, 440753, 53198, -406070, -781299, -1010293, -895493, -354084, 246502, 425291, 212034, 88437, 348925, 841348, 1303418, 1620008, 1729622, 1589153, 1317453, 1147829, 1143249, 1089180, 703017, -135698, -1299084, -2408989, -2997021, -2865339, -2274926, -1643883, -1149207, -806976, -789524, -1279400, -1969443, -2102778, -1272799, 10216, 818794, 795696, 402383, 223588, 338926, 504757, 640865, 786031, 723731, 136489, -778469]
36742g78469n32395J98779M42398J12553n4417K29159L27151j32636m67690l0642
36732f86209O37451O34832J29527n0976J33585L0562l66820l88750k5828p4712
36722b7338o93225r73568m00275L30534N15806M75948O76882P35366J89871m52008
36712C77993m13334J06446L42141K38769L35064O07814M51342j91398o03047l76556
36702H75234K8822O9772j57296k70983j92334m4286J81971N05270O79473L56722
36692B032365m55033j242251j395594q15517m4298L30204L07199K62651K45027
36683g75247j7561l99978l53936J39244L09922k08036o15514j15462P26881P46382
36673e63305l3771m44684L9964N94904L48022m64317j002726q42992j60396N78605
$$ y = [-778469, -1310864, -1112085, -669687, -557134, -611551, -382392, -55241, -187877, -655567, -686209, -48758, 586074, 715601, 664625, 798210, 828772, 461952, 73202, 47374, -27338, -720563, -1694131, -2094406, -1763872, -1248066, -772118, -95236, 640130, 830001, 377993, -35341, 71105, 413246, 652015, 987079, 1594893, 2046235, 1854837, 1251790, 875234, 904056, 973828, 816532, 545549, 353215, 308929, 490900, 996170, 1675643, 2032365, 1577332, 335081, -1060513, -1876030, -1920328, -1590124, -1282925, -1020274, -775247, -792808, -1192786, -1546722, -1407478, -1097556, -1305592, -1921106, -2036568, -1309687, -563305, -597076, -1041760, -1001796, -406892, -58870, -523187, -1525913, -2368905, -2529301, -1950696]
36663a950696Q40712M21671j65059j60493M31314Q37804O50215L07468K23214
36654A436150J66948p3007j14079L43759Q21884O95500J10159l55129n69768p56057
36644A706360q48361o45244l49489k54593j23120L54846O89682J20735r91900
36635c41084j329567m34931N90579O79048K06533J29418M53895M75787P7163k20769
36625B86072l13370o24765j101012j023761j31924Q36013J133408R05298O34482
36616F00441K91357l26928q58927p49596j60583K12751J61132R6353J60461k7457
36606f00996n15031o45093l041Q04550Q90206K84442j69168L4917N30452O85087
36596A296325L36526j49050l08278k7553L10116J90630m05051r12112q93310o02556
$$ y = [-1950696, -1109984, -688313, -853372, -1013865, -582551, 255253, 905468, 1212936, 1436150, 1603098, 1530091, 1416012, 1759771, 2581655, 3277155, 3387314, 3032185, 2462417, 1706360, 857999, 212755, -136734, -391327, -514447, -159601, 530081, 650816, -341084, -1670651, -2105582, -1515003, -835955, -629422, -500004, -46109, 429678, 506841, 286072, -27298, -652063, -1753075, -2776836, -2908760, -2072747, -939339, -34041, 600441, 891798, 564870, -294057, -1043653, -1204236, -991485, -830353, -734000, -573539, -600996, -1116027, -1761120, -1764161, -959611, -69405, 215037, 45869, 80786, 611238, 1296325, 1632851, 1483801, 1175523, 1147970, 1458086, 1648716, 1243665, 331553, -561757, -1164313]
36586a164313n47837p10720o10617n0969O13497R57680Q82473N11528K4684l48563
36576d43157m46711l43829j96166L2165M30569Q11448Q62032N83178K15103k06451
36566A298181p56633j119109p94975K3279M18602m0715n89091k71508P19877J307692
36556A95600R27222Q2595m40413l91817l5528K34619J26038l43060p19393n17390
36546h81527R8629L69522p1025n74311k54787P59938J366819Q71685j31458n79569
36536I73916k95756k7370k58511n86317m51768K7317L33059L03648J50508n1106
36526A17620l50522m79232q141R04261J400492Q55268l52631j245902j245243
36517d04030n81323J08517L86471K90986J37433N5947j73041o76581j066918q44759
$$ y = [-1164313, -1712150, -2422870, -3033487, -3084456, -2470959, -1513279, -630806, -119278, -94594, -443157, -889868, -1233697, -1429863, -1397698, -967129, -155681, 706351, 1289529, 1504632, 1298181, 541548, -577561, -1372536, -1349257, -930655, -971370, -1560461, -1831969, -1112092, 195600, 1122822, 1205417, 765004, 373187, 337659, 572278, 698316, 355256, -364137, -881527, -782898, -413376, -484401, -1058712, -1313499, -553561, 813258, 1684943, 1553485, 973916, 678160, 650790, 392279, -194038, -645806, -618489, -285430, 18218, 168726, 117620, -232902, -712134, -720275, 183986, 1584478, 2439746, 2087115, 841213, -404030, -985353, -876836, -490365, -199379, -61946, -5999, -179040, -855621, -1922539, -2767298]
36507b767298j58889L27342L82983M53059P52756P65166J26651n18416k60543
36498h97189P32953J355809J011447K52645j41330j14228p9472j88140k47049
36489A685446j35949K3037K3839k69053p94023j183155r73325j46502O79284Q48418
36479b41983L84959j26740l12636l32114l70777j98565M27360J114668J081481
36470A425653J75172p47188p77652o6907M33322K49214q3644J05721O82414R85316
36460B381421P48315K94758p1392m04562p90207j076493j107797r35082o01689
36451a562728K48P80699J203337Q11506o6779n81847l90122J7217J54399J95228
36441E61158M34505O03389L49503N3122L31194Q46488N95915m36713r70577k96898
$$ y = [-2767298, -2926187, -2598845, -2215862, -1762803, -1010047, -244881, -118230, -636646, -897189, -164236, 1191573, 2203020, 2455665, 2314335, 2200107, 2120635, 1932495, 1685446, 1549497, 1572534, 1596373, 1327320, 533297, -649858, -1623183, -1769685, -1090401, -241983, 142976, 16236, -296400, -628514, -999291, -1197856, -770496, 344172, 1425653, 1600825, 853637, 75985, 9078, 442400, 691614, 607970, 713691, 1396105, 2381421, 3129736, 3424494, 3353102, 2948540, 2158333, 1081840, -25957, -961039, -1562728, -1562480, -781781, 421556, 1233062, 1166283, 584436, 194314, 211531, 365930, 561158, 995663, 1599052, 1948555, 2001677, 2332871, 3179359, 3775274, 3338561, 2367984, 2071086]
36431B071086N38561K90362n79422p23718q3272J76806k73404m54645P4380L53327
36421A390061l18531j068693p56696K78338Q22542N53825J53169Q362j58484m74088
36411D29805o22685m31751p6377L27223P50820R10654N03540j98924n68146m65593
36401E58566l21748l41722k37671J17394L63149K46602P5392K45892O21258O89922
36391B017034K01287n51031j015806q91607m00713k2789O1199N9538N3444j95480
36381f84924o60666p66551j99781M20084L58673p4554r56N97328Q48647L70055
36371B07355k73448o02647p56041p44899j72808Q42277J372371R19344J95709
36362I87213J8017J20939j79236p46302r02906n21215J931N42351J196749J661098
$$ y = [2071086, 2609647, 2900009, 2320587, 1596869, 1513597, 1690403, 1416999, 962354, 1036734, 1390061, 1071530, 2837, -753859, -475521, 347021, 900846, 1054015, 1062377, 903893, 429805, -192880, -624631, -701008, -373785, 377035, 1287689, 1791229, 1592305, 1024159, 558566, 236818, -104904, -342575, -225181, 137968, 384570, 459962, 705854, 1327112, 2017034, 2218321, 1667290, 651484, -240123, -640836, -663625, -602426, -542888, -489444, -684924, -1345590, -2112141, -2311922, -1891838, -1533165, -1607719, -1608675, -1011347, -162700, 207355, -66093, -668740, -1424781, -2169680, -2342488, -1500211, -127840, 791504, 987213, 1005230, 1126169, 946933, 200631, -702275, -1223490, -1221559, -679208, 517541, 2178639]
36352B178639J479892Q08265J98475k56111q22964j285782j045230j40581O09947
36343A724550O72308L26080m0849m65001r52151j144643q52873m26029k07233
36334a365841m8617K60546N06554M24817K06809J65991J77575m3257k93981p4600
36324h4004N83975R86058O31145j29904n26163k78303J54498K17723n6705j84803
36314A313517J4608J17496k37532o58954m55500K89634O83315K39291m24276m73842
36304D07757J2614L13629J28229k17947m46789n94654o52801n21425l56771m21715
36294b349873n31556k14450M68882Q75815P36346M99858M47020K03290l65983
36285b30651n45600J45941Q84474N92315l21494m81939K89055O57027r7750r37058
$$ y = [2178639, 3658531, 4466796, 4665271, 4409160, 3586196, 2300414, 1255184, 1114603, 1724550, 2396858, 2722938, 2682089, 2217088, 1264937, 120294, -732579, -1158608, -1365841, -1414458, -1153912, -647358, -222541, -15732, 150259, 327834, 284577, -9404, -84004, 499971, 1486029, 2117174, 1987270, 1461107, 1182804, 1337302, 1555025, 1498320, 1313517, 1328125, 1445621, 1208089, 549135, 93635, 383269, 1066584, 1305875, 881599, 407757, 420371, 734000, 862229, 644282, 197493, -397161, -1049962, -1571387, -1928158, -2349873, -2881429, -3095879, -2626997, -1751182, -1014836, -514978, -67958, 135332, -230651, -776251, -630310, 254164, 846479, 524985, 43046, 332101, 989128, 891378, -45680]
36275d5680p19436J03210L96474J16160K7446J79126r1640p90526j085504o22509
36265b532879j4920K32861L86387O99645P98235L72323j58839k62814q9877o9074
36255f38952j09302J52073N54528N32964k4134n91758p19416m70280r1872L16752
36245a089397O53151O79546K93497k38067n06730l51333O6755M60982N84167L16258
36235H68829k13949n99718m65190N2489K79144k65159j121984j227454j74292
36226b867284J151620J514357P10405l70583r20627r47138q09275n56936r119
36217c104580Q11835J582720J868737J338653O9958j231791j636531q82203K82079
36208i01123Q29273M37680l25843o45111k06853N42794Q66385N57901J56489J43872
$$ y = [-45680, -765116, -661906, -265432, -149272, -121826, 57300, -34340, -824866, -1910370, -2532879, -2547799, -2314938, -1928551, -1228906, -430671, -58348, -217187, -480001, -569878, -638952, -748254, -596181, -41653, 491311, 467177, -124581, -843997, -1314277, -1406149, -1089397, -436246, 243300, 536797, 298730, -208000, -559333, -492578, -31596, 552571, 868829, 654880, 55162, -410028, -357539, -78395, -343554, -1465538, -2692992, -2867284, -1715664, -201307, 509098, 138515, -782112, -1729250, -2538525, -3095461, -3104580, -2292745, -710025, 1158712, 2497365, 2567323, 1335532, -300999, -1183202, -901123, -71850, 365830, 39987, -605124, -811977, -269183, 597202, 1155103, 1311592, 1455464]
36198A455464K37216n3483m69428l59683J36865K03668k56975l69751K15780O20810
36188A360483J53694n30279n15565l8772J65986K15203O20477J023446O68393
36179C123066j46389l86101K9485J24032m43506q23168m26009J74304K61548p276
36169A479986j12217K4603J85963K07106j24783q81724j484437j130692J645P81352
36159a053198O50594K50547J76884J33919j14929k6570O47539J007050K66992
36150A938828q53882j124138n95978k21905j30304L71554J223517J399134M82029
36141B488855o51752j081219q91985o17940l93791r5953K35727N09344P23434
36132B24720P70105M83536K5436k04407j56580j75405l52549l45190L184L59766
$$ y = [1455464, 1692680, 1639197, 1169769, 810086, 946951, 1150619, 893644, 523893, 739673, 1360483, 1514177, 983898, 468333, 429561, 595547, 810750, 1431227, 2454673, 3123066, 2976677, 2590576, 2620061, 2744093, 2300587, 1477419, 1051410, 1225714, 1487262, 1479986, 1367769, 1392372, 1578335, 1785441, 1660658, 778934, -705503, -1836195, -1834550, -1053198, -402604, -152057, 24827, 158746, 43817, 17247, 664786, 1671836, 1938828, 1084946, -39192, -635170, -857075, -987379, -615825, 607692, 2006826, 2488855, 1837103, 755884, -136101, -754041, -1147832, -1243785, -1008058, -498714, 224720, 994825, 1478361, 1503797, 1299390, 1142810, 967405, 614856, 269666, 272850, 632616]
36122F32616M21901K90386J33926q2769l43306m60204l77193k13668M8082M37976
36112D87747N61118j4857q04561o92243M32602J178585M51109r55488j404029
36103g60017n65532L95684N31762Q7649k23824j45348Q0589P3571l59363q91710
36093a776539p93307J64935J124060J056451J03738o98083q67234p67779n03770
36084b957528L47567J558933J922379Q34451o05247r50512k81757J94781j542
36075F1525k03380J09122N79606O90281M35354N1593l31967n69168n23996l89790
36065i0820n16502p99844p40502k32998K53023M38662N76897P83216O75823Q1931
36055D28886m89400n69132l97727l53917k60108J02920L22721J8214k53833K55417
$$ y = [632616, 1054517, 1344903, 1478829, 1396060, 1052754, 592550, 215357, 1689, 49771, 487747, 1048865, 1034008, 229447, -462796, -30194, 1148391, 1599500, 644012, -760017, -1325549, -929865, -398103, -310454, -534278, -679626, -599037, -525466, -884829, -1776539, -2569846, -2404911, -1280851, -224400, -120662, -818745, -1685979, -2453758, -2957528, -2609961, -1051028, 871351, 1705802, 1100555, 150043, -131714, 63067, 61525, -141855, -32733, 546873, 1237154, 1672508, 1724101, 1392134, 822966, 298970, -90820, -607322, -1407166, -2147668, -2380666, -2127643, -1688981, -1112084, -328868, 346955, 428886, -60514, -629646, -1027373, -1381290, -1641398, -1538478, -1215757, -1197543, -1451376, -1195959]
36045a195959J089270J060940J24257m18533J27019Q27941O42627n1299k88178
36036A918085p8849r3865k72624P8934R00070J194213M83764m46958p04908m98060
36026B479802n96853j032868j060684l42846M69254N69186J1038m58753l99076
36017c61800j10407o9454l07295n14297m48582o408P79497J448069J181343k06995
36007A383671j565665j502409k16235O56132K68402l47386m44Q15499Q14895Q803
35997C15263l74368J33112O03406K59253m20094n88843k14750J69276L07536K83072
35987D72863J40409q9981k60471l20076l99847m88499l85542j66747k30541o08968
35977b337400p37387k80664L11919N28014N57912P55393Q10298K37202o00706
$$ y = [-1195959, -106689, 954251, 1078508, 659975, 786994, 1614935, 2257562, 2206263, 1918085, 1839236, 1745371, 1472747, 1551681, 2451751, 3645964, 4129728, 3682770, 2977862, 2479802, 1882949, 850081, -210603, -553449, -84195, 484991, 496029, 37276, -361800, -472207, -541661, -848956, -1363253, -1811835, -1818243, -1038746, 409323, 1590666, 1383671, -181994, -1684403, -1900638, -1244506, -976104, -1323490, -1323934, -508435, 306460, 315263, -59105, 74007, 677413, 936666, 516572, -72271, -287021, -117745, 189791, 472863, 613272, 523291, 262820, -57256, -457103, -945602, -1331144, -1497891, -1728432, -2337400, -3074787, -3355451, -3043532, -2515518, -1957606, -1202213, -391915, -154713, -755419]
35968g55419q22336l19185J19255O7857M3187N12557J021123Q28874J4165n94962
35958A15116m61582Q3499L37558Q7071j63430J09028O05558M47328n26620j214155
35948e80629o38050M92155N87761n01153j166350m26044N92293M37557m08375
35939a610835l73582O81200J305284P55698k9072r6554J97149J79637P1963L31376
35929A412264O16885L78971j18578l33396m96868j077234j581065j103513O8680
35920b233854O67976L44492P1390L54641L83903l78481j025795o41781J02772
35911b354737M6733m89510k72564O69642R80922J49290o89309n30306J38796L86524
35901a964519K45004K73080M41492L23690k0317j26049J15765L60250L17696k8849
$$ y = [-755419, -1577755, -1896940, -1777685, -1709828, -1666641, -1154084, -132961, 695913, 710078, 115116, -346466, -262967, 74591, 161662, -1768, 107260, 712818, 1160146, 633526, -580629, -1218679, -726524, -138763, -639916, -1806266, -2232310, -1640017, -1202460, -1610835, -1984417, -1303217, 2067, 757765, 728693, 632139, 829288, 1008925, 1080888, 1412264, 2029149, 2408120, 2289542, 1956146, 1459278, 382044, -1199021, -2302534, -2233854, -1565878, -1221386, -1149996, -795355, -411452, -789933, -1815728, -2457509, -2354737, -2308004, -2797514, -3070078, -2400436, -1419514, -1270224, -1959533, -2489839, -2351043, -1964519, -1719515, -1446435, -1004943, -681253, -701570, -827619, -711854, -351604, -33908, -62757]
35891f2757m71331n35744J90588J297277J634550P25840m08670n58700J5428J38381
35881A964862m11329p08456l06076J08046n4064m17016m69842l96118n15522n97142
35871a802657l37346K7928J63640K04464L40809L32230L0235r7305L41577Q58575
35861F2150P44312K10179K7713K33855J13875n43717j080611j016897o61550m18583
35851b329274j97928J50974M30050M73581M20926K96748j49706q42332j155798
35842b902759p24374l532M12011N65129P48772Q19462N12239P0954r7775j18315
35832g18188l14361m37169j8999O21331O04851j69995p50668m79945J18209K36255
35822a308679n9778j52331Q7082K51332J99121K47335N15867O21811K66806k14331
$$ y = [-62757, -534088, -1069832, -879244, 418033, 2052583, 2778423, 2369753, 1811053, 1826481, 1964862, 1553533, 845077, 539001, 647047, 592983, 175967, -293875, -689993, -1205515, -1802657, -2140003, -2112075, -1948435, -1743971, -1403162, -1070932, -1040697, -1138002, -796425, 62150, 806462, 1016641, 1044354, 1278209, 1392084, 848367, -232244, -1249141, -1910691, -2329274, -2527202, -2376228, -1946178, -1472597, -1051671, -754923, -904629, -1746961, -2902759, -3627133, -3630665, -3218654, -2653525, -1904753, -1085291, -573052, -502098, -599873, -718188, -1032549, -1469718, -1488717, -867386, -262535, -432530, -1183198, -1663143, -1544934, -1308679, -1368457, -1520788, -1433706, -1182374, -983253, -735918, -220051, 401760, 668566, 454235]
35812D54235k26200K86346P34317O41129K28552L4936J54604K29848J18692M8344
35802B704803j9418n56501j578975k140677j413335N3403R46659R08424P63654
35793c31963J009372J049093K95095p80260j251649q59986m6754O51300P99107
35784E33355J63135q51290j290053p31924Q8437K75687j4477p664L94428N40257
35774i00109J23924l81569m33137j4727M99444O60633K23389m72976o14123Q9310
35764a219941P93444N66860k53610o08731l96088m99056j090368j144257j03110
35755c954857J054265J143784L59624k74301l87853l27426k15009J09503M35228
35746b057042L50327J2395r061L29732M73919K13322O635J57945L04342Q1621
$$ y = [454235, 228035, 514381, 1248698, 1889827, 2118379, 2153315, 2307919, 2537767, 2656459, 2704803, 2685385, 2128884, 549909, -1590768, -3004103, -2950700, -2004041, -1095617, -331963, 677409, 1726502, 2021597, 1241337, -10312, -870298, -917052, -265752, 533355, 696490, -154800, -1444853, -2176777, -2088340, -1812653, -1827130, -1834794, -1440366, -900109, -776185, -1157754, -1590891, -1605618, -1106174, -445541, -222152, -695128, -1309251, -1219941, -426497, 140363, -113247, -721978, -1118066, -1617122, -2707490, -3851747, -3954857, -2900592, -1756808, -1397184, -1671485, -2059338, -2386764, -2601773, -2492270, -2057042, -1706715, -1694320, -1703381, -1373649, -899730, -686408, -679773, -521828, -217486, -135865]
35736a35865k01670l7668M25393N25020L9545m43352k86425L28480N87242Q6958
35726H87658n88650n60536K04245P91301M78420l46712o98439k38100L87243M66875
35716G83305R6637j12723M6216J53754j07073l84308j32123N42940R47072P23276
35706B556973K54399j7275j81718m23232m74354r7276K32649j15082q26698r37923
35696b9537k71550K97205K50589J96277P22580J300702J087919K53027l56341
35687C450871n18120p17262j063440j024566l87411K38232K02376l39409o67237
35678h25966l43386L77840Q44426O23478p9737o25955o22780k61831J01525M01508
35668d10878O57545O60804K87418j10789j06015J58562J86820j21339m12383m69540
$$ y = [-135865, -337535, -375203, 50190, 575210, 614755, 171403, -115022, 213458, 800700, 887658, 299008, -261528, -57283, 734018, 1212438, 865726, 167287, -70813, 316430, 783305, 879942, 767219, 813435, 967189, 860116, 475808, 343685, 886625, 1833697, 2556973, 2811372, 2794097, 2612379, 2189147, 1714793, 1617517, 1850166, 1735084, 908386, -29537, -301087, -3882, 246707, 442984, 1165564, 2466266, 3554185, 3807212, 3450871, 2932751, 2215489, 1152049, 127483, -259928, -21696, 180680, -158729, -825966, -1169352, -791512, 52914, 676392, 596655, -29300, -652080, -913911, -812386, -410878, 246667, 907471, 1194889, 1084100, 978085, 1136647, 1323467, 1202128, 789745, 320205]
35658C20205l63346j01847L18652N62324K67651k46179k25765M17589Q77681N59372
35648B386337j70471o49753p85168q33549p89122n06025j45002j6193j29372k53802
35638a892120k57922q9106L47237R16866J092478N36448k59733m26526J55457
35629A23079O49425L46417m53843r34914q25701n38447l65004p3996M86496Q39905
35619g46583M46002l49279n41214K21599J100120J155113M96077j20070m15221
35610A246544o47838p84688m30439L30078P37492L05606n21569r37512o23061
35601a325387J61516R10533J067172L28123q89875j600283j213256j60588O59425
35592b062620Q02495M38333p3818m32589m31567p7965L93970P59848R19290P76728
$$ y = [320205, -43141, -144988, 173664, 735988, 1003639, 757460, 531695, 949284, 1826965, 2386337, 2215866, 1566113, 780945, -52604, -841726, -1347751, -1492753, -1508946, -1638318, -1892120, -2150042, -2239148, -1891911, -975045, 117433, 653881, 394148, -32378, 123079, 772504, 1118921, 665078, -269836, -1095537, -1633984, -1998988, -2072984, -1586488, -746583, -300581, -649860, -1191074, -969475, 130645, 1285758, 1781835, 1661765, 1246544, 598706, -185982, -616421, -286343, 451149, 756755, 235186, -702326, -1325387, -1163871, -253338, 813834, 1141957, 252082, -1348201, -2561457, -2722045, -2062620, -1260125, -821792, -895610, -1328199, -1759766, -1837731, -1443761, -683913, 235377, 1012105]
35582A012105L35157o6367p2866M2835l41024j070628j130875j48710Q04040O79196
35572D2863M8151J76308R43999R97676l4604q18946k77549Q05570R12282j70615
35562B625135j269102j407310p19998O9863M40769L15739k1822j68030j0122J32334
35552a2544r138j95814n8736K23377J31984l01354l96833J43502O43950L65016
35542E33410l70766o09724j81548P4065l34674p10924k12508P84721J116646M35483
35532E24181l77940m77068m1286K46012J41166j18107l12265l84410l47876l50540
35522a498133n62198p55499l92586N14518J070922N77022l93492o58408K0339
35513b077515P60114Q68238N74282L56256K78650K63255L55632L63797j54349
$$ y = [1012105, 1347262, 1280895, 1208029, 1250864, 909840, -160788, -1291663, -1440373, -636333, 42863, 91014, 267322, 1211321, 2208997, 2174393, 1355447, 1077898, 1883468, 2795750, 2625135, 1356033, -51277, -771275, -701412, -260643, 55096, 33274, -134756, -144878, -12544, -21682, -217496, -276232, -52855, 79129, -222225, -619058, -475556, 168394, 533410, 162644, -447080, -628628, -554563, -889237, -1600161, -1812669, -1027948, 88698, 524181, 146241, -330827, -372113, -126101, 15065, -103042, -415307, -799717, -1147593, -1498133, -2060331, -2815830, -3208416, -2693898, -1622976, -1045954, -1439446, -2097854, -2077515, -1317401, -449163, 125119, 481375, 760025, 1023280, 1378912, 1742709, 1588360]
35504A588360j075392j446050o60731N18968Q57671L00015r4493J92469M70078
35495F50895R8636m39618l60786J11454J03653m51855o12667J41509J015077R09192
35485A165490j22925r98757r90067m31304l3211K0434O4155L16531N49184L92141
35475f8329j47050n73599m28131J11719M12507K53123J21428L50010M12850k87262
35465A57266j213254j140918J33703J374474J466226O42416k17090p43138r58404
35456d98719o99564M0027O35901N19405O3604K8537L76921M54265J59285K4976
35446A104638J59796L9822m88724q61492p13878l68821j14185K17448N66493L74537
35436h4366m18845q53831j98648Q53558J109169N67877K02133K89848J16720n46404
$$ y = [1588360, 512968, -933082, -1593813, -1074845, -217174, 82841, -11652, 180817, 650895, 749531, 309913, -50873, 60581, 164234, -287621, -900288, -758779, 256298, 1165490, 1042565, 43808, -946259, -1377563, -1410774, -1390340, -1326185, -1009654, -460470, -68329, -215379, -788978, -1217109, -1105390, -692883, -439760, -318332, 31678, 444528, 157266, -1055988, -2196906, -2063203, -688729, 777497, 1419913, 1202823, 459685, -498719, -1198283, -1158256, -522355, -2950, 60654, 89191, 466112, 920377, 1079662, 1104638, 1264434, 1304256, 815532, -45960, -759838, -1128659, -1242844, -1025396, -458903, -84366, -503211, -1357042, -1555690, -702132, 407037, 974914, 1177047, 1466895, 1583615, 1037211]
35426A037211q22218j12650Q05752Q57511K12818j74872j99756o47302j559020
35417f02526j720883l87347J328111J698560O02887m57778m47868P4946J32918
35408B21020k47751l20230K21626R31916J187622O95036k98934j008102o99470
35399F82733L62256R72475M07928o37905j029905o26033q6833K93033O76958Q53357
35389A868064L11038p67130j424062j071189j12084O95271R32337N43136j89285
35380G86096o14519l02913K79954L42691j5148P646M79874N44995o2210m25296
35370A021170M7148N34201L8672j065572j610705j194066l18722N42545J172495
35361h32834J286235Q46385M50366O26625R70412P21545l8308n62446o25086o70476
$$ y = [1037211, 214993, 102343, 908095, 1765606, 1978424, 1803552, 1603796, 956494, -602526, -2323409, -2710756, -1382645, 315915, 918802, 461024, 13156, 88102, 221020, -26731, -346961, -125335, 806581, 1994203, 2689239, 2390305, 1382203, 682733, 1044989, 2017464, 2425392, 1787487, 757582, 131549, 44716, 337749, 1014707, 1868064, 2179102, 1411972, -12090, -1083279, -1195363, -500092, 432245, 975381, 786096, 171577, -131336, 148618, 491309, 476161, 483807, 963681, 1508676, 1446466, 1021170, 1068318, 1602519, 1641191, 575619, -1035086, -2229152, -2547874, -2005329, -832834, 453401, 1299786, 1750152, 2376777, 3347189, 4068734, 4030426, 3467980, 2842894, 2172418]
35351B172418q38804p29428k70278l0042l56197p78859o20970J41600Q77715R63559
35341E30714L59222l30920m28014N2432M02697J74412k33161k61485k6122M9320
35331B89095N211Q7574R2334k30784m16864J16493Q53534O39867n36505j296582
35321c96627p52054L22482P13604L45345k0679l0658N4671K6080q1343k88201
35311a07380o22846q44363o21268R134N90606O48145Q3082o95425j039432p10739
35301c310486k31489k27978m67978j09859R66794J727578J268319L9507p01081
35292a046673l48184N73827J145159Q51146j44326j107288j231083l87762O64195
35283a030989J061612P17722K07587m3279j27500k85415m97598n43606l18713
$$ y = [2172418, 1333614, 604186, 333908, 303866, -52331, -831190, -1452160, -1310560, -432845, 530714, 889936, 559016, 131002, 183434, 586131, 760543, 527382, 265897, 239775, 289095, 294306, 381880, 474214, 243430, -173434, -56941, 796593, 1436460, 899955, -396627, -1148681, -826199, -112595, 232750, 212071, 181413, 236084, 262164, 180821, -107380, -730226, -1574589, -2195857, -2186723, -1596117, -947972, -864890, -1560315, -2599747, -3310486, -3541975, -3769953, -4237931, -4347790, -3380996, -1653418, -385099, -345592, -1046673, -1394857, -821030, 324129, 1175275, 1030949, -76339, -1307422, -1695184, -1030989, 30623, 748345, 955932, 912653, 785153, 499738, 2140, -541466, -860179]
35274h60179J4369K16062K93081M81365P85858P64424J01668p64092j056621o56034
35264f80099j61601M0063J48732K76492J18813l58913n70509j59410L33333K45802
35254g67297j79787k01514K87366P11360P46700O27993N24771K30775l51636q48194
35244G80537p74623q7632P27108J046564O46909n8653m29512l05314j01646j61812
35234A281926l72162n45767p20112q11809m87563K07919N86617K22706k99499
35225i37744j72609M47926P37598M09282j08873m90252p20219o33242q3440M61775
35215a089798L61478j29952j40626L56944L86998l78242q56029j22289J097850
35206e13666J395127N85107k83723n35553n28309o98458p85225l31874N27819
$$ y = [-860179, -845810, -629748, -336667, 144698, 930556, 1694980, 1796648, 1032556, -24065, -680099, -841700, -801637, -652905, -376413, -257600, -616513, -1187022, -1346432, -1013099, -767297, -947084, -1148598, -861232, -149872, 596828, 1224821, 1749592, 1980367, 1628731, 780537, 5914, -81718, 645390, 1691954, 2338863, 2280210, 1850698, 1545384, 1443738, 1281926, 909764, 363997, -356115, -1167924, -1655487, -1447568, -860951, -638245, -937744, -1110353, -662427, 75171, 484453, 375580, -114672, -834891, -1468133, -1551573, -1089798, -728320, -858272, -998898, -641954, -254956, -633198, -1489227, -1611516, -513666, 881461, 1466568, 1182845, 647292, 118983, -579475, -1364700, -1696574, -1168755]
35197a168755J149030J069906M32882k12569m47576l50600l15632n11245o60454
35188a015013m31504J18331O31682Q57550Q11689O13971L19736q7881n84061r74106
35178B60394r60538m75380J33518M61376N28741O41872Q43342Q64640O16171L10792
35168C224928N3509k44964m69146l35762J3369L3009l54738n38121k44754j05324
35158A032006n84377r98334m72281N73716R30331L96767k6947J93159L90770J4151
35148A448961l42334P0930Q42059R14629P5992q25488j018303n42649J06955N15403
35138A246155M53814q6811p88934j198293j142754q01909l63841J43312O32417
35129a906844Q33037N54800l7248n39918o76120m95797k46470q3848N8453K76363
$$ y = [-1168755, -19725, 1050181, 1483063, 1270494, 822918, 472318, 156686, -354559, -1015013, -1446517, -1328186, -696504, 161046, 972735, 1586706, 1906442, 1818561, 1234500, 260394, -700144, -1175524, -1042006, -580630, -51889, 589983, 1433325, 2297965, 2914136, 3224928, 3278437, 3033473, 2564327, 2228565, 2241934, 2274943, 1920205, 1382084, 1137330, 1032006, 447629, -550705, -1022986, -449270, 481061, 877828, 850881, 1044040, 1434810, 1448961, 1106627, 1177557, 2019616, 2934245, 3010237, 2184749, 1166446, 623797, 730752, 1246155, 1699969, 1613158, 824224, -374069, -1516823, -2318732, -2682573, -2539261, -1906844, -1073807, -519007, -556255, -1096173, -1772293, -2268090, -2514560, -2598408, -2539955, -2263592]
35119b263592M40135L11236n5308k57994l7022L98987P13145Q46294P96848L00995
35109A193724p33244j611213j361335j9777J205928J366316Q11507L89117J82828
35100A423851k38675p00833n00129L75398R76296O45624j35855n47379m85752
35091H12546l42151k35053r2108j38791n86528r94977o71577K75562R48752Q47350
35081a76975M24575K52558K47719R7710o0637R7473M61881O22085M51845J63193
35071B581427n3709q0557K22872P26147Q45362J94761o92948r14693m72070l21795
35061B034797r67529j678750j523760o35618J06443K87364K22429K02772J28206
35052a823646o0832j13763J80766O80355J027462Q82976P8898j097781j805468
$$ y = [-2263592, -1823457, -1512221, -1567529, -1825523, -1862545, -1463558, -750413, 95881, 892729, 1193724, 460480, -1150733, -2512068, -2531845, -1325917, 40399, 851906, 1241023, 1423851, 1185176, 484343, -15786, 359612, 1335908, 1981532, 1845677, 1298298, 812546, 470395, 235342, 143234, 4443, -582085, -1577062, -2248639, -1973077, -1024325, -176975, 247600, 500158, 747877, 845587, 784950, 882423, 1344304, 1966389, 2418234, 2581427, 2527718, 2447161, 2670033, 3396180, 4241542, 4436303, 3743355, 2828662, 2356592, 2034797, 1067268, -611482, -2135242, -2770860, -2664417, -2377053, -2154624, -1951852, -1823646, -1884478, -1998241, -1817475, -1137120, -109658, 773318, 852216, -245565, -2051033]
35043b051033j337876n9522Q30318P13456K56559L42245P92864P75640J76588
35034D39239k16431O1764M65378K72643m02881q33994o00047R0398P78844J080867
35024A135780P71803l2654p59059p86246j12611N86658O91012K74303j08292j32244
35014A528450J4379N3568P5136L58492Q15713R16817L24615o04622j205384j263053
35004A014111j086103q92529n36569N8872N95838P61601O07432L37804J0832k77848
34994E93441k25584K58438O84736M94999j70414o53273o29148l11881R2329N33877
34984F67520P00599J58800q13894j182828m22040O47495Q41998J05309n87307
34975A15652o04003k59446n2232K7020J73697K51820Q692m08965n27774j38514
$$ y = [-2051033, -3388909, -3448431, -2618113, -1904657, -1648098, -1305853, -512989, 262651, 439239, 222808, 284572, 749950, 1022593, 619712, -214282, -814329, -723931, 54913, 1135780, 1907583, 1874929, 1115870, 329624, 217013, 803671, 1494683, 1768986, 1660694, 1528450, 1542829, 1596397, 1671533, 2030025, 2845738, 3762555, 4087170, 3482548, 2277164, 1014111, -71992, -964521, -1501090, -1442218, -846380, -84779, 522653, 860457, 871289, 593441, 367857, 626295, 1311031, 1806030, 1635616, 982343, 353195, 41314, 133643, 667520, 1368119, 1526919, 713025, -469803, -891843, -244348, 597650, 702959, 115652, -488351, -747797, -800029, -773009, -599312, -347492, -338800, -747765, -1275539, -1414053]
34965a414053M06883N73572K37899j98492l12836j56872p7005j24546K736L42743
34955g19971M32818J6573m02215k34304K32603K19616k88732m69499n379L10106
34945i08384k09582r71261q56151K02542J126059J072178K86120m36695n85058
34936a280232j43673N34149Q91755N87469p2505m06205j69116K10737K94361J42341
34926E89081p536j67173l89757m44121r7668M09077N18688j6658q42931j279313
$$ y = [-1414053, -1007170, -433598, -195699, -394191, -707027, -863899, -940904, -1065450, -1062714, -719971, -287153, -270580, -672795, -907099, -674496, -454880, -743612, -1213111, -1218490, -908384, -1117966, -2089227, -2945378, -2742836, -1616777, -544599, -258479, -695174, -1280232, -1423905, -889756, 1999, 589468, 516963, 110758, -58358, 152379, 446740, 589081, 581545, 414372, 24615, -419506, -517174, -108097, 410591, 393933, -448998, -1728311]
$$ [...]
##END NTUPLES=NMR SPECTRUM
##END=
