##TITLE=31P_DE-80H_X3
 64 sc D2O
 26.2.2025
##JCAMPDX= 6.0         $$ Bruker NMR JCAMP-DX V2.0
##DATA TYPE= NMR SPECTRUM
##DATA CLASS= NTUPLES
##ORIGIN= UXNMR, Bruker Analytische Messtechnik GmbH
##OWNER= root
$$ XWIN-NMR		Version 3.5
$$ Thu May 29 12:41:03 2025 Russian Standard Time (UT+4h)  Yarkov@DPX200
##.OBSERVE FREQUENCY= 81.013821
##.OBSERVE NUCLEUS= ^31P
##.ACQUISITION MODE= SIMULTANEOUS
##.ACQUISITION SCHEME= undefined
##.AVERAGES= 64
##.DIGITISER RES= 17
##SPECTROMETER/DATA SYSTEM= spect
##.PULSE SEQUENCE= zgpg30
##.SOLVENT NAME= CDCl3
##.SHIFT REFERENCE= (INTERNAL, CDCl3, 0, 198.062)
##AUDIT TRAIL= $$ (NUMBER, WHEN, WHO, WHERE, WHAT)
$$ ##TITLE= Audit trail, XWIN-NMR		Version 3.5
$$ ##JCAMPDX= 5.01
$$ ##ORIGIN= Bruker BioSpin GmbH
$$ ##OWNER= Yarkov
$$ C:/Bruker/XWIN-NMR/data/yarkov2/nmr/P31/2/pdata/1/auditp.txt
$$ ##AUDIT TRAIL=  $$ (NUMBER, WHEN, WHO, WHERE, WHAT)
(   1,<2025-05-29 12:40:26.51 +0400>,<Yarkov>,<DPX200>,
      <created by zg, POWCHK disabled, PULCHK disabled
       configuration hash MD5:
       00 E9 B6 7A A2 85 ED C7 34 08 36 98 17 FE 4E 26
       data hash MD5: 32K
       25 58 94 8C 81 AD E2 87 29 66 3F 55 B8 9A 01 4E>)
(   2,<2025-05-29 12:40:32.82 +0400>,<Yarkov>,<DPX200>,
      <Start of raw data processing
       efp BC_mod = 2 LB = 1.5 FT_mod = 6 PKNL = 1 PHC0 = 1669.046 PHC1 = 70.95951 SI = 64K 
       data hash MD5: 64K
       E4 F9 48 BA F4 CA 8D 6C 16 40 7D 97 8E CE 7A 1C>)
$$ ##END=
$$ 
$$ hash MD5
$$ 16 FE F6 6D EA BB C8 40 9E 49 ED EE 1E AB 91 AC
##$RELAX= 
##$RELAX= 
##$RELAX= 
##$RELAX= 
##$RELAX= 
##$RELAX= 
##$RELAX= 
##$RELAX= 
$$ Bruker specific parameters
$$ --------------------------
##$DU= <C:/Bruker/XWIN-NMR>
##$EXPNO= 2
##$NAME= <P31>
##$PROCNO= 1
##$TYPE= <nmr>
##$USER= <yarkov2>
##$AMP= (0..31)
100 100 100 100 100 100 100 100 100 100 100 100 100 100 100 100 100 100 
100 100 100 100 100 100 100 100 100 100 100 100 100 100 
##$AQSEQ= 0
##$AQ_mod= 1
##$AUNM= <au_zg>
##$AUTOPOS= <>
##$BF1= 81.014009
##$BF2= 200.13
##$BF3= 200.13
##$BF4= 200.13
##$BF5= 200.13
##$BF6= 200.13
##$BF7= 200.13
##$BF8= 200.13
##$BYTORDA= 1
##$CFDGTYP= 0
##$CFRGTYP= 5
##$CHEMSTR= <none>
##$CNST= (0..31)
1 1 145 1 1 1 1 1 1 1 1 1 1 1 1 1 1 1 1 1 1 1 1 1 1 1 1 1 1 1 1 1 
##$CPDPRG= <waltz16>
##$CPDPRG1= <>
##$CPDPRG2= <waltz16>
##$CPDPRG3= <>
##$CPDPRG4= <mlev>
##$CPDPRG5= <mlev>
##$CPDPRG6= <mlev>
##$CPDPRG7= <mlev>
##$CPDPRG8= <mlev>
##$CPDPRGB= <>
##$CPDPRGT= <>
##$D= (0..31)
0 1 0 0 0 0 0 0 0 0.06 0 0.03 2e-05 3e-06 0 0 0.0002 0 0 0 0 0 0 0 0 0 
0 0 0 0 0 0 
##$DATE= 1748508025
##$DBL= (0..7)
120 120 120 11 120 120 24 19 
##$DBP= (0..7)
150 150 150 150 150 150 150 150 
##$DBP07= 0
##$DBPNAM0= <>
##$DBPNAM1= <>
##$DBPNAM2= <>
##$DBPNAM3= <>
##$DBPNAM4= <>
##$DBPNAM5= <>
##$DBPNAM6= <>
##$DBPNAM7= <>
##$DBPOAL= (0..7)
0.5 0.5 0.5 0.5 0.5 0.5 0.5 0.5 
##$DBPOFFS= (0..7)
0 0 0 0 0 0 0 0 
##$DE= 6
##$DECBNUC= <off>
##$DECIM= 4
##$DECNUC= <off>
##$DECSTAT= 4
##$DIGMOD= 1
##$DIGTYP= 9
##$DL= (0..7)
0 0 52 120 120 21 21 25 
$$ [...]
##$SUBNAM2= <"">
##$SUBNAM3= <"">
##$SUBNAM4= <"">
##$SUBNAM5= <"">
##$SUBNAM6= <"">
##$SUBNAM7= <"">
##$SUBNAM8= <"">
##$SUBNAM9= <"">
##$SW= 400.765351723535
##$SWIBOX= (0..15)
0 1 3 0 0 0 0 0 0 0 0 0 0 0 0 0 
##$SW_h= 32467.5324675325
##$TD= 32768
##$TD0= 1
##$TE= 0
##$TE2= 300
##$TE3= 300
##$TEG= 300
##$TL= (0..7)
0 120 53 12 22 120 120 120 
##$TP= (0..7)
150 150 150 150 150 150 150 150 
##$TP07= 0
##$TPNAME0= <>
##$TPNAME1= <>
##$TPNAME2= <>
##$TPNAME3= <>
##$TPNAME4= <>
##$TPNAME5= <>
##$TPNAME6= <>
##$TPNAME7= <>
##$TPOAL= (0..7)
0.5 0.5 0.5 0.5 0.5 0.5 0.5 0.5 
##$TPOFFS= (0..7)
0 0 0 0 0 0 0 0 
##$TUNHIN= 0
##$TUNHOUT= 0
##$TUNXOUT= 0
##$USERA1= <user>
##$USERA2= <user>
##$USERA3= <user>
##$USERA4= <user>
##$USERA5= <user>
##$V9= 5
##$VALIST= <valist>
##$VCLIST= <CCCCCCCCCCCCCCC>
##$VD= 0
##$VDLIST= <DDDDDDDDDDDDDDD>
##$VPLIST= <PPPPPPPPPPPPPPP>
##$VTLIST= <TTTTTTTTTTTTTTT>
##$WBST= 1024
##$WBSW= 4
##$XGAIN= (0..3)
0 0 0 0 
##$XL= 0
##$YL= 0
##$YMAX_a= 639
##$YMIN_a= -842
##$ZGOPTNS= <>
##$ZL1= 120
##$ZL2= 120
##$ZL3= 120
##$ZL4= 120
##$ABSF1= 0
##$ABSF2= 0
##$ABSG= 0
##$ABSL= 0
##$ALPHA= 0
##$AQORDER= 0
##$ASSFAC= 0
##$ASSFACI= 0
##$ASSFACX= 0
##$ASSWID= 0
##$AUNMP= <proc_1d>
##$AZFE= 0.1
##$AZFW= 0.5
##$BCFW= 0
##$BC_mod= 2
##$BYTORDP= 0
##$COROFFS= 0
##$CY= -3
##$DATMOD= 1
##$DC= 0
##$DFILT= <>
##$DTYPP= 0
##$F1P= 0
##$F2P= 0
##$FCOR= 1
##$FTSIZE= 65536
##$FT_mod= 6
##$GAMMA= 0
##$GB= 0
##$INTBC= 1
##$INTSCL= 9.790993e-09
##$ISEN= 30
##$LB= 1.5
##$LEV0= 0
##$LPBIN= 0
##$MAXI= 10000
##$MC2= 0
##$MEAN= 0
##$ME_mod= 0
##$MI= 50
##$NCOEF= 0
##$NC_proc= -10
##$NLEV= 6
##$NOISF1= 182.463
##$NOISF2= 159.3651
##$NSP= 0
##$NTH_PI= 0
##$NZP= 0
##$OFFSET= 198.0616
##$PC= 4
##$PHC0= 1669.046
##$PHC1= 70.95951
##$PH_mod= 1
##$PKNL= yes
##$PPARMOD= 0
##$PSCAL= 0
##$PSIGN= 0
##$REVERSE= no
##$SF= 81.0140089999434
##$SI= 65536
##$SIGF1= 159.3651
##$SIGF2= -187.1042
##$SINO= 113.3802
##$SIOLD= 16384
##$SREGLST= <1H.CDCl3>
##$SSB= 0
##$STSI= 65536
##$STSR= 0
##$SW_p= 32467.5324675325
##$SYMM= 0
##$S_DEV= 0
##$TDeff= 32768
##$TDoff= 0
##$TI= <>
##$TILT= no
##$TM1= 0
##$TM2= 0
##$TOPLEV= 0
##$USERP1= <user>
##$USERP2= <user>
##$USERP3= <user>
##$USERP4= <user>
##$USERP5= <user>
##$WDW= 1
##$XDIM= 65536
##$YMAX_p= 510284976
##$YMIN_p= -29167851
$$ End of Bruker specific parameters
$$ ---------------------------------
##NTUPLES= NMR SPECTRUM
##VAR_NAME=  FREQUENCY,     SPECTRUM/REAL,   SPECTRUM/IMAG
##SYMBOL=    X,             R,               I
##VAR_TYPE=  INDEPENDENT,   DEPENDENT,       DEPENDENT
##VAR_FORM=  AFFN,          ASDF,            ASDF
##VAR_DIM=   65536,         65536,           65536
##UNITS=     HZ,            ARBITRARY UNITS, ARBITRARY UNITS
##FACTOR=    0.49542278885378, 1,            1
##FIRST=     16045.7642231865, 0,            0
##LAST=      -16421.768244346, 0,            0
##MIN=       -16421.768244346, -29167851,    0
##MAX=       16045.7642231865, 510284976,    0
$$ Real data points
##PAGE= N=1
##DATA TABLE= (X++(R..R)), XYDATA
$$ [...]
42778 499366 867779 1113280 972368 544787 190582 69678 18268 -132046 -339026 -488048
42768 -488048 -558466 -578563 -530190 -366468 -75576 296053 665194 975917 1238105 1430272
42758 1430272 1390430 978234 380524 21378 37753 72470 -218732 -676941 -919825 -918779
42748 -918779 -959590 -1142901 -1290592 -1317487 -1342218 -1398755 -1358704 -1206790 -1116042 -1183312 -1342962
42737 -1342962 -1574764 -1891032 -2048552 -1631744 -620542 396198 807786 606530 247900
42728 247900 77847 111733 225339 308132 271517 94933 -131879 -300278 -374872 -345321
42718 -345321 -190506 29136 153905 100960 -29832 -108800 -134193 -150750 -124074 -14815
42708 -14815 98974 86863 -80184 -295108 -387612 -230586 115394 351076 182957 -330883
42698 -330883 -820940 -1032988 -1046909 -1024829 -963448 -818622 -680501 -664274 -765834 -948520
42688 -948520 -1214367 -1467628 -1501269 -1287846 -1101540 -1156241 -1295052 -1260452 -1105424 -1060277
42678 -1060277 -1102959 -960571 -507390 87256 588816 853042 785659 401627 -49689 -247448
42668 -247448 -159047 -73773 -219414 -486477 -598817 -448297 -181515 -636 65782 170009
42658 170009 404551 606551 518620 130456 -299724 -568037 -662460 -570337 -257551 62251
42648 62251 -3285 -477026 -878655 -909655 -903195 -1219121 -1570245 -1485290 -1155354 -1170484 -1559979
42637 -1559979 -1787086 -1677083 -1631847 -1802443 -1756722 -1244327 -677295 -493273 -560389 -596618
42627 -596618 -698139 -999104 -1212437 -1020325 -639073 -506553 -618169 -632196 -458487 -286114
42617 -286114 -163663 -17105 -6422 -402407 -1102780 -1663897 -1837372 -1733953 -1463235 -996369
42607 -996369 -446022 -114879 -130844 -308258 -476483 -673447 -885394 -871764 -477256 37134
42597 37134 210770 -88124 -498458 -571492 -276797 -24570 -149439 -472772 -555409 -349189
42587 -349189 -299001 -683135 -1169198 -1281897 -1053146 -871016 -881816 -937067 -997613 -1138823
42577 -1138823 -1195997 -875808 -290174 45682 -117086 -449291 -538372 -357810 -91470 174984
42567 174984 386050 431340 348459 364599 523760 505273 42342 -675210 -1236870 -1476167
42557 -1476167 -1494280 -1393242 -1210995 -1001677 -801828 -622723 -562116 -705249 -808783 -419729
42547 -419729 441249 1044405 769664 -91178 -772145 -1055548 -1329109 -1725403 -1826724 -1366566
42537 -1366566 -705202 -331194 -256362 -208502 -153871 -285247 -623399 -939574 -1053898 -993244
42527 -993244 -847243 -647600 -445993 -387752 -593944 -973610 -1240477 -1200616 -996911 -937631
42517 -937631 -1059591 -1051808 -733756 -398668 -428441 -713824 -804506 -600102 -505911 -804289
42507 -804289 -1222462 -1327009 -1080775 -763486 -536656 -367550 -281821 -414846 -805566 -1320830
42497 -1320830 -1797415 -2129966 -2223211 -1991237 -1455882 -802284 -315495 -230993 -555303 -1003737
42487 -1003737 -1212841 -1067187 -738408 -397916 -51179 297615 531984 616126 717168 948776
42477 948776 1151751 1151714 1092099 1222991 1432507 1311522 715769 -16071 -484252 -633061
42467 -633061 -640754 -630039 -636398 -701156 -834697 -980776 -1126141 -1337262 -1579435 -1630330 -1342309
42456 -1342309 -910110 -683628 -726092 -742879 -504750 -190591 -182090 -576397 -1037151 -1154336
42446 -1154336 -855279 -399849 -60856 60279 -47505 -352400 -667962 -695410 -361388 12527
42436 12527 94146 8116 151711 561894 780207 461310 -143721 -500749 -416078 -149774
42426 -149774 -28444 -153027 -426866 -670392 -708386 -503357 -236432 -158514 -339852 -622788
42416 -622788 -801152 -782893 -616260 -446272 -428281 -603582 -862997 -1077617 -1226388 -1339688
42406 -1339688 -1379416 -1272318 -1037664 -799952 -683532 -735530 -904585 -1045734 -1017261 -844315
42396 -844315 -715409 -745154 -834890 -858394 -861596 -933350 -993602 -903955 -707951 -546348 -395170
42385 -395170 -142404 94174 23917 -362981 -666360 -557476 -203445 -44866 -279882 -729483
42375 -729483 -1124473 -1358865 -1474831 -1520442 -1479983 -1345601 -1220970 -1234751 -1284135 -1041730
42365 -1041730 -429364 68644 -88577 -737970 -1178505 -1133824 -1054920 -1289809 -1507250 -1349784
42355 -1349784 -1172606 -1508265 -2078256 -2067425 -1354570 -775843 -988053 -1641931 -1966574 -1723601
42345 -1723601 -1250451 -914426 -897747 -1275127 -1915593 -2420171 -2460415 -2113900 -1667404 -1236529
42335 -1236529 -817972 -546300 -562909 -700563 -623367 -278301 65447 218035 223813 102974
42325 102974 -238992 -739229 -1095574 -1121386 -978914 -902595 -873234 -745415 -546437 -439445
42315 -439445 -472306 -548837 -599604 -616282 -549138 -332164 -20524 212126 228598 19959 -315672
42304 -315672 -607520 -694481 -593426 -532042 -683757 -929914 -1047088 -1065367 -1203835 -1452466
42294 -1452466 -1502675 -1205140 -849160 -797742 -1018142 -1179824 -1089833 -816508 -482306 -174383
42284 -174383 -10458 -52604 -165283 -183964 -217262 -520770 -1030090 -1307270 -1087139 -637365
42274 -637365 -395410 -443140 -551169 -584290 -607913 -672831 -743447 -828247 -980677 -1162437 -1267783
42263 -1267783 -1281149 -1260795 -1186821 -998238 -771479 -669296 -694296 -694017 -656900 -789617 -1197614
42252 -1197614 -1673595 -1939807 -1954240 -1832362 -1599227 -1204568 -711820 -292189 -46820 38354
42242 38354 -6340 -148270 -300709 -406941 -568316 -927406 -1396061 -1668944 -1593744 -1381445
42232 -1381445 -1307086 -1308301 -1091075 -626127 -300889 -437507 -820658 -938352 -653275 -374988
42222 -374988 -483111 -820141 -955890 -787781 -595421 -554758 -516071 -345448 -209042 -320383
42212 -320383 -566049 -609648 -328796 18921 72413 -296273 -921334 -1525570 -1932046 -2132929
42202 -2132929 -2183056 -2077088 -1800678 -1472438 -1296656 -1326544 -1392438 -1337895 -1224018 -1216182
42192 -1216182 -1359076 -1545603 -1618569 -1431267 -930976 -295517 123997 127617 -152695 -493687
42182 -493687 -848733 -1210803 -1376436 -1123054 -559215 -33712 280646 455777 487633 239486
42172 239486 -206028 -452983 -251406 153624 336124 205203 4526 -88827 -130688 -207645
42162 -207645 -287114 -318741 -332251 -351351 -308652 -157669 -40316 -220722 -788809 -1499382
42152 -1499382 -2007168 -2226687 -2322788 -2359090 -2176681 -1717441 -1236117 -978426 -817366 -475249
42142 -475249 8451 329575 367089 253674 37202 -355502 -784752 -922901 -730883 -544884
42132 -544884 -541386 -497492 -288306 -218063 -536508 -974706 -1153041 -1163446 -1298486 -1429618
42122 -1429618 -1183564 -643975 -344741 -521540 -824010 -871329 -703142 -553392 -524348 -636472
42112 -636472 -899464 -1165019 -1157926 -817190 -410440 -193873 -156236 -180508 -213194 -161507 114609
42101 114609 540911 781828 633248 283337 39306 -9106 84447 299061 559591 687461
42091 687461 646699 642192 766341 775113 482732 161901 205257 528461 674926 442554 53488
42080 53488 -259554 -466726 -527873 -349080 -60740 -9445 -307421 -644137 -709604 -576712
42070 -576712 -480380 -427500 -272149 -60457 -48111 -377574 -897144 -1311540 -1413265 -1177678
42060 -1177678 -730229 -242964 183209 549011 873734 1118181 1201156 1057747 692721 238810
42050 238810 -57469 -17953 274683 563226 713767 802868 865722 726395 231961 -429310
42040 -429310 -822813 -698042 -217691 259021 522237 596365 572186 481514 365970 365800 603055
42029 603055 956533 1074043 704133 -36369 -790167 -1272115 -1369044 -1067180 -499631 -18206
42019 -18206 45246 -245638 -500465 -521424 -539298 -808245 -1179509 -1286590 -1021245 -606155
42009 -606155 -268144 -50176 77559 111313 43768 -119364 -368405 -619105 -688930 -491595
41999 -491595 -220510 -166957 -352348 -506561 -436284 -249353 -156066 -198914 -271361 -291167 -247569
41988 -247569 -144136 4598 144721 223860 263297 354138 560300 803344 853472 523610
41978 523610 -63340 -490450 -455204 -114195 109747 15521 -241762 -462152 -627598 -783993
41968 -783993 -897776 -906184 -768344 -446918 -18085 217381 25553 -306701 -179799 481678
41958 481678 986947 776826 200261 -37803 104651 114572 -136500 -252815 -121626 -139171
41948 -139171 -430639 -534896 -241075 -114150 -639676 -1342146 -1433170 -1006931 -836595 -1136050
41938 -1136050 -1319092 -1039353 -708820 -741995 -928722 -908489 -748520 -655542 -546165 -337108
41928 -337108 -303742 -674476 -1135772 -1228554 -1046875 -1051055 -1311300 -1440451 -1238783 -921340
41918 -921340 -672687 -426097 -172145 -74846 -145436 -153251 -8270 72004 -94705 -439404
41908 -439404 -875804 -1419532 -1925146 -2045125 -1671867 -1147127 -825838 -690320 -577368 -477050
41898 -477050 -376676 -140686 156988 116489 -384168 -765146 -406602 461034 1035616 981319
41888 981319 638167 248086 -393781 -1354200 -2178746 -2406974 -2116011 -1680357 -1302634 -1068305
41878 -1068305 -1174333 -1711341 -2338412 -2529579 -2163237 -1646505 -1430887 -1564077 -1752564
41869 -1752564 -1745268 -1575486 -1435010 -1366405 -1189556 -802905 -433683 -401859 -695976 -1014652
41859 -1014652 -1214174 -1441331 -1769386 -1991428 -1913988 -1618316 -1272839 -902386 -518091 -268079
41849 -268079 -243353 -294637 -254323 -198174 -272068 -396223 -386342 -271841 -246327 -362084 -507766
41838 -507766 -649116 -862585 -1141879 -1378559 -1534333 -1645245 -1660989 -1476463 -1141751 -857567
41828 -857567 -721398 -631599 -483696 -322735 -248021 -270034 -306943 -263080 -115681 14468
41818 14468 -77386 -460958 -959886 -1348185 -1578421 -1702895 -1686056 -1487641 -1254615 -1200899
41808 -1200899 -1312548 -1379082 -1310325 -1216979 -1180406 -1164231 -1172635 -1265215 -1367030 -1293320 -1041725
41797 -1041725 -848690 -862998 -961649 -988613 -973959 -990034 -980099 -883614 -775443 -728995 -685570
41786 -685570 -612173 -637255 -840345 -1034322 -982073 -759350 -674786 -843619 -1047720 -1051104 -887164
41775 -887164 -775297 -873687 -1166080 -1485660 -1587641 -1297793 -702392 -164303 -40889 -339285
41765 -339285 -703565 -796511 -652068 -567787 -686437 -843995 -871707 -847016 -884045 -844128 -523635
41754 -523635 -63393 131973 -81018 -416168 -594051 -667237 -758982 -746875 -468038 -76555
41744 -76555 95805 -13847 -146081 -130007 -136686 -436286 -1018539 -1544348 -1650955 -1286391
41734 -1286391 -766027 -504063 -679294 -1154572 -1661700 -1988034 -2040037 -1884498 -1742598 -1782772
41724 -1782772 -1876296 -1723870 -1285009 -891662 -828827 -993350 -1123278 -1185468 -1316070 -1492856
41714 -1492856 -1513704 -1280700 -920692 -620167 -468465 -448713 -473158 -443235 -346244 -247474
41704 -247474 -155407 -29040 11697 -309035 -1021544 -1685231 -1822338 -1490816 -1179462 -1186150
41694 -1186150 -1342626 -1335333 -1068714 -699616 -498813 -669516 -1122822 -1459573 -1362961 -969841
41684 -969841 -655132 -526098 -404168 -251680 -250316 -391562 -351548 39428 461297 451825
41674 451825 -62191 -727697 -1109434 -951006 -276862 578979 1147518 1182512 799972 225445
41664 225445 -437125 -1094256 -1522518 -1544859 -1254625 -884571 -505812 -16974 584797 1057483
41654 1057483 1077550 526998 -347218 -1049508 -1208641 -905084 -572241 -534510 -710043 -786388
41644 -786388 -579839 -173276 198381 342163 270603 203299 317052 506162 538680 435838
41634 435838 464972 702411 877088 803476 713586 901876 1212490 1189762 687979 53439
41624 53439 -326506 -429380 -479452 -601440 -730307 -805764 -921628 -1204460 -1564514 -1692110
41614 -1692110 -1418195 -1007079 -904455 -1197211 -1528126 -1582352 -1425008 -1270948 -1183508 -1172045
41604 -1172045 -1334772 -1636276 -1718867 -1255062 -430421 195163 294305 24375 -290378 -478579
41594 -478579 -500288 -345992 -74523 161734 217335 58951 -209010 -386009 -323601 -115932
41584 -115932 -52404 -280772 -626101 -859473 -994048 -1131588 -1170208 -937441 -537766 -281062
41574 -281062 -273964 -338572 -346148 -378658 -517956 -706202 -874638 -1005925 -1015304 -777944 -351573
41563 -351573 8062 128399 61242 -100190 -362640 -726603 -1110807 -1448489 -1696766 -1713371
41553 -1713371 -1349244 -766526 -437952 -638714 -1072099 -1188675 -814033 -305926 -107893
41544 -107893 -260797 -386015 -130102 388567 638989 250653 -540649 -1138174 -1212354 -930019
41534 -930019 -624687 -464386 -448437 -507454 -549183 -567580 -714038 -1081050 -1447904 -1493006
41524 -1493006 -1253814 -1084839 -1137080 -1211965 -1190259 -1217368 -1321356 -1254952 -957829 -794617
41514 -794617 -1013173 -1303676 -1281938 -1120390 -1231707 -1522238 -1488518 -1014105 -577422 -581840
41504 -581840 -864757 -999355 -795037 -381938 -28453 30781 -219108 -481790 -404328 37458
41494 37458 550853 894855 1030154 927354 513336 -100173 -562875 -604324 -297754 53709
41484 53709 192308 67711 -130884 -104469 239438 612360 657737 408142 216723 257161
41474 257161 360764 375794 386631 465167 470641 258715 -105430 -479923 -807775 -1019343
41464 -1019343 -974159 -667745 -337273 -198688 -214721 -265156 -386570 -654926 -947261 -1021396
41454 -1021396 -791207 -398027 -68734 5253 -252314 -726038 -1184093 -1507660 -1752813 -1941143
41444 -1941143 -1955693 -1739389 -1428841 -1180188 -1029318 -1015202 -1204440 -1447959 -1391653 -961787
41434 -961787 -570715 -541765 -601066 -346523 2589 -147247 -847221 -1489736 -1658240 -1558314
41424 -1558314 -1451789 -1197822 -672504 -216131 -230959 -573571 -754216 -618316 -476309 -605170
41414 -605170 -915915 -1119693 -1014085 -612285 -147452 91918 71174 70684 279357 447565
41404 447565 180299 -496852 -1124649 -1343843 -1196638 -901502 -601665 -401578 -402148 -569481
41394 -569481 -727308 -766160 -713460 -556994 -219235 190688 333185 38648 -406859 -578784
41384 -578784 -404231 -137099 58190 259645 544217 812944 924557 886536 864668 1032794
41374 1032794 1355279 1471100 956494 -118992 -1045284 -1169710 -686087 -400062 -696821
41365 -696821 -1123754 -1124828 -779716 -507847 -360067 -57545 392826 592393 322248 -134427
41355 -134427 -365361 -265524 10981 290305 423517 301157 3559 -204614 -183338 -95197
41345 -95197 -143227 -284910 -376119 -446253 -602948 -768880 -770238 -641653 -589288 -654798 -666516
41334 -666516 -556873 -474457 -492979 -440667 -158598 247016 552101 666944 608857 383518
41324 383518 72813 -87394 64625 364891 488015 333609 89437 -50578 -59115 5610
41314 5610 72637 57963 -34370 -24423 232454 550607 569397 245060 -72965 -150202 -170826
41303 -170826 -362972 -600562 -657964 -647009 -838746 -1158697 -1256436 -1083561 -1009059 -1237531
41293 -1237531 -1460932 -1319431 -962836 -866730 -1202667 -1649928 -1815856 -1655296 -1444806 -1438069
41283 -1438069 -1561585 -1448769 -873376 -160942 48135 -420893 -972984 -981525 -625226 -588308
41273 -588308 -1021828 -1323511 -1076250 -699193 -818064 -1347291 -1668641 -1549882 -1382070 -1489284
41263 -1489284 -1658869 -1530005 -1120359 -730874 -531098 -469107 -469192 -505781 -538606 -543725 -580141
41252 -580141 -701982 -846081 -923398 -972887 -1092562 -1248676 -1288782 -1139247 -873644 -590301
41242 -590301 -336795 -156922 -96900 -146797 -265860 -457709 -711752 -890958 -841559 -650739
41232 -650739 -631769 -959668 -1437280 -1722977 -1705765 -1559800 -1492563 -1529990 -1512423 -1243965
41222 -1243965 -692427 -87230 239603 156819 -168668 -482512 -654479 -671906 -575907 -473624
41212 -473624 -475227 -537658 -509619 -400432 -406106 -549656 -542325 -230228 44604 -142792 -668124
41201 -668124 -1013418 -997513 -954022 -1144265 -1380601 -1368299 -1103384 -759747 -437321 -194054
41191 -194054 -109204 -150600 -168906 -153862 -282885 -587173 -823018 -842871 -821745 -895489 -861606
41180 -861606 -548950 -237115 -317331 -686951 -882360 -733125 -491219 -353962 -276080 -283015
41170 -283015 -540700 -973109 -1174617 -914122 -468388 -259355 -372338 -612564 -830979 -976879
41160 -976879 -984768 -848323 -733330 -814463 -1018339 -1067921 -773279 -195128 438800 898561
41150 898561 1081196 1065930 1025161 1030911 973541 697636 182832 -412439 -831207 -863765 -521729
41139 -521729 -79419 160154 152623 69727 -1339 -147553 -402419 -622219 -672525 -591380 -493210
41128 -493210 -452036 -539089 -797555 -1076975 -1062213 -607599 70956 629883 886443 801023
41118 801023 380135 -251008 -858867 -1348342 -1817813 -2199341 -2094446 -1279148 -210223
41109 -210223 336540 88208 -565451 -1163199 -1557007 -1712286 -1554087 -1184088 -931320 -955955
41099 -955955 -1007201 -783653 -378491 -165243 -350248 -818600 -1335249 -1714333 -1836740 -1684349
41089 -1684349 -1390195 -1155338 -1078329 -1085568 -1004997 -699956 -206245 225835 316884 55434
41079 55434 -264675 -373608 -313778 -318864 -492750 -729997 -903301 -992556 -1023144 -978254 -805280
41068 -805280 -476247 -59199 249141 244539 -44757 -310938 -282563 -40583 118317 87540
41058 87540 26466 25487 -66853 -366963 -705893 -848739 -840906 -910327 -1072124 -1067322 -741100
41047 -741100 -296416 -75624 -198320 -488330 -673762 -606635 -374129 -246187 -428143 -819616
41037 -819616 -1107244 -1123834 -990860 -874166 -785857 -726436 -814300 -1083187 -1314386 -1307256 -1197957
41026 -1197957 -1240362 -1345952 -1149419 -539279 162990 607718 748480 705031 550519 346769
41016 346769 179901 43886 -139917 -314881 -308215 -141570 -89003 -300982 -591096 -731450
41006 -731450 -737187 -714305 -670724 -658136 -843140 -1202069 -1385684 -1166642 -809444 -684133
40996 -684133 -703326 -508051 -83451 203108 134015 -144200 -429262 -659807 -793579 -791357
40986 -791357 -744390 -745813 -641200 -208715 402216 739441 614782 293937 42599 -199572
40976 -199572 -551365 -871628 -904826 -592778 -119229 240864 287233 75145 -67912 83562
40966 83562 275236 46834 -594009 -1098809 -1078597 -763419 -609496 -729612 -906826 -946896
40956 -946896 -814004 -576587 -378281 -336647 -383260 -353447 -264842 -289532 -425779 -477463 -405927
40945 -405927 -382316 -434309 -424893 -467402 -879947 -1530261 -1755807 -1289171 -774634 -891604
40935 -891604 -1383225 -1527921 -1244261 -1051185 -1108691 -1024904 -646088 -384568 -574889 -999145
40925 -999145 -1266692 -1276703 -1092653 -688908 -77713 503475 732104 456336 -216948 -957575
40915 -957575 -1369558 -1320565 -1099859 -1042927 -1060077 -817958 -343398 -76402 -243206 -505386
40905 -505386 -388797 159769 766025 1006440 731505 188109 -153215 -78607 81417 -119469
40895 -119469 -573741 -714242 -296283 294579 617803 674553 637523 438135 -78729 -798974
40885 -798974 -1405468 -1681452 -1588178 -1205450 -761472 -557000 -677312 -894031 -970740 -916268
40875 -916268 -835405 -733808 -621167 -617800 -791858 -1048251 -1298586 -1530633 -1584764 -1163194
40865 -1163194 -313035 372723 389057 -19616 -200975 18083 198712 32451 -213861 -148352
40855 -148352 175234 387840 340203 252687 352681 556516 592747 350166 -11638 -291004
40845 -291004 -458831 -577689 -627051 -561368 -481251 -569045 -866741 -1273469 -1719327 -2132807
40835 -2132807 -2280153 -1942483 -1312472 -915023 -1002957 -1285527 -1388421 -1314462 -1273862 -1320326
40825 -1320326 -1385574 -1466318 -1542985 -1481975 -1228519 -933300 -703972 -430684 -60701 184223
40815 184223 126095 -39588 -22441 126769 150127 -6838 -213817 -428990 -645077 -710694
40805 -710694 -528869 -300821 -254409 -283633 -203244 -184218 -510628 -1031179 -1310726 -1251419
40795 -1251419 -1112806 -998588 -828523 -762840 -1072522 -1551125 -1655949 -1353853 -1226934 -1548886
40785 -1548886 -1868540 -1793619 -1575872 -1507381 -1301889 -635965 114560 306284 -47731 -371928
40775 -371928 -396399 -367328 -451456 -477810 -340185 -210648 -223289 -273723 -248790 -192416 -143832
40764 -143832 -33282 163603 333359 357058 219263 -25220 -281425 -450151 -565541 -820917
40754 -820917 -1282889 -1668742 -1644561 -1291591 -1006839 -948390 -874928 -602185 -331315 -360918
40744 -360918 -667509 -956094 -1022843 -916384 -799943 -782597 -873515 -1015486 -1145878 -1256925
40734 -1256925 -1411001 -1692103 -2112680 -2527502 -2678855 -2445414 -2056656 -1903902 -2072091
40725 -2072091 -2225808 -2065234 -1705645 -1436875 -1304375 -1186875 -1133422 -1283008 -1506706 -1493236
40715 -1493236 -1246045 -1182797 -1618131 -2369569 -2976679 -3121060 -2770143 -2139763 -1619925 -1515036
40705 -1515036 -1709489 -1750831 -1376246 -795783 -367486 -195806 -170692 -186911 -160838 -29699
40695 -29699 80347 -122216 -689534 -1233446 -1375800 -1243681 -1242761 -1475160 -1701697 -1789602
40685 -1789602 -1833926 -1843493 -1669319 -1318902 -1031883 -949768 -992676 -1145055 -1526189 -2013013
40675 -2013013 -2136453 -1638082 -885866 -434484 -375361 -452787 -622510 -1025249 -1454192 -1378101
40665 -1378101 -687794 -31131 -102305 -805871 -1399213 -1342191 -765508 -179652 31508 -175608
40655 -175608 -587046 -932705 -1068659 -1008393 -814365 -563851 -440813 -673512 -1230342 -1714056
40645 -1714056 -1757570 -1445480 -1148010 -1017719 -896030 -681655 -501762 -453704 -422322 -268652
40635 -268652 -29579 158128 187390 66 -326451 -476487 -150451 460007 725485 304207
40625 304207 -411031 -782369 -643310 -284333 41025 259176 302885 193707 210828 569588
40615 569588 961587 847233 248144 -202830 -130559 121074 128448 29264 118769 158921 -342763
40604 -342763 -1273187 -1888789 -1752977 -1267550 -1075230 -1268681 -1464937 -1436462 -1325503 -1287395
40594 -1287395 -1230318 -1001759 -649750 -369477 -266511 -270417 -254096 -178874 -139837 -290703
40584 -290703 -665176 -1030583 -1013067 -487376 208551 591825 545245 340290 154770 -177875
40574 -177875 -806626 -1474874 -1742098 -1498062 -1028789 -623251 -341556 -154188 -62950 -19946
40564 -19946 80257 235770 294212 141856 -165956 -494983 -742321 -840946 -778330 -627244
40554 -627244 -445918 -175603 208858 502667 467713 220276 139553 340132 536924 524799
40544 524799 449956 430180 258985 -223736 -756318 -999223 -1029710 -1108380 -1130578 -771836
40534 -771836 -131301 229816 -17075 -584973 -995421 -1099568 -1058569 -1051168 -1141026 -1272240
40524 -1272240 -1309606 -1209843 -1151863 -1317910 -1577678 -1638404 -1489500 -1388625 -1390661 -1267637
40514 -1267637 -997257 -921320 -1198802 -1470894 -1372375 -1071091 -956849 -1061004 -1181853 -1360655
40504 -1360655 -1745839 -2096105 -1951875 -1346641 -866815 -864572 -1035505 -979556 -782472 -728838
40494 -728838 -747418 -547253 -161244 35649 -162506 -564990 -879998 -964629 -748343 -210600
40484 -210600 419583 680956 325199 -360203 -857151 -968806 -892991 -821099 -707396 -472677
40474 -472677 -220951 -126935 -222426 -402628 -566435 -661120 -660785 -596408 -560958 -612370 -718029
40463 -718029 -838170 -974539 -1080811 -1056149 -930084 -906648 -1068893 -1186491 -1032588 -761266
40453 -761266 -687363 -778909 -715504 -440112 -266382 -348105 -422231 -257308 -10628 104066
40443 104066 190970 402882 554207 371983 -31673 -302588 -341911 -297984 -167831 162794
40433 162794 492925 374897 -260025 -907014 -1091795 -879713 -614605 -441657 -330492 -341734
40423 -341734 -556798 -823537 -838946 -511814 -91309 103295 15489 -97750 57529 454168
40413 454168 699358 448084 -171750 -697475 -874540 -857248 -853508 -838038 -739097 -660911 -713125
40402 -713125 -791562 -756155 -715827 -908261 -1346009 -1777288 -1982567 -1956275 -1803820 -1589668
40392 -1589668 -1302685 -906398 -435452 -47594 121491 176872 368302 702178 860751 654261
40382 654261 331400 213609 223755 88569 -134220 -112329 208337 489047 516471 517037 809275
40371 809275 1365345 1850812 1937243 1498051 683149 -105359 -487513 -458495 -326864 -260727
40361 -260727 -122549 145216 243996 -125866 -788888 -1242511 -1240902 -1015006 -900532 -928560
40351 -928560 -869698 -600855 -318870 -328706 -628226 -820024 -553146 24367 430649 425808
40341 425808 198940 -10166 -178548 -302198 -251787 -41241 11138 -331633 -844141 -1123616
40331 -1123616 -1134611 -1177043 -1385833 -1568558 -1540218 -1349391 -1131070 -954993 -865944 -890723
40321 -890723 -970527 -1041602 -1171508 -1427410 -1630219 -1481218 -965814 -403373 -58038 56715
40311 56715 -52157 -459815 -1037670 -1355226 -1126306 -586630 -207271 -182804 -414768 -819175
40301 -819175 -1338974 -1746697 -1780188 -1498696 -1225030 -1088222 -887794 -484131 -45839 237223
40291 237223 433105 634973 650515 245282 -364882 -604696 -233115 283498 272914 -369831
40281 -369831 -1066603 -1171941 -579955 257970 781639 751947 345328 -78288 -297861 -353231
40271 -353231 -380505 -414221 -444234 -602915 -1084968 -1790797 -2225912 -1964940 -1179787 -529543
40261 -529543 -507661 -1027651 -1643669 -1986949 -1922909 -1497092 -932075 -585624 -687355 -1084622
40251 -1084622 -1381083 -1350875 -1103922 -833350 -557284 -196865 211382 514437 604826 480165
40241 480165 192463 -138152 -299291 -146974 179119 356620 258792 78206 -15111 -146388
40231 -146388 -472342 -800399 -778650 -443496 -256911 -500989 -910315 -1069552 -935645 -731216
40221 -731216 -509138 -143275 304508 522190 324964 -106226 -439936 -509061 -363779 -149268
40211 -149268 -4168 1421 -126224 -387650 -820183 -1341403 -1653634 -1512987 -1077312 -764187
40201 -764187 -734100 -738723 -540532 -242381 -82797 -120245 -272388 -479964 -659299 -658652 -454842
40190 -454842 -260716 -250613 -306081 -224669 -40463 96377 232086 513476 849947 982321
40180 982321 886791 808580 847279 805059 553790 284653 227845 330125 392553 370875 347603
40169 347603 313226 163846 -133055 -511502 -899525 -1224679 -1395381 -1415387 -1467297 -1724177
40159 -1724177 -2079261 -2199685 -1877894 -1232225 -543062 1685 353978 503750 437729 187585
40149 187585 -155678 -505337 -829670 -1112789 -1285609 -1253133 -1015980 -713381 -486093 -331416
40139 -331416 -177220 -79581 -221492 -662846 -1183438 -1459434 -1369301 -1093210 -954736 -1169886
40129 -1169886 -1646458 -1980662 -1779983 -1100702 -452131 -212080 -148044 236730 924675 1287085
40119 1287085 897761 148481 -227466 -75440 80496 -187386 -706295 -1072738 -1190408
40110 -1190408 -1214843 -1213317 -1180571 -1230144 -1415854 -1434840 -914054 -54105 413473 108089
40100 108089 -495437 -724887 -594020 -639206 -1032179 -1320153 -1091637 -506711 -1843 249051
40090 249051 362394 403863 248523 -235169 -961524 -1590650 -1743521 -1354866 -787996 -452172
40080 -452172 -330592 -90470 351833 671151 628264 415682 315954 285801 153419 20403
40070 20403 125922 404156 502997 240226 -206398 -553451 -633532 -399248 31425 325296
40060 325296 192543 -241329 -526247 -392307 25248 461552 765919 837332 618869 279796
40050 279796 135566 222455 189549 -193388 -636150 -668978 -223881 353795 737246 822044
40040 822044 623129 261719 22233 149925 543164 827949 774913 512620 333126 417064
40030 417064 727207 1036806 1097549 916872 800068 936662 1026808 583528 -398910 -1351684
40020 -1351684 -1763011 -1661147 -1401043 -1232298 -1207411 -1277092 -1283951 -1027501 -524093 -89319
40010 -89319 -13038 -263796 -637468 -1043350 -1471145 -1814288 -1941744 -1876482 -1735411 -1572345
40000 -1572345 -1429061 -1410424 -1497027 -1401031 -878979 -135420 356035 421616 317036 287102
39990 287102 280292 167395 -13492 -140923 -149552 -12776 226604 366144 213224 -101915
39980 -101915 -248722 -205394 -317216 -695434 -924440 -650338 -140779 122159 161119 357034
39970 357034 725116 847129 534865 91587 -186799 -347458 -460711 -368283 -8586 321573
39960 321573 337256 182736 176926 296323 225831 -138129 -508337 -536048 -146019 427819
39950 427819 801066 715287 324379 108343 306635 560569 391234 -75000 -238916 115504
39940 115504 535623 624752 630303 982031 1548998 1805927 1633573 1508508 1826112 2379808
39930 2379808 2673505 2524456 2182041 1991910 2105087 2437087 2772696 2931956 2905518 2810806
39920 2810806 2723615 2656504 2706992 3039790 3614779 4096640 4203832 4036472 3879381 3778444
39910 3778444 3535425 3078885 2608859 2371730 2508536 3128056 4254816 5605947 6668274
39901 6668274 7176575 7370499 7647897 8128095 8717586 9464563 10674321 12770804 16115426
39892 16115426 20654349 25412801 28555134 28513402 25287865 20448635 15798122 12216574
39884 12216574 9722501 8121705 7229584 6722741 6246790 5735916 5375078 5183203 4841930
39875 4841930 4064250 3013366 2198657 1959678 2153375 2374983 2385354 2227886 2006899
39866 2006899 1753368 1555527 1605111 1929881 2208297 2079367 1592619 1138160 956404 952370
39856 952370 1003105 1172180 1510129 1866684 2060051 2094249 2090430 2130595 2263217 2516245
39846 2516245 2798600 2937317 2926576 2988723 3259729 3559287 3609906 3349960 2908978 2439021
39836 2439021 2115229 2112350 2375316 2567692 2457490 2203674 2046852 1906619 1581407 1184431
39826 1184431 1007564 1032838 978523 829932 915511 1351310 1765100 1748966 1328037 813783
39816 813783 410982 149119 44055 150533 510128 1097275 1731918 2090876 2014009 1788822
39806 1788822 1865082 2254073 2517312 2431978 2311186 2482014 2797004 2949793 2973112 3042944
39796 3042944 3002494 2548721 1852964 1550980 1979270 2708819 3008491 2621538 1966913 1671956
39786 1671956 1989402 2611854 3000486 2903157 2532706 2239322 2130668 2107856 2139775 2300723
39776 2300723 2577333 2836308 3006796 3143372 3277948 3342312 3283976 3161441 3087081 3142976
39766 3142976 3350478 3633247 3815730 3770908 3594221 3536317 3738771 4131097 4621873 5285084
39756 5285084 6273614 7606452 9137330 10727817 12368533 14104469 15942640 17957406
39748 17957406 20446058 23806836 28297723 34284787 42863674 55513921 72052858 88798076
39740 88798076 99911511 101728064 95812901 87277520 80194076 75035667 70096660 64188325
39732 64188325 57505261 50744609 44330036 38404473 32986661 28032617 23613720 20007413
39724 20007413 17375121 15429098 13691400 12030302 10655399 9610422 8602653 7411338
39716 7411338 6171372 5103831 4203167 3391261 2796942 2604386 2669270 2545950 1973447
39707 1973447 1173103 567652 319623 261617 195459 98829 46847 86165 237360 497172
39697 497172 759458 834031 640742 309719 -1691 -298386 -624273 -838135 -713067 -264526
39687 -264526 191270 355068 210773 -36122 -158001 -33599 266356 473903 347361 -35993
39677 -35993 -337078 -362221 -275748 -335355 -563766 -784621 -842732 -660375 -210343 386708
39667 386708 812438 784835 345772 -189561 -538532 -611482 -443378 -138766 112425 121073
39657 121073 -130336 -471778 -731723 -886480 -1015713 -1172200 -1320272 -1364026 -1214901 -850070
39647 -850070 -325104 243993 686825 817522 580314 179099 -47563 53795 327104 537014
39637 537014 612751 595003 473625 224619 -56081 -202119 -148855 43251 315965 663597
39627 663597 1054908 1380922 1505784 1369447 1076537 869433 912969 1086675 1105956 869586
39617 869586 535973 236947 -48355 -250286 -142651 259362 507624 251827 -235954 -438518
39607 -438518 -343962 -377943 -655789 -812076 -660654 -537042 -755740 -1110402 -1210674 -1051063
39597 -1051063 -943658 -1052544 -1262302 -1415084 -1478038 -1534076 -1710322 -2013176 -2191381 -1964999
39587 -1964999 -1457471 -1122019 -1106762 -1023621 -585659 -139204 -193455 -668865 -1047034 -1116082
39577 -1116082 -1107012 -1153513 -1098188 -898956 -801803 -955576 -1176490 -1257901 -1264287 -1373000 -1628533
39566 -1628533 -1962674 -2258273 -2302157 -1895001 -1135287 -423842 -90148 -162690 -522558 -1026319
39556 -1026319 -1406710 -1358882 -905180 -439207 -231726 -119677 128301 381350 333327 -62797
39546 -62797 -593924 -1059700 -1312629 -1214263 -849625 -639251 -904868 -1407316 -1636009 -1487589
39536 -1487589 -1311940 -1320050 -1334465 -1189285 -1015360 -981587 -1031936 -1042160 -1028111 -1057326 -1122030
39525 -1122030 -1198740 -1269207 -1229615 -993424 -733046 -729353 -862704 -582688 371060 1473314
39515 1473314 1928146 1504754 604070 -291324 -877136 -909724 -325160 465377 811714 536517
39505 536517 138730 119064 345132 305636 -176759 -747509 -986960 -861241 -667399 -650314
39495 -650314 -744282 -691552 -417553 -239584 -571874 -1374458 -2043807 -2008207 -1366893 -765361
39485 -765361 -651285 -851780 -946562 -841103 -765998 -827636 -852601 -729050 -642472 -793976
39475 -793976 -1049221 -1099642 -901853 -719019 -726273 -798434 -740711 -540756 -326966 -242002 -396672
39464 -396672 -745941 -965575 -720935 -166006 134257 -33979 -195543 74476 418150 206193
39454 206193 -426288 -683397 -255975 252211 228216 -171825 -463564 -591721 -807752 -1089584
39444 -1089584 -1158206 -953802 -709509 -604635 -646680 -828527 -1100641 -1237694 -1046763 -718064
39434 -718064 -695440 -1156540 -1827082 -2306350 -2362745 -1947390 -1216212 -586382 -470108 -806147
39424 -806147 -1060860 -835392 -316394 -6143 -153677 -586752 -991441 -1205949 -1269031 -1268569
39414 -1268569 -1164205 -807819 -211300 292449 338876 -43520 -501019 -827091 -1092206 -1265437
39404 -1265437 -1068683 -429201 199386 290185 -109167 -467541 -439301 -174667 6805 -23533
39394 -23533 -223143 -534217 -901443 -1246449 -1514479 -1706004 -1843533 -1941132 -1974245 -1836728
39384 -1836728 -1420185 -839520 -472117 -593042 -1027889 -1358121 -1425409 -1407760 -1424984 -1366566
39374 -1366566 -1176633 -999349 -876103 -585257 -51097 307875 2843 -830667 -1518203
39365 -1518203 -1642338 -1417502 -1198687 -993253 -694138 -481772 -597201 -844191 -743990
39356 -743990 -228835 193665 117324 -241201 -429499 -397053 -410439 -504351 -440347 -206694
39346 -206694 -145653 -442742 -817821 -925308 -791433 -610590 -349793 108731 571358 657321
39336 657321 313546 -119705 -406115 -672013 -1058913 -1404497 -1487318 -1416947 -1528450 -1914832
39326 -1914832 -2243729 -2101246 -1473368 -841493 -733934 -1129856 -1403897 -1015475 -185182
39317 -185182 339881 171349 -360787 -776264 -1000074 -1145785 -1101867 -732440 -311211 -310924
39307 -310924 -754704 -1136981 -1074347 -761591 -673611 -1016821 -1569176 -1904298 -1717241 -1094328
39297 -1094328 -515655 -430229 -779319 -1089949 -1051508 -805649 -654067 -732806 -1037939 -1491386
39287 -1491386 -1847488 -1801125 -1377738 -995440 -948410 -1045977 -974377 -786963 -764377 -978087
39277 -978087 -1285802 -1596105 -1832562 -1805738 -1483880 -1245122 -1432868 -1755416 -1623991 -1078753
39267 -1078753 -816383 -1149974 -1491959 -1190521 -451049 -19020 -225296 -743942 -1110945
39258 -1110945 -1103378 -721434 -158797 240243 279870 153223 168205 299619 251361 -96818
39248 -96818 -556703 -910782 -1085397 -1074320 -929190 -812478 -833055 -849814 -674592 -439516
39238 -439516 -479145 -834040 -1172033 -1267547 -1257213 -1295124 -1241416 -901929 -383202 9197
39228 9197 121975 46846 -44927 -34103 83514 145796 -67617 -549662 -968842 -990886 -657548
39217 -657548 -341282 -341354 -590562 -755345 -614496 -354179 -416688 -950809 -1505743 -1498563 -966466
39206 -966466 -567266 -753675 -1237606 -1441763 -1226195 -924872 -838434 -947367 -1030520 -868026
39196 -868026 -430680 -40932 -187430 -944888 -1720208 -1850319 -1342612 -737438 -370152 -162370
39186 -162370 -85538 -334731 -894118 -1347606 -1388085 -1228526 -1232799 -1368681 -1338075 -1087700
39176 -1087700 -836055 -643959 -309939 235954 721297 867342 739251 573651 388574
39167 388574 9622 -525805 -840592 -638817 -124055 187807 41460 -342168 -627391 -738211
39157 -738211 -773437 -729816 -513297 -163806 120106 187255 33236 -291513 -713232 -1049035
39147 -1049035 -1063063 -729606 -364437 -365930 -795125 -1256294 -1252312 -705771 -104619 -37798
39137 -37798 -576546 -1245911 -1639214 -1835045 -2044611 -2098936 -1661040 -873196 -363654 -482698
39127 -482698 -859154 -910210 -540940 -112169 85889 59034 -66806 -161442 -61909 316393
39117 316393 793367 1026403 859078 460099 107974 -27869 117008 529730 1019318 1216386
39107 1216386 869413 154257 -446159 -628148 -540768 -501311 -537479 -371775 158875 854204
39097 854204 1381967 1594298 1523095 1244670 911105 742066 747051 586521 -857 -722114
39087 -722114 -1023277 -824341 -570007 -517047 -433571 -172914 -63771 -377303 -780684 -778461
39077 -778461 -468333 -384905 -717350 -1150159 -1430765 -1618220 -1722402 -1562079 -1150872 -852652
39067 -852652 -928215 -1189806 -1305233 -1214616 -1040409 -792719 -418406 -29685 151144 56652
39057 56652 -146144 -215819 -20073 354849 624350 550941 225101 -40523 -144825 -311837
39047 -311837 -656609 -887598 -674095 -127574 356625 607226 731262 767135 650737 518441
39037 518441 646827 969179 1003104 475760 -251329 -639018 -630221 -544813 -485475 -249319
39027 -249319 188845 509137 491370 311279 204925 99132 -178537 -529598 -734084 -846783
39017 -846783 -1098336 -1431237 -1495815 -1183491 -830214 -735185 -775307 -718776 -655710 -802378
39007 -802378 -1046305 -1041460 -700537 -270349 72448 383263 673058 798531 750055 766643
38997 766643 985761 1194259 1115359 767859 353707 -42106 -414959 -641306 -590208 -393000
38987 -393000 -358750 -607701 -975433 -1278179 -1468598 -1502017 -1276516 -827152 -424115 -323533
38977 -323533 -486147 -655392 -664438 -555731 -422320 -256503 -2964 313914 596399 789734
38967 789734 909288 926910 727299 282540 -184566 -374295 -274929 -199519 -387720 -723419
38957 -723419 -953504 -1011961 -940101 -653197 -103710 368414 223942 -593547 -1435626 -1624003
38947 -1624003 -1185154 -709723 -611748 -768003 -840299 -712552 -557182 -615527 -959326 -1380979
38937 -1380979 -1523913 -1222864 -695472 -283096 -49914 185415 453528 533948 328983 74572
38927 74572 -10168 -86008 -457476 -1090306 -1631989 -1869094 -1906525 -1897115 -1862249 -1832452 -1894512
38916 -1894512 -1972965 -1801416 -1293600 -763403 -572139 -690527 -814891 -789961 -662615 -403483
38906 -403483 98380 709675 1001323 686415 -26686 -647535 -894200 -892526 -957411 -1249025
38896 -1249025 -1614978 -1752149 -1554848 -1262473 -1180729 -1315867 -1421241 -1346629 -1140067 -835138
38886 -835138 -414756 -46739 -56608 -490394 -937874 -1009149 -810320 -721409 -867304 -1080018
38876 -1080018 -1262928 -1473547 -1676938 -1718222 -1569498 -1349361 -1070205 -641429 -192701 -92646
38866 -92646 -466035 -923282 -1008401 -773145 -647980 -806578 -940897 -736767 -347584 -209228
38856 -209228 -470057 -813766 -892834 -759758 -713230 -823760 -855513 -675694 -484821 -510566
38846 -510566 -685578 -819161 -913604 -1077181 -1269240 -1406569 -1599397 -1943506 -2153572 -1816539
38836 -1816539 -1044553 -451900 -350097 -378492 -156921 99210 -20031 -397845 -524334 -236950
38826 -236950 86995 84145 -174973 -380336 -361928 -204042 -121619 -244345 -439880 -422917
38816 -422917 -142596 84870 2311 -205123 -209140 -55558 -39476 -178142 -223062 -167633 -283942
38805 -283942 -573105 -635194 -281557 120206 176619 13626 -16801 85736 31420 -279808
38795 -279808 -653886 -880470 -859859 -558719 -96929 201116 83175 -351908 -821015 -1177999
38785 -1177999 -1371952 -1265422 -797323 -214435 168495 347993 466080 404054 -39724 -643675
38775 -643675 -941228 -952084 -1211437 -1904949 -2487061 -2448272 -2007930 -1664870 -1453259 -1129701
38765 -1129701 -818467 -900630 -1346676 -1670410 -1578019 -1253635 -953867 -698437 -450042 -268245
38755 -268245 -176239 -145440 -268835 -642199 -1012423 -915694 -318278 232070 300446 78489
38745 78489 -45608 -95705 -339907 -783536 -1230798 -1648344 -2026014 -2036620 -1378260 -444696
38735 -444696 -90965 -571284 -1194056 -1279901 -1028456 -1074678 -1517457 -1840544 -1642217 -1030769
38725 -1030769 -357819 72452 44620 -448602 -1046037 -1265614 -1023815 -694887 -583015 -580048
38715 -580048 -460682 -267619 -201212 -290122 -387308 -405723 -373617 -313076 -231359 -203265 -314000
38704 -314000 -522956 -692789 -746761 -719022 -685573 -726012 -891095 -1098826 -1126871 -850559
38694 -850559 -448861 -220799 -219256 -232097 -124454 -15368 -70649 -289883 -571743 -842282
38684 -842282 -1032126 -1064500 -977278 -949538 -1091591 -1286805 -1336069 -1175528 -863407 -465684
38674 -465684 -93739 39280 -207757 -676831 -1002852 -964313 -668892 -404527 -376882 -550148
38664 -550148 -659161 -441020 26061 281387 -55029 -809423 -1422686 -1575753 -1438303 -1280133
38654 -1280133 -1101550 -783550 -383974 -64956 159663 388664 590652 592777 329790 -34850
38644 -34850 -273026 -295030 -181491 -89113 -129644 -278985 -403982 -415382 -356869 -296237 -204505
38633 -204505 -41034 112379 148300 132074 240328 493193 704313 721344 552110 218221
38623 218221 -302789 -875082 -1156301 -966469 -578688 -410431 -507776 -589800 -544842 -546365
38613 -546365 -628457 -526927 -158953 63913 -238543 -777754 -932533 -671478 -639924 -1179478
38603 -1179478 -1724769 -1529689 -697512 -52103 -109663 -610035 -1058013 -1291051 -1369646 -1277421
38593 -1277421 -1007388 -747405 -720592 -927530 -1207848 -1439188 -1513463 -1266350 -672714 -36345
38583 -36345 259549 175222 -10396 -105217 -140580 -110101 127205 564876 907788 891041 591716
38572 591716 263395 -6785 -283861 -512484 -486375 -129542 329294 531985 301209 -227186
38562 -227186 -731598 -958263 -884137 -651678 -385281 -137915 12157 -39223 -265974 -489551
38552 -489551 -619543 -803353 -1195816 -1666262 -1901903 -1756839 -1338491 -796668 -232652 186122
38542 186122 265336 38887 -198292 -244683 -239930 -409358 -674457 -715386 -398166 36640
38532 36640 257743 202294 85934 112849 242565 246662 -30288 -494177 -904906 -1131857
38522 -1131857 -1245266 -1349967 -1414318 -1321701 -1039750 -677098 -398227 -312821 -398304 -494809
38512 -494809 -444377 -285982 -229267 -359818 -468785 -299450 114001 506381 718274 779119
38502 779119 682099 333316 -184050 -518139 -406183 -9637 283521 328022 321310 448279
38492 448279 594071 488921 73614 -356468 -409130 -18456 424924 458380 67476 -305456
38482 -305456 -317925 -122500 -74500 -216122 -301808 -254270 -270087 -405748 -369025 58777 580298
38471 580298 641971 100548 -600782 -955366 -901635 -728569 -639219 -576412 -432069 -265448
38461 -265448 -254942 -492489 -861881 -1102452 -1013848 -659108 -350467 -342400 -536339 -612093
38451 -612093 -474988 -385698 -530351 -668169 -457892 -5570 243911 132877 -56914 -138381
38441 -138381 -300917 -658541 -894061 -694921 -281288 -114844 -259199 -427136 -520880 -662208
38431 -662208 -742252 -457846 116747 473531 373692 195845 341202 653227 727271 499809
38421 499809 192314 -101021 -399035 -547041 -316051 234119 763561 1010294 933181 564102
38411 564102 -28170 -631842 -973704 -953554 -682312 -323567 -24429 73431 -64749 -282711
38401 -282711 -392059 -375164 -325051 -289518 -312114 -482632 -747904 -814963 -498478 -58290
38391 -58290 89868 -74263 -204605 -112154 56960 147340 172659 149139 70143 86708 381985
38380 381985 785313 847076 443803 19187 46765 485847 938408 1139386 1119937 1046423
38370 1046423 1047909 1096354 1003198 678694 372913 398544 612871 531657 40484 -408653
38360 -408653 -481336 -418204 -526084 -612590 -342766 121809 298455 46946 -341270 -592719
38350 -592719 -611467 -320258 222691 603831 394525 -253714 -736390 -763223 -620671 -595795
38340 -595795 -546316 -239335 204466 463250 421907 216616 4076 -141296 -195237 -183398
38330 -183398 -149347 -58732 161381 434846 528945 326840 -5211 -206502 -172701 44765
38320 44765 344506 565878 504425 107929 -387705 -657547 -614010 -441196 -336315 -340881
38310 -340881 -430687 -623737 -904539 -1135793 -1192963 -1167544 -1269361 -1476941 -1469552 -1049678
38300 -1049678 -467421 -98437 62627 261869 422459 176272 -458885 -925970 -912702 -835557
38290 -835557 -1127000 -1415791 -993424 90745 1018138 1275414 1166911 1145554 1166489 956540
38280 956540 519544 60217 -342260 -715449 -1019307 -1200008 -1292225 -1333656 -1315346 -1300946
38270 -1300946 -1406969 -1572282 -1563756 -1331413 -1142219 -1223487 -1480526 -1703316 -1824308 -1806074
38260 -1806074 -1517136 -957869 -430706 -235613 -304259 -331339 -163263 97905 235160 14166
38250 14166 -658056 -1466147 -1795245 -1399266 -798900 -683507 -1033252 -1215376 -914866 -543275
38240 -543275 -600378 -981583 -1160885 -866085 -325395 84473 225024 205234 150747 79586
38230 79586 -8037 -34033 64318 196657 216840 155430 182627 291189 214115 -213536 -772741
38219 -772741 -1102131 -1097923 -912485 -680688 -445638 -260334 -137940 57573 458183 931822
38209 931822 1156893 970659 502327 -28430 -490151 -816368 -964256 -948241 -838326 -727361
38199 -727361 -747182 -1014257 -1420207 -1576229 -1189511 -482614 -29044 -139200 -581986 -937111
38189 -937111 -1023582 -912208 -720894 -556267 -533992 -664305 -731229 -442559 224667 894333
38179 894333 1104629 771424 272149 26414 75968 171642 167252 117265 23891 -222741 -568760
38168 -568760 -743601 -658199 -611247 -857517 -1167702 -1112452 -659513 -178715 85995 241943
38158 241943 445398 656722 758683 707468 503289 174338 -157334 -312240 -185584 204791
38148 204791 714814 1033762 833736 178307 -373479 -362361 -24135 27963 -368020 -787759
38138 -787759 -888988 -792233 -718081 -657484 -577758 -606767 -780096 -866822 -676264 -342437 -118571
38127 -118571 -80504 -197452 -470867 -786181 -827739 -409220 227219 678790 860562 988271
38117 988271 1148069 1142601 814623 338067 60414 97336 185858 13154 -341494 -461859
38107 -461859 -187589 57179 -197644 -730359 -829351 -258769 402196 553837 316346 177351
38097 177351 210033 65945 -369419 -728107 -640406 -206756 129037 61404 -296676 -561591
38087 -561591 -463328 -83517 272266 372160 179862 -201411 -545459 -558359 -162143 302533
38077 302533 412627 193028 29541 64978 52620 -123173 -199288 14505 320646 502164
38067 502164 640880 791110 701245 230352 -249961 -280202 62283 335573 337949 170593
38057 170593 -99487 -413343 -517500 -248302 75473 4302 -343889 -398674 39124 538302
38047 538302 676664 533502 423548 482221 651290 808151 808940 629177 492148 608021
38037 608021 801889 721263 411129 297357 535662 785453 765770 628217 560235 396338
38027 396338 -61606 -615184 -912653 -958905 -1047983 -1254255 -1294681 -947155 -411746 -141590
38017 -141590 -344690 -722172 -792018 -505526 -382562 -856007 -1615667 -1901407 -1415997 -622737
38007 -622737 -98293 68504 112747 159645 180385 165368 117487 -2962 -173126 -262975 -208443
37996 -208443 -109260 -71366 -81494 -90699 -68821 48499 267338 377444 154475 -233225 -337350
37985 -337350 -53369 208337 140952 -19550 75849 328237 368192 66923 -416903 -889375
37975 -889375 -1139465 -936324 -348560 115476 41550 -350437 -529790 -362697 -120786 70766
37965 70766 322878 553382 459949 34167 -301060 -239461 41326 239446 369701 606076
37955 606076 880318 916015 625219 278307 228869 535391 904807 1030089 944284 932799
37945 932799 1099795 1230772 1186974 1179912 1413262 1678897 1668498 1536590 1700403 2104809
37935 2104809 2178381 1645638 936772 566220 490080 374817 174294 67650 59180 55173
37925 55173 204312 723410 1397992 1672313 1340969 820785 590408 646702 712005 725229
37915 725229 830151 1004370 1025566 829366 650483 718513 987118 1265214 1471153 1623158
37905 1623158 1682292 1576365 1363721 1242619 1373507 1749930 2215876 2537006 2515119 2168530
37895 2168530 1782020 1634671 1674519 1617796 1388269 1256305 1439098 1747078 1821464 1637689
37885 1637689 1565004 1905261 2513355 2936225 2864364 2406765 1961588 1862134 2150567 2656533
37875 2656533 3227232 3843115 4561275 5417051 6359792 7232921 7864168 8240839 8518516
37866 8518516 8751062 8707289 8128435 7109558 6029815 5139707 4428236 3867291 3525578
37857 3525578 3408435 3424277 3544758 3760866 3875649 3652071 3221218 2999631 3088905 3107304
37847 3107304 2775572 2319595 2093151 2145913 2386177 2801214 3237204 3341446 3083128 2984034
37837 2984034 3416867 3985864 4067190 3692596 3387977 3359433 3394156 3411349 3524573 3624449
37827 3624449 3470759 3196659 3183429 3409486 3459930 3254964 3237605 3686294 4305685 4687643
37817 4687643 4796562 4825290 4897594 5061478 5301515 5460962 5392383 5200928 5093499 5068890
37807 5068890 5066638 5263325 5787397 6300617 6405828 6345665 6669530 7299478 7666947 7776257
37797 7776257 8297180 9435063 10525727 11042899 11273069 11673849 12259652 12943250 13797234
37788 13797234 14668079 15248724 15828454 17170049 19320093 21446297 23252804 25544636
37780 25544636 28878420 32789983 37070915 42603053 49939807 58173215 66316769 74718259
37772 74718259 83936943 93570006 103850780 117216051 136462581 162829713 198449424
37765 198449424 248787936 317402901 396582551 466680521 507583146 510284976 477924313
37758 477924313 420199421 349894844 281181345 224965926 183987624 154310097 131718858
37751 131718858 114803943 102488849 92086361 81384823 70732686 61543928 53929598
37744 53929598 47017912 40610039 35211655 30928920 27362155 24308849 21800956 19657711
37736 19657711 17604817 15683050 14105958 12868935 11786657 10704532 9490189 8136478
37728 8136478 7027667 6664961 6909076 6976195 6457785 5823754 5569128 5435058 4990255
37719 4990255 4474816 4391760 4584094 4422728 3762542 3065214 2625061 2278065 1921009 1768193
37709 1768193 1945221 2247480 2449514 2513649 2378709 1894971 1150593 578253 512757 806727
37699 806727 1053644 1064754 982756 1020565 1222788 1454571 1557649 1533693 1576393 1872570
37689 1872570 2380699 2861465 3095323 3000219 2596061 1983931 1351873 885977 655935 641065
37679 641065 816212 1108614 1321229 1253861 931134 622569 609746 951706 1420698 1632849
37669 1632849 1373643 910875 848787 1482364 2393265 2904010 2853013 2658460 2674379 2835645
37659 2835645 3002905 3296522 3876546 4637216 5359744 6007936 6647683 7195778 7473900
37650 7473900 7428803 7087249 6370713 5210466 3848546 2786221 2344048 2390964 2527709
37641 2527709 2408588 1897668 1117747 423259 148865 262078 379910 223744 -80482
37632 -80482 -278590 -400417 -661065 -1020435 -1127976 -789596 -282763 -61847 -267408 -666088
37622 -666088 -989262 -1162463 -1221713 -1178849 -1043740 -881554 -753458 -630431 -438611 -191256
37612 -191256 -13706 3904 -53065 -8960 146585 174716 -127349 -593967 -815815 -646851
37602 -646851 -404906 -428593 -594077 -500320 -41947 491110 879755 1213139 1544145 1621563
37592 1621563 1218904 529221 -54334 -424929 -720370 -865581 -527882 378570 1430749
37583 1430749 2099444 2234482 2031850 1719555 1452358 1352098 1411298 1413942 1158341 750474
37573 750474 508773 572455 756965 818640 713757 543241 375067 216401 79678 -26044
37563 -26044 -140956 -318242 -548601 -761508 -886717 -882318 -728810 -447653 -122176 146700
37553 146700 318924 421083 472124 454308 388010 371250 445244 431429 46082 -725057 -1459716
37542 -1459716 -1662609 -1289438 -777064 -545285 -617577 -771346 -876017 -946757 -994135 -998514
37532 -998514 -981294 -957467 -860163 -643727 -407168 -267918 -175258 -34207 40261 -159546
37522 -159546 -554222 -784253 -678040 -459817 -364829 -296420 -53961 318352 650802 941052
37512 941052 1255041 1467081 1400135 1142059 905634 627362 72266 -640671 -1021318 -863198
37502 -863198 -556335 -510447 -564498 -289432 313359 766732 706035 226265 -326919 -650067
37492 -650067 -570684 -109661 469557 853308 980543 1029317 1115634 1190916 1235840 1314174 1366713
37481 1366713 1194917 781490 410864 290584 236283 -39843 -463544 -690298 -596219 -390256
37471 -390256 -227276 -6939 323655 515940 283959 -303323 -902392 -1308202 -1585769 -1801659
37461 -1801659 -1844478 -1609262 -1214752 -900750 -773978 -765953 -787726 -795043 -720933 -491254 -145743
37450 -145743 166324 347363 394891 251374 -215511 -956598 -1612889 -1840544 -1691224 -1480645
37440 -1480645 -1355507 -1236684 -1145352 -1245129 -1474253 -1479597 -1133330 -832828 -977264 -1343432
37430 -1343432 -1359444 -914897 -498675 -498286 -744212 -888997 -904630 -966134 -1077003 -1091703 -983595
37419 -983595 -830107 -605207 -246652 83372 64828 -366969 -852359 -968104 -662608 -247020
37409 -247020 -35800 -94992 -295694 -489980 -593275 -563203 -388898 -136480 33823 -36753
37399 -36753 -368083 -823245 -1232107 -1499959 -1601909 -1545489 -1382501 -1210546 -1112481 -1109725
37389 -1109725 -1185442 -1311238 -1442880 -1549628 -1654044 -1761190 -1749409 -1472230 -1020793 -724437
37379 -724437 -774399 -984227 -1065353 -1000566 -952034 -925988 -795258 -604652 -572092 -767887 -1050093
37368 -1050093 -1348463 -1724631 -2066886 -2043307 -1557183 -994060 -756842 -736924 -535171 -93050
37358 -93050 213395 100223 -272568 -522836 -416855 19776 553330 819562 534314 -221042
37348 -221042 -997714 -1369149 -1292475 -1042843 -869140 -797353 -718823 -554093 -302182 -2310
37338 -2310 287017 489773 564900 578518 653687 798824 866598 767309 613404 488040 189373
37327 189373 -488731 -1242928 -1437133 -953544 -471925 -589299 -994667 -954045 -376115 145091
37317 145091 247961 167041 120627 -60470 -442211 -635533 -320858 220677 495342 468009
37307 468009 453498 525559 460318 198749 -28765 -74701 -77886 -237136 -585887 -1015873 -1356629
37296 -1356629 -1443733 -1275168 -1076708 -1058165 -1155778 -1172706 -1083581 -999122 -925980 -807809 -723460
37285 -723460 -762460 -763483 -498257 -95753 70062 -46669 -68567 221847 555564 604990
37275 604990 433102 305670 301146 315762 250914 14612 -447347 -935581 -1043165 -639488
37265 -639488 -103280 144373 119688 58021 -15402 -165953 -237233 -80175 48251 -231889
37255 -231889 -793623 -1106115 -992937 -859090 -1073112 -1519339 -1898409 -2101934 -2108303 -1845996
37245 -1845996 -1392611 -1034591 -893703 -738853 -409789 -180723 -393600 -906732 -1243369
37236 -1243369 -1193851 -954419 -725864 -517015 -387134 -557439 -1099909 -1691086 -1880920 -1587156
37226 -1587156 -1203917 -1176836 -1509289 -1758242 -1550872 -1022365 -626315 -576875 -680850 -715488
37216 -715488 -698504 -678311 -531580 -180141 198607 415189 548343 730961 828545 635853
37206 635853 254305 -74415 -404523 -948756 -1544242 -1716772 -1364897 -946567 -809004 -721021
37196 -721021 -316921 326427 858389 1145304 1260909 1159713 708707 -7564 -684917 -1097577
37186 -1097577 -1227301 -1152619 -984646 -862238 -849932 -874050 -857877 -823823 -763480 -568654
37176 -568654 -247405 -29525 -42954 -56247 185455 505325 493454 89196 -346648 -505802
37166 -505802 -382078 -89424 229405 306814 -68825 -675531 -964646 -665176 -39148 523195
37156 523195 856446 877331 456383 -331583 -1081896 -1427922 -1377275 -1142083 -868245 -706125
37146 -706125 -871739 -1353634 -1753922 -1721124 -1417937 -1296284 -1521581 -1869848 -2072824 -1995489
37136 -1995489 -1595343 -1030561 -742055 -1077820 -1808540 -2307025 -2254048 -1913050 -1675138 -1615234
37126 -1615234 -1590176 -1519563 -1419768 -1330218 -1330479 -1495428 -1735306 -1805492 -1567232 -1140116 -740271
37115 -740271 -481181 -383019 -445413 -630453 -864276 -1101579 -1301801 -1348011 -1147607 -841372
37105 -841372 -724987 -879553 -1046951 -975629 -733077 -547612 -484211 -441254 -372388 -344199
37095 -344199 -421495 -626829 -964020 -1352568 -1585916 -1505094 -1211945 -981949 -946314 -970141
37085 -970141 -883279 -734310 -734210 -987855 -1373300 -1712500 -1980756 -2241674 -2398766 -2196348
37075 -2196348 -1593739 -1002710 -922474 -1353950 -1798065 -1873825 -1708029 -1609257 -1593125 -1451677
37065 -1451677 -1151207 -890706 -781889 -703800 -538381 -379615 -395473 -570062 -702341 -651778
37055 -651778 -497461 -409590 -409123 -345482 -143489 18916 -110044 -528234 -954640 -1143138
37045 -1143138 -1101046 -965290 -798586 -591933 -359175 -113312 187302 553917 855502 895432
37035 895432 615330 167673 -230592 -496706 -728756 -1050457 -1417338 -1640033 -1642608 -1599047
37025 -1599047 -1682676 -1753146 -1495936 -876593 -243901 79858 114988 43947 -82844 -312252
37015 -312252 -611670 -893927 -1125704 -1282074 -1284323 -1098063 -805746 -497544 -212491 -62978
37005 -62978 -221867 -629498 -902526 -759714 -409337 -282916 -483727 -729912 -755684 -521452
36995 -521452 -97617 380744 661168 557359 236703 101043 318943 657424 821719 776405
36985 776405 660471 546500 391709 155413 -99520 -219463 -122259 24331 -85648 -506635
36975 -506635 -913455 -1013312 -916563 -886692 -903184 -772159 -529983 -374979 -276597 -43487
36965 -43487 238906 239395 -116666 -560167 -935713 -1332482 -1682636 -1698912 -1400321 -1255796
36955 -1255796 -1520917 -1791000 -1523014 -719332 180119 799060 939053 503157 -330079
36946 -330079 -1067647 -1365414 -1357452 -1281435 -1066650 -629914 -264765 -264598 -382343 -185331 199439
36935 199439 254885 -68378 -249248 -15291 293896 353884 343218 533042 790509 823216
36925 823216 649495 504772 446861 330504 75571 -257054 -589432 -856093 -961994 -853349
36915 -853349 -615554 -421004 -387773 -499077 -615424 -584704 -409556 -254092 -187768 -26513
36905 -26513 385928 826352 878221 448248 -149562 -599381 -789282 -640303 -115399 507032
36895 507032 738018 432966 -56289 -431806 -802949 -1281273 -1610851 -1561367 -1396544 -1522431
36885 -1522431 -1848788 -1938928 -1705581 -1521932 -1632049 -1840589 -1865868 -1679636 -1394939 -1089496
36875 -1089496 -854449 -782681 -784236 -615732 -223834 115853 140528 -69391 -252529 -338641
36865 -338641 -480254 -762989 -1051293 -1153020 -1046396 -897153 -875182 -980206 -1061029 -1003934
36855 -1003934 -860317 -752486 -700336 -619242 -471086 -322578 -228974 -131368 82551 439850
36845 439850 827368 1064169 1028595 735077 307066 -96869 -320009 -252837 37785 252756
36835 252756 114069 -266216 -445480 -200413 135273 51279 -535760 -1243501 -1684030 -1733652
36825 -1733652 -1415490 -811425 -146349 289001 430176 510570 748005 1082353 1300028 1291464
36815 1291464 1093316 785771 457299 205599 81761 58948 84908 110513 56582 -156030
36805 -156030 -509791 -902295 -1270312 -1605896 -1837209 -1823296 -1523287 -1073303 -654968 -378611
36795 -378611 -296720 -380490 -450483 -308040 -9761 158767 64017 -116551 -227079 -383474
36785 -383474 -678181 -851242 -583339 -28912 277442 63791 -410861 -777274 -964361 -1069753
36775 -1069753 -1076737 -923614 -735863 -769541 -1120630 -1609871 -1959795 -2004537 -1731591 -1219019
36765 -1219019 -601622 -68861 203167 199075 112599 132713 168039 -55918 -534813 -810551
36755 -810551 -487022 187157 559631 409293 212885 439700 877107 932666 438388 -161096
36745 -161096 -378424 -157163 240055 529948 483928 -35337 -872140 -1528557 -1572086 -1106476
36735 -1106476 -657007 -556367 -620001 -502274 -181436 92603 213107 319641 477013 505973
36725 505973 270107 -38562 -91385 168865 479730 593546 513256 397470 365929 418823
36715 418823 438304 257053 -160559 -588456 -713003 -473457 -116002 117347 207369 211203
36705 211203 82046 -209878 -495065 -539233 -337462 -128861 -124030 -333909 -648193 -943678
36695 -943678 -1106360 -1092300 -1021452 -1096624 -1359023 -1612725 -1662439 -1543233 -1427744 -1379713
36685 -1379713 -1314924 -1161606 -925558 -606751 -200832 183020 363207 332145 308511 391909
36675 391909 303508 -278866 -1172754 -1774906 -1766697 -1464953 -1323446 -1343119 -1218366 -867486
36665 -867486 -498926 -248550 -72503 35278 34326 40243 197869 312971 -9543 -719336
36655 -719336 -1183381 -948006 -348659 -54795 -218722 -411378 -281134 49957 210268 -52301
36645 -52301 -688430 -1319670 -1447673 -909958 -92257 480287 663062 620115 423635 62266
36635 62266 -264166 -268092 -3295 194220 228007 331881 570834 649928 375715 -52628
36625 -52628 -405617 -730787 -1056016 -1121885 -754508 -277290 -184561 -523469 -915916 -1108074
36615 -1108074 -1190643 -1305938 -1420818 -1431918 -1306989 -1086226 -858000 -719874 -681958 -676362
36605 -676362 -730385 -982299 -1403142 -1687376 -1619046 -1383038 -1272662 -1239001 -1029737 -677038
36595 -677038 -509321 -681211 -979035 -1113977 -969035 -571289 -88900 148880 -72725 -518278
36585 -518278 -721602 -578410 -419588 -451086 -492954 -414480 -442762 -769298 -1155405 -1268830
36575 -1268830 -1206431 -1313620 -1590507 -1648218 -1261888 -655800 -170620 99550 228567 221740
36565 221740 30815 -280926 -539451 -629119 -583828 -493635 -368049 -131777 247413 662282
36555 662282 917482 856461 441052 -209773 -802614 -998381 -714982 -274003 -96831 -265511
36545 -265511 -534909 -741627 -955436 -1182723 -1213660 -953023 -689860 -782458 -1177995 -1480759
36535 -1480759 -1449365 -1214812 -1025108 -979221 -1040278 -1138902 -1201289 -1181445 -1098648 -964362 -699256
36524 -699256 -262593 139757 162958 -273300 -819682 -1049059 -898133 -661684 -613769 -750637
36514 -750637 -880608 -848663 -649199 -399186 -235425 -188141 -139180 36447 274303 354688
36504 354688 183289 -60664 -154145 -114740 -100812 -99105 52546 311601 362739 32691 -438642
36493 -438642 -711275 -745560 -695162 -591107 -404999 -281311 -371213 -501688 -365520 -44920
36483 -44920 12542 -383974 -900844 -1151092 -1124981 -997178 -799099 -502639 -212001 -45953
36473 -45953 32920 111975 187197 237185 269750 210613 -34685 -323405 -363100 -175647 -135912
36462 -135912 -370285 -508564 -313872 -149033 -402703 -804944 -824009 -479324 -207035 -126253
36452 -126253 -53754 -105080 -571578 -1188109 -1249484 -636555 -79060 -134157 -497860 -667984
36442 -667984 -730843 -1034259 -1523679 -1909175 -2165152 -2371211 -2341659 -1951444 -1618420 -1864974
36432 -1864974 -2477559 -2692814 -2259501 -1744348 -1620054 -1593305 -1180863 -548414 -299354 -590718
36422 -590718 -911449 -769960 -261806 161899 235162 13544 -337913 -646053 -705752 -441862
36412 -441862 -134953 -219022 -717876 -1107508 -946952 -470007 -284162 -598490 -1057294 -1286386
36402 -1286386 -1266597 -1142576 -1005790 -971702 -1157751 -1424616 -1412461 -1025532 -643979 -643259
36392 -643259 -909338 -1056474 -942149 -715220 -499961 -303973 -154582 -75759 26011 240613
36382 240613 457095 479242 309495 149279 139382 231587 271940 104465 -309814 -752958
36372 -752958 -871565 -613301 -384494 -535487 -842535 -826607 -498686 -391788 -802200 -1363562
36362 -1363562 -1533133 -1227469 -776692 -445677 -237131 -87430 -37793 -155367 -367615 -454666
36352 -454666 -264752 54365 138679 -186096 -661368 -884139 -772915 -593477 -570998 -661635
36342 -661635 -705892 -631538 -472775 -325439 -301538 -404475 -452737 -261177 111174 429107
36332 429107 564346 547793 383435 31973 -412753 -754569 -942378 -1087678 -1215743 -1233643
36322 -1233643 -1180984 -1236374 -1390491 -1413455 -1296388 -1407379 -1943900 -2480396 -2404247 -1678556
36312 -1678556 -857742 -422563 -408967 -649485 -1024049 -1389028 -1550876 -1465607 -1286014 -1111525
36302 -1111525 -889627 -681493 -780401 -1318379 -1911153 -2009414 -1573567 -1097241 -918969 -835857
36292 -835857 -567605 -299148 -421268 -870421 -1120369 -880769 -491937 -485867 -962428 -1536982
36282 -1536982 -1751638 -1429895 -774328 -214264 -17397 415 180371 410181 161629 -691334
36272 -691334 -1492837 -1596553 -1209283 -984348 -1038298 -970400 -741052 -828354 -1376553 -1817045
36262 -1817045 -1651294 -1149848 -918877 -1119404 -1473412 -1762316 -1930946 -1878250 -1528217 -1048509
36252 -1048509 -712939 -579344 -506717 -423809 -382843 -405527 -461577 -573917 -812192 -1194558
36242 -1194558 -1634680 -1910311 -1718930 -992392 -185239 60116 -337927 -802385 -913583
36233 -913583 -941188 -1273101 -1705233 -1764089 -1474757 -1278964 -1322958 -1362163 -1336897 -1502141
36223 -1502141 -1897202 -2165894 -2080411 -1866679 -1816372 -1881014 -1844454 -1655418 -1412751 -1204157
36213 -1204157 -1076662 -994045 -774924 -307177 134601 95499 -425946 -875173 -853696 -627500
36203 -627500 -682927 -1049265 -1373236 -1469177 -1449133 -1404642 -1286406 -1082293 -848003 -560342
36193 -560342 -183684 98266 -30945 -602098 -1214367 -1450609 -1341240 -1278532 -1504266 -1815185
36183 -1815185 -1828767 -1461008 -1022425 -825434 -824255 -753201 -534329 -367785 -418272 -593609
36173 -593609 -704056 -700350 -655527 -610763 -550003 -482364 -463987 -535942 -653851 -673427 -466385
36162 -466385 -122484 50591 -123792 -416825 -478002 -340079 -353235 -600565 -729061 -502524
36152 -502524 -192951 -184391 -456208 -744479 -985919 -1250819 -1394061 -1177276 -701290 -347738
36142 -347738 -264687 -246508 -180445 -260091 -602409 -955519 -1026932 -914396 -965309 -1303113 -1706187
36131 -1706187 -1921531 -1927138 -1879497 -1923049 -2070236 -2197496 -2157123 -1940541 -1705910 -1587132
36121 -1587132 -1508407 -1269602 -811410 -320227 -53621 -120952 -450906 -894063 -1288424 -1476768
36111 -1476768 -1378770 -1081542 -782389 -592220 -455973 -312324 -231576 -276911 -304420 -85379
36101 -85379 365880 760008 874170 764515 578053 338225 39203 -214215 -336788 -417627
36091 -417627 -562969 -678116 -611139 -452655 -457410 -654437 -746456 -471945 67318 499457
36081 499457 509101 54360 -627155 -1192350 -1457405 -1510547 -1514829 -1468383 -1288504 -1060284 -982780
36070 -982780 -1054680 -1033571 -788323 -513001 -486880 -764731 -1206341 -1675561 -2081199 -2320448
36060 -2320448 -2321345 -2109791 -1767332 -1380291 -1077437 -1018954 -1252700 -1627856 -1909835 -1948368
36050 -1948368 -1742857 -1446585 -1305591 -1440226 -1655778 -1644728 -1424760 -1350341 -1577702 -1771777
36040 -1771777 -1559488 -1063441 -698783 -585331 -502186 -378322 -471290 -972031 -1687120 -2225755
36030 -2225755 -2343360 -2062972 -1648497 -1491039 -1779798 -2188416 -2126117 -1460489 -784846 -749194
36020 -749194 -1267215 -1638756 -1398676 -789626 -363836 -336671 -455648 -390203 -101393 179454
36010 179454 254399 174921 139314 214840 238560 28527 -359202 -650392 -629801 -363949 -134721
35999 -134721 -155677 -368120 -550836 -626267 -755109 -1044470 -1278628 -1150859 -746883 -538186
35989 -538186 -784794 -1169646 -1216626 -894837 -554250 -383971 -267214 -173319 -335571 -870028
35979 -870028 -1465608 -1689767 -1478777 -1116132 -813662 -550177 -315122 -276836 -601971 -1217221
35969 -1217221 -1827723 -2120444 -1956443 -1489259 -1125738 -1216124 -1681533 -2058770 -2012917 -1680589
35959 -1680589 -1380729 -1158682 -872905 -621569 -704470 -1098462 -1340681 -1140953 -815266 -821626
35949 -821626 -1097715 -1238409 -1203592 -1405365 -2054924 -2819672 -3265447 -3313665 -3086778 -2604056
35939 -2604056 -1888008 -1163390 -677802 -443576 -367413 -488631 -837271 -1176699 -1192241 -917369
35929 -917369 -714055 -807516 -1049262 -1167948 -1073118 -879121 -777070 -898000 -1175335 -1359991
35919 -1359991 -1297272 -1128540 -1060905 -1029429 -811320 -396633 26827 395237 743481 886621
35909 886621 543576 -129816 -550696 -446769 -205546 -233959 -342564 -137088 272231 420235
35899 420235 203722 -11168 26891 180146 289260 446096 757201 1105270 1313283 1371937
35889 1371937 1368313 1322960 1221933 1113611 1049374 953035 621536 -114809 -1191135 -2238298
35879 -2238298 -2789154 -2650594 -2055295 -1415134 -1005504 -916006 -1113016 -1382687 -1370466 -925767
35869 -925767 -347866 -78975 -212639 -518388 -866988 -1330231 -1855820 -2153377 -2018402 -1570632
35859 -1570632 -1082683 -735932 -605384 -713765 -1008592 -1378559 -1710482 -1854256 -1634153
35850 -1634153 -1091814 -624713 -602523 -881497 -994457 -788119 -515161 -304208 704 361618
35840 361618 407518 47280 -214154 36425 443317 347484 -272448 -793674 -804248 -526766
35830 -526766 -364129 -402387 -486206 -522346 -546609 -611457 -711934 -787816 -787370 -747410 -752817 -792639
35818 -792639 -767356 -679247 -658815 -732788 -750981 -634460 -478586 -299065 42230 468298
35808 468298 552072 52956 -655250 -1024934 -989479 -829556 -622093 -277027 43304 68734
35798 68734 -60165 70781 467279 675256 495291 267758 293481 417295 404518 342893
35788 342893 404191 499871 429542 166213 -179286 -474679 -541955 -279135 89390 184080
35778 184080 -2124 -102745 -33411 -199597 -792285 -1335704 -1345002 -1059264 -1015893 -1155312
35768 -1155312 -909704 -78757 900625 1544966 1725410 1460483 778812 -68350 -634093
35759 -634093 -730864 -639750 -718607 -976106 -1138872 -979518 -492224 110900 513250 550128
35749 550128 414623 474366 829121 1169442 1108658 541750 -320478 -1114115 -1510295 -1438882
35739 -1438882 -1196745 -1178588 -1434741 -1642968 -1566667 -1344667 -1214960 -1142752 -917292 -510319
35729 -510319 -132908 29047 -42170 -310297 -755862 -1269063 -1623818 -1686212 -1575379 -1488854
35719 -1488854 -1408470 -1136475 -642249 -199425 -73138 -204197 -349265 -423272 -507348 -593825
35709 -593825 -572207 -459348 -385292 -321385 -108388 167290 158512 -192180 -401836 -49029
35699 -49029 603794 944151 811428 570079 449633 250078 -200867 -659286 -736238 -352516
35689 -352516 237650 721505 885985 643717 91328 -484983 -799717 -815398 -768816 -912104
35679 -912104 -1216181 -1386202 -1241022 -993973 -966541 -1066782 -875420 -343032 -16926 -303087
35669 -303087 -844754 -1038941 -902587 -912558 -1151742 -1225810 -1030890 -978111 -1279441 -1562060
35659 -1562060 -1478829 -1247702 -1238087 -1383588 -1391650 -1278571 -1303900 -1511144 -1656188 -1522248
35649 -1522248 -1097513 -545143 -152766 -149892 -419040 -577590 -485203 -408213 -509423 -523462
35639 -523462 -236372 55385 -14617 -246792 -167136 212635 438589 342849 223043 290856
35629 290856 415231 468056 483201 395616 62314 -340675 -378304 17790 394264 450117
35619 450117 454843 712956 987347 835527 265242 -332644 -743721 -1058672 -1342980 -1526629
35609 -1526629 -1601248 -1638744 -1598991 -1343719 -855781 -264158 338134 919584 1360224 1460747
35599 1460747 1137389 490360 -310730 -1081973 -1596212 -1677241 -1376506 -959727 -685967 -638731
35589 -638731 -716380 -694459 -366802 233830 792733 1025147 988732 943494 971542 946125 840714
35578 840714 795761 821708 703721 344827 -12697 -98688 12808 60674 18006 102409 373050
35567 373050 542115 268721 -477259 -1389366 -2056534 -2190147 -1762687 -1046722 -477043 -365222
35557 -365222 -699546 -1209763 -1597249 -1706408 -1550540 -1249431 -940131 -701111 -545155 -491079
35547 -491079 -615373 -978368 -1481415 -1850177 -1835333 -1448997 -953746 -587849 -357857 -164203
35537 -164203 -58813 -215658 -618532 -954334 -952842 -725444 -595149 -649877 -671450 -513205
35527 -513205 -319307 -269112 -295975 -231353 -108822 -127556 -355884 -647814 -856627 -985240
35517 -985240 -1102205 -1227551 -1327579 -1325607 -1114903 -681042 -222949 -4637 -32703 -26448
35507 -26448 197560 442871 376172 -30587 -467340 -676291 -716603 -794086 -945406 -990269
35497 -990269 -767774 -341116 62854 288449 372724 411719 366755 104778 -358098 -765460
35487 -765460 -861494 -674613 -467907 -416703 -425272 -297617 -22887 193828 194572 80264 63320
35476 63320 124515 -32705 -580631 -1228655 -1473145 -1176212 -718741 -541922 -708745 -990324
35466 -990324 -1201749 -1299866 -1269861 -1097796 -822973 -498055 -137472 199853 356908 251167
35456 251167 52046 30124 238538 478427 574137 540618 458606 325107 98760 -187991
35446 -187991 -434663 -571359 -625772 -687045 -778482 -777357 -552428 -209822 -66851 -281675
35436 -281675 -636081 -831693 -886006 -1040954 -1368988 -1716538 -2011174 -2354545 -2749247 -2966265
35426 -2966265 -2809069 -2367774 -1911699 -1632490 -1556343 -1607097 -1694280 -1799114 -1963244 -2106925
35416 -2106925 -1942336 -1274378 -363995 250361 324517 71621 -258819 -645743 -1032912 -1151164
35406 -1151164 -868949 -493582 -436632 -710363 -998588 -1108981 -1109252 -1102123 -1107217 -1115180 -1049283
35395 -1049283 -731725 -104589 563235 918582 959770 1012592 1259284 1495745 1403000 895885
35385 895885 154662 -550294 -1013736 -1190714 -1206374 -1234790 -1362157 -1578004 -1815633 -1939399
35375 -1939399 -1807981 -1464899 -1156977 -1028742 -919141 -632434 -285661 -158015 -273586
35366 -273586 -374196 -266155 25708 396557 716973 806911 629005 476633 669589 1063374
35356 1063374 1183265 881157 510427 355256 254747 -10823 -280602 -245585 65710 294711
35346 294711 158817 -309932 -832489 -1076304 -914539 -603337 -566399 -920447 -1380885 -1698302
35336 -1698302 -1936672 -2191702 -2320943 -2190246 -1968094 -1907309 -1989405 -2034790 -2027485 -2072429
35326 -2072429 -2126600 -2003990 -1579236 -830033 175123 1150118 1656757 1565273 1278012 1201171
35316 1201171 1169847 756788 3276 -603889 -842267 -980881 -1234473 -1418323 -1305619 -983465
35306 -983465 -653057 -336879 8639 276452 304250 92351 -198462 -413596 -532269 -686655
35296 -686655 -1012502 -1395424 -1497518 -1217851 -961617 -1156333 -1635964 -1880215 -1764436 -1615250
35286 -1615250 -1565743 -1398293 -1091164 -937212 -938332 -668415 -27593 435798 341019 68391
35276 68391 56650 32459 -430638 -1017907 -1099668 -783629 -727153 -1007973 -1019389 -555214 -187736
35265 -187736 -325888 -610764 -607324 -502389 -678294 -1053880 -1306507 -1400281 -1451323 -1347059
35255 -1347059 -944453 -456167 -233884 -302567 -450167 -612322 -793932 -764168 -278867 431551
35245 431551 819172 710079 483559 488543 604684 501349 71823 -515323 -991960 -1123721
35235 -1123721 -870657 -509161 -403965 -577607 -709602 -635987 -578867 -719873 -826858 -597573
35225 -597573 -199427 -119659 -519200 -1048137 -1337647 -1395485 -1412151 -1410214 -1258163 -904118
35215 -904118 -450211 -73584 35774 -218084 -656021 -864594 -614165 -191551 -120164 -547833
35205 -547833 -1095896 -1334241 -1199345 -870053 -453997 17405 416750 567598 451310 226399
35195 226399 51134 -15763 9885 30277 -123889 -515557 -940276 -1105864 -1003696 -954030
35185 -954030 -1222156 -1701032 -2033153 -1963798 -1547316 -1106508 -1011214 -1365080 -1851961 -2009464
35175 -2009464 -1718122 -1301866 -1085224 -1019964 -891433 -741114 -832532 -1209197 -1524232 -1430729
35165 -1430729 -1023843 -748481 -881674 -1228281 -1387196 -1227058 -964376 -801353 -694912
35156 -694912 -575000 -564680 -739072 -813819 -425823 281613 712932 554583 116929 -211434
35146 -211434 -483070 -871633 -1152305 -959807 -446271 -221909 -582548 -1139166 -1320149 -985040
35136 -985040 -437821 -50782 4404 -187297 -385851 -447143 -498872 -744999 -1115420 -1311785
35126 -1311785 -1228190 -1102648 -1169334 -1364582 -1488516 -1480867 -1414932 -1369183 -1413174 -1564159 -1648714
35115 -1648714 -1389444 -787722 -265165 -240185 -669938 -1162775 -1415464 -1375131 -1130822 -891240
35105 -891240 -958146 -1429392 -1954103 -2048331 -1658471 -1162359 -816441 -521201 -221335 -188395
35095 -188395 -642234 -1296352 -1584021 -1283296 -697998 -258567 -152578 -327840 -618981 -800710
35085 -800710 -710231 -437031 -261746 -291552 -280991 20454 425221 439345 -118873 -819697
35075 -819697 -1077285 -808966 -479060 -501527 -777040 -930275 -890573 -1009533 -1522649 -2078739
35065 -2078739 -2053806 -1333602 -532086 -295883 -593925 -918710 -1020772 -1085627 -1225579 -1246967
35055 -1246967 -1092991 -1107292 -1499944 -1825817 -1463236 -528346 148517 20646 -592239 -1042511
35045 -1042511 -1109544 -1003342 -926883 -948108 -1129596 -1465365 -1747171 -1744752 -1498674 -1245045
35035 -1245045 -1094316 -979926 -877262 -843882 -852283 -826964 -879284 -1237508 -1826754 -2167403
35025 -2167403 -1908641 -1309033 -936324 -956017 -973560 -595775 97935 735382 1078762 1092969
35015 1092969 754205 75228 -676907 -1039144 -762076 -67361 568646 802347 576141
35006 576141 50019 -510959 -891587 -1073768 -1146218 -1035004 -537160 240794 736533 525921
34996 525921 -93519 -465868 -430516 -400448 -599158 -711076 -470085 -163992 -234340 -659019
34986 -659019 -1059511 -1217844 -1169996 -956014 -625576 -393999 -446053 -613364 -563686 -320844
34976 -320844 -292572 -712428 -1310317 -1643151 -1562322 -1255657 -983794 -878931 -901003 -917387
34966 -917387 -881558 -917942 -1115952 -1276341 -1065367 -476244 45375 50461 -449049 -1053921
34956 -1053921 -1406972 -1437586 -1266521 -1037559 -879377 -919670 -1203296 -1559241 -1648573 -1286639
34946 -1286639 -714951 -397337 -494611 -708757 -740980 -693862 -810609 -988766 -876917 -420997
34936 -420997 9231 121103 68330 174911 468419 666192 554053 235381 -2277 -78
34926 -78 125097 148680 14535 -137888 -209372 -249403 -280177 -210430 -47494 19959 -58113
34915 -58113 -20347 280265 499334 232582 -344329 -736593 -925831 -1324278 -1896026 -1980872
34905 -1980872 -1277378 -443934 -277684 -681326 -929019 -698046 -330613 -203670 -338693
34896 -338693 -645696 -1115973 -1629779 -1867120 -1611428 -1042962 -619819 -672466 -1103156 -1471891
34886 -1471891 -1445324 -1167734 -1062560 -1263322 -1458780 -1366151 -1083813 -824869 -594070 -376351
34876 -376351 -375606 -719310 -1102253 -1092739 -699183 -299223 -95689 -3111 -21998 -326028 -916163
34865 -916163 -1508944 -1853612 -1920932 -1760324 -1444587 -1177116 -1146613 -1212816 -1038955 -622303
34855 -622303 -381277 -577493 -940497 -1050688 -858036 -629046 -581641 -768994 -1151833 -1581494
34845 -1581494 -1841488 -1889847 -1950598 -2204195 -2501868 -2551892 -2282257 -1849392 -1390273 -963722
34835 -963722 -677524 -666502 -921744 -1260272 -1470056 -1424483 -1125527 -745166 -556962 -679362
34825 -679362 -904079 -897098 -556715 -79948 274440 355934 105908 -425062 -994753 -1279915
34815 -1279915 -1188555 -964999 -876746 -883309 -757189 -481927 -339597 -553334 -997458 -1362763
34805 -1362763 -1490792 -1420912 -1228452 -1018371 -1008886 -1349359 -1816716 -1960844 -1674123 -1378413
34795 -1378413 -1465434 -1761001 -1790089 -1425346 -993168 -812389 -899632 -1100565 -1251333 -1203793
34785 -1203793 -933732 -659368 -646665 -870188 -1056567 -1061691 -982222 -887513 -701900 -411729
34775 -411729 -143030 49390 242049 408563 365029 71561 -219675 -249629 -24780 269060
34765 269060 430909 275004 -230562 -751070 -807583 -379717 -5399 -85861 -387018 -480360
34755 -480360 -371799 -340876 -401431 -353448 -246242 -361421 -751915 -1152950 -1361007 -1402481
34745 -1402481 -1340174 -1218741 -1191734 -1374599 -1551172 -1365654 -866313 -514062 -542149 -652381
34735 -652381 -527120 -324209 -394356 -729328 -988741 -957355 -710668 -394396 -98500 47121
34725 47121 -110699 -530080 -895098 -881419 -501373 -125035 -109219 -402241 -584845 -365801
34715 -365801 37741 160159 -89404 -264844 51848 674612 986513 651771 -12628 -415804
34705 -415804 -317877 12589 181456 52766 -265999 -639994 -945798 -995637 -678984 -219733
34695 -219733 -47255 -271305 -479827 -251917 272931 557726 302890 -297464 -846894 -1057891
34685 -1057891 -845513 -386262 -68506 -130557 -362982 -424247 -393321 -650297 -1208220 -1606244
34675 -1606244 -1597320 -1499486 -1620128 -1739727 -1512882 -1044935 -665959 -410718 -180695 -185746
34665 -185746 -661396 -1256932 -1321232 -848458 -550583 -828626 -1246292 -1312614 -1233569 -1412403
34655 -1412403 -1628836 -1345088 -643732 -224448 -438862 -868024 -996398 -841712 -689861
34646 -689861 -593714 -453884 -336098 -365725 -447286 -388096 -208044 -54453 103621 388715
34636 388715 662897 611650 247448 7374 193557 577123 756808 688842 600079 530101
34626 530101 284659 -172830 -575008 -684276 -581597 -519885 -616601 -779937 -836566 -644644
34616 -644644 -171009 429013 848429 855614 505212 73631 -221131 -393072 -574879 -788254
34606 -788254 -895131 -785611 -544120 -359893 -309728 -331991 -409447 -630694 -997381 -1302075
34596 -1302075 -1333471 -1132491 -918332 -826289 -857140 -1005395 -1227709 -1309466 -1019215 -476755
34586 -476755 -150022 -339786 -814022 -1101157 -1026848 -799260 -658215 -635119 -635085 -580463 -444391
34575 -444391 -262722 -141023 -164064 -293422 -435641 -589105 -806280 -1021005 -1066298 -904187
34565 -904187 -693825 -562830 -453127 -297250 -208279 -332544 -606702 -847049 -1022240 -1224755
34555 -1224755 -1392121 -1316637 -1010026 -819835 -1024733 -1477481 -1803042 -1799852 -1487744 -946384
34545 -946384 -354233 -42082 -188751 -510958 -551512 -249758 69668 226933 320731 327972
34535 327972 48118 -410464 -581127 -348701 -239142 -608587 -983462 -758919 -222952 -200399
34525 -200399 -821402 -1366440 -1367457 -1147212 -1065408 -912447 -455900 -51739 -166408 -597971
34515 -597971 -713058 -327794 121605 267360 258065 422874 776010 1016824 909005 557305
34505 557305 316626 420139 699811 757609 437133 5707 -188906 -122529 -89172 -399222
34495 -399222 -1113502 -1933000 -2338633 -2051477 -1399996 -982121 -901319 -664078 26524 766533
34485 766533 1027503 888426 787572 800808 645461 266381 -75168 -271863 -470304 -659395
34475 -659395 -594939 -258481 -17466 -148258 -479350 -677735 -661271 -568186 -502084 -452429
34465 -452429 -344051 -92905 262025 480853 365980 77095 -37194 74493 144335 84505
34455 84505 142838 415671 560261 244354 -375873 -880522 -1074824 -1009719 -731141 -311613
34445 -311613 7285 252 -280257 -636469 -990823 -1278932 -1234540 -632459 287041 953448
34435 953448 1049757 712310 179220 -418611 -849248 -738063 999 877597 1231918 887411
34425 887411 238238 -262480 -524548 -719029 -930299 -1050672 -984081 -801023 -605715 -352614
34415 -352614 37739 412071 460749 141441 -183694 -186389 33118 183419 232098 335174
34405 335174 441847 331191 33678 -147425 -117635 -157584 -460094 -810230 -944381 -968962
34395 -968962 -1148276 -1465156 -1692080 -1772480 -1814587 -1772189 -1475616 -1023813 -839881 -1190088
34385 -1190088 -1823256 -2206451 -2005890 -1289853 -426470 129417 118246 -298569 -676401 -753707
34375 -753707 -683068 -700513 -721115 -483033 -31659 205717 -79286 -664694 -1021901 -888636
34365 -888636 -516784 -369550 -647893 -1122155 -1377293 -1193288 -707470 -259076 -117725 -331197
34355 -331197 -726966 -994446 -853081 -291984 336054 579989 318078 -149963 -486225 -683609
34345 -683609 -932416 -1198948 -1155003 -603137 187671 727124 814813 643086 421577 122389
34335 122389 -307905 -679062 -716972 -431796 -120381 9993 40914 119971 209986 165057
34325 165057 -52420 -328257 -496218 -427206 -130052 163460 141428 -250634 -719279 -968397
34315 -968397 -1004695 -980232 -901744 -702680 -474386 -375489 -384722 -388970 -451185 -712316 -1056116
34304 -1056116 -1169558 -958104 -628543 -354343 -172071 -223729 -695106 -1374238 -1665685 -1291548
34294 -1291548 -674898 -382852 -485628 -737849 -1069126 -1495486 -1770863 -1588170 -1055641
34285 -1055641 -590912 -379282 -275945 -199341 -245698 -378285 -344526 -14467 418310 639725
34275 639725 463305 -86625 -730464 -1036223 -838252 -519904 -593578 -1026439 -1300760 -1134900
34265 -1134900 -779407 -545294 -421555 -296731 -214013 -214248 -203837 -172594 -307811 -710491
34255 -710491 -1207345 -1603003 -1905296 -2144962 -2200416 -1991612 -1653579 -1333967 -996638 -596137
34245 -596137 -263005 -134378 -162567 -251293 -413473 -651235 -873668 -1075196 -1364511 -1655852
34235 -1655852 -1612454 -1131904 -611995 -436057 -445395 -275588 7374 41247 -191984 -325450
34225 -325450 -202328 -91840 -229178 -477781 -573276 -465720 -321670 -358378 -707817 -1267129
34215 -1267129 -1678640 -1650085 -1301499 -1021619 -1013538 -1174941 -1351344 -1433097 -1246651 -692040
34205 -692040 -39306 236460 26235 -291002 -423078 -566559 -1021478 -1632427 -1893985 -1534712
34195 -1534712 -788556 -115871 189916 124023 -168841 -583566 -1098772 -1645487 -2011561 -1990141
34185 -1990141 -1630210 -1248808 -1153630 -1366325 -1591193 -1455922 -895465 -340750 -347384 -909640
34175 -909640 -1345152 -1081645 -377229 31660 -159793 -639379 -1091847 -1519587 -1905181 -2031432
34165 -2031432 -1841051 -1624657 -1630223 -1760800 -1850481 -1955204 -2135569 -2202861 -1961397 -1543789
34155 -1543789 -1263594 -1249542 -1400907 -1557299 -1536631 -1170995 -518172 77629 309356 181995
34145 181995 -140987 -554501 -912664 -976831 -747354 -648666 -1043657 -1670756 -1892171 -1456718
34135 -1456718 -730670 -205823 -53240 -150224 -282384 -287154 -191079 -200797 -402349 -564469
34125 -564469 -465244 -296144 -421268 -799285 -1022149 -947612 -896822 -1105162 -1342199 -1281273
34115 -1281273 -961419 -651204 -469278 -366265 -311328 -275632 -164497 29314 120043 -28704
34105 -28704 -261526 -327425 -223534 -134536 -106860 -19574 144271 234523 183922 126722 183578
34094 183578 256684 127125 -303201 -901983 -1388905 -1534281 -1350744 -1086653 -973416 -1024309
34084 -1024309 -1161471 -1435419 -1916139 -2402376 -2504066 -2102351 -1518416 -1110394 -902175
34075 -902175 -758584 -706987 -830988 -997111 -1003879 -948271 -1118615 -1500695 -1715665 -1550112
34065 -1550112 -1242105 -1072162 -961249 -740850 -591458 -842533 -1411828 -1802345 -1703390 -1309588
34055 -1309588 -959146 -723317 -518116 -407456 -528875 -770260 -764831 -296888 413772 944685
34045 944685 1121509 1089558 944750 523484 -262995 -1053850 -1323109 -1034913 -685926 -614537
34035 -614537 -623235 -462317 -295544 -344478 -402718 -177483 100924 -47490 -565329 -906636
34025 -906636 -872731 -820208 -942870 -950629 -687808 -493096 -594642 -654545 -357160 -27994
34015 -27994 -152212 -590501 -816370 -715292 -596512 -549193 -358482 -38834 86055 -90414
34005 -90414 -304530 -390767 -484884 -629149 -575059 -193979 216382 267889 -70632 -536020
33995 -536020 -907440 -1115571 -1152892 -1044095 -858633 -666729 -503411 -367779 -201636 72058
33985 72058 394722 551023 437015 223450 71994 -137388 -512244 -750896 -457260 200882
33975 200882 596502 449681 97248 -129390 -334005 -681441 -1035674 -1246146 -1425853 -1641411
33965 -1641411 -1665611 -1392244 -1199379 -1476935 -1993244 -2171585 -1892426 -1600842 -1648044 -1920645
33955 -1920645 -2164825 -2325754 -2442418 -2453759 -2249178 -1785178 -1103909 -358706 180948 313193
33945 313193 120376 -126452 -276221 -373830 -459087 -491924 -511886 -671181 -998473 -1256591
33935 -1256591 -1165759 -738297 -322050 -299997 -728960 -1252521 -1423392 -1169635 -874176 -907018
33925 -907018 -1177299 -1316341 -1234382 -1232709 -1501105 -1763363 -1634689 -1197828 -953583 -1175076
33915 -1175076 -1542777 -1566051 -1224518 -964383 -1072824 -1305758 -1268855 -977489 -794392 -878153
33905 -878153 -966296 -768111 -359608 -66011 -88633 -364644 -693638 -887513 -863304 -692753
33895 -692753 -543157 -539779 -722488 -1093286 -1567638 -1899067 -1863649 -1569932 -1363171 -1335011
33885 -1335011 -1192567 -790725 -519087 -826138 -1487950 -1719987 -1063863 87020 922146
33876 922146 996485 501365 -95949 -525490 -812390 -1004083 -986855 -716125 -493739 -694975
33866 -694975 -1185819 -1367869 -975680 -496223 -518088 -949523 -1241421 -1164922 -948557 -788516
33856 -788516 -683273 -704426 -970509 -1316728 -1418247 -1320786 -1436098 -1881676 -2221258 -2056365
33846 -2056365 -1539177 -1082603 -857059 -803867 -874549 -983583 -923583 -595669 -193847 48837
33836 48837 164582 311353 470206 484948 295513 -45232 -482747 -931394 -1245299 -1364099
33826 -1364099 -1372254 -1300994 -1048830 -641226 -342275 -287400 -228929 53622 281301 7568
33816 7568 -649852 -1019719 -687698 21681 479483 418887 49516 -290338 -448334 -530836
33806 -530836 -755434 -1177178 -1560817 -1619310 -1353402 -1026290 -834119 -761123 -733992 -724002
33796 -724002 -685561 -589192 -552026 -752879 -1169066 -1559267 -1739079 -1707592 -1498367 -1130789
33786 -1130789 -747176 -540967 -459387 -237678 144207 314274 11930 -510782 -834963 -905839
33776 -905839 -940223 -1000942 -1005008 -1016950 -1146692 -1216499 -935525 -423130 -154494 -300004 -516782
33765 -516782 -544635 -595518 -885283 -1152299 -1039076 -710562 -646937 -927341 -1148447 -1043230
33755 -1043230 -776965 -560073 -339064 -28700 239845 294714 141466 -159192 -642024 -1284823
33745 -1284823 -1856043 -2099467 -1977886 -1613186 -1122969 -658695 -449369 -602923 -951455
33736 -951455 -1259517 -1487623 -1688659 -1780465 -1654732 -1426373 -1325765 -1372809 -1372405 -1208462
33726 -1208462 -950158 -716142 -638360 -888890 -1491636 -2158725 -2576343 -2789278 -3001651 -3094826
33716 -3094826 -2781966 -2234053 -2021653 -2277101 -2423336 -2004926 -1317284 -851169 -556986
33707 -556986 -149014 208314 108171 -386884 -810222 -981990 -1096730 -1168283 -960457 -533893
33697 -533893 -316254 -472301 -676264 -682380 -666113 -795842 -920696 -937936 -1019567 -1160622
33687 -1160622 -964606 -309803 181789 -113310 -907857 -1430080 -1538925 -1718331 -2036345
33678 -2036345 -1900152 -1049445 -104638 262431 184365 172645 254311 90521 -289394 -479127
33668 -479127 -388523 -409037 -771983 -1168391 -1203456 -912528 -603882 -430871 -362657 -397996
33658 -397996 -530665 -592572 -406595 -94677 2743 -227339 -497906 -498977 -305223 -262238
33648 -262238 -526453 -857371 -886036 -515028 -20418 219708 91496 -148934 -151657 131837
33638 131837 369992 216168 -276632 -684945 -671733 -335880 -51929 -24882 -113619 -101055
33628 -101055 -12331 -56189 -301953 -560284 -621617 -486212 -261943 58782 539434 1029192
33618 1029192 1156742 714772 -46574 -630928 -758934 -536803 -224365 38297 283789
33609 283789 611807 1048362 1431330 1450623 924868 64850 -656855 -951754 -930752 -835045
33599 -835045 -706887 -451938 -98616 205026 411375 593673 739858 721616 524216 317967
33589 317967 193835 1356 -381821 -747761 -747047 -338879 151839 424957 453881 322867
33579 322867 45602 -343734 -704725 -953596 -1184189 -1470320 -1662483 -1564815 -1225834 -846499
33569 -846499 -471244 -36129 284739 114578 -579294 -1216283 -1145018 -381768 397218 582677
33559 582677 198404 -242668 -289224 71374 457361 451722 -4745 -526041 -639989 -274919
33549 -274919 163558 246501 -3284 -177260 -15234 238423 111895 -488006 -1077208 -1084152
33539 -1084152 -477622 196402 389697 65028 -371153 -534751 -391832 -178637 -84144 -54014
33529 -54014 74674 275673 288785 -46200 -523107 -800944 -831792 -843148 -924280 -909568 -736107
33518 -736107 -623779 -732107 -878941 -821868 -641996 -617416 -847341 -1207661 -1533311 -1628064
33508 -1628064 -1277322 -554611 25319 13600 -388015 -603699 -478606 -381749 -518659 -619273
33498 -619273 -446737 -180121 -60279 -14507 99408 173772 54681 -188579 -472059 -925957
33488 -925957 -1602851 -2174177 -2269517 -1970234 -1636273 -1394395 -1169186 -1086851 -1373667 -1834858
33478 -1834858 -1892043 -1312824 -588136 -384611 -816705 -1412346 -1647587 -1389517 -922429 -634642
33468 -634642 -625255 -621072 -369378 -36987 -20987 -394978 -791069 -873293 -702580 -565798 -652220
33457 -652220 -975868 -1412027 -1710258 -1652808 -1305273 -963801 -798061 -732054 -726485 -921376
33447 -921376 -1360781 -1800342 -1962874 -1815765 -1462028 -973801 -515142 -396117 -718493 -1093578
33437 -1093578 -992644 -342607 418260 819884 730351 337767 -43942 -204621 -222965 -352999
33427 -352999 -631443 -779031 -653466 -551230 -759058 -1017158 -843597 -291802 68544 -64020
33417 -64020 -395834 -582271 -673094 -829651 -960041 -897625 -702347 -545254 -459198 -381345
33407 -381345 -285199 -138295 84284 230968 64272 -327886 -495581 -224984 113108 108564
33397 108564 -78772 -67625 8511 -334381 -1057689 -1460756 -1103477 -425012 -153813 -425146
33387 -425146 -827054 -1090278 -1299079 -1465673 -1341339 -841593 -373675 -427788 -911024 -1176548
33377 -1176548 -790336 -42701 466266 572378 609813 802251 937958 758121 377409 98615
33367 98615 -3232 -67389 -141392 -146294 -85723 -39243 32073 227774 440561 396053 38782
33356 38782 -331663 -428123 -322842 -299500 -470385 -673485 -699339 -524558 -340307 -390416
33346 -390416 -741368 -1183393 -1408742 -1319927 -1123768 -1097158 -1280411 -1405488 -1137436 -457181
33336 -457181 178113 200239 -426056 -1054412 -1038035 -461908 36289 98374 -18881 38818
33326 38818 225708 288582 184179 50752 -85791 -327153 -679626 -1011358 -1216728 -1277540
33316 -1277540 -1169504 -842548 -334796 163401 417952 355405 170167 161258 382241 524428
33306 524428 291302 -169391 -418231 -296998 -87412 -34603 50 235798 556925 651113
33296 651113 443823 171088 74165 184872 361239 405630 210226 -105485 -282661 -243141
33286 -243141 -209485 -403501 -766136 -1100844 -1326416 -1420630 -1296817 -975138 -730751 -785417
33276 -785417 -929516 -737439 -137625 485256 747601 588414 146696 -414490 -908168 -1174285
33266 -1174285 -1218135 -1156261 -1008287 -711497 -345078 -128545 -145294 -251592 -310299 -327031
33256 -327031 -291688 -92117 281367 591864 575025 248319 -104670 -240462 -189860 -188213
33246 -188213 -382403 -625675 -638802 -398863 -232748 -414462 -791269 -965956 -753534 -291911
33236 -291911 188002 487318 436125 41451 -389985 -534559 -451108 -458442 -642441 -772831
33226 -772831 -716962 -612501 -547585 -375746 2811 409554 584886 447824 79788 -349941
33216 -349941 -577017 -411008 -31796 112885 -158010 -542854 -716101 -773665 -1021464 -1492067
33206 -1492067 -1890203 -1939398 -1637445 -1230171 -1011070 -1068794 -1207830 -1224993 -1214377 -1388605
33196 -1388605 -1659687 -1736347 -1651174 -1764630 -2105700 -2158983 -1592101 -804037 -368025 -237102
33186 -237102 41677 519433 750347 471850 -48814 -425608 -603305 -784322 -1090477 -1383454
33176 -1383454 -1356826 -847720 -127169 257419 84530 -227350 -106574 470234 973050 943970
33166 943970 423116 -206207 -604459 -706523 -693575 -747044 -816891 -728958 -511720 -402466
33156 -402466 -482655 -581227 -637284 -819728 -1098077 -1065658 -503887 194740 538714 591323
33146 591323 683086 716753 295669 -540026 -1212886 -1287139 -884021 -412975 -211211 -419714
33136 -419714 -883792 -1189334 -1086868 -827980 -813762 -1047019 -1262661 -1414833 -1590935 -1595966
33126 -1595966 -1160430 -501910 -125564 -66533 99911 445658 498790 26603 -562564 -840683
33116 -840683 -881253 -900456 -855813 -713756 -693022 -888627 -990405 -712529 -222373 157605
33106 157605 398920 609494 680962 447084 60811 -81599 235778 828314 1251535 1157768
33096 1157768 667187 322562 427479 560889 165204 -501122 -603340 62046 799571
33087 799571 1110072 1286773 1589280 1612859 1040073 364121 199800 389944 453761 433298
33077 433298 599380 822970 1049249 1873569 3565400 4846325 3952066 1025896 -1733981
33068 -1733981 -2668776 -2358467 -2247160 -2602735 -2692626 -2283427 -1916433 -1899721 -1908726 -1666824
33058 -1666824 -1384713 -1327040 -1368039 -1215516 -846488 -522383 -464638 -636828 -827380 -892403
33048 -892403 -889912 -960118 -1120332 -1263775 -1331569 -1349832 -1284514 -1019244 -557454 -136825 -48597
33037 -48597 -381982 -968724 -1515518 -1790183 -1776336 -1677151 -1701509 -1840095 -1908185 -1773804
33027 -1773804 -1464521 -1115205 -934011 -1138969 -1725272 -2313630 -2448829 -2088931 -1605119
33018 -1605119 -1257943 -914310 -401545 107998 322456 308686 430046 784573 999364 747377
33008 747377 252514 8275 93473 109376 -165315 -436327 -410441 -288560 -370206 -446354
32998 -446354 -118867 403698 472909 45933 -97689 503358 1202003 1075410 148989 -754613
32988 -754613 -1126886 -1150247 -1080159 -857460 -444442 -78530 42933 64293 237137 513052
32978 513052 557621 175629 -380104 -628501 -405712 -41243 127817 198704 369814 394616
32968 394616 -117770 -945764 -1421303 -1398323 -1388337 -1610520 -1677756 -1480508 -1525312 -1961669
32958 -1961669 -2157631 -1842337 -1761129 -2396089 -2931536 -2517594 -1755949 -1717370 -2184947 -2259389
32948 -2259389 -2111459 -2543307 -3260137 -3384866 -3409325 -4492994 -5701403 -4373114 -108726
32939 -108726 3825070 4503252 2967595 2160945 2731213 2968455 2015896 919433 643482
32930 643482 913955 1242194 1625870 1909217 1631390 875307 340869 288659 220685 -160330
32920 -160330 -450014 -263391 212377 633890 893141 904738 566810 133399 105951 541693
32910 541693 910820 812199 423444 99206 -82362 -224596 -402090 -662659 -961671 -1063501
32900 -1063501 -807419 -466379 -508620 -983299 -1437151 -1440141 -946923 -212532 393819 612888
32890 612888 584238 719403 1048780 1045259 460334 -116311 -100486 112754 -230738 -980548
32880 -980548 -1324303 -1112997 -992640 -1244028 -1462322 -1494958 -1721046 -2150035 -2188215 -1689712
32870 -1689712 -1370737 -1685413 -2070153 -1883879 -1413435 -1280941 -1402265 -1243228 -721860
32861 -721860 -179169 266106 690596 894680 597037 42357 -149245 199243 591077 552570
32851 552570 210153 -20494 -103144 -450134 -1273147 -2082775 -2134356 -1386245 -640506 -517951
32841 -517951 -678398 -443872 173843 635333 776854 837924 730807 82664 -952369 -1676654
32831 -1676654 -1767346 -1528852 -1159727 -551215 55107 96472 -333921 -404384 177037 653613
32821 653613 449876 43636 21493 104984 -146186 -408917 -226400 38230 -232144 -842974
32811 -842974 -1137567 -1031368 -883637 -690920 -239196 226072 294279 119606 97369 72942
32801 72942 -330550 -840122 -846372 -437433 -278952 -551497 -814296 -861298 -904870 -919589 -587849
32790 -587849 43956 529535 650290 475945 -53011 -879087 -1348292 -861641 77497 407408
32780 407408 82169 85259 777168 1318096 1036746 355370 -72340 -204920 -67356 794080
32770 794080 2642807 4884221 6567462 7117585 6356977 4511998 2528524 1599954 1899312
32761 1899312 2422018 2415305 2128238 1764642 815549 -761842 -1734515 -1110845 248167
32752 248167 752516 297107 48127 333713 194541 -851640 -1907505 -2011995 -1393077
$$ [...]
##END NTUPLES=NMR SPECTRUM
##END=
