##TITLE=31P_DE-80H_X3
 64 sc D2O
 26.2.2025
##JCAMPDX= 6.0         $$ Bruker NMR JCAMP-DX V2.0
##DATA TYPE= NMR SPECTRUM
##DATA CLASS= NTUPLES
##ORIGIN= UXNMR, Bruker Analytische Messtechnik GmbH
##OWNER= root
$$ XWIN-NMR		Version 3.5
$$ Thu May 29 12:49:55 2025 Russian Standard Time (UT+4h)  Yarkov@DPX200
##.OBSERVE FREQUENCY= 81.013821
##.OBSERVE NUCLEUS= ^31P
##.ACQUISITION MODE= SIMULTANEOUS
##.ACQUISITION SCHEME= undefined
##.AVERAGES= 64
##.DIGITISER RES= 17
##SPECTROMETER/DATA SYSTEM= spect
##.PULSE SEQUENCE= zgpg30
##.SOLVENT NAME= CDCl3
##.SHIFT REFERENCE= (INTERNAL, CDCl3, 0, 198.062)
##AUDIT TRAIL= $$ (NUMBER, WHEN, WHO, WHERE, WHAT)
$$ ##TITLE= Audit trail, XWIN-NMR		Version 3.5
$$ ##JCAMPDX= 5.01
$$ ##ORIGIN= Bruker BioSpin GmbH
$$ ##OWNER= Yarkov
$$ C:/Bruker/XWIN-NMR/data/yarkov2/nmr/P31/2/pdata/1/auditp.txt
$$ ##AUDIT TRAIL=  $$ (NUMBER, WHEN, WHO, WHERE, WHAT)
(   1,<2025-05-29 12:49:11.28 +0400>,<Yarkov>,<DPX200>,
      <created by zg, POWCHK disabled, PULCHK disabled
       configuration hash MD5:
       00 E9 B6 7A A2 85 ED C7 34 08 36 98 17 FE 4E 26
       data hash MD5: 32K
       9E 46 BF 1B 72 7F D4 72 F8 E3 72 11 22 00 B3 21>)
(   2,<2025-05-29 12:49:27.32 +0400>,<Yarkov>,<DPX200>,
      <Start of raw data processing
       efp BC_mod = 2 LB = 1.5 FT_mod = 6 PKNL = 1 PHC0 = 1669.046 PHC1 = 70.95951 SI = 64K 
       data hash MD5: 64K
       D0 AF 24 88 78 1E 93 06 6A F3 5A 0E 0E 2F 5D 16>)
$$ ##END=
$$ 
$$ hash MD5
$$ 46 C6 35 44 E5 C4 19 97 CF DA 46 E2 81 9D E8 CA
##$RELAX= 
##$RELAX= 
##$RELAX= 
##$RELAX= 
##$RELAX= 
##$RELAX= 
##$RELAX= 
##$RELAX= 
$$ Bruker specific parameters
$$ --------------------------
##$DU= <C:/Bruker/XWIN-NMR>
##$EXPNO= 2
##$NAME= <P31>
##$PROCNO= 1
##$TYPE= <nmr>
##$USER= <yarkov2>
##$AMP= (0..31)
100 100 100 100 100 100 100 100 100 100 100 100 100 100 100 100 100 100 
100 100 100 100 100 100 100 100 100 100 100 100 100 100 
##$AQSEQ= 0
##$AQ_mod= 1
##$AUNM= <au_zg>
##$AUTOPOS= <>
##$BF1= 81.014009
##$BF2= 200.13
##$BF3= 200.13
##$BF4= 200.13
##$BF5= 200.13
##$BF6= 200.13
##$BF7= 200.13
##$BF8= 200.13
##$BYTORDA= 1
##$CFDGTYP= 0
##$CFRGTYP= 5
##$CHEMSTR= <none>
##$CNST= (0..31)
1 1 145 1 1 1 1 1 1 1 1 1 1 1 1 1 1 1 1 1 1 1 1 1 1 1 1 1 1 1 1 1 
##$CPDPRG= <waltz16>
##$CPDPRG1= <>
##$CPDPRG2= <waltz16>
##$CPDPRG3= <>
##$CPDPRG4= <mlev>
##$CPDPRG5= <mlev>
##$CPDPRG6= <mlev>
##$CPDPRG7= <mlev>
##$CPDPRG8= <mlev>
##$CPDPRGB= <>
##$CPDPRGT= <>
##$D= (0..31)
0 1 0 0 0 0 0 0 0 0.06 0 0.03 2e-05 3e-06 0 0 0.0002 0 0 0 0 0 0 0 0 0 
0 0 0 0 0 0 
##$DATE= 1748508550
##$DBL= (0..7)
120 120 120 11 120 120 24 19 
##$DBP= (0..7)
150 150 150 150 150 150 150 150 
##$DBP07= 0
##$DBPNAM0= <>
##$DBPNAM1= <>
##$DBPNAM2= <>
##$DBPNAM3= <>
##$DBPNAM4= <>
##$DBPNAM5= <>
##$DBPNAM6= <>
##$DBPNAM7= <>
##$DBPOAL= (0..7)
0.5 0.5 0.5 0.5 0.5 0.5 0.5 0.5 
##$DBPOFFS= (0..7)
0 0 0 0 0 0 0 0 
##$DE= 6
##$DECBNUC= <off>
##$DECIM= 4
##$DECNUC= <off>
##$DECSTAT= 4
##$DIGMOD= 1
##$DIGTYP= 9
##$DL= (0..7)
0 0 52 120 120 21 21 25 
$$ [...]
##$SUBNAM2= <"">
##$SUBNAM3= <"">
##$SUBNAM4= <"">
##$SUBNAM5= <"">
##$SUBNAM6= <"">
##$SUBNAM7= <"">
##$SUBNAM8= <"">
##$SUBNAM9= <"">
##$SW= 400.765351723535
##$SWIBOX= (0..15)
0 1 3 0 0 0 0 0 0 0 0 0 0 0 0 0 
##$SW_h= 32467.5324675325
##$TD= 32768
##$TD0= 1
##$TE= 0
##$TE2= 300
##$TE3= 300
##$TEG= 300
##$TL= (0..7)
0 120 53 12 22 120 120 120 
##$TP= (0..7)
150 150 150 150 150 150 150 150 
##$TP07= 0
##$TPNAME0= <>
##$TPNAME1= <>
##$TPNAME2= <>
##$TPNAME3= <>
##$TPNAME4= <>
##$TPNAME5= <>
##$TPNAME6= <>
##$TPNAME7= <>
##$TPOAL= (0..7)
0.5 0.5 0.5 0.5 0.5 0.5 0.5 0.5 
##$TPOFFS= (0..7)
0 0 0 0 0 0 0 0 
##$TUNHIN= 0
##$TUNHOUT= 0
##$TUNXOUT= 0
##$USERA1= <user>
##$USERA2= <user>
##$USERA3= <user>
##$USERA4= <user>
##$USERA5= <user>
##$V9= 5
##$VALIST= <valist>
##$VCLIST= <CCCCCCCCCCCCCCC>
##$VD= 0
##$VDLIST= <DDDDDDDDDDDDDDD>
##$VPLIST= <PPPPPPPPPPPPPPP>
##$VTLIST= <TTTTTTTTTTTTTTT>
##$WBST= 1024
##$WBSW= 4
##$XGAIN= (0..3)
0 0 0 0 
##$XL= 0
##$YL= 0
##$YMAX_a= 2418
##$YMIN_a= -851
##$ZGOPTNS= <>
##$ZL1= 120
##$ZL2= 120
##$ZL3= 120
##$ZL4= 120
##$ABSF1= 0
##$ABSF2= 0
##$ABSG= 0
##$ABSL= 0
##$ALPHA= 0
##$AQORDER= 0
##$ASSFAC= 0
##$ASSFACI= 0
##$ASSFACX= 0
##$ASSWID= 0
##$AUNMP= <proc_1d>
##$AZFE= 0.1
##$AZFW= 0.5
##$BCFW= 0
##$BC_mod= 2
##$BYTORDP= 0
##$COROFFS= 0
##$CY= -3
##$DATMOD= 1
##$DC= 0
##$DFILT= <>
##$DTYPP= 0
##$F1P= 0
##$F2P= 0
##$FCOR= 1
##$FTSIZE= 65536
##$FT_mod= 6
##$GAMMA= 0
##$GB= 0
##$INTBC= 1
##$INTSCL= 9.790993e-09
##$ISEN= 30
##$LB= 1.5
##$LEV0= 0
##$LPBIN= 0
##$MAXI= 10000
##$MC2= 0
##$MEAN= 0
##$ME_mod= 0
##$MI= 50
##$NCOEF= 0
##$NC_proc= -10
##$NLEV= 6
##$NOISF1= 182.463
##$NOISF2= 159.3651
##$NSP= 0
##$NTH_PI= 0
##$NZP= 0
##$OFFSET= 198.0616
##$PC= 4
##$PHC0= 1669.046
##$PHC1= 70.95951
##$PH_mod= 1
##$PKNL= yes
##$PPARMOD= 0
##$PSCAL= 0
##$PSIGN= 0
##$REVERSE= no
##$SF= 81.0140089999434
##$SI= 65536
##$SIGF1= 159.3651
##$SIGF2= -187.1042
##$SINO= 113.3802
##$SIOLD= 16384
##$SREGLST= <1H.CDCl3>
##$SSB= 0
##$STSI= 65536
##$STSR= 0
##$SW_p= 32467.5324675325
##$SYMM= 0
##$S_DEV= 0
##$TDeff= 32768
##$TDoff= 0
##$TI= <>
##$TILT= no
##$TM1= 0
##$TM2= 0
##$TOPLEV= 0
##$USERP1= <user>
##$USERP2= <user>
##$USERP3= <user>
##$USERP4= <user>
##$USERP5= <user>
##$WDW= 1
##$XDIM= 65536
##$YMAX_p= 331740687
##$YMIN_p= -11578243
$$ End of Bruker specific parameters
$$ ---------------------------------
##NTUPLES= NMR SPECTRUM
##VAR_NAME=  FREQUENCY,     SPECTRUM/REAL,   SPECTRUM/IMAG
##SYMBOL=    X,             R,               I
##VAR_TYPE=  INDEPENDENT,   DEPENDENT,       DEPENDENT
##VAR_FORM=  AFFN,          ASDF,            ASDF
##VAR_DIM=   65536,         65536,           65536
##UNITS=     HZ,            ARBITRARY UNITS, ARBITRARY UNITS
##FACTOR=    0.49542278885378, 1,            1
##FIRST=     16045.7642231865, 0,            0
##LAST=      -16421.768244346, 0,            0
##MIN=       -16421.768244346, -11578243,    0
##MAX=       16045.7642231865, 331740687,    0
$$ Real data points
##PAGE= N=1
##DATA TABLE= (X++(R..R)), XYDATA
$$ [...]
42847d46542k06248J0124L86572P38795O58771R3300m12487l11470K28324M95431
42837A234570J30225m35509n68283k35933K7778j36587m96081n94863l12891P4047
42827a313527K54661J63359l1920j19170n0670M557j11097k67570j70199J87785
42817a453791M28353L04288Q3465J52474M12163M25877J00728j74108j21215O3440
42807B21674Q9749j561j1420N5613N5244j1479j1700Q9828J92831K05120J02243
42796I76142q2724k23849j63172O8702K08236Q4055j24234j26803O9215J91831
42786H77399R0159j10733k27980k19095j51846j14606j66284k71503l02417j96611
42776g93517o0718j1172Q534J10521K42353K55061J30457l1274j81790k92898
$$ plain form
42847 -446542 -652790 -642666 -256094 482701 1141472 1234772 822285 510815 739139 1234570
42837 1234570 1364795 929286 361003 125070 152848 16261 -479820 -1074683 -1387574 -1313527
42827 -1313527 -1058866 -895507 -927427 -1046597 -1097267 -1092710 -1203807 -1471377 -1641576 -1453791
42817 -1453791 -1025438 -721150 -637685 -485211 -73048 352829 453557 279449 158234 221674
42807 221674 311423 309862 298442 354055 409299 397820 386120 475948 668779 873899 976142
42796 976142 893418 669569 506397 575099 783335 867390 743156 616353 685568 877399
42786 877399 967558 856825 628845 409750 257904 143298 -22986 -294489 -596906 -793517
42776 -793517 -854235 -865407 -856873 -746352 -503999 -248938 -118481 -149755 -331545 -624443
42766f24443k39978M0752L34949L56088J36324o0154j60733k77479l12414k6276
42756h33364M13770M58273j6321l94311j74307K72438K62799j92272m89539l56499
42746a049333r8559J3494L8108P553j80216l86152k48269K23094N19459L54424
42736h06397R2856J55332L83501L89060K12815J66396K27422R9075k07632l40461
42726C71967j85179m1703j11966j91224n1198J68934J85964m374j54092j14208
42716a27079K6122J17227J30466J40924J82980J70246J7679j62295j42828L7789
42706C91231j4860n08254r86750p89733K8899O64905N68318Q8137j04127J23484
42696e38750L95395M48322L33271J48632m9813j27312J0345J83677J09157j92734
$$ plain form
42766 -624443 -864421 -823669 -488720 -132632 3692 -56462 -217195 -494674 -807088 -833364
42756 -833364 -419594 38679 22358 -371953 -546260 -273822 -11023 -203295 -692834 -1049333
42746 -1049333 -1147892 -1134398 -1096290 -1088737 -1268953 -1655105 -1903374 -1680280 -1160821 -806397
42736 -806397 -713541 -558209 -174708 214352 427167 593563 820985 920060 712428 371967
42726 371967 186788 145085 33119 -158105 -209303 -40369 145595 141221 -12871 -127079
42716 -127079 -100957 16270 146736 287660 470640 640886 658565 496270 353442 391231
42706 391231 376371 -131883 -1118633 -1908366 -1879467 -1214562 -646244 -558107 -662234 -538750
42696 -538750 -143355 304967 638238 786870 737057 609745 620090 803767 912924 720190
42686G20190m12374l75195k01635m3258O9243Q4694p3686k84508k66268K5873
42676g56924K63989J63348j44262l08913j87288P8693K77165K74094O5088j68142
42666d43152j56473J38908L86536K36561k21015n12120l10330J99002N24809L88352
42656B31078L645j68197N3896L59231L43872K7819k24357k53860k74881m13425
42646c15179m20027q4497L25325L73727N8571k36546l04761k76672k47255j22496
42636a249810Q8482J72560M7450q3126o6077k9967r1968q4143J71274M96816N58784
42625f9725L27719O7137o8493j37848j35113P5722M52922O61204M44799k3530
42615A594794l35893l18122j54783p8556r2189n6324M5443N3093j39115l93976
$$ plain form
42686 720190 307816 -67379 -269014 -312272 -243029 -158335 -232021 -516529 -782797 -756924
42676 -756924 -492935 -329587 -473849 -782762 -970050 -891357 -614192 -340098 -275010 -443152
42666 -443152 -599625 -460717 -74181 162380 -58635 -570755 -881085 -682083 -157274 231078
42656 231078 234723 66526 120422 479653 823525 851344 626987 373127 98246 -315179
42646 -315179 -735206 -819703 -494378 -120651 -62080 -298626 -603387 -880059 -1127314 -1249810
42636 -1249810 -1161328 -988768 -941318 -1024444 -1090521 -1120488 -1212456 -1296599 -1125325 -628509 -69725
42625 -69725 257994 325131 256638 118790 -16323 59399 512321 1173525 1618324 1594794
42615 1594794 1258901 940779 785996 707440 615251 558927 604370 657463 518348 124372
42605A24372m70293l17502j11050J0356R0489J83313K13556J44712J23814K55685
42595B47452L58050J97115j10929k29606j06571j6481o5771k8129J89213K88895
42585G23238M5057k89194l55698k26338j94091k12829J7991M65754O89440M23143
42575A086473q8378m32448m65264l35367k65163l43135l89989j12943M12337O11030
42565c22847J34174m68480l60928L50616O87711K22055l23704k45292J08451O1559
42555a56685k35488j68955K02458K53254j01032k54629O2620L76512K93765P5245
42545C47065P2985J34456m5111l58692m60538k65298L0282K50902L36100K75133
42535C17284J22243l6606k03779l97646m62544k18089J81470L65608K79528K27921
$$ plain form
42605 124372 -345921 -663423 -774473 -764117 -673628 -490315 -276759 -132047 -8233 247452
42595 247452 605502 802617 691688 462082 355511 339030 273259 245130 434343 723238
42585 723238 768295 479101 123403 -102935 -297026 -509855 -491864 -26110 663330 1086473
42575 1086473 998095 565647 100383 -234984 -500147 -843282 -1233271 -1346214 -933877 -322847
42565 -322847 -188673 -657153 -1018081 -667465 20246 242301 -81403 -326695 -218244 -156685
42555 -156685 -392173 -561128 -358670 -105416 -206448 -461077 -398457 -21945 271820 347065
42545 347065 420050 554506 509395 150703 -309835 -575133 -544851 -293949 42151 317284
42535 317284 439527 402921 199142 -198504 -661048 -879137 -697667 -332059 -52531 175390
42525A75390L06349K28330j10730l57385k57822o9884r3431j82608j01790k301
42515d65882j05942k19724m3028K76729L73346K57357K09186K42899J66723M6505
42505G38169R5375J83293j6223m11502n46744l08160p6533q7845j17447N2024
42495d95593K67187K94584J51158q623p6457J1594J96053K10640j01853m21327
42485B7363k99040J45466L56228J91664Q4733K45242L16842O8197j75626j39896
42475H21173q2877k47999l48240j05623J47076q965l14141k30211J54991K90558
42465G5742P9214m0765J08687K12749R3679r429O2946J12011j5174j53331j41337
42454C84992p8238q6477j07094o8560n299P6265J88716J91463m9444l06219j95568
$$ plain form
42525 175390 481739 710069 599339 241954 -15868 -85752 -179183 -361791 -463581 -465882
42515 -465882 -571824 -791548 -834576 -557847 -184501 72856 282042 524941 691664 738169
42505 738169 833544 1016837 1000614 589112 42368 -265792 -342325 -430170 -547617 -495593
42495 -495593 -228406 66178 217336 208713 132256 143850 339903 550543 448690 27363
42485 27363 -271677 -126211 230017 421681 506414 751656 1068498 1136695 961069 821173
42475 821173 738296 490297 142057 36434 183510 174545 -139596 -369807 -214816 75742
42465 75742 154956 114191 222878 435627 529306 519877 582823 694834 679660 526329 384992
42454 384992 306754 220277 113183 44623 39324 115589 304305 495768 446324 140105 -55463
42443e5463J87020K99642k1026k61451l8678K72247J42727k54463l21233M6719
42433c959L50529K40676q2907k58083j79015M4724K63084L41320K41002Q1892
42423A039263k0129j21251k85351l74940k62826j25771j82897k34542R6012O53173
42413A80741P83380K44378l79719m53649j00912J11588l487j57398j23762L6113
42403A37273J94796K54383R8259k21924l46065k5465L95333L52215j04068l41248
42393C93489q4360K15926J54173l2953J497O9806j52346m34282l07059J06788
42383f9321K11719j29882l82369j65651K28489L52683J93325o046j36840j65670
42373f9563n041K55889K65761j18898m97977l98496Q5950M56927M76117L29420
$$ plain form
42443 -55463 131557 431199 410173 148722 110044 382291 525018 270555 -50678 -3959
42433 -3959 346570 587246 504339 246256 67241 111965 375049 716369 957371 1039263
42423 1039263 1019134 897883 612532 237592 -25234 -151005 -333902 -568444 -472432 180741
42413 180741 964121 1208499 828780 375131 274219 385807 382320 224922 101160 137273
42403 137273 332069 586452 684711 462787 116722 91257 486590 838805 734737 393489
42393 393489 309129 525055 679228 646275 647772 717578 565232 130950 -176109 -69321
42383 -69321 142398 12516 -369853 -535504 -307015 45668 238993 232947 96107 -69563
42373 -69563 -74604 181285 447046 328148 -169829 -568325 -482375 -25448 450669 780089
42363G80089K25112J80054J70689J75489P4496k04259m53697l96077j07097P9841
42353E24640Q1042J11751J98254O5827l35775o01431m27646p9552O790j59456
42343f15556k38856j08516O2846J81312L12928M22602L43593N1431k65812m38343
42333b92371m16434j63704K90268O66791N99338J01565l50253l51221j5831K44024
42323C12172K28583P5203l755O7334K13971K76055J42624q0000j30234O4812K35187
42312A401952J28061j06443j39087O851k6848l48080n89470m41152j23532n0043
42302b87791k05457k12279L4566J74958n7364l79955l07629J90555O35532O21259
42292B06395K44757r7647j76631p4267M3467J37672K55823L86147M36765L47300
$$ plain form
42363 780089 1005201 1185255 1355944 1531433 1605929 1401670 947973 551896 444799 524640
42353 524640 605682 717433 915687 981514 645739 44308 -383338 -462890 -456100 -615556
42343 -615556 -854412 -962928 -900082 -718770 -405842 16760 360353 411784 145972 -292371
42333 -292371 -708805 -872509 -582241 84550 683888 785453 435200 83979 68148 312172
42323 312172 540755 615958 612203 679537 893508 1169563 1312187 1232187 1101953 1166765 1401952
42312 1401952 1530013 1423570 1284483 1291334 1264486 916406 326936 -114216 -237748 -287791
42302 -287791 -493248 -705527 -670961 -496003 -553367 -933322 -1240951 -1050396 -414864 206395
42292 206395 451152 353505 176874 102607 146074 283746 539569 925716 1362481 1709781
42282A709781J71973L6145J7874O8690N3612j01365k92795l25713j61847j8837
42272A157518j20312l79152m70546k42643R2831K45385J75458L4477q0003j48194
42262B64819j21966L287Q2293J115q7546M0970K76736K61395p3580l70925l65576
42251h8978k18482j48655o1577J64925L17977J70704m1727O3408L34272K42111
42241G33978k61907n95331m09215q1958n8590j65405n199L28519M46986L41931
42231B73809L12686L41092J28814k41935k99025K0448J56084j96305n32845l10125
42221c47302J80472K80243N373m3683K98473N23577L09327k3037j39098k13461
42211H30884m66829o42194l99385P4138L09265K11833L9476j13386l39954n18573
$$ plain form
42282 1709781 1881754 1917899 1935773 2004463 2058075 1956710 1663915 1338202 1176355 1157518
42272 1157518 1037206 658054 187508 -55135 37696 283081 458539 493016 413013 264819
42262 264819 142853 146140 228433 229548 142002 182972 459708 721103 647523 276598 -88978
42251 -88978 -307460 -456115 -517692 -352767 -34790 135914 94187 157595 491867 733978
42241 733978 472071 -123260 -532475 -614433 -673023 -838428 -843627 -515108 -68122 273809
42231 273809 586495 927587 1056401 814466 515441 535889 691973 495668 -37177 -347302
42221 -347302 -166830 113413 118786 75103 373576 897153 1206480 1183443 1044345 830884
42211 830884 364055 -278139 -677524 -603386 -294121 -82288 -42812 -156198 -496152 -1014725
42201a014725l77923L790K02206M5336j63135j27019Q2366K74966M15645M86369
42191a72124L78098J10825q8269r5460m4896l9582R798J01615K7667k27379k95748
42180c35455N2433M71273M77808J15793j79915j98573n8143J36076L15966K52431
42170A049694k06599p28443p66128k71152K52751M38150L95184L11299J48888
42161F23644j04351k71296k78400k96775l88466l07961J09029O02205P76638N63990
42151A028257K01227q3125j87205j10188J2305j6510k06202l46484l12867k09974
42141b30766j24625K027J28440N1941j99018k36365J24865M69051L27430j04856
42131B08124k41246M4904L11397K50551L7889p8891j14070j31012n6956J01039
$$ plain form
42201 -1014725 -1392648 -1388858 -1186652 -1141316 -1304451 -1431470 -1349104 -1074138 -658493 -172124
42191 -172124 205974 316799 228530 133070 88174 48592 58390 160005 187672 -39707 -335455
42180 -335455 -283022 188251 666059 781852 601937 403364 345221 481297 797263 1049694
42170 1049694 843095 114652 -651476 -922628 -669877 -231727 163457 474756 623644
42161 623644 519293 247997 -30403 -327178 -715644 -1023605 -914576 -312371 464267 1028257
42151 1028257 1229484 1146359 959154 848966 861271 844761 638559 292075 -20792 -230766
42141 -230766 -355391 -353364 -224924 -172983 -372001 -608366 -483501 -14450 312980 208124
42131 208124 -33122 11782 323179 573730 611619 532728 418658 287646 230690 331729
42121C31729J39832l5595k12350j74754k8653j3181j26567j60595l4873J11254
42111b03753J49373J11864P5023K1696r7554k25435k21392n3417J03878O0451
42101b79266j07426r8204K18211N59787N27709Q7355l92939n66437m27482k00684
42091f79376o6423o1940j37912k05454j64579K6855K88785M48757L72776J00799
42081g7712j57335k14574j00770j291m055j6539L4648O1187l5244j79407k10845
42070i01937q7411R5044K18513K06062O5899n4576J5784K21241L05859J87091
42060B71569Q0162R6806P729l13808m99952j76588L47475M17740M871k45488j8513
42049b7997K15422J0243l35812k91277P4612K67109J35288l8017j02490k07013
$$ plain form
42121 331729 471561 435966 223616 48862 20209 7028 -119539 -280134 -315007 -203753
42111 -203753 -54380 57484 132507 154203 56649 -168786 -390178 -443595 -339717 -279266
42101 -279266 -386692 -484896 -266685 293102 820811 908166 515227 -51210 -478692 -679376
42091 -679376 -745799 -807739 -945651 -1151105 -1315684 -1288829 -1000044 -551287 -178511 -77712
42081 -77712 -235047 -449621 -550391 -551682 -555737 -572276 -537628 -476441 -511685 -691092 -901937
42070 -901937 -989348 -894304 -675791 -469729 -403830 -458406 -442622 -221381 84478 271569
42060 271569 351731 448537 456266 142458 -357494 -534082 -186607 231133 236004 -9484 -27997
42049 -27997 187425 197668 -138144 -429421 -354809 -87700 47588 9571 -92919 -299932
42039b99932l85734m05440j44573J87536L43767L17156K12137N8236j03012j27545
42029c47404N0154K48223K25679j474j82822j69248q6633j21333k40073k37987
42019h62918l3751K14237L29817L41220L73857M01063K69060k5050k44173j81723
42009E81639P3483K27618R6565k12570m02328k65797P7036K45963K194m31462
41999g659n84723k84758J58958L44120J89601r3914k74784k44795m0270J69261
41989f68963K25193J82532K21246K98695J30417l24662o15027l28698K75166N16604
41979h7497J57636l08795l13601J04190M25069L09603m8144k05697R677L36792
41969C79233M25000K50670P9104N7747M9579p6029k13286k31662k22694l21134
$$ plain form
42039 -299932 -685666 -1091106 -1235679 -1048143 -704376 -387220 -175083 -116847 -219859 -347404
42029 -347404 -297250 -49027 176652 175178 -7644 -176892 -263525 -384858 -624931 -862918
42019 -862918 -896669 -682432 -352615 -11395 362462 763525 1032585 1007535 763362 581639
42009 581639 655122 882740 979305 766735 364407 98610 175646 421609 423803 -7659
41999 -7659 -592382 -877140 -718182 -374062 -184461 -278375 -553159 -797954 -838224 -668963
41989 -668963 -443770 -261238 -39992 258703 389120 64458 -550569 -879267 -604101 -87497
41979 -87497 70139 -238656 -552257 -448067 -22998 286605 238461 32764 42441 379233
41969 379233 804233 1054903 1134007 1191754 1241333 1165304 952018 720356 497662 176528
41959A76528m23214l29671q2655Q6080R7036Q3937J38006K00260J93970Q8523
41949B28800j21908l27851k87696O8527M15699L95203J20825J176J18978J70947
41939G82700K0402j15695j02803q2783j03552P112K02827J03866l78178p08410
41929c74514m18347J85775M41618K31319Q666O6131K28385K38663O3949j90096
41919D81549l64860k80357L5402K23840J8336l03466k65297Q5324K49511O2944
41909e7074r7539N716J07812n974o7361J83250M43274K45722l00230o21634m47725
41898f11763m9691K72769N36266P91115Q37151M75846j09001m75418m26208k14661
41888A026405j86415l47815m31439l21817j88718j44185k9062K58583M48755K42820
$$ plain form
41959 176528 -246686 -576357 -659012 -572932 -475896 -391959 -253953 -53693 140277 228800
41949 228800 106892 -220959 -508655 -440128 -24429 370774 491599 492775 611753 782700
41939 782700 803102 687407 584604 501821 398269 405381 608208 712074 333896 -374514
41929 -374514 -792861 -607086 -165468 65851 74517 140648 369033 607696 671645 481549
41919 481549 116689 -163668 -128266 95574 113910 -189556 -454853 -369529 -120018 -57074
41909 -57074 -154613 -148897 -41085 -47059 -114420 68830 512104 757826 457596 -164038 -611763
41898 -611763 -661454 -388685 147581 938696 1775847 2251693 2142692 1667274 1241066 1026405
41888 1026405 839990 492175 60736 -261081 -449799 -593984 -623046 -364463 84292 327112
41878C27112j60425k82039o9013O3446m8052m7792K84568N84255M44420L4060
41868A130540k17885k52101k69964k51322n3406J82791K01102Q6952R3955J28292
41858G78954q6513m05428l87365l5426J66415M0161n2109Q0740J23320r7841k16677
41847i1769K9461K73882J17954j71014j04588K07675K73648N0534l5625J70341
41837G20499L39880K14007q0522l18609m02133k62905J01334M46218M60193J73659
41827A391621q8365j58543j37492r1507R52J0657k37954n82187o35325l50051
41817h78194o6165P2887K83443N78461N58141O0281m27772m00716m3525J01602
41807a61557q8146k96965l27641k39103n0678K56443M83049L54550n0835l33719
$$ plain form
41878 327112 166687 -115352 -184365 -120919 -168971 -216763 67805 652060 1096480 1130540
41868 1130540 912655 660554 390590 139268 85862 268653 469755 556707 650662 778954
41858 778954 692441 287013 -100352 -135778 30637 70798 18689 99429 222749 124908 -91769
41847 -91769 -62308 211574 329528 158514 53926 261601 535249 585783 550158 720499
41837 720499 1060379 1274386 1193864 875255 473122 210217 311551 757769 1217962 1391621
41827 1391621 1303256 1144713 1007221 915714 916666 927323 689369 107182 -528143 -878194
41817 -878194 -944359 -871472 -588029 -9568 548573 608854 181082 -219634 -263159 -161557
41807 -161557 -249703 -546668 -874309 -1113412 -1164090 -907647 -424598 -70048 -120883 -454602
41797d54602k67222K616K48207L78819L59941J94973K9159K2603Q5986p642k24053
41786C68785k73880q6606L8375r5842k58303j68812M2771O4823n8970J3019L30959
41775h3681M79755J54837l40407m39465n8607K90518J81855j90994l36030j30210
41765d72429J08894J41886O9913K6364o2211k23915k28654Q2313M26833L78732
41755B47726k4062k94861j53980J20697J06838k18963n00791m39602p8777K87264
41745i48511M07311K97462J87242K22959K87152J95376j4908j47404j37117q1793
41735B67769j7056J06896K14195J29396j11510k29844j06589K8423j7977o5965
41725A97738J28600M01917L48444q4695m81298m91950k39293p9300j45655k79499
$$ plain form
41797 -454602 -721824 -719208 -471001 -92182 267759 462732 491891 514494 600480 592838 368785
41786 368785 94905 8299 46674 -49168 -307471 -476283 -433512 -368689 -427659 -414640 -83681
41775 -83681 396074 550911 210504 -228961 -287568 2950 184805 -6189 -342219 -472429
41765 -472429 -363535 -221649 -151736 -125372 -187583 -411498 -640152 -557839 -131006 247726
41755 247726 223664 -71197 -225177 -104480 2358 -216605 -717396 -1156998 -1235775 -948511
41745 -948511 -541200 -243738 -56496 166463 453615 648991 634083 486679 349562 267769
41735 267769 250713 357609 571804 701200 589690 359846 253257 281680 263703 197738
41725 197738 326338 728255 1076699 992004 510706 18756 -220537 -299837 -445492 -724991
41715g24991k99714j86886l1400Q4443J43250J94020K99387M43817N10001L90873
41705H22800J15694j69777l26151k85555n1419K61081M07805J97012k48980n45506
41695A77004m57651j49881P7950J54030J61161O0942k15609m76944m21432j06033
41685a196463Q3937J5602r407J97241L74976K79714J09145J17518J47964j3364
41675A06863j11655K00403O45474N91815l799n20400n78005m22740k97810n9870
41665d49724L19918M56542J48395j80342p2809K71175L38286O1651k02025k53821
41655D37246j88054q5272M5257J11741M9612k0205r683o0208k26833k13389J76215
41644A6427N52991M09110q9306l30190j85814j01393k48452k58965L1280K20781
$$ plain form
41715 -724991 -1024705 -1211591 -1242991 -1158548 -1015298 -821278 -521891 -78074 431927 822800
41705 822800 938494 768717 442566 157011 105592 366673 774478 971490 722510 177004
41695 177004 -280647 -430528 -352578 -198548 -37387 23555 -192054 -668998 -1090430 -1196463
41685 -1196463 -1112526 -1096924 -1106331 -909090 -534114 -254400 -145255 -27737 120227 106863
41675 106863 -4792 195611 841085 1432900 1429101 908701 330696 -92044 -389854 -449724
41665 -449724 -129806 326736 475131 294789 221980 493155 831441 893092 691067 437246
41655 437246 249192 163920 209177 320918 370530 350325 340642 280434 53601 -159788 16427
41644 16427 569418 978528 889222 559032 373218 271825 23373 -235592 -204312 16469
41634A6469L7198j64281q207K54999J89890q9570j51826K2543Q5601k5891k3659
41623A43266J48408J69832r8588l34357k30262O1006J84167O2669r8284j35643
41613a27786m2102J45158L61463M56507L02972j0393k19097j65851K2284P7910
41603H01065j15616l93774m58774j70234K85519N33376L58636p8277l98696l66820
41593c595p1968K12408K83898J38343o5285j33529n845J63009J59240m229n7848
41582F14599J70600M67256M59979R6660k86817l92739k75296j66950j60857j80146
41572C46289j42256k3294J73624M03838N66902N69998L78181P102m35326p09993
41562A135065o25100l02123p4798n2048q510J78525K70062P0277j76309j24574
$$ plain form
41634 16469 53667 -110614 -118821 136178 326068 236498 84672 107215 192816 166925 143266
41623 143266 291674 461506 362918 28561 -201701 -140695 43472 106141 7857 -127786
41613 -127786 -169888 -24730 336733 793240 1096212 1085819 866722 700871 723155 801065
41603 801065 685449 291675 -167099 -337333 -51814 481562 840198 761921 363225 -3595
41593 -3595 -75563 136845 420743 559086 493801 360272 354427 517436 676676 672447 614599
41582 614599 785199 1252455 1712434 1809094 1522277 1129538 854242 687292 526435 346289
41572 346289 204033 180739 354363 758201 1325103 1895101 2273282 2280384 1845058 1135065
41562 1135065 509965 207842 133044 80996 72486 251011 521073 591350 415041 290467
41552B90467J22095J80559j2184j71389j78878j95742k46570j31737J43919K67352
41542F7892J03282q8294j04068r5509j82651j45298J71385M59676L58320L2556
41532E77291q2671L3686K5589j72672j91568J50087M88766M02163j8385l20971
41522H91315k65889k4915J30543J49146J62686K24376J88506r4515n11004p46672
41512A03577o54019m09999k23300o1929J67612L50865L31879K25238K50781L21457
41502D02162J56010j83517k68626M3993L16673J40869k59130l62553q4619J99489
41492A00751K55914K26683K54084K32650N3825j73510k97509l16673k54069k6140
41482E6006L73044O86903O12454J66846l15120n25432m15204j49980K2642p6689
$$ plain form
41552 290467 412562 593121 580937 409548 230670 34928 -211642 -343379 -199460 67892
41542 67892 171174 82880 -21188 -116697 -299348 -444646 -273261 186415 544735 577291
41532 577291 494620 528306 553895 381223 189655 339742 828508 1230671 1212286 891315
41522 891315 625426 600511 731054 880200 1042886 1267262 1455768 1361253 850249 103577
41512 103577 -550442 -960441 -1183741 -1245670 -1078058 -727193 -395314 -170076 80705 402162
41502 402162 558172 374655 106029 150022 466695 607564 348434 -14119 -98738 100751
41492 100751 356665 583348 837432 1070082 1123907 950397 652888 336215 82146 56006
41482 56006 429050 1115953 1728407 1895253 1580133 1054701 639497 489517 512159 435470
41472D35470l61286m68708j56392L04322L83967j294l29526j76424J97670K51672
41462G9471l8180j80046O0453L00819J16891l30071n17045k62018Q5642J51065
41452e33019q334n3084J67546M47519N12931L51619J76464J19245Q2289q3081
41442A180095l57105n75513n96285l83678k0554K85063L25144J47670O6418K53058
41432C24313M57220L68593J23788J01857K67664J64534l32122p03159m98853o995
41422B66840J61749q1575k86224j70867O1200J21906Q442j06170j06734J8781
41412a12652J93684K75835K12487J49681K11546K29801m6871m84776o18968k66630
41402b56863J90837K92490M5970j82773j54887N4172K35594K41742P3771r1658
$$ plain form
41472 435470 74184 -394524 -550916 -246594 137373 136079 -193447 -369871 -172201 79471
41462 79471 41291 -138755 -78302 222517 339408 9337 -507708 -769726 -684084 -533019
41452 -533019 -541353 -594437 -426891 20628 533559 885178 1061642 1180887 1263176 1180095
41442 1180095 822990 247477 -348808 -732486 -753040 -467977 -142833 4837 71255 324313
41432 324313 781533 1150126 1273914 1375771 1643435 1807969 1475847 772688 273835 266840
41422 266840 428589 347014 60790 -110077 -48877 73029 81471 -24699 -131433 -112652
41412 -112652 81032 356867 569354 719035 930581 1160382 1113511 628735 9767 -256863
41402 -256863 -66026 226464 272434 89661 -65226 -11054 224540 466282 540053 448395
41392D48395l6041K28795M11920K87548p976j70327j35805j12694k31683l52088
41382C30044k64456M0241L70796N33155M70381K47572l6133k92633m20140l12158
41372F66669J2944L09306K77307q2222m01322l57044p6338K7823j97023m42278
41362b62178l55406j3290J78962K7780j84116o8610L31424N56229L11771j35450
41352C87116k93794o7267J84374J91911J11756J88333L12688J73831k41111n66537
41342C81300n01387j22082L00036N89395O67048M57725N365m12738n17288l69967
41332D77407k83331l58208l35841k3380L53223M43384K71202J47936J45895J3027
41322H51314l16525m87571k20013K38240M50215L78954K95866K54302Q0733j54971
$$ plain form
41392 448395 412354 641149 1053069 1340617 1332641 1162314 1026509 913815 682132 330044
41382 330044 65588 105829 476625 1009780 1480161 1727733 1691600 1398967 978827 666669
41372 666669 679613 988919 1266226 1184004 782682 425638 349300 377123 180100 -262178
41362 -262178 -617584 -630874 -451912 -424132 -608248 -676858 -345434 210795 522566 387116
41352 387116 93322 26055 210429 402340 514096 702429 1015117 1188948 947837 381300
41342 381300 -120087 -242169 57867 647262 1314310 1772035 1777400 1364662 847374 477407
41332 477407 194076 -164132 -499973 -523353 -170130 273254 544456 692392 838287 851314
41322 851314 534789 47218 -172795 65445 515660 894614 1190480 1444782 1525515 1370544
41312A370544j39288J15209J62472j87275m84611k90215J27621J88830j17645
41303G45642k55622J3296L08820K49575l5250k02755j83067j43570j91179l17825
41293a1935m74709n32785l38298L0785K45782J46357j0850N9363K29974K00380
41283d55936J6253j8146J17983J07570j68006m06084l27602m0959J97824L21552
41273f55551L67322K98583J24901j101j9266j01755l31334m48233k14483J37896
41263h43021J77143j03559k99341j98529K30J02594J73284K71716K71957J08451
41253c39075o6986j27029j27550r5406P1845L30432L94825J40349j42799j46130
41243a07524K2640O9485j7128k9397P2888J43485J18547L0740j39866l52721l63181
$$ plain form
41312 1370544 1231256 1346465 1508937 1321662 837051 546836 674457 863287 745642
41303 745642 490020 503316 812136 1061711 1026461 823706 640639 497069 305890 -11935
41293 -11935 -486644 -1019429 -1357727 -1326942 -1081160 -934803 -945653 -886290 -656316 -455936
41283 -455936 -439683 -457829 -339846 -232276 -400282 -806366 -1133968 -1174927 -977103 -655551
41273 -655551 -288229 10354 135255 134154 114888 13133 -318201 -766434 -980917 -843021
41263 -843021 -665878 -769437 -1068778 -1267307 -1267077 -1164483 -991199 -719483 -447526 -339075
41253 -339075 -406061 -533090 -660640 -756046 -684201 -353769 41056 181405 38606 -107524
41243 -107524 -84884 -15399 -32527 -61924 10964 154449 272996 303736 163870 -188851 -552032
41232e52032j2030M25815N21141K73885P8952J33986K35296J79095Q254k00985
41222A091377m54683o46030n62129k14842J00120J83355J23214L5926r3630k13703
41212f51025j58211O0608J99839J74008K04207M13307N72511M61522K07917M0805
41202A525488m0230j16221j16866M369Q0957k2775j71655j96601j64277j85262
41192E96927j92343j50850k12045l72962k99353J44081N03013L35524p3186j43098
41182A35708Q0091P5953k11605l10244j11871p6364l55492m36785j9856L81785
41172h48680K12124k34180k61904J95870N81966N76127L83913K05869m0841l51990
41162D18274m27286q2857L78639M74208J27809k48933k61094L3045K60550K12153
$$ plain form
41232 -552032 -564062 -138247 382894 656779 735731 869717 1105013 1284108 1292362 1091377
41222 1091377 636694 -9336 -571465 -786307 -686187 -502832 -379618 -343692 -437322 -651025
41212 -651025 -809236 -748628 -548789 -374781 -170574 242733 815244 1276766 1484683 1525488
41202 1525488 1485258 1369037 1252171 1256540 1337497 1314722 1143067 946466 782189 596927
41192 596927 404584 253734 41689 -331273 -630626 -486545 16468 351992 278806 135708
41182 135708 215799 291752 80147 -230097 -341968 -418332 -773824 -1210609 -1230465 -848680
41172 -848680 -636556 -870736 -1132640 -936770 -354804 221323 605236 811105 770264 418274
41162 418274 -9012 -91869 286770 760978 888787 639854 378760 411805 672355 884508
41152H84508K5326j13387k30789l74215l52074J7997M72244M98448N2956k86025
41142E94989p7027L84660N01494J67059k14722l59339l74173m13400m06475k50564
41132d47498m8595Q860r3677j76794r2333J02543K24058J90759J11940J14554
41122a06183J67908J83120J92998K44606J83369j67806n95998o08550j01368L97925
41112b09979L82767l243k60028k08873m0128J22868L05447M19383L20786J19490
41102I48490O8374J32138K8735k58878l99865k55368j17327k12507l16827j44104
41092e27139J57399K38748J03518O1884K04259K79247J31973m5957k4621J34576
41082G13887K13769J43199j570j90641m13679n07387k65133J99227M28536J68860
$$ plain form
41152 884508 909834 796447 565658 191443 -160631 -142634 329610 828058 881014 594989
41142 594989 517962 902622 1404116 1571175 1356453 997114 622941 209541 -196934 -447498
41132 -447498 -496093 -487233 -580910 -757704 -850037 -747494 -523436 -332677 -220737 -106183
41122 -106183 61725 244845 437843 682449 865818 698012 102014 -506536 -607904 -209979
41112 -209979 172788 169545 -90483 -299356 -339484 -216616 88831 508214 829000 948490
41102 948490 1016864 1149002 1177737 918859 518994 263626 146299 -66208 -383035 -527139
41092 -527139 -369740 -130992 -27474 34410 238669 517916 649889 603932 579311 713887
41082 713887 927656 1070855 1069285 878644 464965 -42422 -307555 -108328 320208 489068
41072D89068k06426j09897M44233P64459L49144m51731q78960o71523k30290K0517
41062d81406Q5941J78386L46166M65954M30063K24024o0801k26168j25068J03288
41052I40379J16523k00127n30056m99502j46973J52495J72516N9223N6628J72635
41042B93741K16741R3948o4614q9066N720P7267Q5130J09971J31328n616k83789
41031E70761l88408j20419K26040K17705p4005j65874R4104L04642J63896q1117
41021G47325j00257k2083j29789k87522j36183K56612M07216R4057l65296n86402
41011a22322n28115l30963o7640J80131K53588J22587j6939j2526M0937J7378
41001d63884K80J08503K26764J48627q7969k42853k25723j81481k01260j63767
$$ plain form
41072 489068 282642 172745 616978 1381437 1730581 1278850 399890 -271633 -501923 -481406
41062 -481406 -395465 -217079 129087 595041 1025104 1249128 1188327 962159 837091 940379
41052 940379 1056902 856775 326719 -172783 -319756 -167261 5255 64478 121106 293741
41042 293741 510482 604430 539816 450750 456470 533737 618867 728838 860166 854550 570761
41031 570761 182353 61934 287974 505679 431674 265800 359904 664546 828442 747325
41021 747325 647068 624985 495196 207674 71491 328103 735319 829376 464080 -122322
41011 -122322 -650437 -981400 -1049040 -868909 -615321 -492734 -509673 -522199 -481262 -463884
41001 -463884 -463604 -355101 -128337 20290 -67679 -310532 -536255 -717736 -918996 -1082763
40991a082763M0205K83500L45488K11177R3474J51087K84359K80461J24633N3006
40981G84627K23603M24748K91348j71633m95949l19802J22584L04648Q6962j97001
40971A054135k95990l24423l97807l53792q6750J35763N1320r8573J11030N43153
40961C38066N75470J9327n18578m42359P1143M64064N99889O91439O59701J84333
40951B642495n89711r87934o71556j11204J03445M6421J49690L92766L13111k26831
40941A060692p62474q44981n84034l66953k83534j08648K37992M97498M13383
40932g41059J00765p3552O2646L05355L75589K62307J45401R0805L0083N10J36179
40921F95029L57143L41898k5112m03945m13495j16773J46275K44979K83429K65230
$$ plain form
40991 -1082763 -1042558 -759058 -413570 -202393 -108919 42168 326527 606988 731621 784627
40981 784627 1008230 1432978 1724326 1552693 1056744 736942 859526 1164174 1251136 1054135
40971 1054135 758145 433722 35915 -317877 -404627 -268864 -217544 -316117 -205087 338066
40961 338066 913536 932863 414285 -28074 43069 507133 1107022 1798461 2458162 2642495
40951 2642495 2052784 1064850 393294 282090 385535 431956 581646 974412 1287523 1060692
40941 1060692 298218 -546763 -1130797 -1497750 -1781284 -1889932 -1651940 -1154442 -741059
40932 -741059 -640294 -713846 -651200 -345845 29744 292051 437452 528257 558340 558850 695029
40921 695029 1052172 1394070 1368958 965013 551518 434745 581020 825999 1109428 1374658
40911A374658Q5606j74677k92514k64491l01271m12272l38775j3073K45544J69155
40901G7890j00870k79550l02754k26668k9175K31513K95506M7499j90963m4799
40891e22371L58094N46298L46451K9375j52927k28215k64759k01712l4997Q0293
40881d4470M7095l3622l9768J1234M8315L5027p6479k94986m39889k62261J79659
40870h70145M81533L78227P9685m9426L2992J11051J12648J62912K68850K29972
40860I38299m9417l46775l56226n8015K59217L28694J74016J7862j9133l4047
40850H54475j37772k52965k34501j19445p6072j05805l446L02406N53308M58717
40840A238900Q0065k41689k89927j70398j27782k66775m55493m62337k16905O1620
$$ plain form
40911 1374658 1460264 1285587 993073 728582 427311 15039 -323736 -336809 -91265 77890
40901 77890 -22980 -302530 -605284 -831952 -861127 -629614 -334108 -286609 -477572 -522371
40891 -522371 -164277 382021 728472 757847 604920 376705 111946 -89766 -124763 -44470
40881 -44470 2625 -30997 -70765 -59531 -11216 23811 -52668 -347654 -787543 -1049804 -870145
40870 -870145 -388612 -10385 69300 19874 52866 163917 276565 439477 708327 938299
40860 938299 888882 542107 185881 127866 387083 715777 889793 907655 888522 854475
40850 854475 716703 463738 229237 109792 33720 -72085 -75531 226875 780183 1238900
40840 1238900 1318965 1077276 787349 616951 489169 222394 -233099 -695436 -912341 -850721
40830h50721Q9824j11290k22362n7793J94146K82940K48132K62781L01542K37124
40820C74323J49825K15584L22991J58320k58580m67481j83589K44170K59802j54868
40810F60497m54788k50760J97295L37758M2925k46034j31245J81834J61460k74315
40800B24627n81571l21917K27547M74201L03765R9578Q1996O4207j12293l15659
40790A44481m04012l96665k41609J93265P11007P84703K60486l09946l97456k07510
40780A36744k24173l68347k00030K28356L94102J73551K8482J87836K74263K1169
40770F51953k11316m8624K31142J47150j93644l07743j38819p0932j97605j59548
40760b97986J81619M19995K00526k38364m16534k56471o8596m0496m2171R4647
$$ plain form
40830 -850721 -760897 -872187 -1094549 -1152342 -958196 -675256 -427124 -164343 137199 374323
40820 374323 524148 739732 1062723 1221043 962463 494982 311393 555563 815365 660497
40810 660497 205709 -45051 152244 490002 532927 286893 155648 337482 498942 224627
40800 224627 -356944 -678861 -451314 22887 326652 426230 508226 572433 460140 144481
40790 144481 -259531 -656196 -897805 -704540 6467 791170 1051656 741710 344254 136744
40780 136744 -87429 -455776 -655806 -427450 -33348 140203 168685 356521 630784 651953
40770 651953 440637 392013 623155 770305 576661 268918 130099 59167 -138438 -297986
40760 -297986 -116367 303628 504154 265790 -150744 -407215 -475811 -516307 -558478 -463831
40750d63831L38367N24533N14159K71876r8530l83685m18220k34310p720J25272
40740A67911J42699O9434p2725k41008l54339l14638n3763L71591P09265O60542
40730A084969K10142k81682m51050l20944j72882j25886p4911K486j6875j09039
40720b55672o4772J16644J10135k19089m67872k20152K73845L81472j3334l59510
40710g18305k53838M7348J29940L6690N7028J82506J60752m0993j94319j92999
40700g86190j52405j13070M6138L14739M36239K38932r3253k35705j01775J24159
40690c22191K53008K59176K14758J71197J32094Q8198L6549m1735j90870m05618
40680A94566n45636m34101j08793J42236J19982j9927j6288Q8773N1978j09952
$$ plain form
40750 -463831 -125464 399069 913228 1185104 1086574 702889 284669 50359 42639 167911
40740 167911 310610 380044 307319 66311 -288028 -602666 -656429 -284838 424427 1084969
40730 1084969 1295111 1013429 562379 241435 68553 -57333 -132244 -129758 -146633 -255672
40720 -255672 -320444 -203800 -93665 -312754 -780626 -1000778 -726933 -345461 -358795 -718305
40710 -718305 -972143 -924795 -794855 -758165 -701137 -518631 -357879 -398872 -593191 -786190
40700 -786190 -938595 -1051665 -1005527 -690788 -254549 -15617 -108870 -344575 -446350 -322191
40690 -322191 -69183 189993 404751 575948 708042 796240 832789 791054 600184 194566
40680 194566 -351070 -785171 -893964 -751728 -631746 -651673 -667961 -579188 -527210 -637162
40670f37162j06715J05388J58177j52694m42059k37794K80046M61179P2123m02826
40660i02337m38642r3528K33314L77905M55558M97971L89522J59620M3098J44878
40650H67359K51553J23136j67814l54693l40163k48676j61466k6753J31225J48611
40640B22319q191j10954J597J27690r291k85711l09127n025K72449K86705K21664
40629D04125K68478K51514l5971l74642l68363k2808K81455L29623K43160J43232
40619A119803Q709j00368l9741J12662R0413j10250j75074l0723o0066m71177
40609C44188q16104n59661J14801N38651M64429K49210J67490O1561k00333l79325
40599a5093k33605Q6648K74645K69299J84205L7942j80585l21166k18905L2032
$$ plain form
40670 -637162 -743877 -638489 -480312 -633006 -1075065 -1312859 -1032813 -571634 -499511 -902337
40660 -902337 -1340979 -1434507 -1201193 -823288 -367730 130241 519763 679383 722481 867359
40650 867359 1118912 1242048 1074234 719541 379378 130702 -30764 -57517 73708 222319
40640 222319 214128 103174 104771 232461 223170 -62541 -371668 -376693 -104244 182461 404125
40629 404125 672603 924117 888146 513504 145141 122333 403788 733411 976571 1119803
40619 1119803 1128512 1028144 988403 1101065 1191478 1081228 906154 875431 815365 344188
40609 344188 -471916 -1031577 -916776 -378125 86304 335514 503004 564565 364232 -15093
40599 -15093 -248698 -162050 112595 381894 566099 604041 423456 102290 -116615 -84583
40589h4583J71559J01696n1142j46707j38097l1495Q7248M5879k07031m33017
40579f85690l38569L9342L64885M02950K06804o2027k81235l35222j77498K1097
40569h45163Q633j91145k75295j04308Q3788M4967j02386q5664J05082K45111
40559a116380K34087J96215K38447L00932K78672J62051J9550q1356j13789r2102
40549B6327l7591M9001J35237J16253m3775j50804K4237L44463L73479p415l30084
40538D99328j52937K90656M14172R6639k34244k83039k06217j88872j29939O9329
40528A74876K44776K27199J07762L2495m0211j60765j94556o4833J1706j60430
40518A78019l54171j86775K71313N16569K84591j15698k54776j11281K1077k2060
$$ plain form
40589 -84583 86976 188672 137530 -9177 -147274 -178769 -91521 -45642 -252673 -685690
40579 -685690 -1024259 -984917 -620032 -217082 -10278 -72305 -353540 -688762 -866260 -845163
40569 -845163 -836530 -1027675 -1302970 -1407278 -1323490 -1278523 -1380909 -1466573 -1361491 -1116380
40559 -1116380 -882293 -686078 -447631 -146699 131973 294024 313574 232218 118429 26327
40549 26327 -11264 37737 172974 289227 245452 94648 118885 463348 836827 829412 499328
40538 499328 346391 637047 1051219 1147858 913614 630575 424358 235486 105547 174876
40528 174876 419652 646851 754613 787108 746897 586132 391576 326743 338449 178019
40518 178019 -176152 -362927 -91614 424955 709546 593848 339072 227791 248868 226808
40508B26808j21473r6218P1527K33603K34419Q0527m5252L977J27428R7842q5808
40497G27380j39200J02378L76136K91810j34027m81341m73323k70003j21730J0904
40487a11016K59320M54800K85581j72575m37633k49736Q3356J61707M4818M6680
40477C65302J89675K30956J27886P1593O3324j16970m21944m48960o9514K37259
40467B28607L1810l90296l92842N7189L26279J8966n01346o64580m14648j11124
40457a811985N6995K23949M76559O44726N59680L28343J95172K12834K05010M7830
40447A139113j56339k34158j47187L4772K38203L40240J62093k71742n67886l65088
40437A72021J09899K44116j12816l88171r9372M34799N61356K04097j50165k31206
$$ plain form
40508 226808 105335 9117 80644 314247 548666 629193 583941 587918 715346 813188 727380
40497 727380 588180 690558 1066694 1358504 1224477 743136 269813 -190 -121920 -111016
40487 -111016 148304 603104 888685 716110 278477 28741 112097 273804 318622 365302
40477 365302 554977 785933 913819 985412 1048736 931766 509822 60862 -8652 228607
40467 228607 260417 -129879 -522721 -465532 -139253 -120287 -621633 -1286213 -1700861 -1811985
40457 -1811985 -1754990 -1531041 -1054482 -409756 149924 478267 673439 886273 1091283 1139113
40447 1139113 982774 748616 601429 636201 874404 1214644 1376737 1104995 537109 172021
40437 172021 281920 526036 413220 25049 -74323 360476 921832 1125929 975764 744558
40427G44558k37438l01431k16924J18947L97163L08507L646j30541J2564K06229
40417I05280K33747O5004k25783n04786n70379k85128K49973P40277R20698P06572
40407B235475K08574l10791n69113m81832k36721o9551K316J26756L22081L72783
40397A599977R8155l34544m90537j37428M19140O13276K71840j73059k51244o1223
40387A554353n2862l09077m25348j74194J00623J908k99377l20319l625J95271
40377B67353j6960l50598l39357N5222M49177N40497L98747K41962J05846j21862
40367A230027l91158m13576k2059N02931O73144L58026r4043l50797m74602o50755
40357C67138p57135m96117J12172O51773P69041N09932J57425p6001j18932J4163
$$ plain form
40427 744558 507120 205689 -11235 107712 504875 813382 817028 686487 699051 905280
40417 905280 1139027 1204031 978248 473462 -96917 -382045 -132072 608205 1528903 2235475
40407 2235475 2444049 2133258 1564145 1082313 845592 776041 778357 905113 1227194 1599977
40397 1599977 1698132 1363588 873051 735623 1154763 1768039 2039879 1866820 1615576 1554353
40387 1554353 1501491 1192414 767066 592872 693495 695403 396026 75707 72082 267353
40377 267353 250393 -100205 -439562 -384340 64837 605334 1004081 1246043 1351889 1230027
40367 1230027 838869 425293 403234 906165 1579309 1937335 1843292 1492495 1017893 367138
40357 367138 -389997 -886114 -773942 -122169 646872 1156804 1314229 1238228 1119296 1133459
40347A133459K09259K85188J73265K1367K1248J60109K29387P8569k02881l81759
40337A727211l41947k18742k29027l66605l71928r8269K01033J59809j51859k43906
40327F5770J18704N27898M64401K4401k28742o4973J55152R0611j07252j47205
40317H98765q8902j41553k01084j2404L04015L47356Q8055m0904J45635K49619
40307A548598k9815k97344k6663N37859O39555J14094l76072l51332j77141l67145
40297A214594o92698n38945P3265M41166K06164j24289M8037N17029N83641P8644
40287A806608m16301m19393j70130j50680l32400l18210o5716M7190p8778k3704
40277a21514M37430Q23054N76381q1262m40254l01981j35229k37256l18604j07467
$$ plain form
40347 1133459 1342718 1627906 1801171 1822538 1843786 2003895 2233282 2311851 2108970 1727211
40337 1727211 1385264 1166522 937495 570890 198962 100693 301726 461535 309676 65770
40327 65770 184474 712372 1176773 1201174 972432 907459 1062611 1153222 1045970 898765
40317 898765 809863 668310 467226 454822 758837 1106193 1194248 1153344 1298979 1548598
40307 1548598 1518783 1221439 1194776 1732635 2372190 2486284 2110212 1758880 1581739 1214594
40297 1214594 521896 -17049 56216 497382 703546 579257 627294 1144323 1727964 1806608
40287 1806608 1390307 970914 800784 650104 317704 -506 -66222 -19032 -97810 -121514
40277 -121514 315916 1138970 1715351 1634089 1193835 891854 756625 519369 200765 93298
40267I3298J44524R2130j38420j93972n3988L3767O909J090J0476r2042k26793
40256c23021j57250R1651J90591q184k10049p0941L29882N95135M96036J88333
40246A122183l7113q8008j05157k20457l64864l64923j90437m729N8467O6582
40236a28456J59842L21927L81597K31076k6873j68882q5689O7842J0207l14236
40226D48355n99531n36793k30332k4023M1189K49052O14317O79821J75606m50467
40216C67194n46796j00505L39440M48442L84013K90317L9796l76983o02412l33389
40206i0883K14717N12613L00645j82088m85400l65958K0905K81167J80441j12979
40196B73180k62140j93331j20039j38086m4714L06332O62641O15209J36940l19523
$$ plain form
40267 93298 237822 329952 191532 -2440 -56428 -22661 -15752 -14662 -4186 -96228 -323021
40256 -323021 -480271 -388620 -198029 -206213 -416262 -487203 -157321 437814 933850 1122183
40246 1122183 1085070 997062 891905 671448 306584 -58339 -248776 -253505 -195038 -128456
40236 -128456 31386 353313 734910 965986 939113 770231 684542 752384 762591 448355
40226 448355 -151176 -687969 -918301 -942324 -901135 -652083 -37766 642055 817661 367194
40216 367194 -179602 -280107 59333 507775 891788 1182105 1221901 844918 242506 -90883
40206 -90883 123834 636447 937092 755004 269604 -96354 -75449 205718 386159 273180
40196 273180 11040 -182291 -302330 -440416 -485130 -178798 483843 1099052 1235992 916469
40186I16469l24646L4306K65739O3995l28560m39578j70222J06797Q0106q9717
40176A14689m5881K40538M44320L21011k4821k82946k10394J77719N45732M65691
40166A745658r0835n77811m41513J87107O40877N43747J84314Q130N0104L4804
40156B284582j82300m69572n98185m31649l1541L26457L40547m082l62771l49057
40146E22429Q8628O10418P70214M00887k07213n52663m20780o8906J43678J54843
40136A441535J00870K7680n6373k4250J51220J73268j89120n89434m59571J20550
40126F96375M25520Q8368l87704l68030P2028L64492K20362j32247l03674r9851
40116E75639L34204N85059L66479o8753j76520J32017L52902J58219j25942j05639
$$ plain form
40186 916469 591823 626129 891868 955863 627303 187725 17503 124300 204406 114689
40176 114689 68808 309346 753666 1074677 1049856 766910 556516 734235 1279967 1745658
40166 1745658 1654823 1077012 635499 822606 1463483 2007230 2191544 2199674 2249778 2284582
40156 2284582 2102282 1632710 1034525 602876 571335 897792 1238339 1234257 871486 522429
40146 522429 611057 1221475 1991689 2392576 2185363 1632700 1211920 1143014 1286692 1441535
40136 1441535 1542405 1570085 1513712 1489462 1640682 1813950 1624830 1035396 575825 696375
40126 696375 1121895 1210263 822559 454529 526557 891049 1111411 979164 675490 575639
40116 575639 909843 1494902 1861381 1792628 1616108 1748125 2101027 2259246 2133304 2027665
40106B027665K8045j32410m87348n73492k75432P5114K41824L00086L24831K51673
40096A780556J01429L0857Q6284J37119R5484K594j20205l11041n28441o32098
40086F42538n35396k81425J1836K03844K04455R1904O5692J84463K68330J65217
40076A021458l0462j43774j41871o1781R7747K58660K39099L0496r5993M7092
40066A220671K91692L93958L52807K38997j5032l72645n18955k83447r56o1690
40056A245400k99881k50022J37871M66035M68914K22164j35742m89354o26498
40047G38887m22265r1681P6486J28185K45113L26368K04398Q4740K38652M12107
40037A940990J57641l28610l89508M5655L10349N3655k45678r7799K73304L84661
$$ plain form
40106 2027665 2055710 1923300 1435952 862460 587028 662142 903966 1204052 1528883 1780556
40096 1780556 1881985 1912842 1999126 2136245 2231729 2234323 2114118 1803077 1274636 642538
40086 642538 107142 -174283 -162447 41397 245852 337756 403448 587911 856241 1021458
40076 1021458 990996 847222 705351 643570 741317 999977 1239076 1269572 1173579 1220671
40066 1220671 1512363 1906321 2259128 2498125 2483093 2110448 1591493 1308046 1307090 1245400
40056 1245400 945519 695497 833368 1299403 1768317 1990481 1854739 1365385 738887
40047 738887 316622 224941 301427 429612 674725 1001093 1205491 1290231 1528883 1940990
40037 1940990 2098631 1770021 1380513 1426168 1736517 1790172 1544494 1446695 1719999 2104660
40027B104660J84327q2059k94216m02624k93823k0723J35205Q6233J04841L36661
40017A858482N02344L50721O1408r3332j59175k70406l22040j93425l1540j848
40007A701189O791J51671L45502M44509M76799M55672K59786n1303j24713J92010
39997C857913N63568O79596P06597Q57864Q65801L69370m13384r01754r05631
39988E679940p22553n97061n08438m25216l79471l15683j71189m3514k2940m11
39978B493464Q7514L6977k51286m14596r9860L86542M29633K0847k34559l8214
39968B416462K28204J72540p1864j92449j56083n6776J54933M83308O61653M33239
39958D073167m7331l49481k70618j6994J18745J05231J31538K99258M67760M39570
$$ plain form
40027 2104660 2288987 2206928 1912712 1510088 1216265 1195542 1330747 1416980 1521821 1858482
40017 1858482 2360826 2711547 2772955 2679623 2520448 2250042 1928002 1734577 1703037 1701189
40007 1701189 1707980 1859651 2205153 2649662 3126461 3582133 3841919 3790616 3665903 3857913
39997 3857913 4421481 5101077 5807674 6665538 7531339 7900709 7487325 6585571 5679940
39988 5679940 4957387 4360326 3851888 3426672 3047201 2731518 2560329 2516815 2493875 2493464
39978 2493464 2580978 2617955 2366669 1952073 1852213 2238755 2668388 2689235 2454676 2416462
39968 2416462 2644666 2817206 2745342 2552893 2396810 2340034 2494967 2978275 3639928 4073167
39958 4073167 4025836 3676355 3405737 3388743 3507488 3612719 3744257 4043515 4511275 4950845
39948D950845K17504j5135j15923o4289J12605L07564K83497p0793m34555l38903
39938D832417J66097M93595L23835L9258J02446L72038M07302J68838j5577j6035
39928F874214o047o5219m4545J49978L94342N01757M06699K19833J62131L44069
39918H937212N91273O63814O22984P02398Q65062Q99842R26941J258660J730862
39909A7199048J851013J723256K024879K838244L427640L549850L949503M963768
39901D1527201N711715N479137M899184M902672N608878P195005J0491249J5548252
39893A01363293K1385174K8676920L9758535N2117620N4169655L4269490m038478
39886C27702209m0758804n7133916n2080024l8595569k7649833k0445990j4291845
$$ plain form
39948 4950845 5168349 5153214 5037291 4973002 5085607 5393171 5676668 5605875 5171320 4832417
39938 4832417 4998514 5492109 5815944 5855202 5957648 6329686 6736988 6905826 6890249 6874214
39928 6874214 6868167 6802948 6758403 6908381 7302723 7804480 8211179 8431012 8593143 8937212
39918 8937212 9528485 10192299 10815283 11517681 12382743 13282585 14209526 15468186 17199048
39909 17199048 19050061 20773317 22798196 25636440 29064080 32613930 36563433 41527201
39901 41527201 47238916 52718053 57617237 62519909 68128787 75323792 85815041 101363293
39893 101363293 122748467 151425387 191183922 243301542 297471197 331740687 327702209
39886 327702209 286943405 229809489 177729465 139133896 111484063 91038073 76746228
39879G6746228r237200o818057o458980o278992n784264n616288n674004n192301
39871B5686142m099855l018611k260678j721866j432797j467720j554429j355389
39863H774797r48894o38128n08283m71576m98638n58222n65254n47302o06625
39854C431875o50785m89431k24926j44868k09549j20386P1051k1235l91562n26640
39844G23544k15394R4554J8364k12499k34430j18923r9923j23052k4005J44048
39834d7716K62145L59881M38305L52418R1308q9815j7721J62776K46700K02513
39824A960794M5804k19762m44998m39728k99780k84940l60767k89697j61370k75617
39814g70061m72852k63351K50220L58173p7973k69340K16177O41091K52213m57968
$$ plain form
39879 76746228 67509028 60690971 54231991 47952999 42168735 36552447 30878443 25686142
39871 25686142 21586287 18567676 16306998 14585132 13152335 11684615 10130186 8774797
39863 8774797 7825903 7187775 6679492 6207916 5709278 5151056 4585802 4038500 3431875
39854 3431875 2781090 2291659 2066733 1921865 1712316 1591930 1662981 1641746 1250184 723544
39844 723544 508150 602704 621068 408569 174139 55216 -44707 -167759 -191764 -47716
39834 -47716 214429 574310 1012615 1365033 1456341 1366526 1348805 1511581 1758281 1960794
39824 1960794 2006598 1786836 1341838 902110 602330 317390 -43377 -333074 -494444 -770061
39814 -770061 -1242913 -1506264 -1256044 -897871 -975844 -1245184 -1029007 -387916 -135703 -593671
39804e93671m94745J34245N64001M17689J23236L1975M3913R1099K69069M30348
39794A017159K54211k07729n48646n72865l95126o6056L84790O42944M50603J93599
39784A152884M82880J129436J242536M94282l99456p14954o04932n93617p38449
39775A450610p53660n84782l94834k05116O2399L24246M14619L27353J76609K6208
39765H43652r6459j50565j64900k29391l23095l18032k07192j19583o1728R8880
39755g28413L23032L63690J59054j9748M0487K16526L03456K82307J81268n2063
39745A069596l53373m77574l36139j63911j57106j89852r8596L292n6789j91884
39735i52336k04780q1510P5714K23530K99646J96315M964J8991K70747L80879
$$ plain form
39804 -593671 -1088416 -954171 -390170 27519 150755 182730 226643 317742 586811 1017159
39794 1017159 1271370 1063641 514995 -57870 -452996 -519052 -134262 508682 959285 1152884
39784 1152884 1635764 2765200 4007736 4502018 4102562 3387608 2782676 2189059 1450610
39775 1450610 696950 112168 -282666 -487782 -425383 -101137 313482 640835 817444 843652
39765 843652 747193 596628 431728 202337 -120758 -438790 -645982 -765565 -827293 -728413
39755 -728413 -405381 -41691 117363 97615 138102 354628 658084 940391 1121659 1069596
39745 1069596 716223 238649 -97490 -261401 -418507 -608359 -706955 -703663 -760452 -952336
39735 -952336 -1157116 -1238626 -1162912 -939382 -639736 -443421 -438457 -419466 -148719 232160
39725B32160J49954n9834P6038K24932q6314o06135o56360j78840J87417R8546
39715f18436q2587j9953O6955r7432l10645k26319J12693M06784N16643M78211
39705B25914L29867J63925J31774J91387R7338j54580j84986J78769M82492K14128
39695A676028m32051p99500o32202k42026Q7416L53206M77021K35121k72842n34099
39685h3928k81639R3995J01101j53028j76864J63379N04464N35499L25153O7087
39675A095219j69467l17584k30561O5723K30838j6864m61220n82033k11352K29057
39665c68244K51142j05944l72994k57949M0415J48954j1023j75461q3449K41381
39655f93172N48816O16637M21523J17739r7334j17159M466Q5738l4574l18355
$$ plain form
39725 232160 382114 322280 398318 623250 536936 -69199 -725559 -904399 -716982 -618436
39715 -618436 -701023 -720976 -654021 -751453 -1062098 -1288417 -1175724 -768940 -252297 225914
39705 225914 555781 719706 851480 1042867 1140205 985625 800639 979408 1461900 1676028
39695 1676028 1243977 444477 -187725 -429751 -342335 10871 487892 723013 450171 -83928
39685 -83928 -365567 -271572 -170471 -323499 -500363 -336984 167480 702979 1028132 1095219
39675 1095219 925752 608168 377607 443330 674168 657304 196084 -385949 -597301 -368244
39665 -368244 -117102 -223046 -596040 -853989 -813574 -664620 -675643 -851104 -934553 -693172
39655 -693172 -144356 472281 893804 1011543 914209 797050 801516 887254 852680 534325
39645E34325n13457l93763k8015K69641K91379J49702P8354J21656J41459N7565
39635G08846q1509k38028m14923n29730m41906j71626O4689J17264O3001L5260
39625h88662O3737J77397M54996P94559Q30658L52052l12519o16493m51132j92293
39615B12300j23042j43564j03969p3240j17758j08832K8314J07197k8369j90804
39605e41767j09052J23460J65285n9252k57875j98649J9912J84045K22824J62676
39595b88393J5725j69231k77547k54098j62107n4266J00179K95780M26666M28273
39585F0981L66742K97469J56986r4617l42357m58313m65320m13980k20445J63438
39575i49416N05851M92622J75093m5944L9713J73876L1893l09753n10673m29721
$$ plain form
39645 534325 20868 -372895 -400910 -131269 160110 309812 388166 509822 651281 708846
39635 708846 627337 389309 -25614 -555344 -997250 -1168876 -1104187 -986923 -923922 -888662
39625 -888662 -824925 -647528 -192532 602027 1432685 1784737 1472218 855725 404593 212300
39615 212300 89258 -54306 -158275 -231515 -349273 -458105 -429791 -322594 -350963 -541767
39605 -541767 -650819 -527359 -362074 -421326 -679201 -877850 -857938 -673893 -451069 -288393
39595 -288393 -272668 -441899 -719446 -973544 -1135651 -1189917 -1089738 -793958 -367292 60981
39585 60981 427723 725192 882178 787561 445204 -13109 -478429 -892409 -1112854 -949416
39575 -949416 -443565 49057 224150 178206 217919 391795 423688 113935 -396738 -826459
39565h26459k27221q4827m6488j00829j95575j67210J12504M70541N43874K58832
39555b62858k2514M323J54875O4176k21381k91105Q928L39466L63687J95895J49510
39544D83002K35305J79774j32383m87971o26397m91305j74809J95587M50987M49581
39534H1371K67586J72791K73845L38986J41275j53333k09513o7270j19279m73226
39524B53233o88057l72099K24390N30834L99685J65343N1045n8448k12618k00462
39514I2846M9785K35525J13797j11128j39929p7002k05847m34140l93470m6754
39504i16317K21214J68077j9703j01839j14848j83561k71024k68826j30262J80861
39494a436228O37559R60548P74336J09228n12376o58911m19390j16778R9562J86054
$$ plain form
39565 -826459 -1053680 -1138507 -1184995 -1285824 -1481399 -1648609 -1536105 -1065564 -521690 -262858
39555 -262858 -285372 -281049 -126174 -61998 -283379 -574484 -565556 -226090 137597 333492 483002
39544 483002 718307 898081 765698 277727 -348670 -839975 -1014784 -819197 -368210 81371
39534 81371 348957 521748 795593 1134579 1275854 1122521 913008 845738 726459 253233
39524 253233 -434824 -806923 -582533 -51699 347986 513329 564374 505926 293308 92846
39514 92846 142631 378156 491953 380825 240896 163894 -41953 -476093 -869563 -916317
39504 -916317 -695103 -527026 -546729 -648568 -763416 -946977 -1218001 -1486827 -1617089 -1436228
39494 -1436228 -798669 161879 936215 1045443 533067 -125844 -545234 -662012 -562450 -376396
39484c76396P2205j28640r1353K26369L82764J07461j95669q1412J42459j01838
39474d4050o15481o37106o5053L52491K04290p079J82616M04093J48030l14842
39464c92091l58831Q628K36114J11654m9263k2227O5153J02554J59603K17018
39454G8312J24093r7542k30868k05005j68091j81234j37941l1969j17l7257K3158
39443h64461J67245J64913o436l8411K23032M80714M20433J72314M3249J5670
39433G78262j22424k88546j69275K18919M22245J42638l44602n48633l39457K1993
39423b28880K68881L15439J59232j33446l38742k25898J07804K55353k392l79580
39413b02229m51796k08239J0489N3083J17142L19620M36861K65543o599o2654
$$ plain form
39484 -376396 -304191 -432831 -524184 -297815 84949 192410 -3259 -84671 57788 -44050
39474 -44050 -659531 -1296637 -1361690 -1009199 -804909 -811988 -629372 -225279 -77249 -392091
39464 -392091 -750922 -742294 -506180 -394526 -443789 -466016 -400863 -298309 -138706 78312
39454 78312 202405 104863 -126005 -331010 -499101 -680335 -818276 -850245 -850362 -887619 -864461
39443 -864461 -697216 -532303 -538739 -577150 -354118 126596 547029 719343 762592 778262
39433 778262 655838 367292 198017 416936 839181 981819 637217 88584 -250873 -228880
39423 -228880 40001 355440 514672 381226 42484 -183414 -75610 179743 177351 -202229
39413 -202229 -654025 -862264 -851775 -798692 -681550 -361930 74931 340474 333875 271221
39403B71221O5230Q5071n8846j11245M0677J63048O5296p6948j7341J36527R6126
39392F58816r3469o4485K72217M69291J34368m38463n93285k15161J05118o1580
39382A73367l53815j92830L04421M82538J36171j98690o4241K96824M08632K46996
39372A239373P9212p3846l48125n79884m42821k2363K08715O2662j29416q9052
39362i5545K303r8494k25434o9718K73356L83554J02654k51290l05866o2044J86977
39351a59547K24999Q5929q0480j91932k48414k39301j30746N0805K10710K96331
39341a81646L27612K74636L5264l54078o11015m90851j11950J83118K44607K06849
39331d77454K08234K41818K73727K77054J35236k36758o28107o57104k65350J56113
$$ plain form
39403 271221 336451 421522 362676 251431 292108 455156 520452 443504 426163 562690 658816
39392 658816 565347 500862 773079 1242370 1376738 938275 344990 129829 234947 173367
39382 173367 -180448 -373278 -68857 413681 549852 351162 286921 583745 992377 1239373
39372 1239373 1318585 1244739 896614 316730 -126091 -148454 60261 122923 -6493 -95545
39362 -95545 -93242 -191736 -417170 -486888 -213532 170022 272676 21386 -284480 -346524 -159547
39351 -159547 65452 151381 70901 -121031 -369445 -608746 -739492 -688687 -477977 -181646
39341 -181646 145966 420602 455866 101788 -509227 -1000078 -1112028 -928910 -684303 -477454
39331 -477454 -269220 -27402 246325 523379 658615 421857 -206250 -863354 -1128704 -972591
39321i72591K65038J60575J19945J72556J59911N3909k8089l2751J6228J47273
39311F2004L82738N79194M98979O5322n31250r63368r77456n76886o4377K03252
39301a321848J76571J24231K38218L95460L90783K10089m8026l17177m82954l83366
39291a018019q2427Q5702j7942o4917K46243O50195O57045K71004p3347j99034
39281D54503l21756m89480l99973N7178M89239M68294M0305m09501n65370l34684
39271a011245J38627M78525L63228m9595k50355n8561J42561K4517j97732j74337
39261e94367J3779O4691j8974j6906O3767L0735j09489j83136j84483k17543j84064
39250a335990P0112L42079K51607j24170k44242J28612N54806N23833J04697k55880
$$ plain form
39321 -972591 -707553 -546978 -427033 -254477 -94566 -40657 -68746 -101497 -85269 62004
39311 62004 444742 1023936 1522915 1588237 1056987 93619 -883837 -1460723 -1525100 -1321848
39301 -1321848 -1145277 -1021046 -782828 -387368 3415 213504 165478 -151699 -634653 -1018019
39291 -1018019 -1100446 -1014744 -1032686 -1097603 -851360 -201165 455880 726884 653537 454503
39281 454503 132747 -356733 -756706 -699528 -210289 258005 298310 -111191 -676561 -1011245
39271 -1011245 -872618 -394093 -30865 -80460 -330815 -389376 -246815 -222298 -420030 -594367
39261 -594367 -580588 -515897 -534871 -551777 -488010 -457275 -566764 -749900 -934383 -1151926 -1335990
39250 -1335990 -1265878 -923799 -672192 -796362 -1040604 -911992 -357186 166647 271344 15464
39240A5464l28994k33661j45544j20516j15932k4221K28519N20928O00505L86170
39230G82718N2665k31635m26434m29279r1319M21508O24871L20923j01373k47751
39220F74894k62267m20005n22976k33679K16623K66889j04089l47479j91908P0166
39210h53831K09665L57412N10743L60450j14221m37621l49180j87181k04372q4928
39200g93064L63730O19589K28020k93735j55146M15692M94583n6021m08081j62070
39190B53497O4558k17568n27876k84470J86771K15025j17154j84443J31808L27772
39180a52080J42151j04336j15215m7485j57586l79078m51259k58241R2489L88474
39170a042166M45701K48925j1279j38809j38258j09198k0567K20800N24863O51515
$$ plain form
39240 15464 -313530 -547191 -692735 -813251 -929183 -953404 -724885 -203957 396548 782718
39230 782718 835383 603748 177314 -251965 -343284 78224 703095 1024018 922645 674894
39220 674894 412627 -7378 -530354 -764033 -547410 -280521 -384610 -732089 -923997 -853831
39210 -853831 -644166 -286754 223989 584439 470218 32597 -316583 -503764 -708136 -793064
39200 -793064 -429334 190255 418275 124540 -30606 385086 879669 823648 415567 253497
39190 253497 318055 100487 -427389 -711859 -525088 -310063 -427217 -611660 -479852 -152080
39180 -152080 -9929 -114265 -229480 -276965 -434551 -813629 -1264888 -1523129 -1430640 -1042166
39170 -1042166 -596465 -347540 -358819 -497628 -635886 -745084 -765651 -544851 -19988 631527
39160F31527M93872J66173j68693l87400l63184o4759K76178L10786l4764m58118
39150D01618o22590m69469j65594R8474J99394J18278k6309q0685m7438p3627
39140f67948k00331k47234l9752L34411O00386N86064L47643L2559k69032m90035
39130a3269n00654k08293K30559M57587L06273L2914l6080K0596j05029l48116
39120a63512k73451J94153M96599K17022k51131k64907R7852J80215k38199o41473
39110f46832n71713k16702j885J3108O6452K73106N09508N82284L80607j3454
39100C74479l19286l33471k15197k61064m08955l05994P3760K82067M3478l21422
39090a391605l74997j52165K2508M8195O0932J30446K48658M57363O97126O81877
$$ plain form
39160 631527 1125399 1291572 1122879 735479 372295 307536 583714 894500 859736 401618
39150 401618 -220972 -690441 -856035 -757561 -558167 -439889 -466198 -546883 -594321 -667948
39140 -667948 -868279 -1115513 -1155265 -820854 -220468 365596 713239 745798 476766 -13269
39130 -13269 -513923 -722216 -491657 -34070 272203 305117 269037 289633 184604 -163512
39120 -163512 -436963 -242810 253789 470811 219680 -45227 52625 232840 -5359 -646832
39110 -646832 -1218545 -1435247 -1437132 -1424024 -1357572 -1084466 -574958 7326 387933 374479
39100 374479 55193 -278278 -493475 -754539 -1163494 -1469488 -1395728 -1113661 -1070183 -1391605
39090 -1391605 -1766602 -1918767 -1896259 -1848064 -1787132 -1656686 -1408028 -950665 -253539 428338
39080D28338K25372m17206p94318p28581l28729K52162P64174P98947K19291m65471
39070d6021n95139j75823K14787K62531J57934L2220k32681m91284k69210M46544
39060f96142Q94297M97939k64466n09835j81446R420k49135m59434j93927K35673
39050i17056L12151O8542r8726q1837q2000j32425o4827N9817n8963m04447m78628
39039a878399J6886O16561O01014l5792n40322l71065J61152M14148K67537J26411
39029f21869K27622L39361K04744m7180j30549m0749r413r7521j00597Q5940K32585
39018D2374P4864k72991m15344j77947J80154L19412K13365O6336j9869r8362
39008h8008j54433n8684K00425M01867L16040k9631l74076m61531k34469J33944
$$ plain form
39080 428338 653710 236504 -557814 -1286395 -1615124 -1362962 -598788 200159 419450 -46021
39070 -46021 -641160 -816983 -602196 -339665 -181731 -149511 -382192 -873476 -1142686 -696142
39060 -696142 198155 696094 431628 -78207 -259653 -250233 -499368 -958802 -1152729 -917056
39050 -917056 -604905 -536363 -635089 -716926 -798926 -931351 -996178 -936361 -995324 -1399771 -1878399
39039 -1878399 -1861513 -1244952 -643938 -679730 -1220052 -1591117 -1429965 -1015817 -748280 -621869
39029 -621869 -394247 -54886 149858 102678 -27871 -68620 -78033 -175554 -276151 -190211 42374
39018 42374 117238 -155753 -571097 -749044 -568890 -249478 -36113 30223 10354 -88008
39008 -88008 -242441 -301125 -100700 301167 617207 587576 213500 -248031 -482500 -348556
38998c48556L63706K95519L6346j63581j75311p0217K8336N3014k5587j68358
38988a74689k15451m6594J78144J50806j39580l28214j69631J26121K44817K23384
38978a50887K70854L11809Q4770l40753n19692k05793L02269N30106L50093n905
38968F26871l00939m84540n91657o01133m31416n1054M08715O87230O15665L03815
38958A81557K7567p2927r2552j47576j82242o9852J60795L11578K49125Q5851
38948D51324N2472J86449K44461J8856l27798m18098j57359J28837J43025l253
38938C18916k7449P7866Q6459o0030j64463r8077J9214K2283r3245k40140l72073
38927e30739m62927m49773k75962M1502L97345O12978N14869J02882l71535n93803
$$ plain form
38998 -348556 15150 310669 347015 183434 8123 -62094 -33758 19256 -6331 -174689
38988 -174689 -390140 -436734 -258590 -107784 -247364 -575578 -745209 -619088 -374271 -150887
38978 -150887 119967 431776 516546 175793 -343899 -549692 -247423 282683 632776 626871
38968 626871 325932 -158608 -750265 -1351398 -1782814 -1833868 -1425153 -737923 -122258 181557
38958 181557 209124 136197 43645 -103931 -286173 -356025 -195230 116348 365473 451324
38948 451324 503796 690245 934706 953562 625764 207666 50307 179144 322169 318916
38938 318916 291467 369333 455792 395762 231299 133222 152436 174719 81474 -158666 -530739
38927 -530739 -993666 -1443439 -1719401 -1677899 -1280554 -667576 -152707 -49825 -421360 -1015163
38917a015163m61735j27367J82765L23212K95447K60477L84913N59262M25380
38908H27191j17188n99044m92408M7828L30276L7769l88769l99049j4650L49245
38898d18799M59365L88332K47123P8931n3475r5525q7978q2600k5951J38901L13815
38887H62139L27045J44382j01150k54986k44000r8971M3240K7846j40029k67561
38877B97955k03248k2838R7607J16729J30033J92284K46051K05667M1625j83714
38867I18151l09166j73942J75080M18340K39271k95861p20889o23379j10486K72771
38857b10110J58542k00503k68114M2108K54102L8050l05419l31750j20542l7875
38847i81511l6375K57053P85271R76075N60804l3364l36692m15698n07719n21859
$$ plain form
38917 -1015163 -1476898 -1604265 -1421500 -1098288 -802841 -542364 -157451 401811 827191
38908 827191 710003 110959 -381449 -333621 -3345 34424 -354345 -753394 -768044 -418799
38898 -418799 40566 428898 676021 754952 701477 605952 517974 435374 409423 548324 862139
38887 862139 1189184 1333566 1232416 977430 733430 634459 677699 705545 565516 297955
38877 297955 94707 71869 169476 286205 416238 608522 854573 1060240 1101865 918151
38867 918151 608985 435043 610123 1028463 1267734 971873 250984 -372395 -482881 -210110
38857 -210110 -51568 -252071 -520185 -478077 -223975 -185925 -491344 -823094 -943636 -981511
38847 -981511 -1017886 -760833 24438 1000513 1561317 1527953 1191261 775563 267844 -254015
38837b54015l05940o7633q1052k06222j28737J00609J83031R2172O8005J81093
38827d18689K83819L22467L36085K24944r9805m01099l52828o1537N6587q2492
38817a92548j37312O3223K57967K01954m874j75108k76327k81536j13983J14502
38807e44042J42724j4109k9489J73861K26115o8574l10865q5104L58408M57347
38797C06272J65945o2467k5406L819j61158l08255k50672j74255k87025l86809
38787a180011j23239M04501O46209K71171l83910o91960m49726l4489J33058P6117
38777a332279R9344K92324M21326L07754R3822K1389Q5182O4617j38288l36336
38767d21145k80763K1983K99496L32917K08962J58532J92516Q9076k03570l88066
$$ plain form
38837 -254015 -559955 -627588 -708640 -914862 -1043599 -942990 -759959 -667787 -599782 -418689
38827 -418689 -134870 187597 523682 748626 648821 247722 -105106 -166643 -110056 -192548
38817 -192548 -329860 -266637 -8670 193284 188410 13302 -263025 -544561 -658544 -544042
38807 -544042 -401318 -415427 -444916 -271055 -44940 -113514 -424379 -509483 -151075 306272
38797 306272 472217 409750 384344 388163 227005 -81250 -331922 -506177 -793202 -1180011
38787 -1180011 -1303250 -898749 -252540 18631 -365279 -1057239 -1506965 -1541454 -1408396 -1332279
38777 -1332279 -1232935 -940611 -519285 -211531 -117709 -96320 -11138 53479 -84809 -421145
38767 -421145 -701908 -679925 -380429 -47512 161450 319982 512498 601574 398004 9938
38757I938k32885L1107K6606j81537j91738O2504J80775m1835k44318o1648K81933
38746c61098L13945L5960j08404Q7551L37766L24145R1143j20599j88756j32789
38736B78864o524J01012Q3866m5059j28436p1087J2732l6830j78827k11609m6709
38725b48607J65598K18330Q6704o8350j01163k1086O7313R0549L2053j03503k69660
38714a51822l54645k76688j00321L5147R8543J60116J96116P2799j90056l13559
38704h24370r5865K51109L24445O6968j54343o8966J26447Q8416j44112k03323
38694f33594N6375L40760L44448J51922J8450m8300j95929l38933k39806K4879
38684e19728R4307p0303n0319L18231N45648K11176l00092l39656N685J38462
$$ plain form
38757 9938 -222947 -191840 -165234 -346771 -538509 -476005 -295230 -337065 -581383 -643031 -361098
38746 -361098 -47153 -11193 -119597 -32046 305720 629865 721008 600409 411653 278864
38736 278864 272340 373352 457218 412159 283723 212636 225368 188538 9711 -201898 -248607
38725 -248607 -83009 135321 222025 153675 52512 31426 98739 189288 221341 117838 -151822
38714 -151822 -506467 -783155 -883476 -848329 -749786 -589670 -393554 -320755 -510811 -824370
38704 -824370 -920235 -669126 -344681 -277713 -432056 -501022 -374575 -286159 -430271 -633594
38694 -633594 -577219 -236459 107989 259911 278361 230061 34132 -304801 -544607 -519728
38684 -519728 -425421 -495724 -546043 -227812 317836 529012 228920 -110736 -105051 33411
38674C3411K0473K02002P13375Q02197J30302n48616m70380J0258P1038k69894
38664F94166l21731N0522K28039j18958n43179n45997k00018J57287L61812L50001
38654A11944Q3406k38076k63869J2581K01770J21199M8695J77184K60411R7407
38644F12652n0080Q7911K67063J05283k78611m60021l50493j91998o4071J31180
38634a91185K94392K22827K7638k1028k0897k66584n48449k79948M92594Q86858
38624E96218L87032l40715l92979P9200K29010j26609l29659l7105K66127J47700
38614D78220q1166J1015J89021m6951n68927p21246k48915L59846N25975K24994
38604A21866j25293j84075J2002J45147j5430k87308k44125J61065L81255j079
$$ plain form
38674 33411 53884 255886 969261 1771458 1901760 1353144 882764 893022 964060 694166
38664 694166 372435 422957 650996 532038 -11141 -557138 -757156 -599869 -238057 111944
38654 111944 195350 -42726 -306595 -294014 -92244 28955 77650 254834 515245 612652
38644 612652 562572 650483 917546 1022829 744218 284197 -66296 -258294 -322365 -191185
38634 -191185 103207 326034 353672 332644 311747 45163 -503286 -783234 -290640 596218
38624 596218 983250 642535 249556 328756 557766 431157 101498 64393 330520 478220
38614 478220 397054 408069 597090 550139 -18788 -740034 -988949 -629103 -103128 121866
38604 121866 -3427 -187502 -175500 -30353 -45783 -333091 -577216 -416151 -34896 -35975
38594c5975n46825m54720K66590P02544K72972m67849o10836o9383M52894M36015
38584e4573N8125j84230m7246K64281L14835o7358m55535k43224M83982Q90154
38574I59211M77112k04112l74560j42909j61848m75190n15986j67262L2565j31629
38564g04608j88356J16946L14348M0152k84243j46046K25923L21463K04648K64197
38554A64424M41556L79743J18773j3176l9162k07450l52790r2801L71613L95586
38544A166316p9619l66678j06170K02343O6317k43804k41712l434Q9244k4249
38534D58554j84340l83322n72629m45107Q4700N00419L39367n2927m0531K72291
38524b3525K51245j61706l70440j97444j86559n77288p68007k62412M82881P22525
$$ plain form
38594 -35975 -582800 -1037520 -770930 -68386 204586 -263263 -874099 -943482 -490588 -54573
38584 -54573 3552 -180678 -227924 36357 351192 283834 -171701 -414925 69057 959211
38574 959211 1436323 1232211 857651 714742 552894 77704 -438282 -605544 -572979 -704608
38564 -704608 -892964 -776018 -461670 -421518 -705761 -851807 -625884 -304421 -99773 164424
38554 164424 605980 985723 1104496 1091320 1052158 844708 491918 399117 770730 1166316
38544 1166316 1086697 720019 613849 816192 882509 638705 396993 393559 482803 458554
38534 458554 274214 -109108 -681737 -1126844 -1042144 -541725 -202358 -255285 -295816 -23525
38524 -23525 227720 66014 -304426 -501870 -688429 -1265717 -2033724 -2296136 -1813255 -1090730
38514a090730M67530K69086K92312K28515m2393k74993k96482j76976m157J49959
38504d78329J35608m2755n0178L18643O81446N58383J43578j3148L7877k40060
38494A051065p89464q56828k23010L13199J47456j97730R718N12201N73966K07426
38484G47999m403p92j99093m84688k52683M35350P04819J96155l22023j40087
38474F80554L38632L43197o4274k61749j40490j29214l32571l85354j62726j955
38464a15950j16294l05336l71866l65565k72335P7402N65872O71813J32319n57459
38454f57399o58172n6337O60633Q93748N51671k5434m04656l54725k0404J91071
38444A19996M5343k36019k75862l9530J87527K56289K89643L35169K14403j26847
$$ plain form
38514 -1090730 -623200 -354114 -61802 166713 124320 -150673 -447155 -624131 -628288 -478329
38504 -478329 -342721 -385476 -435654 -117011 564435 1122818 1266396 1253248 1291125 1051065
38494 1051065 261601 -595227 -818237 -505038 -357582 -555312 -545594 -33393 540573 747999
38484 747999 743596 742804 543711 59023 -193660 241690 946509 1142664 820641 680554
38474 680554 1019186 1362383 1298109 1036360 895870 766656 434085 48731 -113995 -115950
38464 -115950 -232244 -537580 -909446 -1275011 -1547346 -1469944 -904072 -232259 -99940 -657399
38454 -657399 -1315571 -1371908 -711275 182473 734144 708710 304054 -50671 -71075 119996
38444 119996 165339 -70680 -346542 -386072 -198545 57744 347387 682556 896959 770112
38434G70112m02898l69478k13116k58419m18768k98827J63426N18215L92205k6546
38424a44094k84199k43625j44917j93923l20247l35295j68068Q6011K67699K95696
38414a184962K37842K02796J54249m8157l68894n20135l06155Q3155L01424K76885
38404a171952K17301K46639K61416J54585j2151j04650n4727J12558K77111K67484
38394A93614L2067k60566m14246m32260l97668k30885J79908O47698P78883M49361
38384E45906m4391l58672m08824k72972m6506J26962J08148n7109j80897j84345
38374g72700j10884O9095L63711M98374J65665l97101n45474j13286L09130K32465
38364c01005p7872j61258j01855k10454l46455j60369K10939K96488L3056j97528
$$ plain form
38434 770112 367214 -2264 -215380 -473799 -892567 -1191394 -1027968 -509753 -117548 -144094
38424 -144094 -428293 -671918 -816835 -1010758 -1331005 -1666300 -1834368 -1748357 -1480658 -1184962
38414 -1184962 -947120 -744324 -590075 -638232 -1007126 -1527261 -1833416 -1750261 -1448837 -1171952
38404 -1171952 -954651 -708012 -446596 -292011 -304162 -408812 -463539 -350981 -73870 193614
38394 193614 225681 -34885 -449131 -881391 -1279059 -1509944 -1330036 -682338 96545 545906
38384 545906 501515 142843 -265981 -538953 -585459 -458497 -350349 -407458 -588355 -772700
38374 -772700 -883584 -814489 -450778 47596 213261 -183840 -729314 -842600 -533470 -301005
38364 -301005 -378877 -540135 -641990 -852444 -1198899 -1359268 -1148329 -851841 -818785 -1016313
38354a016313k07889j45691l4682K59240N66015M80133K1063k87869j79479p328
38344e52800j24813l39774k90499k1102J48873J03242o756k9180O0721J77409
38334h74679J58758n5319k21446j3850M73761P39915N21859J35138n634P9991
38324I38494R6201q5916l63860n75864n54018k26571J65402K17759p6922k21747
38314f87042P7273M18933K88211j34476k14000K02510N60239L58831k19111n76064
38304G5304l93533O1766K59524P48l32356k33553K41900N05701K29818k06646
38294B08673k62161P5590M15204N14216L91628J19246j57766j92280K4418Q9406
38284A226174k77436p28041p28673l21050J4411Q6000P2369J9017j66272k82293
$$ plain form
38354 -1016313 -1224202 -1369893 -1404575 -1145335 -579320 -99187 -78124 -365993 -545472 -552800
38344 -552800 -677613 -1017387 -1307886 -1328988 -1180115 -1076873 -1083629 -1112809 -1052088 -874679
38334 -874679 -715921 -771240 -992686 -1006536 -532775 207140 728999 864137 858503 938494
38324 938494 1034695 948779 584919 9055 -544963 -771534 -606132 -388373 -465295 -687042
38314 -687042 -609769 -190836 97375 -37101 -251101 -48591 511648 870479 651368 75304
38304 75304 -318229 -256463 3061 3809 -328547 -562100 -320200 185501 415319 208673
38294 208673 -53488 22102 437306 951522 1343150 1462396 1304630 1112350 1136768 1226174
38284 1226174 948738 220697 -507976 -829026 -814615 -728615 -656246 -637229 -803501 -1085794
38274a085794j7311M23615N00170K10858J24063L95368M67815L9429l70852k68120
38264D19241K0464m9379l32623l31584p9095n135j30987p0264K35064M05756K93109
38253C74567J95286K75061K50740j02842n11837n46422k00144J26461J39418l3336
38243c3048m7991K14631M72577L59403j04559m97029m94221k08679P0453K54238
38233a4225L78763L61322J22614j62505k36499j31617r5916j78641j75064k320
38223a34088J44570R0537p9747j74577j33053k6644O6812J21389J49831J54696
38213A79726Q3279j02452k89656k92608j35713o1048j25455l9348L58709P10649
38203B86083N66072L4806l66341m02409k48213j5969L57060P17808O88264K16973
$$ plain form
38274 -1085794 -1103105 -679490 -179320 31538 155601 550969 1018784 1058213 687361 419241
38264 419241 439705 390326 57703 -273881 -352976 -358111 -489098 -559362 -324298 81458 374567
38253 374567 569853 844914 1095654 992812 480975 -65447 -265591 -139130 288 -33048
38243 -33048 -81039 133592 606169 965572 861013 363984 -130237 -338916 -268463 -14225
38233 -14225 364538 725860 848474 685969 449470 317853 221937 43296 -131768 -134088
38223 -134088 10482 101019 21272 -153305 -286358 -313002 -246190 -124801 25030 179726
38213 179726 263005 160553 -129103 -421711 -557424 -618472 -743927 -783275 -424566 286083
38203 286083 852155 886961 520620 118211 -130002 -145971 211089 928897 1617161 1834134
38193A834134k45490l14580j09369L4599j4475k16470n10425p34300o50788k56633
38183a183797J36922K83039K47610J72369O6811k0222P5024L31668M42057K29769
38173G81250p5941j91213j44819p6968M8060K58756L58341J83314j21835l36308
38163F82637m40684m36450k00104J83650K89514n1674l59147j87165J17200n2554
38153d54777n18584n43428j4461L82357K72849J10739L06411N32403L43806m2760
38143C74555j25177P7744J31169r6860l09383l01737j97203j47928j17578k3596
38133g35994J16202K37189K98386K77158J79994N2453p2090j87808k47240j72282
38123b54032N341J16460M4957j38429k92427l59303l43917k43588p3699J11081
$$ plain form
38193 1834134 1588644 1274064 1164695 1199294 1184819 968349 457924 -276376 -927164 -1183797
38183 -1183797 -1046875 -763836 -516226 -343857 -277046 -297268 -222244 109424 551481 781250
38173 781250 705309 514096 369277 292309 340369 599125 957466 1140780 1018945 682637
38163 682637 241953 -194497 -394601 -210951 78563 26889 -332258 -519423 -402223 -454777
38153 -454777 -973361 -1516789 -1531250 -1148893 -876044 -765305 -458894 73509 417315 374555
38143 374555 249378 327122 458291 361431 52048 -249689 -446892 -594820 -712398 -735994
38133 -735994 -619792 -382603 -84217 192941 372935 425388 353298 165490 -81750 -254032
38123 -254032 -248691 -132231 -87274 -225703 -518130 -877433 -1221350 -1464938 -1538637 -1427556
38113a427556K65062L54819L28265J96584J14542K03139L10642J77328j46683
38104C76142l18026k07136j00933k50752m79799m53349j50048J53539K43126J38240
38094a048996J0559N3223L03704N12092L72244k4660k16043J2171L15229L05027
38084E94550P6014p2209j47343l08937m24413k52166L9711K9892k74976l86035
38074a125912o2491L27147L57126R9515j15533k03949k81952k97970o6384L41742
38064a028661N36189K57503k66470n57956m21336r7422J06641J71659K59583M06357
38054f33913N06522N13138M30420J73012k79104o03483l81710K76284P19273N48506
38044A268945Q2009j95766k73150l72015m30202k87980j43280k96025n63522m74918
$$ plain form
38113 -1427556 -1162494 -807675 -479410 -282826 -168284 34855 345497 522825 376142
38104 376142 58116 -149020 -249953 -500705 -980504 -1433853 -1583901 -1430362 -1187236 -1048996
38094 -1048996 -1038437 -985214 -681510 -169418 202826 178166 -37877 -25706 289523 594550
38084 594550 670564 598355 451012 142075 -282338 -534504 -494793 -464901 -739877 -1125912
38074 -1125912 -1188403 -861256 -504130 -404615 -520148 -724097 -1006049 -1304019 -1370403 -1028661
38064 -1028661 -492472 -234969 -501439 -1059395 -1480731 -1578153 -1471512 -1299853 -1040270 -633913
38054 -633913 -127391 385747 816167 989179 710075 106592 -275118 1166 720439 1268945
38044 1268945 1350954 1155188 882038 510023 79821 -208159 -351439 -647464 -1210986 -1685904
38034a685904j7309L15568K62546J06896J35234K19730J37893k4746k0096K13362
38024c56826N00585N94639L45594j35216m88348m74669k80968k26503k62994j01433
38014h86139K26837L49466J27141j47144k04453j00174J3367O1321n6987l54980
38004i71745m95454j04736N46259O95213J28700m50136l94566L9851K19470O2538
37994g24606n7851k8065n9671j80869j52385J20560M44665O10138N59985L28262
37984H60163K2081j80353j79587n2660P9739J57255J05390j21171l49518l16830
37974B4509p6509M6337l246O9720K98302K75564j27868m02076j71744J68870J16777
37963B18636j04772p805K46078J39738k27560k55209J35772L44963L1761m27107
$$ plain form
38034 -1685904 -1703213 -1387645 -1125099 -1018203 -882969 -663239 -525346 -550092 -570188 -356826
38024 -356826 143759 738398 1083992 948776 460428 -14241 -295209 -521712 -784706 -886139
38014 -886139 -659302 -309836 -182695 -329839 -534292 -634466 -621099 -559778 -616765 -971745
38004 -971745 -1467199 -1571935 -1025676 -330463 -201763 -651899 -1046465 -1006614 -787144 -724606
37994 -724606 -782457 -810522 -870193 -1051062 -1203447 -1082887 -638222 -28084 531901 860163
37984 860163 882244 701891 522304 469644 549383 706638 812028 690857 341339 24509
37974 24509 -52000 -5663 -8909 60811 359113 634677 506809 104733 -67011 101859 218636
37963 218636 113864 106059 352137 491875 264315 9106 144878 489841 521602 94495
37953I4495n48273k86070J34275M55416M00517q0950n35331m49283K414J64899
37943f47891j18891l25316j38728J05469P9752k4267M8471J54578R5381N850N2357
37932g13235R0983l9230j78368j10897P9827J85527J71867R1823n0572j59695
37922f31970m6649K35366L36098R0739k23641l08981k23024j27959J4244K35987
37912f49790L44470J90254p5265k44895l21812l40266k02495P7331K49712J86788
37902g85968Q1639P6082K5287j20067q8241K21859M13189J79258j28152j7943
37892a43057L37599L79909N7849j47052k2773J19090M2751o4006J1103J46055
37882G17468J08566j15417l59462m71579l91176j66231O1817J74214J60546N0363
$$ plain form
37953 94495 -453778 -739848 -605573 -150157 250360 169410 -365921 -815204 -812790 -647891
37943 -647891 -766782 -1092098 -1230826 -1125357 -1045605 -1069872 -1021401 -866823 -771442 -765592 -713235
37932 -713235 -622252 -661482 -839850 -950747 -870920 -685393 -513526 -421703 -472275 -631970
37922 -631970 -678619 -443253 -107155 -16416 -240057 -549038 -772062 -900021 -885777 -649790
37912 -649790 -305320 -115066 -190331 -435226 -757038 -1097304 -1299799 -1222468 -972756 -785968
37902 -785968 -704329 -628247 -602960 -723027 -811268 -589409 -176220 3038 -125114 -143057
37892 -143057 194542 574451 632300 485248 462475 581565 624316 560310 571413 717468
37882 717468 826034 710617 351155 -120424 -511600 -677831 -616014 -441800 -281254 -230891
37872b30891j18354k01667l0947K77250L35399L375l51700l44316o6730J64739
37862e63842K79676L41245K40376q8215l56603k58729M7281J94248J57001J16369
37852A08807r906l61554o20087l23771L27328N94610K06655l10534m26806k17016
37842a032274k2537K1802o6961k38723k98432m5456L34976M01320J11229n9354
37832h94410J78860N10351N14126K11203j16666l21013l66509k19976J0197Q7199
37822d06638q999j3906J78172K96581J06327k44156m70023m73467k68771J02013
37812a202867M08150L27678p7583l12554j06438K08265K25089L1237o0107l3564
37802e92694p4012j82671k27874j90719p8389J93064N48273O26532K36450k68907
$$ plain form
37872 -230891 -349245 -550912 -581859 -304609 30790 34165 -317535 -661851 -728581 -563842
37862 -563842 -284166 57079 297455 209240 -147363 -406092 -358811 -164563 -7562 108807
37852 108807 98901 -262653 -882740 -1206511 -879183 -284573 -77918 -388452 -815258 -1032274
37842 -1032274 -1054811 -1033009 -1099970 -1338693 -1637125 -1682581 -1347605 -946285 -835056 -894410
37832 -894410 -715550 -205199 308927 520130 403464 82451 -284058 -504034 -493837 -406638
37822 -406638 -415637 -429543 -251371 45210 151537 -92619 -562642 -1036109 -1304880 -1202867
37812 -1202867 -794717 -467039 -544622 -857176 -963614 -755349 -530260 -499023 -559130 -592694
37802 -592694 -666706 -849377 -1077251 -1267970 -1346359 -1153295 -605022 21510 257960 -10947
37792a0947m14385k30547j19084k32745l37599k18443P4538L46332M23148K74740
37782d44992J07050J75295L84192L26068j17350n24776n21976k82344j40931n6193
37772a095957J60259L92087M32577L81803L85764K53269j71343n21128l72283
37763a54952R772K9717k60729k38807K40872N71735L16765j94353m15941k64030
37753c59951j7921R1903J7927j07647m5687K17313K88432j05842n55115m60015
37743a036603J5591J62898j09779j27947L70640P48119N33518J96582L00006N34513
37733A587538K88649k91431n47665l33393j01298j17240k02728k04332j87867
37724a09767j63968n3880O2776K0652j27478j84056j28494p8081j8929J22169
$$ plain form
37792 -10947 -425332 -655879 -774963 -1007708 -1345307 -1563750 -1489212 -1142880 -719732 -444992
37782 -444992 -337942 -162647 221545 547613 430263 -94513 -616489 -898833 -1039764 -1095957
37772 -1095957 -935698 -543611 -111034 270769 656533 909802 738459 217331 -154952
37763 -154952 -145180 -115463 -376192 -614999 -374127 197608 514373 320020 -95921 -359951
37753 -359951 -377872 -285969 -268042 -375689 -421376 -204063 84369 -21473 -576588 -1036603
37743 -1036603 -1021012 -858114 -967893 -1095840 -725200 22919 556437 753019 1053025 1587538
37733 1587538 1876187 1584756 1037091 703698 602400 485160 282432 78100 -109767
37724 -109767 -273735 -327615 -264839 -244187 -371665 -555721 -684215 -762296 -781225 -659056
37714f59056K35557J69682J9873k8448l4032j56850l02721k64672j10848n3541
37704a185056k8930J73003M20742L48253k5037k32180j7249L40697M92410M46561
37694G33214L68737K67401Q4828j18920k51247l09738l12691k38205r0093R1258
37684B24544K72256L53088J55422k96686o08307m39523o723K03125J31716J22561
37674A11473K52055K34782M7194L9228K40034J73668l06013n96045k48151K13538
37664A61763J1382o75366r09371k89440N77061R15804N85771k8337m77382m86823
37654f14938r5277L14043L73275J72507R7041K41845L18879J70219j933k5276
37644I50385k2939j14757j57953q300J87969J87196k6606k87989m67606m83775
$$ plain form
37714 -659056 -423499 -253817 -233944 -262392 -296424 -453274 -755995 -1020667 -1131515 -1185056
37704 -1185056 -1213986 -1040983 -620241 -271988 -297025 -529205 -546454 -205757 286653 733214
37694 733214 1101951 1369352 1454180 1335260 1084013 774275 461584 223379 133286 224544
37684 224544 496800 849888 1005310 708624 100317 -339206 -345929 -142804 -11088 111473
37674 111473 363528 598310 645504 684732 924766 1098434 792421 196376 -51775 161763
37664 161763 173145 -502221 -1411592 -1701032 -1123971 -208167 377604 349267 -128115 -614938
37654 -614938 -710215 -396172 -22897 149610 246651 488496 807375 977594 975661 950385
37644 950385 927446 812689 654736 646436 834405 1021601 994995 707006 239400 -244375
37634b44375k68936Q1602K72525J30532j43302k40759j58377j16590j57396j08157
37624i53233N4879J06992m3803j19248J67326O35678P81137M06647j06942k76252
37614F53181r8231M0415m9064j47647p3688l4830k75399n61845m05658J95815
37604g56951O24300M17905j17396l51820j82338o3430k35773l46301j9587N05102
37594e26289O48414K86690r7273j12683M0748j5231k12224j89684O2309J64956
37584D9733o313r7631J07463K67347K4026l59402l57442J4591K51085J34396l8759
37573a0906l3140J3529l0220n3518k4183j28767l71469m24849j43602J39720J31174
37562i36231L2532J30510K64840J31691j56497k81629k73095l53141m00553j19882
$$ plain form
37634 -244375 -513311 -431709 -159184 -28652 -171954 -412713 -571090 -687680 -845076 -953233
37624 -953233 -898354 -791362 -835165 -954413 -787087 -151409 629728 1036375 929433 653181
37614 653181 554950 595365 546301 398654 324966 290136 14737 -547108 -952766 -756951
37604 -756951 -132651 285254 167858 -183962 -366300 -429730 -665503 -1011804 -1031391 -526289
37594 -526289 122125 408815 311542 198859 239607 224376 12152 -177532 -115223 49733
37584 49733 43420 -54211 53252 320599 344625 -14777 -372219 -357628 -106543 27853 -10906
37573 -10906 -44046 -30517 -60737 -114255 -138438 -267205 -638674 -1063523 -1207125 -1067405 -936231
37562 -936231 -903699 -773189 -508349 -376658 -533155 -814784 -1087879 -1441020 -1841573 -1961455
37552a961455L36134M82687K49724N8280Q3713J2219k98960m65123j64110L54598
37542a312293O58089O63950M96807J74894k19393l74309j36536J73386J87636
37533C12231R935m2703K5968L1396O6847L21645N60376L26957l19397p79703p19888
37522b06336m35496k70669j35831J45076M02540L78981J55068j5825j13779k74420
37512c70691m43692m34091k53872q3863L6108K12627L99916L89939J57153n0313
37502d40779o4010j2819o0795j31878p0365P1116J00147l3194j90307k43559j91359
37491a267802j04558o1518r7070j33130l2182J89692L11131J93162q333q6151
37481a096759q8218j38982j08287J85141N22270M75271P9221j52606m337J42964
$$ plain form
37552 -1961455 -1625321 -1142634 -892910 -834630 -750917 -738698 -1037658 -1502781 -1666891 -1312293
37542 -1312293 -654204 9746 506553 681447 462054 87745 -48791 124595 312231
37533 312231 322166 279463 305431 336827 403674 725319 1285695 1612652 1293255 513552 -206336
37522 -206336 -641832 -912501 -1048332 -903256 -500716 -121735 33333 17508 -96271 -370691
37512 -370691 -814383 -1248474 -1502346 -1586209 -1550101 -1337474 -937558 -547619 -390466 -440779
37502 -440779 -504789 -517608 -578403 -710281 -780646 -709530 -609383 -642577 -832884 -1076443 -1267802
37491 -1267802 -1372360 -1433878 -1530948 -1664078 -1696260 -1506568 -1195437 -1002275 -1010608 -1096759
37481 -1096759 -1184977 -1323959 -1432246 -1247105 -724835 -249564 -170343 -322949 -327286 -184322
37471a84322R668j02608R4752K86683R3712j76523K1399M91615M98559q4882n47928
37460D00125l98547j2389L4353k40003m22289l19755o2060J47371J50511o7998
37450g90681k60277j45766J59260K70858J56443J94120M94468O57439M19911N3919
37440A209694j45756k70805l93090k92794J7194N6736l38404n56094j36817L73068
37430d77068K42420k36513k46565J83085K96641n0586k03998J01348L51459K37638
37420A97861J12975J84141J06246k43679l80526m7756K65107J27840j49663j54273
37410A8273p9586k32763l88673k59298j18985k96450m66248j56116L83314N54585
37400a041947L87022L58938M38330J44673m58411o72496k29224K77724K91646
$$ plain form
37471 -184322 -174654 -277262 -182510 104173 197885 21362 42761 534376 1032935 948053 400125
37460 400125 1578 -10811 23542 -216461 -638750 -958505 -1020565 -873194 -722683 -790681
37450 -790681 -1050958 -1196724 -1037464 -766606 -610163 -416043 78425 735864 1155775 1209694
37440 1209694 1063938 793133 400043 107249 124443 181179 -157225 -713319 -850136 -477068
37430 -477068 -234648 -471161 -717726 -534641 -238000 -288586 -492584 -391236 -39777 197861
37420 197861 310836 494977 601223 357544 -22982 -70738 194369 322209 172546 18273
37410 18273 -61313 -294076 -682749 -942047 -1061032 -1357482 -1823730 -1979846 -1596532 -1041947
37400 -1041947 -654925 -295987 142343 287016 -171395 -843891 -1073115 -795391 -503745
37391e03745K3934l2808J66549L35869L48044K73130J67776Q5282R8484J29558
37381A092073k6502l49221n09368l23959n4533l4999k14716l10081k29205q4894
37371a045405P4171K59274L45221J69129j67745l47159k40722o4741m3933j05814
37361a167724n0109J17444K15977J92907J77596K09002J31585j20211l17689k07819
37351h19041J25360L71815L89136K74258J20338l7551q3256O5824K07081N5099
37341F69063k64473l03903K5445K81681J81642R594M3404K2923l65230q26924
37331e26778q17600l41232J28905L67228N02284N26224K82348o6127j23355J03272
37321C5169J69612r0451l12637k17677L516J25665K48786M47676M69171J20623
$$ plain form
37391 -503745 -479811 -512619 -346070 -10201 337843 610973 778749 864031 962515 1092073
37381 1092073 1065571 716350 206982 -116977 -171510 -206509 -421225 -731306 -960511 -1045405
37371 -1045405 -971234 -711960 -366739 -197610 -365355 -712514 -953236 -1017977 -1061910 -1167724
37361 -1167724 -1217833 -1100389 -884412 -691505 -513909 -304907 -173322 -293533 -611222 -819041
37351 -819041 -693681 -321866 67270 341528 461866 424315 341059 406883 613964 669063
37341 669063 404590 100687 126132 407813 589455 599049 642453 665376 300146 -526778
37331 -526778 -1344378 -1685610 -1556705 -1189477 -687193 -160969 121379 55252 -68103 35169
37321 35169 204781 114330 -198307 -415984 -412468 -286803 -38017 409659 878830 999453
37311I99453l29607m59535k00719J88894M40353L76262k6458m55911m37499M7458
37301A42691L94930J37741l88195n00562q8931L28580L53192J10078p7984q3427
37291C28113P814M3994n6698j88708j48769L5705N1459k17547l85903r3861L51370
37280b73031L33182j41503l97606p2680L72478L69629L5243j19747L2001J78978
37270C16944J39738M9757k735j25252l07602l01567j0558K48441J29336k39691
37260a03189m10779k16718O3133J60594J61099K60306M06049L89043J64165j13402
37250G60301k91612k92687p5796K69915M67578L14872k8703k30843k17798j66758
37240E08469j11375J06528M33711N04896J22154m23911o99611n91037k67154R1219
$$ plain form
37311 999453 669846 210311 9592 198486 638839 1015101 988643 532732 95233 142691
37301 142691 537621 675362 287167 -213395 -302326 26254 379446 489524 411540 328113
37291 328113 335927 379921 323223 134515 -14254 21451 72910 -144637 -530540 -624401 -273031
37280 -273031 60151 -81352 -478958 -551638 -179160 190469 225712 105965 137966 316944
37270 316944 456682 506439 503704 378452 70850 -230717 -241275 7166 136502 -103189
37260 -103189 -513968 -730686 -667553 -506959 -345860 -85554 320495 709538 873703 760301
37250 760301 468689 176002 100206 370121 837699 1152571 1123868 893025 675227 508469
37240 508469 397094 503622 937333 1442229 1564383 1140472 440861 -150176 -417330 -326111
37230c26111L33405L25987J29934K5989J48299K56063Q9581k22090l68151l12496
37220H0410k48115k16461r2233J19515K79630L61968M02192K58806k03691o85510
37210E6511o27831L0490O29739N59449r926m27610l96120j92609j42178j94404
37200g14489j08675J37844K82801R0981l45679o57082n52909j17810K77909L52206
37190a354903J56428m0628m6184J02346K25652K01106P8248R755P6394K03947
37180c87839K58895J84071J6937j72651l12068l33464k16581j8512J71751K95232
37170e14229L25843K50229Q0458j21148k36450j28986K21543N64407N02623l3861
37160I10429n36971m32522J59287N04494J86759l77060n27998j53830L56368O47512
$$ plain form
37230 -326111 7294 333281 463215 489204 637503 893566 983147 761057 392906 80410
37220 80410 -167705 -384166 -476399 -356884 -77254 284714 686906 945712 742021 56511
37210 56511 -571320 -540830 88909 648358 638432 210822 -185298 -377907 -520085 -714489
37200 -714489 -823164 -685320 -402519 -311538 -657217 -1314299 -1867208 -1985018 -1707109 -1354903
37190 -1354903 -1198475 -1239103 -1285287 -1182941 -957289 -756183 -677935 -668180 -591786 -387839
37180 -387839 -128944 55127 72064 -100587 -412655 -746119 -962700 -981212 -809461 -514229
37170 -514229 -188386 61843 142301 21153 -215297 -344283 -122740 441667 944290 910429
37160 910429 373458 -59064 100223 604717 791476 414416 -113582 -267412 88956 736468
37150G36468N70584Q4349o02838r49856n76850J95845O59379N27606J08012k44385
37140E08314m20968l47113K2592L97507L14283j88761m66754j02876M85046N76930
37130G78200M2742o01347q49748o32635k13352O7348J4949k32562k94959J0337
37120a911027M05508M95330K66610M0302M522L4577k7128j35319j58706q5216
37110a070547j1383Q487J8648O9132J18433P7761m8348j35857r5998K5856J69343
37099h74473L47924M85348L28615k04649o87646n60054J16912O37098N08222R741
37089A07038k84534k24280o4500N991q510r0871j92323j22088K42216O64852P33339
37078G66330L39912k06276n29875m84764j54455K33065M05554K61521R681m9156
$$ plain form
37150 736468 1307052 1391401 788563 -161293 -738143 -542298 117081 644687 752699 508314
37140 508314 87346 -259767 -237175 160332 474615 285854 -180900 -283776 201270 778200
37130 778200 820942 219595 -630153 -1262788 -1476140 -1408792 -1393843 -1626405 -1921364 -1911027
37120 -1911027 -1505519 -1010189 -743579 -703277 -698755 -664178 -691306 -826625 -985331 -1070547
37110 -1070547 -1081930 -1073443 -1054795 -985663 -867230 -789469 -837817 -973674 -1069672 -1043816 -874473
37099 -874473 -526549 -41201 287414 82765 -604881 -1164935 -1048023 -410925 97297 107038
37089 107038 -177496 -401776 -466276 -460285 -468795 -559666 -751989 -874077 -631861 32991 766330
37078 766330 1106242 899966 370091 -114673 -269128 -36063 369491 631012 640693 591537
37068E91537J21582K82727K33266r023l09664n38173n91039m42368j88744N3935
37058g95964K72415M77376N72838M57051K14072M6435K9853O4917M2220p2048
37048A309165k61051m19195l54981j8485L20024L26496K1155k65307l39319l12838
37038E664l04088k34444l4174J57308J50858m7373k60067l24597j94095M8912
37028a036096K29013K28046J36306J46197K72022L13544J45814r2322j70798k9661
37018A42065J77232K15803l6761m05377m74873n6178M36604L96811j33801m32627
37008a71102j02440L12415J18736m42830n02797J32009O23481K57517n57188q34989
36998a167188k64781N14314P83705M93843R3196p8965n8707o1326j82485k93195
$$ plain form
37068 591537 713119 995846 1229112 1220089 910425 372252 -218787 -661155 -849899 -795964
37058 -795964 -523549 -46173 526665 983716 1197788 1244223 1274076 1338993 1381213 1309165
37048 1309165 1048114 628919 273938 255453 575477 901973 923128 657821 318502 5664
37038 5664 -298424 -532868 -567042 -409734 -258876 -306249 -566316 -890913 -1085008 -1036096
37028 -1036096 -807083 -579037 -442731 -296534 -24512 289032 434846 342524 171726 142065
37018 142065 319297 535100 498339 92962 -381911 -438089 -1485 395326 261525 -171102
37008 -171102 -273542 38873 157609 -285221 -788018 -656009 -32528 224989 -332199 -1167188
36998 -1167188 -1431969 -917655 -133950 359893 453089 374124 315417 254091 71606 -221589
36988b21589j95332J11664L63186L09664K8156j73534j55646q4283j27406j98998
36978c44118j30593N4378K11742L10261L83380L22020j5774m70431o33905l59163
36968f72203P755Q0221o8065r0069O9796J05882j37778l80045k82160P1072K85354
36957a010240J84834Q921M8302K73404M48033M78959M52461L67214Q1620l83684
36947I49824p08802o28049k83736j6553R0007J97209L10174K22277q8346l31082
36937b87077l20376k47847l33645m34262k61851J44845M37627L95284J35262p6483
36927h48523o2697J70750M24089M34530J52543j70293k76726j78143j3656J89823
$$ plain form
36988 -221589 -416921 -305257 57929 367593 395749 222215 66569 -17714 -145120 -344118
36978 -344118 -474711 -420333 -208591 101670 485050 807070 791296 320865 -313040 -672203
36968 -672203 -664448 -584227 -652292 -742361 -672565 -566683 -704461 -1084506 -1366666 -1295594 -1010240
36957 -1010240 -825406 -816485 -768183 -494779 -46746 432213 884674 1251888 1333508 949824
36947 949824 241022 -387027 -670763 -687316 -597309 -400100 -89926 132351 44005 -287077
36937 -287077 -607453 -855300 -1188945 -1623207 -1885058 -1740213 -1302586 -907302 -772040 -848523
36927 -848523 -911220 -740470 -316381 118149 270692 100399 -176327 -354470 -368126 -178303
$$ [...]
##END NTUPLES=NMR SPECTRUM
##END=
