##TITLE=31P_DE-80H_X3
 64 sc D2O
 26.2.2025
##JCAMPDX= 6.0         $$ Bruker NMR JCAMP-DX V2.0
##DATA TYPE= NMR SPECTRUM
##DATA CLASS= NTUPLES
##ORIGIN= UXNMR, Bruker Analytische Messtechnik GmbH
##OWNER= root
$$ XWIN-NMR		Version 3.5
$$ Mon May 26 10:54:45 2025 Russian Standard Time (UT+4h)  Yarkov@DPX200
##.OBSERVE FREQUENCY= 81.013821
##.OBSERVE NUCLEUS= ^31P
##.ACQUISITION MODE= SIMULTANEOUS
##.ACQUISITION SCHEME= undefined
##.AVERAGES= 64
##.DIGITISER RES= 17
##SPECTROMETER/DATA SYSTEM= spect
##.PULSE SEQUENCE= zgpg30
##.SOLVENT NAME= CDCl3
##.SHIFT REFERENCE= (INTERNAL, CDCl3, 0, 198.062)
##AUDIT TRAIL= $$ (NUMBER, WHEN, WHO, WHERE, WHAT)
$$ ##TITLE= Audit trail, XWIN-NMR		Version 3.5
$$ ##JCAMPDX= 5.01
$$ ##ORIGIN= Bruker BioSpin GmbH
$$ ##OWNER= Yarkov
$$ C:/Bruker/XWIN-NMR/data/yarkov2/nmr/P31/2/pdata/1/auditp.txt
$$ ##AUDIT TRAIL=  $$ (NUMBER, WHEN, WHO, WHERE, WHAT)
(   1,<2025-05-26 10:54:01.85 +0400>,<Yarkov>,<DPX200>,
      <created by zg, POWCHK disabled, PULCHK disabled
       configuration hash MD5:
       00 E9 B6 7A A2 85 ED C7 34 08 36 98 17 FE 4E 26
       data hash MD5: 32K
       AE 64 8E FB 2E 8E 96 37 FA B2 19 00 D9 9A 9D C0>)
(   2,<2025-05-26 10:54:10.87 +0400>,<Yarkov>,<DPX200>,
      <Start of raw data processing
       efp BC_mod = 2 LB = 1.5 FT_mod = 6 PKNL = 1 PHC0 = 1669.046 PHC1 = 70.95951 SI = 64K 
       data hash MD5: 64K
       49 99 6B E5 82 16 FC 47 72 19 FD C9 B2 0A EF FE>)
$$ ##END=
$$ 
$$ hash MD5
$$ 90 E7 1F D0 E7 D1 49 7D 79 63 19 52 A1 DC 51 2B
##$RELAX= 
##$RELAX= 
##$RELAX= 
##$RELAX= 
##$RELAX= 
##$RELAX= 
##$RELAX= 
##$RELAX= 
$$ Bruker specific parameters
$$ --------------------------
##$DU= <C:/Bruker/XWIN-NMR>
##$EXPNO= 2
##$NAME= <P31>
##$PROCNO= 1
##$TYPE= <nmr>
##$USER= <yarkov2>
##$AMP= (0..31)
100 100 100 100 100 100 100 100 100 100 100 100 100 100 100 100 100 100 
100 100 100 100 100 100 100 100 100 100 100 100 100 100 
##$AQSEQ= 0
##$AQ_mod= 1
##$AUNM= <au_zg>
##$AUTOPOS= <>
##$BF1= 81.014009
##$BF2= 200.13
##$BF3= 200.13
##$BF4= 200.13
##$BF5= 200.13
##$BF6= 200.13
##$BF7= 200.13
##$BF8= 200.13
##$BYTORDA= 1
##$CFDGTYP= 0
##$CFRGTYP= 5
##$CHEMSTR= <none>
##$CNST= (0..31)
1 1 145 1 1 1 1 1 1 1 1 1 1 1 1 1 1 1 1 1 1 1 1 1 1 1 1 1 1 1 1 1 
##$CPDPRG= <waltz16>
##$CPDPRG1= <>
##$CPDPRG2= <waltz16>
##$CPDPRG3= <>
##$CPDPRG4= <mlev>
##$CPDPRG5= <mlev>
##$CPDPRG6= <mlev>
##$CPDPRG7= <mlev>
##$CPDPRG8= <mlev>
##$CPDPRGB= <>
##$CPDPRGT= <>
##$D= (0..31)
0 1 0 0 0 0 0 0 0 0.06 0 0.03 2e-05 3e-06 0 0 0.0002 0 0 0 0 0 0 0 0 0 
0 0 0 0 0 0 
##$DATE= 1748242441
##$DBL= (0..7)
120 120 120 11 120 120 24 19 
##$DBP= (0..7)
150 150 150 150 150 150 150 150 
##$DBP07= 0
##$DBPNAM0= <>
##$DBPNAM1= <>
##$DBPNAM2= <>
##$DBPNAM3= <>
##$DBPNAM4= <>
##$DBPNAM5= <>
##$DBPNAM6= <>
##$DBPNAM7= <>
##$DBPOAL= (0..7)
0.5 0.5 0.5 0.5 0.5 0.5 0.5 0.5 
##$DBPOFFS= (0..7)
0 0 0 0 0 0 0 0 
##$DE= 6
##$DECBNUC= <off>
##$DECIM= 4
##$DECNUC= <off>
##$DECSTAT= 4
##$DIGMOD= 1
##$DIGTYP= 9
##$DL= (0..7)
0 0 52 120 120 21 21 25 
$$ [...]
##$SUBNAM2= <"">
##$SUBNAM3= <"">
##$SUBNAM4= <"">
##$SUBNAM5= <"">
##$SUBNAM6= <"">
##$SUBNAM7= <"">
##$SUBNAM8= <"">
##$SUBNAM9= <"">
##$SW= 400.765351723535
##$SWIBOX= (0..15)
0 1 3 0 0 0 0 0 0 0 0 0 0 0 0 0 
##$SW_h= 32467.5324675325
##$TD= 32768
##$TD0= 1
##$TE= 0
##$TE2= 300
##$TE3= 300
##$TEG= 300
##$TL= (0..7)
0 120 53 12 22 120 120 120 
##$TP= (0..7)
150 150 150 150 150 150 150 150 
##$TP07= 0
##$TPNAME0= <>
##$TPNAME1= <>
##$TPNAME2= <>
##$TPNAME3= <>
##$TPNAME4= <>
##$TPNAME5= <>
##$TPNAME6= <>
##$TPNAME7= <>
##$TPOAL= (0..7)
0.5 0.5 0.5 0.5 0.5 0.5 0.5 0.5 
##$TPOFFS= (0..7)
0 0 0 0 0 0 0 0 
##$TUNHIN= 0
##$TUNHOUT= 0
##$TUNXOUT= 0
##$USERA1= <user>
##$USERA2= <user>
##$USERA3= <user>
##$USERA4= <user>
##$USERA5= <user>
##$V9= 5
##$VALIST= <valist>
##$VCLIST= <CCCCCCCCCCCCCCC>
##$VD= 0
##$VDLIST= <DDDDDDDDDDDDDDD>
##$VPLIST= <PPPPPPPPPPPPPPP>
##$VTLIST= <TTTTTTTTTTTTTTT>
##$WBST= 1024
##$WBSW= 4
##$XGAIN= (0..3)
0 0 0 0 
##$XL= 0
##$YL= 0
##$YMAX_a= 740
##$YMIN_a= -872
##$ZGOPTNS= <>
##$ZL1= 120
##$ZL2= 120
##$ZL3= 120
##$ZL4= 120
##$ABSF1= 0
##$ABSF2= 0
##$ABSG= 0
##$ABSL= 0
##$ALPHA= 0
##$AQORDER= 0
##$ASSFAC= 0
##$ASSFACI= 0
##$ASSFACX= 0
##$ASSWID= 0
##$AUNMP= <proc_1d>
##$AZFE= 0.1
##$AZFW= 0.5
##$BCFW= 0
##$BC_mod= 2
##$BYTORDP= 0
##$COROFFS= 0
##$CY= -3
##$DATMOD= 1
##$DC= 0
##$DFILT= <>
##$DTYPP= 0
##$F1P= 0
##$F2P= 0
##$FCOR= 1
##$FTSIZE= 65536
##$FT_mod= 6
##$GAMMA= 0
##$GB= 0
##$INTBC= 1
##$INTSCL= 9.790993e-09
##$ISEN= 30
##$LB= 1.5
##$LEV0= 0
##$LPBIN= 0
##$MAXI= 10000
##$MC2= 0
##$MEAN= 0
##$ME_mod= 0
##$MI= 50
##$NCOEF= 0
##$NC_proc= -11
##$NLEV= 6
##$NOISF1= 182.463
##$NOISF2= 159.3651
##$NSP= 0
##$NTH_PI= 0
##$NZP= 0
##$OFFSET= 198.0616
##$PC= 4
##$PHC0= 1669.046
##$PHC1= 70.95951
##$PH_mod= 1
##$PKNL= yes
##$PPARMOD= 0
##$PSCAL= 0
##$PSIGN= 0
##$REVERSE= no
##$SF= 81.0140089999434
##$SI= 65536
##$SIGF1= 159.3651
##$SIGF2= -187.1042
##$SINO= 113.3802
##$SIOLD= 16384
##$SREGLST= <1H.CDCl3>
##$SSB= 0
##$STSI= 65536
##$STSR= 0
##$SW_p= 32467.5324675325
##$SYMM= 0
##$S_DEV= 0
##$TDeff= 32768
##$TDoff= 0
##$TI= <>
##$TILT= no
##$TM1= 0
##$TM2= 0
##$TOPLEV= 0
##$USERP1= <user>
##$USERP2= <user>
##$USERP3= <user>
##$USERP4= <user>
##$USERP5= <user>
##$WDW= 1
##$XDIM= 65536
##$YMAX_p= 505120211
##$YMIN_p= -61107469
$$ End of Bruker specific parameters
$$ ---------------------------------
##NTUPLES= NMR SPECTRUM
##VAR_NAME=  FREQUENCY,     SPECTRUM/REAL,   SPECTRUM/IMAG
##SYMBOL=    X,             R,               I
##VAR_TYPE=  INDEPENDENT,   DEPENDENT,       DEPENDENT
##VAR_FORM=  AFFN,          ASDF,            ASDF
##VAR_DIM=   65536,         65536,           65536
##UNITS=     HZ,            ARBITRARY UNITS, ARBITRARY UNITS
##FACTOR=    0.49542278885378, 1,            1
##FIRST=     16045.7642231865, 0,            0
##LAST=      -16421.768244346, 0,            0
##MIN=       -16421.768244346, -61107469,    0
##MAX=       16045.7642231865, 505120211,    0
$$ Real data points
##PAGE= N=1
##DATA TABLE= (X++(R..R)), XYDATA
$$ [...]
$$ plain form
45360 -1433681 -1815089 -2030271 -2113448 -2386874 -2786905 -2683758 -1640362 -67648 1131962
45351 1131962 1419698 972477 354192 -4936 -95190 -186927 -382614 -407913 614 646992
45341 646992 1082236 1130446 887987 371131 -355043 -806410 -474798 322497 624939 93062
45331 93062 -478731 -213770 800986 1848574 2440024 2440423 1851892 989339 475409 543398
45321 543398 693585 522523 446429 956906 1579239 1437944 669682 354438 996772 1930912
45311 1930912 2430388 2600759 2787644 2779782 2173043 1147251 352387 176758 477454 911752
45301 911752 1263923 1526813 1836383 2249191 2527508 2333454 1716147 1173864 1102490 1390441
45291 1390441 1691843 1895557 2163298 2637431 3203211 3427453 2785344 1232567 -458044
$$ packed form
45360a433681l81408k15182q3177k73426m00031J03147J043396J572714J199610
45351A131962K87736m47221o18285l59128r0254r1737j95687k5299M08527O46378
45341F46992M35244M8210k42459n16856p26174m51367L31612P97295L02442n31877
45331I3062n71793K64961J014756J047588N91450L99n88531q62553n13930O7989
45321E43398J50187j71062p6094N10477O22333j41295p68262l15244O42334R34140
45311A930912M99476J70371J86885p862o06739j025792p94864j75629L00696M34298
45301I11752L52171K62890L09570M12808K78317j94054o17307n42283p1374K87951
45291A390441L01402K03714K67741M74133N65780K24242o42109j552777j690611
$$ plain form
45282 -458044 -1327630 -1303752 -1230254 -1660077 -2101760 -1816639 -942438 -307596 -350067 -732466
45272 -732466 -958103 -925069 -834613 -857756 -943978 -836280 -412778 -131044 -757363 -2285693
45262 -2285693 -3517059 -3338451 -2181934 -1453896 -1606015 -1691985 -1025436 -290190 -406666
45253 -406666 -1062038 -1218952 -662913 -163668 -251344 -647011 -942102 -1114626 -1187482 -976876
45243 -976876 -454933 81985 453571 824167 1277659 1554183 1470010 1246458 1141423 1086559
45233 1086559 991739 1066011 1439702 1733506 1450364 657658 -93753 -405138 -268117 130811
45223 130811 464736 345715 -185137 -450810 21885 643369 475215 -231423 -84678 1592896
45213 1592896 3748819 4895413 4739565 3942191 2885558 1535253 212139 -427852 -262309
$$ packed form
45282d58044q69586K3878P3498m29823m41683K85121Q74201O34842m2471l82399
45272g32466k25637L3034R0456k3143q6222J07698M23502K81734o26319j528330
45262b285693j231366J78608J156517P28038j52119q5970O66549P35246j16476
45253d06666o55372j56914N56039M99245q7676l95667k95091j72524p2856K10606
45243i76876N21943N36918L71586L70596M53492K76524q4173k23552j05035n4864
45233A086559r4820P4272L73691K93804k83142p92706p51411l11385J37021L98928
45223A30811L33925j19021n30852k65673M72695O21484j68154p06638J46745J677574
45213A592896K155923J146594j55848p97374j056633j350305j323114o39991J65543
$$ plain form
45204 -262309 110446 184864 33964 -117423 -273267 -406091 -256799 308924 1013239 1461634
45194 1461634 1522971 1287549 920953 723511 1022223 1720252 2180739 1892507 1133043 651700
45184 651700 757093 1060041 1154272 1189595 1546210 2163531 2518454 2260075 1603488 1003496
45174 1003496 644540 408449 170474 -121773 -562291 -1154934 -1551556 -1265430 -287165
45165 -287165 798761 1482833 1812614 1975465 1779442 1033820 230560 211416 1067591 1890088
45155 1890088 1834342 1041750 272307 6385 237780 803131 1410072 1497930 652566 -723050
45145 -723050 -1601692 -1440081 -785658 -497975 -627657 -479313 313802 1254606 1643388 1389833
45135 1389833 924300 591275 450641 480735 597298 557030 220650 -114476 -40856 266347
$$ packed form
45204b62309L72755P4418j50900j51387j55844j32824J49292N65723P04315M48395
45194A461634O1337k35422l66596j97442K98712O98029M60487k88232p59464m81343
45184F51700J05393L02948R4231L5323L56615O17321L54923k58379o56587n99992
45174A003496l58956k36091k37975k92247m40518n92643l96622K86126R78265
45165b87165J085926O84072L29781J62851j96023p45622q03260j9144Q56175Q22497
45155A890088n5746p92592p69443k65922K31395N65351O06941Q7858q45364j375616
45145g23050q78642J61611O54423K87683j29682J48344P93115R40804L88782k53555
45135A389833m65533l33025j40634L0094J16563m0268l36380l35126P3620L07203
$$ plain form
45125 266347 126344 -706176 -1575004 -1673638 -963673 -46995 615256 982462 1091446 864155
45115 864155 329393 -216099 -395113 -51505 630202 1276267 1639141 1765264 1808330 1796827
45105 1796827 1739281 1757066 1786888 1370867 275838 -825504 -1015302 -468023 -266569 -739562
45095 -739562 -1018418 -651354 -482182 -1112681 -1602920 -911000 231072 333236 -530239
45086 -530239 -1008814 -791852 -913708 -1685751 -2073063 -1592293 -1235162 -1744056 -2321643 -1982805
45076 -1982805 -1080514 -484956 -146610 480912 1269608 1662281 1583107 1264032 669597 -111074
45066 -111074 -434229 97812 895541 1264934 1495205 2136649 2724518 2369786 1324214
45057 1324214 766319 1088155 1503438 1436085 1232407 1233579 1097285 507653 -120156 -141049
$$ packed form
45125B66347j40003q32520q68828r8634P09965R16678O62251L67206J08984k27291
45115H64155n34762n45492j79014L43608O81707O46065L62874J26123M3066j1503
45105A796827n7546J7785K9822m16021j095029j101342j89798N47279K01454m72993
45095g39562k78856L67064J69172o30499m90239O91920J142072J02164q63475
45086e30239m78575K16962j21856p72043l87312M80770L57131n08894n77587L38838
45076a982805R02291N95558L38346O27522P88696L92673p9174l19075n94435p80671
45066a11074l23155N32041P97729L69393K30271O41444N87869l54732j045572
45057A324214n57895L21836M15283o7353k03678J172j36294n89632o27809k0893
$$ plain form
45047 -141049 512803 1375219 2010256 2279660 2238532 1946959 1369675 529357 -236504 -490901
45037 -490901 -313957 -267404 -487522 -378046 359163 1027837 944050 558545 727528 1336121
45027 1336121 1594858 1316759 863450 157929 -1049901 -2110909 -1983461 -884284 -173409
45018 -173409 -388669 -638410 -282549 45880 -333130 -1009460 -1274491 -1159531 -1013879 -827243
45008 -827243 -588330 -565862 -646588 -178847 892398 1540893 1049984 147293 -57628 406678
44998 406678 784247 903658 1096065 1257090 1026278 686733 959954 1956295 3033816
44989 3033816 3619381 3604568 3126904 2530016 2287570 2374814 2019035 734462 -712830
44980 -712830 -1148729 -573731 -73938 -250999 -570032 -325958 473775 1344667 1872252 1881487
$$ packed form
45047a41049O53852Q62416O35037K69404m1128k91573n77284q40318p65861k54397
45037d90901J76944M6553k20118J09476P37209O68674q3787l85505J68983O08593
45027A336121K58737k78099m53309p05521j207830j061008J27448J099177P10875
45018a73409k15260k49741L55861L28429l79010o76330k65031J14960J45652J86636
45008h27243K38913K2468q0726M67741J071245O48495m90909r02691k04921M64306
44998D06678L77569J19411J92407J61025k30812l39545K73221R96341J077521
44989C033816N85565j4813m77664n96888k42446Q7244l55779j284573j447292
44980g12830m35899N74998M99793j77061l19033K44074P99733Q70892N27585R235
$$ plain form
44970 1881487 1497766 1121732 1024443 1030769 898088 772087 864498 982265 883546 775696
44960 775696 872696 827930 333592 -79621 258037 917637 860528 58213 -466887 -263699
44950 -263699 20475 -48003 -10832 392009 523098 -89362 -850233 -1010722 -801471 -869688
44940 -869688 -1108884 -865053 -8275 908404 1385408 1315916 763578 -87578 -866788 -1290868
44930 -1290868 -1401776 -1300121 -924103 -370932 -47127 -84852 9422 605335 1206051 1126406
44920 1126406 681811 885273 1915363 2688219 2295217 1242023 706017 926382 1023617
44911 1023617 420265 -234835 19446 1009298 1548764 1003401 61034 -352224 -289999 -315377
44901 -315377 -310030 313562 1325321 1611935 676620 -625414 -1297928 -1451372 -1753818 -2193136
$$ packed form
44970A881487l83721l76034r7289O326j32681j26001R2411J17767r8719j07850
44960G75696R7000m4766m94338m13213L37658O59600n7109q02315n25100K03188
44950b63699K84174o8478L7171M02841J31089o12460p60871j60489K09251o8217
44940h69688k39196K43831Q56778R16679M77004o9492n52338q51156p79210m24080
44930a290868j10908J01655L76018N53171L23805l7725R4274N95913O00716p9645
44920A126406m44595K03462J030090P72856l93002j053194n36006K20365R7235
44911A023617o03352o55100K54281R89852N39466n45363r42367m13258O2225k5378
44901c15377N347O23592J011759K86614r35315j302034o72514j53444l02446m39318
$$ plain form
44891 -2193136 -2142501 -1427324 -651703 -447219 -805879 -1162615 -907908 56415 1064574
44882 1064574 1202688 316242 -734653 -1054255 -640594 -89754 211825 208989 -86574 -443007
44872 -443007 -317719 479776 1286797 1386384 1091906 1295148 2037487 2378635 1825672 1093573
44862 1093573 1084167 1725521 2274905 2332872 2084423 1818809 1673094 1739015 2053500 2464964
44852 2464964 2703098 2597572 2174227 1620423 1206338 1119692 1302007 1520501 1603373 1498745
44842 1498745 1152518 528174 -240077 -906552 -1371597 -1740302 -2118036 -2481958 -2735801
44833 -2735801 -2774492 -2573606 -2330206 -2320277 -2409688 -1999299 -860682 241838 372633 -247779
44823 -247779 -458228 233755 1034633 1130023 789525 679609 721887 385744 -253794 -545290
$$ packed form
44891b193136N0635P15177P75621K04484l58660l56736K54707R64323J008159
44882A064574J38114q86446j050895l19602M13661N50840L01579k836k95563l56433
44872d43007J25288P97495Q07021R9587k94478K03242P42339L41148n52963p32099
44862A093573r406O41354N49384N7967k48449k65614j45715O5921L14485M11464
44852B464964K38134j05526m23345n53804m14085q6646J82315K18494Q2872j04628
44842A498745l46227o24344p68251o66475m65045l68705l77734l63922k53843
44833b735801l8691K00886K43400R929q9411M10389J138617J102520J30795o20412
44823b47779k10449O91983Q00878R5390l40498j09916M2278l36143o39538k91496
$$ plain form
44813 -545290 -249041 169447 261200 84927 -60090 65663 631203 1564191 2339209 2403428
44803 2403428 1926108 1683000 2041048 2486942 2373093 1718664 989358 462803 185568
44794 185568 251984 642632 910772 506381 -520624 -1465615 -1722452 -1373500 -928848 -645747
44784 -645747 -260865 605850 1845032 2762571 2735857 1944223 1205616 1014832 1048553 805983
44774 805983 368803 136800 114638 23229 -39472 280622 793525 807018 192693 -286718
44764 -286718 -122036 114884 -303829 -1019665 -1058539 -286515 419018 413397 -52102 -504287
44754 -504287 -875526 -1202676 -1278213 -956039 -442327 -44409 44323 -397424 -1483056 -2714679
44744 -2714679 -3131833 -2339469 -1014814 -88816 144025 -208790 -1136600 -2345283 -2858585
$$ packed form
44813e45290K96249M18488R1753j76273j45017J25753N65540R32988P75018O4219
44803B403428m77320k43108L58048M45894j13849o54429p29306n26555k77235
44794A85568O6416L90648K68140m04391j027005r44991k56837L48952M44652K83101
44784f45747L84882Q66715J239182R17539k6714p91634p38607j90784L3721k42570
44774H05983m37180k32003k2162r1409o2701L20094N12903J3493o14325m79411
44764b86718J64682K36920m18713p15836l8874P72024P05533n621m65499m52185
44754e04287l71239l27150p5537L22174N13712L97918Q8732m41747j085632j231623
44744b714679m17154P92364J324655R25998K32841l52815r27810j208683n13302
$$ plain form
44735 -2858585 -1905686 -130975 873053 378835 -707750 -1017751 -143731 1239785 2178006
44726 2178006 2143872 1346944 555346 323667 320623 -198255 -1211567 -1797397 -1412200 -709543
44716 -709543 -624828 -1124517 -1472796 -1405937 -1297785 -1265948 -926968 -245614 92852 -352455
44706 -352455 -911505 -532581 789926 1917587 1942215 1146609 438218 310719 676693
44697 676693 1293698 1836125 1791750 918318 -199840 -634532 -280279 1714 -399873 -1074344
44687 -1074344 -1388578 -1449242 -1640022 -1660681 -903726 326452 870837 219569 -749700 -917335
44677 -917335 -272162 342510 443167 317399 388451 701406 1104619 1561173 2100644 2652231
44667 2652231 3088269 3354008 3442734 3296816 2858947 2209474 1496210 686010 -377489
$$ packed form
44735b858585R52899J774711J004028m94218j086585l10001Q74020J383516R38221
44726B178006l4134p96928p91598k31679l044n18878j013312n85830L85197P02657
44716g09543Q4715m99689l48279O6859J08152L1837L38980O81354L38466m45307
44706c52455n59050L78924J322507J127661K4628p95606p08391j27499L65974
44697F76693O17005N42427m4375q73432j118158m34692L54253K81993m01587o74471
44687a074344l14234o0664j90780k0659P56955J230178N44385o51268r69269j67635
44677i17335O45173O14672J00657j25768P1052L12955M03213M56554N39471N51587
44667B652231M36038K65739Q8726j45918m37869o49473p13264q10200j063499
$$ plain form
44658 -377489 -1474317 -1853209 -1073367 83130 214416 -953794 -2061736 -1801174 -531716
44649 -531716 413968 521346 310277 83297 -436242 -1138248 -1255977 -474123 491836 903636
44639 903636 939084 1127717 1432062 1470141 1209990 863325 425131 -137034 -519725 -438202
44629 -438202 -118362 43393 82987 267023 547703 738344 984556 1460887 1790008 1463447
44619 1463447 802487 780792 1737266 2874909 3279146 2911190 2277326 1569135 608115
44610 608115 -549454 -1407454 -1512810 -945200 -219242 263366 577023 1000355 1433725
44601 1433725 1341339 422812 -870110 -1736061 -1821813 -1390710 -832327 -299697 222101 764704
44591 764704 1308733 1712624 1793015 1629248 1605983 1914003 2217851 2146865 1906999 1964707
$$ packed form
44658c77489j096828l78892P79842J156497J31286j168210j107942K60562J269458
44649e31716R45684J07378k11069k26980n19539p02006j17729P81854R65959M11800
44639I03636L5448J88633L04345L8079k60151l46665m38194n62165l82691Q1523
44629d38202L19840J61755L9594J84036K80680J90641K46212M76331L29121l26561
44619A463447o60960k1695R56474J137643M04237l67956o33864p08191r61020
44610F08115j157569q58000j05356N67610P25958M82608L13657M23332M33370
44601A433725r2386r18527j292922q65951q5752M31103N58383N32630N21798N42603
44591G64704N44029M03891Q0391j63767k3265L08020L03848p0986k39866N7708
$$ plain form
44581 1964707 2266228 2301875 1929456 1581231 1532901 1475308 1050593 419428 17029 20498
44571 20498 299103 669442 978155 1103809 1070226 1045079 1114867 1184535 1153719 1023913 790737
44560 790737 441924 125255 89701 351832 600688 522903 82841 -520903 -971923 -935756
44550 -935756 -354181 304808 415564 -63483 -515966 -496870 -354975 -796169 -1998456 -3363742
44540 -3363742 -4072271 -3813893 -3086145 -2754782 -3113134 -3423319 -2722354 -1085816 351181
44531 351181 754193 483103 359306 532679 569495 349422 258456 522690 869875 989714
44521 989714 964014 1026597 1112224 888929 196484 -722228 -1471363 -1858965 -1895007 -1559710
44511 -1559710 -860965 -133151 146410 104208 619669 2206833 3996624 4492460 3307303
$$ packed form
44581A964707L01521L5647l72419l48225m8330n7593m24715o31165m02399L469
44571B0498K78605L70339L08713J25654l3583k5147O9788O9668l0816j29806k33176
44560G90737l48813l16669l5554K62131K48856p7785m40062o03744m51020L6167
44550i35756N81575O58989J10756m79047m52483J9096J41895m41194j202287j365286
44540c363742p08529K58378P27748L31363l58352l10185P00965J636538J436997
44531C51181M03012k71090j23797J73373L6816k20073r0966K64234L47185J19839
44521I89714k5700O2583Q5627k23295o92445r18712p49135l87602l6042L35297
44511a559710O98745P27814K79561m2202N15461J587164J789791M95836j185157
$$ plain form
44502 3307303 1530670 356975 37062 282647 872947 1468385 1547685 1089610 779819
44493 779819 1006248 1172872 612842 -316698 -774982 -688004 -681468 -1029863 -1456582 -1788751
44483 -1788751 -1996201 -1706172 -578000 812699 1386034 1053730 915477 1596181 2232835
44474 2232835 1732767 415522 -356990 112771 1196939 1879901 1779857 1179356 485359
44465 485359 -103674 -529908 -667361 -331750 395426 991866 955575 452102 166520 440465
44455 440465 937050 1299215 1673926 2251663 2696936 2549466 1975674 1584401 1564694 1530425
44445 1530425 1266244 1095625 1280476 1497185 1298545 842689 720383 1121073 1575041
44436 1575041 1585254 1154293 531089 -208701 -1007009 -1501022 -1332300 -762629 -532516 -951666
$$ packed form
44502C307303j776633j173695l19913K45585N90300N95438P9300m58075l09791
44493G79819K26429J66624n60030r29540m58284Q6978O536l48395m26719l32169
44483a788751k07450K90029J128172J390699N73335l32304j38253O80704O36654
44474B232835n00068j317245p72512M69761J084168O82962j00044o00501o93997
44465D85359n89033m26234j37453L35611P27176N96440l6291n03473k85582K73945
44455D40465M96585L62165L74711N77737M45273j47470n73792l91273j9707l4269
44445A530425k64181j70619J84851K16709j98640m55856j22306M00690M53968
44436A575041J0213m30961o23204p39790p98308m94013J68722N69671K30113m19150
$$ plain form
44426 -951666 -1473427 -1386635 -655287 177833 690015 871486 857177 692120 374407 -62661
44416 -62661 -541793 -969748 -1356695 -1895423 -2680181 -3311292 -3169936 -2291277 -1564112 -1722492
44406 -1722492 -2475670 -3005579 -2954622 -2449929 -1541650 -282807 876981 1493145 1789796
44397 1789796 2231838 2595254 2301311 1611765 1493515 2114316 2484005 2001444 1408521
44388 1408521 1572539 2105337 1980281 994336 -134971 -753410 -700151 -124357 473734
44379 473734 350874 -659937 -1701964 -1886055 -1436183 -1204675 -1396747 -1568464 -1601590
44370 -1601590 -1734688 -1747674 -1135023 -170955 206546 -167554 -328110 314411 1006173 813091
44360 813091 23873 -372500 -112077 235011 285485 203155 142328 8747 -182994 -237103
$$ packed form
44426i51666n21761Q6792P31348Q33120N12182J81471j4309j65057l17713m37068
44416f2661m79132m27955l86947n38728p84758o31111J41356Q78659P27165j58380
44406a722492p53178n29909N0957N04693R08279J258843J159788O16164K96651
44397A789796M42042L63416k93943o89546j18250O20801L69689m82561n92923
44388A408521J64018N32798j25056r85945j129307o18439N3259N75794N98091
44379D73734j22860j010811j042027j84091M49872K31508j92072j71717l3126
44370a601590j33098j2986O12651R64068L77501l74100j60556O42521O91762j93082
44360H13091p89218l96373K60423L47088N0474q2330o0827j33581j91741n4109
$$ plain form
44350 -237103 -136088 -72241 -87778 -49674 15101 -46828 -112247 177379 851975 1433827 1464163
44339 1464163 940115 152837 -593403 -1023650 -1039831 -978548 -1323234 -1956500 -2144060 -1557665
44329 -1557665 -813290 -533633 -395652 190693 892228 903761 380686 278442 682604 566892
44319 566892 -343621 -776602 141662 1315089 1335955 809462 1382347 2945501 3687720
44310 3687720 2980038 2298687 2713155 3228067 2666047 1725293 1741788 2418181 2355415 1290742
44300 1290742 289724 -62641 -244502 -548493 -551379 -101681 251026 223633 341126 1070107
44290 1070107 2068049 2697022 2768644 2462801 1971168 1494357 1185626 889990 309682 -472024
44280 -472024 -1057756 -1359417 -1615614 -1732317 -1267372 -270413 513580 584553 258245 -6634
$$ packed form
44350b37103J01015O3847j5537L8104O4775o1929o5419K89626O74596N81852L0336
44339A464163n24048p87278p46240m30247j6181O1283l44686o33266j87560N86395
44329a557665P44375K79657J37981N86345P01535J1533n23075j02244M04162j15712
44319E66892r10513m32981R18264J173427K0866n26493N72885J563154P42219
44310C687720p07682o81351M14468N14912n62020r40754J6495O76393o2766j064673
44300A290742j001018l52365j81861l03991k886M49698L52707k7393J17493P28981
44290A070107R97942O28973P1622l05843m91633m76811l08731k95636n80308p81706
44280d72024n85732l01661k56197j16703M64945R96959P83993P0973l26308k64879
$$ plain form
44270 -6634 -260271 -658893 -971428 -962045 -818884 -744699 -523289 48804 667330 929177
44260 929177 936135 1066687 1437230 1972850 2659761 3282770 3278922 2416805 1376780 1086198
44250 1086198 1618748 2260967 2535324 2608980 2711509 2673773 2205097 1342308 499794 166513
44240 166513 506398 1201582 1840609 2446163 3266510 4037982 4081334 3403855 3008488 3539725
44230 3539725 4197066 3723853 2059735 240104 -991408 -1594228 -1520629 -647816 512810
44221 512810 988448 528878 -48325 66544 806795 1554740 1736055 995715 -532013
44212 -532013 -1947308 -2262768 -1595557 -1020756 -1022003 -898822 -117723 613818 360028 -570838
44202 -570838 -1025808 -553136 255952 811662 1129953 1334909 1219089 576590 -375470 -1151596
$$ packed form
44270f634k53637l98622l12535R383J43161P4185K21410N72093O18526K61847
44260I29177O958J30552L70543N35620O86911O23009l848q62117j040025k90582
44250A086198N32550O42219K74357P3656J02529l7736m68676q62789q42514l33281
44240A66513L39885O95184O39027O05554Q20347P71472M3352o77479l95367N31237
44230C539725O57341m73213j664118j819631j231512o02820P3599Q72813J160626
44221E12810M75638m59570n77203J14869P40251P47945J81315p40340j527728
44212e32013j415295l15460O67211N74801j247J23181P81099P31541k53790r30866
44202e70838m54970M72672Q09088N55710L18291K04956j15820o42499r52060p76126
$$ plain form
44192 -1151596 -1451736 -1379973 -1281984 -1365155 -1470622 -1327859 -1009024 -867227 -963458 -892802
44182 -892802 -359588 385024 905012 1095061 1097987 988631 792427 546348 114324 -714538
44172 -714538 -1678135 -2030586 -1498119 -824872 -816060 -1211764 -1207183 -816506 -848269 -1537319
44162 -1537319 -2084959 -1817817 -1067000 -498470 -171758 225608 646558 783103 695758 803357
44152 803357 1257349 1725817 1858596 1686652 1495475 1525405 1875070 2494880 3104339 3208015
44142 3208015 2418392 878067 -717903 -1668900 -1863563 -1729167 -1594988 -1309638 -602232
44133 -602232 388785 1201193 1577480 1653157 1628055 1489130 1131959 605015 144471 -6541
44123 -6541 148865 249053 -146427 -1029627 -1834744 -2035218 -1706828 -1281968 -928793 -499482
$$ packed form
44192a151596l00140P1763R7989q3171j05467J42763L18835J41797r6231P0656
44182h92802N33214P44612N19988J90049K926j09356j96204k46079m32024q28862
44172g14538r63597l52451N32467O73247Q812l95704M581L90677l1763o89050
44162a537319n47640K67142P50817N68530L26712L97366M20950J36545q7345J07599
44152H03357M53992M68468J32779j71944j91177K9930L49665O19810O09459J03676
44142C208015p89623j540325j595970r50997j94663J34396J34179K85350P07406
44133f02232R91017Q12408L76287P5677k5102j38925l57171n26944m60544j51012
44123f541J55406J00188l95480q83200q05117k00474L28390M24860L53175M29311
$$ plain form
44113 -499482 54194 634270 1295454 2114138 2738208 2591054 1685088 748085 296628 38023
44103 38023 -488051 -1122749 -1414522 -1402894 -1500160 -1723888 -1617913 -989175 -246497 170896
44093 170896 364397 739126 1368232 1812349 1577143 689531 -213769 -446771 40466 638602
44083 638602 776389 451292 -29656 -549755 -1149626 -1718563 -2090718 -2328462 -2532923 -2475673
44073 -2475673 -1876587 -1025556 -594688 -694019 -621677 172727 1298486 1940909 1822831 1256303
44063 1256303 523556 -298408 -1020353 -1347474 -1274810 -1156116 -1308838 -1744214 -2238278 -2440263
44053 -2440263 -2026010 -1085230 -281147 -202779 -550495 -436408 396965 1164882 1098218 427230
44043 427230 -103089 -294569 -488098 -703457 -466079 410135 1397157 1837222 1591658 900404
$$ packed form
44113d99482N53676N80076O61184Q18684O24070j47154r05966r37003m51457k58605
44103C8023n26074o34698k91773J1628r7266k23728J05975O28738P42678M17393
44093A70896J93501L74729O29106M44117k35206q87612r03300k33002M87237N98136
44083F38602J37787l25097m80948n20099n99871n68937l72155k37744k04461N7250
44073b475673N99086Q51031M30868r9331P2342P94404J125759O42423j18078n66528
44063A256303p32747q21964p21945l27121P2664J18694j52722m35376m94064k01985
44053b440263M14253R40780Q04083P8368l47716J14087Q33373P67917o6664o70988
44043D27230n30319j91480j93529k15359K37378Q76214R87022M40065k45564o91254
$$ plain form
44033 900404 -46287 -1069255 -1780141 -1822015 -1326304 -843711 -763902 -980658 -1151055 -1098522
44023 -1098522 -902373 -758486 -848393 -1206218 -1580653 -1529255 -825145 251923 1181100 1748108
44013 1748108 2146083 2493943 2502461 1837417 691546 -275993 -589004 -352563 4806 164084
44003 164084 30293 -338875 -732880 -846560 -523550 84160 669239 1015445 1088557 1067232
43993 1067232 1335958 2172005 3254640 3749765 3183608 2054051 1248568 1008688 859416
43984 859416 447946 -53859 -422563 -735933 -1044293 -1136082 -954466 -895766 -1271695 -1689386
43974 -1689386 -1447670 -516382 341827 571355 567705 1102666 2192274 2953898 2678238 1707059
43964 1707059 968652 837362 845268 484335 -172057 -797950 -1306477 -1682082 -1686896 -1175100
$$ packed form
44033I00404r46691j022968p10886m1874M95711M82593P9809k16756j70397N2533
44023a098522J96149J43887q9907l57825l74435N1398P04110J077068R29177N67008
44013A748108L97975L47860Q518o65044j145871r67539l13011K36441L57369J59278
44003A64084j33791l69168l94005j13680L23010O07710N85079L46206P3112k1325
43993A067232K68726Q36047J082635M95125n66157j129557q05483k39880j49272
43984H59416m11470n01805l68704l13370l08360r1789J81616N8700l75929m17691
43974a689386K41716R31288Q58209K29528l650N34961J089608P61624k75660r71179
43964A707059p38407j31290P906l60933o56392o25893n08527l75605m814N11796
$$ plain form
43954 -1175100 -455104 110436 644548 1397218 2067359 2116345 1648009 1276809 1128696 737194
43944 737194 48378 -296945 4643 376552 298575 90771 211986 396576 161902 -287379
43934 -287379 -359186 30646 474919 718881 740300 478473 25799 -219788 -135458 -238892
43924 -238892 -875535 -1473995 -1360106 -896802 -890786 -1178065 -888936 -20567 414553 -20021
43914 -20021 -510656 -266868 427840 860752 836216 561449 239394 155515 563515 1136333
43904 1136333 1116618 319020 -622303 -1253828 -1813787 -2419025 -2585269 -2091377 -1545609 -1443908
43894 -1443908 -1372265 -886934 -532057 -1070248 -2137256 -2582104 -1906785 -574696 875639
43885 875639 2188840 2991370 2888545 2091692 1359728 1203125 1534023 2039243 2474361
$$ packed form
43954a175100P19996N65540N34112P52670O70141M8986m68336l71200j48113l91502
43944G37194o88816l45323L01588L71909p7977k07804J21215J84590k34674m49281
43934b87379p1807L89832M44273K43962K1419k61827m52674k45587Q4330j03434
43924b38892o36643n98460J13889M63304O016k87279K89129Q68369M35120m34574
43914b0021m90635K43788O94708M32912k4536k74767l22055q3879M08000N72818
43904A136333j9715p97598r41323o31525n59959o05238j66244M93892N45768J01701
43894a443908P1643M85331L54877n38191j067008m44848O75319J332089J450335
43885H75639J313201Q02530j02825p96853p31964j56603L30898N05220M35118
$$ plain form
43876 2474361 2680554 2724695 2910240 3287664 3373289 2759178 1725528 805751 108841 -382761
43866 -382761 -293211 586752 1546254 1652989 1045769 681613 957758 1502373 2155579 3008950
43856 3008950 3458494 2548291 644265 -497604 -28382 707684 95101 -1404805 -1947923
43847 -1947923 -867447 589651 984091 210376 -815007 -1292813 -1117275 -711292 -518145
43838 -518145 -566814 -561552 -413125 -391586 -596956 -653841 -237388 432329 967085 1338286
43828 1338286 1623758 1591263 1072653 478409 336607 496777 408007 48976 -117485 -71436
43818 -71436 -314392 -857357 -950143 -263908 332750 -148713 -1349618 -1890171 -1042347 555159
43808 555159 1872383 2570143 2890896 2973875 2712437 2088708 1259401 334535 -654129 -1548232
$$ packed form
43876B474361K06193M4141J85545L77424Q5625o14111j033650r19777o96910m91602
43866c82761Q9550Q79963R59502J06735o07220l64156K76145N44615O53206Q53371
43856C008950M49544r10203j904026j141869M69222P36066o12583j499906n43118
43847a947923J080476J457098L94440p73715j025383m77806J75538M05983J93147
43838e18145m8669N262J48427K1539k05370n6885M16453O69717N34756L71201
43828A338286K85472l2495n18610n94244j41802J60170q8770l59031j66461M6049
43818g1436k42956n42965r2786O86235N96658m81463j200905n40553Q47824J597506
43808E55159J317224O97760L20753Q2979k61438o23729q29307r24866r88664q94103
$$ plain form
43798 -1548232 -2063864 -2092338 -1869851 -1759450 -1906441 -2118758 -2051226 -1565035 -970014 -786623
43788 -786623 -1122870 -1443512 -1202629 -539393 31274 470450 1162198 1961304 2013854 905561
43778 905561 -590103 -1424585 -1471248 -1222825 -715822 446008 2133632 3518547 3946059
43769 3946059 3473416 2557808 1718591 1432791 1757361 2043939 1606626 672234 67638
43760 67638 4430 -95692 -537222 -951982 -1132897 -1390619 -1759755 -1716553 -1145395 -760960
43750 -760960 -991979 -1217947 -802066 -166881 -32536 -211074 -92088 160640 -68887 -629540
43740 -629540 -764382 -387563 -185257 -399986 -491965 -217615 -145165 -711737 -1478174 -1768615
43730 -1768615 -1520906 -1084353 -620609 -153261 110649 -31374 -416787 -705968 -866696
$$ packed form
43798a548232n15632k8474K22487J10401j46991k12317O7532M86191N95021J83391
43788g86623l36247l20642K40883O63236N70667M39176O91748P99106N2550j108293
43778I05561j495664q34482m6663K48423N07003J161830J687624J384915M27512
43769C946059m72643r15608q39217k85800L24570K86578m37313r34392o04596
43760F7638o3208j00122m41530m14760j80915k57722l69136M3202N71158L84435
43750g60960k31019k25968M15881O35185J34345j78538J18986K52728k29527n60653
43740f29540j34842L76819K02306k14729r1979K74350P2450n66572p66437k90441
43730a768615K47709M36553M63744M67348K63910j42023l85413k89181j60728
$$ plain form
43721 -866696 -1178765 -1721111 -2059021 -1613181 -369429 920486 1463890 1325695 1283318
43712 1283318 1715827 2087742 1813688 1162388 790029 732422 529760 177583 204475 728284
43702 728284 1092754 699316 -234275 -970159 -991135 -301896 719069 1628760 2262124 2773106
43692 2773106 3178831 3077735 2207424 1087212 539329 617836 610721 149726 -318135 -330757
43682 -330757 -50161 206771 522497 1030111 1410504 1225440 553715 -118965 -567369 -1042287
43672 -1042287 -1749371 -2294534 -1863360 -152030 1901969 2731955 1800942 310276 -209654
43663 -209654 310426 745233 546674 295484 431557 457453 -134788 -920828 -1149797 -817684
43653 -817684 -577526 -867141 -1532439 -2086269 -2100245 -1645723 -1486928 -2357306 -3839594 -4549557
$$ packed form
43721h66696l12069n42346l37910M45840J243752J289915N43404j38195m2377
43712A283318M32509L71915k74054o51300l72359n7607k02662l52177K6892N23809
43702G28284L64470l93438r33591p35884k0976O89239J020965R09691O33364N10982
43692B773106M05725j01096q70311j120212n47883P8507p115m60995m67861j2622
43682c30757K80596K56932L15726N07614L80393j85064o71725o72680m48404m74918
43672a042287p07084n45163M31174J711330K053999Q29986r31013j490666n19930
43663b09654N20080M34807j98559k51190J36073K5896n92241p86040k28969L32113
43653h17684K40158k89615o65298n53830j3976M54522J58795q70378j482288p09963
$$ plain form
43643 -4549557 -3765885 -2283714 -1238398 -738695 -273570 142174 103667 -210320 -70806
43634 -70806 821739 2048562 3150124 3994136 4432929 4181696 3263510 2228661 1707448
43625 1707448 1851708 2256337 2356707 1946207 1331993 893550 618426 391178 555628
43616 555628 1514147 2719987 2923097 1787057 451873 -48073 -113586 -596090 -1281500
43607 -1281500 -1388382 -1002898 -821308 -771162 -137365 979203 1531183 1053244 295534
43598 295534 40939 185430 323055 426859 559643 609167 688190 1165879 1952428 2368133
43588 2368133 2079400 1568394 1317375 1151012 813237 569469 672802 738972 284589 -449477
43578 -449477 -804773 -616332 -302816 -201694 -262778 -300192 -179027 168099 624522 890423
$$ packed form
43643d549557P83672J482171J045316M99703M65125M15744l8507l13987J39514
43634g0806Q92545J226823J101562Q44012M38793k51233r18186j034849n21213
43625A707448J44260M04629J00370m10500o14214m38443k75124k27248J64450
43616E55628R58519J205840K03110j136040j335184m99946o5513m82504o85410
43607a281500j06882L85484J81590N0146O33797J116568N51980m77939p57710
43598B95534k54595J44491J37625J03804J32784M9524P9023M77689P86549M15705
43588B368133k88733n11006k51019j66363l37775k43768J03333O6170m54383p34066
43578d49477l55296J88441L13516J01122o1084l7414J21165L47126M56423K65901
$$ plain form
43568 890423 827326 661565 649840 739793 775893 810704 947215 1085576 1121618 1209830 1492335
43557 1492335 1685755 1309669 372248 -417148 -246230 1010880 2578791 3348975 2778661
43548 2778661 1336881 90638 -134638 711298 1904641 2381552 1568272 87287 -740844
43539 -740844 -496215 -267667 -1020276 -1921734 -1415042 308361 1324702 671536 -399233
43530 -399233 -454615 160835 332947 9813 -189529 -363443 -967395 -1588413 -1444326 -809354
43520 -809354 -599652 -700282 -123640 1110701 1746573 1325123 1010964 1649334 2260985
43511 2260985 1563796 83308 -560568 -7936 528016 240684 -240129 -154198 110734
43502 110734 -201354 -789368 -586276 644872 1829528 1924976 1147606 471251 342881
$$ packed form
43568H90423o3097j65761j1725Q9953L6100L4811J36511J38361L6042Q8212K82505
43557A492335J93420l76086r37421p89396J70918J257110J567911P70184n70314
43548B778661j441780j246243k25276Q45936J193343M76911q13280j480985q28131
43539g40844K44629K28548p52609r01458N06692J723403J016341o53166j070769
43530c99233n5382O15450J72112l23134j99342j73914o03952o21018J44087O34972
43520h09354K09702j00630N76642J234341O35872m21450l14159O38370O11651
43511B260985o97189j480488o43876N52632N35952k87332m80813Q5931K64932
43502A10734l12088n88014K03092J231148J184656R5448p77370o76355j28370
$$ plain form
43493 342881 437156 439059 425823 470388 468497 517444 930082 1618597 1945241 1521958 766549
43482 766549 333520 380663 750986 1435367 2342325 2951872 2791532 2089338 1464474 1131481
43472 1131481 862727 554633 361417 414717 798913 1561692 2363994 2519536 1919439 1467159
43462 1467159 1898408 2639869 2733396 2441630 2760262 3597707 3829574 3206959 2758345 2965257
43452 2965257 2990176 2329170 1835673 2192007 2598227 2130214 1386910 1463860 2057645 2047155
43442 2047155 1483444 1474787 2207969 2517857 1620458 89672 -1176824 -1926766 -2139764
43433 -2139764 -1602105 -410710 787955 1525996 1961363 2305842 2406456 2228950 2146490
43424 2146490 2328532 2395598 2153012 2156970 2967320 4185772 4822192 4418516 3324014 2065114
$$ packed form
43493C42881R4275J903j3236M4565j891M8947M12638O88515L26644m23283p55409
43482G66549m33029M7143L70323O84381R06958O09547j60340p02194o24864l32993
43472A131481k68754l08094j93216N3300L84196P62779Q02302J55542o00097m52280
43462A467159M31249P41461R3527k91766L18632Q37445K31867o22615m48614K06912
43452B965257K4919o61006m93497L56334M06220m68013p43304P6950N93785j0490
43442B047155n63711q657P33182L09888q97399j530786j266496p49942k12998
43433b139764N37659J191395J198665P38041M35367L44479J00614j77506q2460
43424B146490J82042O7066k42586L958Q10350J218452O36420m03676j094502j258900
$$ plain form
43414 2065114 989743 431204 622296 1300541 1812449 1825496 1698497 1968679 2643200
43405 2643200 3196498 3202002 2774390 2336039 2093698 1918288 1698848 1552467 1553735 1498956
43395 1498956 1209691 916717 1006182 1452429 1860212 2053454 2226641 2456341 2488254 2176804
43385 2176804 1756107 1452883 1178460 869213 790726 1139948 1599151 1694689 1442857 1224707
43375 1224707 1105989 743368 51809 -427736 -81557 1022818 2177479 2837641 3223860
43366 3223860 3977435 5247858 6385479 6744582 6550112 6531103 6796880 6697101 5943122
43357 5943122 5183501 5021501 5044515 4494071 3490694 2788343 2522441 2099022 1362170
43348 1362170 965651 1278683 1704388 1593735 1262704 1501443 2414188 3306278 3546262
$$ packed form
43414B065114j075371n58539J91092O78245N11908J3047j26999K70182O74521
43405B643200N53298N504m27612m38351k42341j75410k19440j46381J268n4779
43395A498956k89265k92974Q9465M46247M07783J93242J73187K29700L1913l11450
43385B176804m20697l03224k74423l09247p8487L49222M59203R5538k51832k18150
43375A224707j18718l62621o91559m79545L46179J104375J154661O60162L86219
43366C223860P53575J270423J137621L59103j94470j9009K65777r9779p53979
43357E943122p59621j62000K3014n50444j003377p02351k65902m23419p36852
43348A362170l96519L13032M25705j10653l31031K38739R12745Q92090K39984
$$ plain form
43339 3546262 3100052 2359338 1835419 1898169 2444012 2893960 2808935 2387801 2081265 1907066
43329 1907066 1541053 985224 736907 1263689 2543745 4051640 5013810 4939884 4248962
43320 4248962 4075097 4950357 5967904 5943738 5193507 5201227 6454063 7700031 7854345
43311 7854345 7665089 8605651 10753887 12837393 14164855 15500312 17897593 21463054
43303 21463054 25571991 29754947 34017838 38629765 43956242 50437576 58542302 68508798
43295 68508798 79638254 89518662 94516057 92089623 82974841 70641956 58458264 47763188
43287 47763188 38535281 30841317 24946800 20638328 17324700 14689341 12677997 11021329
43279 11021329 9403377 8049971 7492048 7599629 7413070 6230773 4477865 3166234
$$ packed form
43339C546262m46210p40714n23919O2750N45843M49948q5025m21134l06536j74199
43329A907066l66013n55829k48317N26782J280056J507895R62170p3926o90922
43320D248962j73865Q75260J017547k4166p50231P720J252836J245968J54314
43311G854345j89256R40562K148236K083506J327462J335457K397281L565461
43303B1463054M108937M182956M262891M611927N326477O481334Q104726R966496
43295F8508798J1129456R880408M997395k426434r114782j2332885j2183692j0695076
43287D7763188r227907p693964n894517m308472l313628k635359k011344j656668
43279A1021329j617952j353406n57923J07581j86559j182297j752908j311631
$$ plain form
43271 3166234 2750432 2846818 2909284 2804264 2716149 2786959 2968316 3071922 2878127 2331957
43261 2331957 1736446 1608557 2143869 2868194 3023770 2322271 1154214 97584 -474474
43252 -474474 -263112 994553 3060325 4991814 5884824 5734371 5221223 4835734 4646471
43243 4646471 4693009 4940597 4923601 4200046 3261124 3200754 4225738 5264447 5417303 5011704
43233 5011704 4733838 4548945 4209359 4085378 4545486 5043773 4822223 4135675 3779722
43224 3779722 3742846 3417507 2883998 2760124 2880611 2432646 1471932 942691 954456 484160
43214 484160 -714830 -1364639 -613121 602659 1132921 1300683 1771385 1878952 694688
43205 694688 -964029 -1339423 -260635 758954 894484 906992 1474079 2101142 2171595
$$ packed form
43271C166234m15802R6386O2466j05020q8115P0810J81357J03606j93795n46170
43261B331957n95511j27889N35312P24325J55576p01499j168057j056630n72058
43252d74474K11362J257665K065772J931489Q93010j50453n13148l85489j89263
43243D646471M6538K47588j6996p23555r38922o0370J024984J038709J52856m05599
43233E011704k77866j84893l39586j23981M60108M98287k21550o86548l55953
43224C779722l6876l25339n33509j23874J20487m47965r60714n29241J1765m70296
43214D84160j198990o49809P51518J215780N30262J67762M70702J07567j184264
43205F94688j658717l75394J078788J019589J35530J2508N67087O27063P0453
$$ plain form
43196 2171595 1869453 1510758 983810 402879 387108 1101502 1821450 1980659 1867939 1798005
43186 1798005 1497532 949132 895285 1628589 2136638 1546435 743147 1252101 2886415
43177 2886415 3896077 3423506 2456464 2062637 1951660 1436370 810199 828368 1365753
43168 1365753 1526095 929413 156653 -100938 231585 814443 1321952 1470436 1013088
43159 1013088 48942 -827099 -993309 -410371 430636 1134440 1735287 2365244 2859583
43150 2859583 2886804 2345122 1491934 810021 823797 1742687 3020024 3578019 2930040 1883512
43140 1883512 1593255 2065295 2278888 1755533 1151950 1073796 1211166 1181120 1397070 2274313
43130 2274313 3171242 3133985 2423269 2296714 3278155 4516936 4982494 4525357 3590894
$$ packed form
43196B171595l02142l58695n26948n80931j5771P14394P19948J59209j12720o9934
43186A798005l00473n48400n3847P33304N08049n90203q03288N08954J634314
43177B886415J009662m72571r67042l93827j10977n15290o26171J8169N37385
43168A365753J60342n96682p72760k57591L32523N82858N07509J48484m57348
43159A013088r64146q76041j66210N82938Q41007P03804O00847O29957M94339
43150B859583K7221n41682q53188o81913J3776R18890J277337N57995o47979j046528
43140A883512k90257M72040K13593n23355o03583p8154J37370l0046K15950Q77243
43130B274313Q96929l7257p10716j26555R81441J238781M65558m57137r34463
$$ plain form
43121 3590894 2645481 2187554 2635683 3739468 4560361 4461274 3789392 3265567 3061636
43112 3061636 2849390 2456059 2044773 1783548 1660123 1559768 1337649 912995 413047
43103 413047 89551 32152 169117 579262 1470828 2717927 3746978 4086291 3780098
43094 3780098 3137323 2410914 1892511 1913347 2436445 2957431 3123968 3183564 3526168 4078595
43084 4078595 4484170 4599641 4460187 4044028 3484353 3240639 3570890 4026455 3966412 3425779
43074 3425779 2975683 2868647 2894991 3002672 3398796 3961767 4204455 4043077 4014995 4392502
43064 4392502 4590140 3940982 2748443 2037340 2340341 3139186 3525909 3120450 2287179
43055 2287179 1687804 1737990 2372375 3196401 3832915 4141954 4166747 3972572 3602160 3163540
$$ packed form
43121C590894r45413m57927M48129J103785Q20893r9087o71882n23825k03931
43112C061636k12246l93331m11286k61225j23425j00355k22119m24654m99948
43103D13047l23496n7399J36965M10145Q91566J247099J029051L39313l06193
43094C780098o42775p26409n18403K0836N23098N20986J66537N9596L42604N52427
43084D078595M05575J15471j39454m16159n59675k43714L30251M55565o0043n40633
43074C425779m50096j07036K6344J07681L96124N62971K42688j61378k8082L77507
43064D392502J97638o49158j192539p11103L03001P98845L86723m05459q33271
43055B287179n99375N0186O34385Q24026O36514L09039K4793j94175l70412m38620
$$ plain form
43045 3163540 2909702 3171061 4102354 5422620 6484974 6749297 6216838 5360444 4689592
43036 4689592 4477280 4825279 5784874 7344190 9399522 11791726 14311009 16651114 18435108
43027 18435108 19333031 19145212 17805211 15402722 12292470 9181107 6953109 6125535
43019 6125535 6313180 6427620 5709129 4517135 3829565 4029677 4557471 4742698 4510718
43010 4510718 4160974 3952067 4116006 4765339 5482380 5539482 4945616 4715508 5503086 6461421
43000 6461421 6231585 4741907 3202807 2518491 2572235 2981412 3577646 3990170 3685439
42991 3685439 2804673 2259045 2598868 3354238 3832516 4017841 4320801 4933258 5803831
42982 5803831 6865197 8032919 9371879 11341942 14240189 17278264 19158530 20092617
$$ packed form
43045C163540k53838K61359R31293J320266J062354K64323n32459q56394o70852
43036D689592k12312L47999R59595J559316K055332K392204K519283K340105J783994
43027A8435108Q97923j87819j340001k402489l110252l111363k227998q27574
43019F125535J87645J14440p18491j191994o87570K00112N27794J85227k31980
43010D510718l49744k08907J63939O49333P17041N7102n93866k30108P87578R58335
43000F461421k29836j489678j539100o84316N3744M09177N96234M12524l04731
42991C685439q80766n45628L39823P55370M78278J85325L02960O12457Q70573
42982E803831J061366J167722J338960J970063K898247L038075J880266R34087
$$ plain form
42974 20092617 22375704 28090077 36706555 45628703 52527068 56310972 56446503 52745631
42966 52745631 46098939 38586353 32490805 29401165 29895167 33257160 37492207 40396109
42958 40396109 40892999 39035398 35017406 29066890 22288516 16513651 12730024 10244459
42950 10244459 7867695 5437581 3707970 3171155 3555933 4263846 4806202 4912260 4613129
42941 4613129 4209573 3898295 3495016 2777782 2025778 1888291 2626258 3694415 4232166
42932 4232166 3899912 3112454 2479186 2179604 1971480 1645189 1244944 927235 890935 1395546
42922 1395546 2430138 3302365 3082061 1719084 229684 -587924 -1083357 -1857963 -2498764
42913 -2498764 -2097441 -778162 278902 392654 64921 -92778 -257175 -803724 -1511316
$$ packed form
42974B0092617K283087N714373Q616478Q922148O898365L783904J35531l700872
42966E2745631o646692p512586o095548l089640M94002L361993M235047K903902
42958D0396109M96890j857601m017992n950516o778374n774865l783627k485565
42950A0244459k376764k430114j729611n36815L84778P07913N42356J06058k99131
42941D613129m03556l11278m03279p17234p52004j37487P37967J068157N37751
42932D232166l32254p87458o33268k99582k08124l26291m00245l17709l6300N04611
42922A395546J034592Q72227k20304j362977j489400q17608m95433p74606o40801
42913b498764M01323J319279J057064J13752l27733j57699j64397n46549p07592
$$ plain form
42904 -1511316 -1882955 -1786822 -1303014 -339131 1083231 2408676 2886712 2261166 906766
42895 906766 -522507 -1398314 -1385680 -729955 -113631 -12905 -340678 -775799 -1102339 -1112119
42885 -1112119 -629605 113319 566497 634163 902246 1693918 2362933 2100474 1128660 462441
42875 462441 638179 1258223 1723392 1858946 1778725 1600477 1411544 1223604 945112 633565
42865 633565 642595 1164044 1749795 1742308 1157915 699129 859561 1455988 2131360 2862263
42855 2862263 3735870 4562719 5036188 5193816 5560180 6829393 9329444 12611441 15568354
42846 15568354 17141506 16970096 15363479 12903681 10312770 8397103 7552247 7280619
42838 7280619 6618954 5141433 3254173 1552914 334025 -250229 -130269 345657 498087
$$ packed form
42904a511316l71639R6133M83808R63883J422362J325445M78036o25546j354400
42895I06766j429273q75807J2634O55725O16324J00726l27773m35121l26540r780
42885a112119M82514P42924M53178O7666K68083P91672O69015k62459r71814o66219
42875D62441J75738O20044M65169J35554q0221j78248j88933j87940k78492l11547
42865F33565R030N21449N85751p487n84393m58786J60432N96427O75372P30903
42855B862263Q73607Q26849M73469J57628L66364J269213K500051L281997K956913
42846A5568354J573152j71410j606617k459798k590911j915667q44856k71628
42838G280619o61665j477521j887260j701259j218889n84254J19960M75926J52430
$$ plain form
42829 498087 99857 -253054 102799 1034484 1840873 2119658 2050889 1976274 2047346 2198387
42819 2198387 2167771 1642300 679357 -117249 -186512 284505 617323 586644 659581 1160972
42809 1160972 1655126 1509819 797366 195421 66280 57162 -285550 -844839 -1105211 -802240
42799 -802240 -137243 583155 1264012 1940416 2569380 2997077 3053636 2674113 2047459 1632317
42789 1632317 1820479 2517066 3238104 3678021 3918543 3967090 3481081 2316940 1063603
42780 1063603 493332 574234 600649 348078 447976 1312256 2268296 2332887 1533946 841898
42770 841898 871776 1230751 1243202 845077 553778 872982 1907468 3294967 4345255
42761 4345255 4494695 3811140 2872172 2084583 1453028 1097346 1408834 2262190 2619725
$$ packed form
42829D98087l98230l52911L55853R31685Q06389K78785o8769p4615P1072J51041
42819B198387l0616n25471r62943p96606o9263M71017L32818l0679P2937N01391
42809A160972M94154j45307p12453o01945j29141r118l42712n59289k60372L02971
42799h02240O64997P20398O80857O76404O28964M27697N6559l79523o26654m15142
42789A632317J88162O96587P21038M39917K40522M8547m86009j164141j253337
42780A063603n70271Q0902K6415k52571R9898Q64280R56040O4591p98941o92048
42770H41898K9878L58975J2451l98125k91299L19204J034486J387499J050288
42761D345255J49440o83555r38968p87589o31555l55682L11488Q53356L57535
$$ plain form
42752 2619725 1697433 267128 -115269 785339 1491948 850701 -437371 -938669 -412962
42743 -412962 235026 451015 483668 521010 396055 279996 745590 1775171 2449849 2131315
42733 2131315 1411931 1339107 2058135 2762300 2771189 2174891 1527216 1316663 1692949 2376895
42723 2376895 2837013 2780653 2443085 2241266 2257209 2243931 2010454 1587598 1105596 694839
42713 694839 440207 322119 316219 592470 1347676 2310978 2760616 2331389 1569338 1374366
42703 1374366 2056029 3172386 4061842 4261314 3691641 2821337 2432765 2831927 3478894
42694 3478894 3763057 3847194 4219921 4679496 4484309 3477484 2353942 1686059 1325548
42685 1325548 995473 878218 1240331 1893931 2424767 2697405 2831486 2902707 2948969 3097117
$$ packed form
42752B619725r22292j430305l82397R00608P06609o41247j288072n01298N25707
42743d12962O47988K15989L2653L7342j24955j16059M65594J029581O74678l18534
42733B131315p19384p2824P19028P04165Q889n96298o47675k10553L76286O83946
42723B376895M60118n6360l37568k01819J5943j3278k33477m22856m82002m10757
42713F94839k54632j18088n900K76251P55206R63302M49638m29227p62051j94972
42703A374366O81663J116357Q89456J99472n69673q70304l88572L99162O46967
42694C478894K84163Q4137L72727M59575j95187j006825j123542o67883l60511
42685A325548l30075j17255L62113O53600N30836K72638J34081P1221M6262J48148
$$ plain form
42675 3097117 3421071 3767800 3892884 3689934 3222549 2689173 2410731 2620631 3133221
42666 3133221 3407428 3088085 2370871 1764077 1628957 1980578 2539104 2918337 2971447 3027029
42656 3027029 3577460 4632542 5555660 5653047 4840110 3726878 3165203 3627841 4801197
42647 4801197 5821210 6122238 5967280 5906837 5942264 5702755 5298553 5299981 5750072 5894223
42637 5894223 5235287 4280997 3789027 3755972 3737570 3832417 4629323 6181844 7609308 7927151
42627 7927151 7010108 5626076 4714964 4718413 5452969 6461066 7405076 8140808 8607310
42618 8607310 8873916 9180707 9581202 9576866 8577703 6855765 5526213 5249471 5393234
42609 5393234 4968649 4086833 3866580 4947524 6656371 7796281 7876885 7367068 6995140
$$ packed form
42675C097117L23954L46729J25084k02950m67385n33376k78442K09900N12590
42666C133221K74207l19343p17214o06794j35120L51621N58526L79233N3110N5582
42656C027029N50431J055082R23118R7387q12937j113232n61675M62638J173356
42647D801197J020013L01028j54958o0443L5427k39509m04202J428M50091J44151
42637E894223o58936r54290m91970l3055j8402R4847P96906J552521J427464L17843
42627G927151r17043j384032r11112L449P34556J008097R44010P35732M66502
42618H607310K66606L06791M00495m336r99163j721938j329552k76742J43763
42609E393234m24585q81816k20253J080944J708847J139910Q0604n09817l71928
$$ plain form
42600 6995140 7034391 7187567 7023910 6525685 6199905 6564589 7516093 8338616 8451092 8101373
42590 8101373 8190059 9341953 11224813 12890655 13732082 13918953 13915631 13901852 13870926 14019333
42580 14019333 14670361 15888862 17455089 19149526 20801325 22168571 23124736 23946380
42572 23946380 25103960 26777223 28867808 31443129 34801808 39063710 44042325 49637405
42564 49637405 56099066 63774737 72771468 83082908 95202998 110658405 131682398
42557 131682398 160208216 197852589 247397285 312146989 389397948 462745492 505120211
42550 505120211 495995192 438156147 356020798 276828515 214315462 168389827 134384116
42543 134384116 108847862 89405471 74197509 62562255 54344612 48309431 42664525
$$ packed form
42600F995140L9251J53176j63657m98225l25780L64684R51504Q22523J12476l49719
42590H101373Q8686J151894J882860J665842Q41427J86871l322j3779l0926J48407
42580A4019333O51028J218501J566227J694437J651799J367246R56165Q21644
42572B3946380J157580J673263K090585K575321L358679M261902M978615N595080
42564D9637405O461661P675671Q996731J0311440J2120090J5455407K1023993
42557A31682398K8525818L7644373M9544696O4749704P7250959P3347544M2374719
42550E05120211r125019n7839045q2135349p9192283o2513053m5925635l4005711
42543A34384116k5536254j9442391j5207962j1635254q217643o035181n644906
$$ plain form
42536 42664525 36987174 32169507 28545872 25392744 22185673 19096866 16273729 13700226
42528 13700226 11661327 10338670 9146815 7450572 5627456 4404925 3596144 2666517
42520 2666517 2035017 2382451 3074909 2882474 2031486 1840060 2391116 2379858 1434700 754053
42510 754053 1014721 1383126 1187717 932547 949512 627884 -163937 -381761 457979 1161721
42500 1161721 580780 -665748 -1290638 -1189888 -1110117 -1311153 -1609934 -2029305 -2440166
42491 -2440166 -2244124 -1300434 -469454 -384419 -434209 153720 1021988 1466761 1746882 2492243
42481 2492243 3403964 3654583 3133375 2325652 1450483 656293 481324 1057103 1407090
42472 1407090 691033 -329638 -282244 763311 1517020 1455295 1213314 1081235 505531
$$ packed form
42536D2664525n677351m817667l623635l153128l207071l088807k823137k573503
42528A3700226k038899j322657j191855j696243j823116j222531q08781r29627
42520B666517o31500L47434O92458j92435q50988j91426N51056j1258r45158o80647
42510G54053K60668L68405j95409k55170J6965l21628p91821k17824Q39740P03742
42500A161721n80941j246528o24890J00750P9771k01036k98781m19371m10861
42491b440166J96042R43690Q30980Q5035m9790N87929Q68268M44773K80121P45361
42481B492243R11721K50619n21208q07723q75169p94190j74969N75779L49987
42472A407090p16057j020671M7394J045555P53709o1725k41981j32079n75704
$$ plain form
42463 505531 -694286 -1795095 -2191880 -2010896 -1434232 -305602 1246981 2531126 2980848
42454 2980848 2612847 1668374 383879 -784196 -1333389 -1290625 -1119553 -989333 -664072
42445 -664072 -163599 56714 -243801 -711873 -840579 -516072 -109803 -230830 -1207846 -2553023
42435 -2553023 -3236548 -2833725 -2030173 -1612587 -1481621 -1206355 -954268 -1088153 -1342031
42426 -1342031 -1280225 -1150270 -1350638 -1465490 -861383 118777 667336 865002 1258614 1370019
42416 1370019 145096 -2050552 -3396270 -2942121 -1682048 -899225 -666718 -497995 -345184
42407 -345184 -320052 -330179 -501683 -1115823 -1777267 -1649083 -894821 -737095 -1534705 -2001712
42397 -2001712 -1115418 306799 870828 483560 -44750 -428122 -822474 -992727 -728124
$$ packed form
42463E05531j199817j100809l96785J80984N76664J128630J552583J284145M49722
42454B980848l68001r44473j284495j168075n49193M2764J71072J30220L25261
42445f64072N00473K20313l00515m68072j28706L24507M06269j21027r77016j345177
42435b553023o83525M02823Q03552M17586J30966K75266K52087j33885k53878
42426a342031O1806J29955k00368j14852O04107R80160N48559J97666L93612J11405
42416A370019j224923k195648j345718M54149J260073P82823K32507J68723J52811
42407c45184K5132j0127j71504o14140o61444J28184P54262J57726p97610m67007
42397b001712Q86294J422217N64029l87268n28310l83372l94352j70253K64603
$$ plain form
42388 -728124 -619656 -1293682 -2180729 -2123584 -1056755 -119268 -161511 -975566 -1940900 -2601008
42378 -2601008 -2567571 -1654414 -343085 433592 222262 -529050 -1054101 -1020180 -685827 -521631
42368 -521631 -688328 -838427 -564134 -14138 260888 90579 -147906 -228669 -380507 -701797
42358 -701797 -873006 -731467 -533164 -334860 228058 1160213 1781894 1654065 1166516 724280
42348 724280 98488 -802467 -1295545 -851339 6104 561830 1024911 1850786 2569019 2393085
42338 2393085 1568184 979099 709176 113644 -873661 -1647668 -2071559 -2619246 -3373775
42329 -3373775 -3913464 -4215458 -4618178 -4809562 -3980483 -2257404 -934512 -855308 -1432637
42320 -1432637 -1698970 -1522629 -1302320 -1172110 -1071305 -1087851 -1229070 -1212240 -848909 -339548
$$ packed form
42388g28124J08468o74026q87047N7145J066829R37487m2243q14055r65334o60108
42378b601008L3437R13157J311329P76677k11330p51312n25051L3921L34353J64196
42368e21631j66697j50099K74293N49996K75026j70309k38485q0763j51838l21290
42358g01797j71209J41539J98303J98304N62918R32155O21681j27829m87549m42236
42348G24280o25792r00955m93078M44206Q57443N55726M63081Q25875P18233j75934
42338B393085q24901n89085k69923n95532r87305p74007m23891n47687p54529
42329c373775n39689l01994m02720j91384Q29079J723079J322892P9204n77329
42320a432637k66333J76341K20309J30210J00805j6546j41219J6830L63331N09361
$$ plain form
42310 -339548 32030 178410 72541 -281455 -664417 -832333 -896504 -1069579 -1143880 -842963
42300 -842963 -576822 -1014346 -1864250 -2007785 -1067373 68692 614039 848050 1241601
42291 1241601 1532221 1340044 948398 734870 472090 -28085 -170771 600752 1641690
42282 1641690 1734910 726735 -343364 -728517 -784222 -1166983 -1921349 -2646274 -3082959
42273 -3082959 -3208608 -3016525 -2493447 -1748264 -1019395 -520358 -247387 45122 556859
42264 556859 1120697 1342571 1077356 546618 -17577 -538218 -873018 -821952 -479440 -201752
42254 -201752 -94045 61700 253926 149896 -229044 -342237 9294 269479 50521 -153204
42244 -153204 177141 585799 352682 -198524 -83513 817183 1607110 1773773 1762356 1929751
$$ packed form
42310c39548L71578J46380j05869l53996l82962j67916o4171j73075p4301L00917
42300h42963K66141m37524q49904j43535R40412J136065N45347K34011L93551
42291A241601K90620j92177l91646k13528k62780n00175j42686P71523J040938
42282A641690R3220j008175j070099l85153n5705l82761p54366p24925m36685
42273c082959j25649J92083N23078P45183P28869M99037K72971K92509N11737
42264E56859N63838K21874k65215n30738n64195n20641l34800N1066L42512K77688
42254b01752J07707J55745J92226j04030l78940j13193L51531K60185k18958k03725
42244a53204L30345M08658k33117n51206J15011R00696P89927J66663j1417J67395
$$ plain form
42234 1929751 1859019 1184033 355764 -21057 -117984 -537008 -1339843 -1986071 -2094334 -1816478
42224 -1816478 -1531898 -1505156 -1750210 -1947796 -1643296 -838157 -202248 -284006 -653571 -386762
42214 -386762 572055 1146772 497583 -871311 -1800632 -1852428 -1423707 -793855 147531 1217387
42204 1217387 1813821 1801179 1828726 2263020 2403838 1488389 63310 -549417 -38950 570071
42194 570071 514404 295733 655302 1328293 1535828 1242674 1094528 1234933 985480 -69925
42184 -69925 -1240998 -1404128 -323529 1076993 1777844 1695376 1465394 1429990 1272928 707880
42174 707880 30919 -354604 -577619 -953000 -1257855 -993813 -281741 183885 127722 -27590
42164 -27590 -20024 -201245 -847255 -1622060 -2062551 -2062201 -1593185 -591364 497750 763992
$$ packed form
42234A929751p0732o74986q28269l76821r6927m19024q02835o46228j08263K77856
42224a816478K84580K6742k45054j97586L04500Q05139O35909q1758l69565K66809
42214c86762R58817N74717o49189j368894r29321n1796M28721O29852R41386J069856
42204A217387N96434j2642K7547M34294J40818r15449j425079o12727N10467O09021
42194E70071n5667k18671L59569O72991K07535k93154j48146J40405k49453j055405
42184f9925j171073j63130J080599J400522P00851q2468k29982l5404j57062n65048
42174G07880o76961l85523k23015l75381l04855K64042P12072M65626n6163j55312
42164b7590P566j81221o46010p74805m40491L50M69016J001821J089114K66242
$$ plain form
42154 763992 2875 -772513 -659510 -149102 -299514 -1099224 -1584292 -1339270 -950118 -998932
42144 -998932 -1398375 -1754163 -1729757 -1074783 66224 926606 860341 249644 -10433 182633
42134 182633 170635 -193772 -304400 14407 112028 -305655 -542235 -35307 687806 873034
42124 873034 706083 821805 1097181 773161 -392635 -1782569 -2674041 -2813435 -2294047
42115 -2294047 -1352290 -341705 405116 750614 714474 458417 418806 1060077 2158905
42106 2158905 2678059 1824140 37926 -1495946 -2146757 -2199055 -2092942 -1879605 -1485751
42097 -1485751 -1049944 -796737 -780853 -824595 -608943 36759 743979 742145 -252124 -1473615
42087 -1473615 -1891491 -1422832 -828653 -471388 117230 1223938 2187961 2152754 1197083
$$ packed form
42154G63992p61117p75388J13003N10408j50412p99710m85068K45022L89152m8814
42144i98932l99443l55788K4406O54974J141007Q60382o6265o10697k60077J93066
42134A82633j1998l64407j10628L18807R7621m17683k36580N06928P23113J85228
42124H73034j66951J15722K75376l24020j165796j389934q91472j39394N19388
42115b294047R41757J010585P46821L45498l6140k56057l9611O41271J098828
42106B158905N19154q53919j786214j533872o50811n2298J06113K13337L93854
42097a485751M35807K53207J5884m3742K15652O45702P07220j834r94269j221491
42087a473615m17876M68659N94179L57265N88618J106708R64023l5207r55671
$$ plain form
42078 1197083 194708 -238240 -155944 217057 794307 1306512 1207140 311298 -705010
42069 -705010 -891876 -132045 673281 634597 -197816 -1128077 -1744726 -2155205 -2404660 -2179485
42059 -2179485 -1284666 -62531 944549 1533281 1792132 1729865 1282676 588445 -61103
42050 -61103 -513060 -759632 -734842 -403328 -5543 128334 46183 132315 513618 820885
42040 820885 694202 256452 -120435 -321155 -534820 -913277 -1378810 -1726170 -1792567 -1561538
42030 -1561538 -1156762 -684904 -108584 589787 1178279 1389488 1384781 1632199 2168583 2395608
42020 2395608 1934466 1308718 1267349 1648787 1535263 539836 -641892 -1121403 -760643
42011 -760643 13479 888398 1789163 2611213 3209269 3510129 3381805 2594674 1217919
$$ packed form
42078A197083j002375m32948Q2296L73001N77250N12205r9372q95842j016308
42069g05010j86866P59831Q05326l8684q32413r30261o16649m10479k49455K25175
42059b179485Q94819J222135J007080N88732K58851o2267m47189o94231o49548
42050f1103m51957k46572K4790L31514L97785J33877q2151Q6132L81303L07267
42040H20885j26683m37750l76887k00720k13665l78457m65533l47360o6397K31029
42030a561538M04776M71858N76320O98371N88492K11209m707K47418N36384K27025
42020B395608m61142o25748m1369L81438j13524r95427j181728m79511L60760
42011g60643P74122Q74919R00765Q22050N98056L00860j28324p87131j376755
$$ plain form
42002 1217919 -121123 -717163 -434805 380090 1432689 2525192 3225400 3040369 2028963
41993 2028963 848906 70721 -242820 -223600 112613 659425 1034452 886079 265845
41984 265845 -402681 -589788 23476 1131252 1741977 1072378 -364007 -1147778 -694453
41975 -694453 32855 -22509 -535782 -508151 105377 468728 319551 269680 569132 598626
41965 598626 -23781 -671788 -616553 -122625 -32844 -611154 -1330847 -1590748 -1200662 -334340
41955 -334340 584314 1036037 786989 122844 -431362 -533670 -146131 473628 789731 359356
41945 359356 -598700 -1335020 -1461948 -1316238 -1228511 -1008418 -579664 -514067 -1228184 -2093883
41935 -2093883 -2186494 -1633641 -1301805 -1299318 -854737 204833 945347 716836 116915 -35122
$$ packed form
42002A217919j339042n96040K82358Q14895J052599J092503P00208j85031j011406
41993B028963j180057p78185l13541J9220L36213N46812L75027j48373o20234
41984B65845o68526j87107O13264J107776O10725o69599j436385p83771M53325
41975f94453P27308n5364n13273K7631O13528L63351j49177m9871K99452K9494
41965E98626o22407o48007N5235M93928Q9781n78310p19693k59901L90086Q66322
41955c34340R18654M51723k49048o64145n54206j02308L87539O19759L16103m30375
41945C59356r58056p36320j26928J45710Q7727K20093M28754O5597p14117q65699
41935b093883r2611N52853L31836K487M44581J059570P40514k28511n99921j52037
$$ plain form
41925 -35122 100838 -49724 -348732 -276841 -506 -159463 -710903 -877758 -354780 190961
41915 190961 90143 -414675 -535305 136643 1283222 2143748 2021399 849016 -596739
41906 -596739 -1358758 -1309771 -1180359 -1486277 -1873069 -1755159 -1148687 -476689 113215 775846
41896 775846 1514585 2132174 2528105 2713717 2684872 2599481 2833136 3411542 3641964 2934310
41886 2934310 1853316 1592851 2331904 2911238 2434326 1433597 959761 1179996 1552367
41877 1552367 1871321 2300581 2646192 2492207 2038982 1985596 2441772 2705588 2373878 1956878
41867 1956878 1966284 2010050 1400027 271733 -545070 -586983 -94175 635353 1614250 2745879
41857 2745879 3517638 3412687 2419968 964954 -479885 -1574086 -2107965 -2065146 -1641558
$$ packed form
41925c5122J35960j50562k99008P1891K76335j58957n51440j66855N22978N45741
41915A90961j00818n04818j20630O71948J146579Q60526j22349j172383j445755
41906e96739p62019M8987J29412l05918l86792J17910O06472O71998N89904O62631
41896G75846P38739O17589L95931J85612k8845q5391K33655N78406K30422p07654
41886B934310j080994k60465P39053N79334m76912j000729m73836K20235L72371
41877A552367L18954M29260L45611j53985m53225n3386M56176K63816l31710m17000
41867A956878R406M3766o10023j128294q16803m1913M92808P29528R78897J131629
41857B745879P71759j04951r92719j455014j444839j094201n33879M2819M23588
$$ plain form
41848 -1641558 -1060109 -398170 318669 940226 1254292 1191745 829584 204596 -698541 -1703193
41838 -1703193 -2348619 -2230222 -1424997 -466897 94750 25530 -625450 -1636767 -2592261
41829 -2592261 -2954843 -2416461 -1199249 89258 915533 1156400 1133179 1390930 2237415
41820 2237415 3284603 3604085 2659160 1054740 44109 235092 1067486 1644344 1733437
41811 1733437 1713213 1811785 1815520 1531505 1203864 1257717 1699400 1955990 1452802 357565
41801 357565 -423910 -190567 666278 975401 77770 -1403906 -2261759 -2027426 -1358663
41792 -1358663 -1123935 -1378492 -1456596 -966600 -347706 -240756 -550318 -559727 25137 636892
41782 636892 667947 269691 -60247 -269936 -541704 -590237 34163 964741 1151308 202389
$$ packed form
41848a641558N81449O61939P16839O21557L14066o2547l62161o24988r03137j004652
41838a703193o45426J18397Q05225R58100N61647o9220o50980j011317r55494
41829b592261l62582N38382J217212J288507Q26275K40867k3221K57751Q46485
41820B237415J047188L19482r44925j604420j010631J90983Q32394N76858Q9093
41811A733437k0224R8572L735k84015l27641N3853M41683K56590n03188j095237
41801C57565p81475K33343Q56845L09123q97631j481676q57853K34333O68763
41792a358663K34728k54557p8104M89996O18894J06950l09562r409N84864O11755
41782F36892L1055l98256l29938k09689k71768m8533O24400R30578J86567r48919
$$ plain form
41772 202389 -1073660 -1748838 -1748719 -1389949 -642118 533170 1606543 1965854 1740022 1548070
41762 1548070 1624414 1733999 1739641 1659333 1328753 646519 55582 96359 478521 313002
41752 313002 -575646 -1236404 -782372 554061 1892052 2734264 3090990 2955343 2224013
41743 2224013 1072487 -1367 -583304 -622140 -330149 35634 293288 347542 141553
41734 141553 -334051 -915823 -1266780 -1208662 -1001119 -1022976 -1169247 -883203 83029 1203252
41724 1203252 1678670 1274201 502843 55324 139759 337374 96738 -579119 -1045448 -795982
41714 -795982 -208116 -166493 -930722 -1753714 -1779103 -1009006 -155259 248704 323545 525818
41704 525818 1070224 1708428 2058098 2142032 2439677 3210076 3935829 3839120 2929541 2082838
$$ packed form
41772B02389j276049o75178J19L58770P47831J175288J073373L59311k25832j91952
41762A548070P6344J09585N642q0308l30580o82234n90937M0777L82162j65519
41752C13002q88648o60758M54032J336433J337991Q42212L56726j35647p31330
41743B224013j151526j073854n81937l8836K91991L65783K57654N4254k05989
41734A41553m75604n81772l50957N8118K07543k1857j46271K86044R66232J120223
41724A203252M75418m04469p71358m47519Q4435J97615k40636o75857m66329K49466
41714g95982N87866M1623p64229q22992k5389P70097Q53747M03963P4841K02273
41704E25818N44406O38204L49670Q3934K97645P70399P25753r6709r09579q46703
$$ plain form
41694 2082838 1970517 2371324 2746982 3008993 3328466 3577337 3474199 3081274 2662640
41685 2662640 2165993 1357916 470686 181813 744271 1518576 1666116 1091424 392751
41676 392751 -13299 -356155 -995658 -1742368 -2040209 -1781231 -1525912 -1691087 -1855536 -1303616
41666 -1303616 -96234 921040 1181002 926693 574353 167223 -207731 -71368 763333
41657 763333 1549736 1402826 617794 449660 1459623 2732043 3039253 2291633 1419960
41648 1419960 1135331 1276335 1287759 920447 350996 -131825 -369755 -344748 -113044 213045
41638 213045 484403 601652 582758 493138 342033 141389 12368 46773 75971 -155464
41628 -155464 -523579 -567405 -176657 133448 -35012 -306194 -129746 241275 82542 -563432
$$ packed form
41694B082838j12321M00807L75658K62011L19473K48871j03138l92925m18634
41685B662640m96647q08077q87230k88873N62458P74305J47540n74692o98673
41676C92751m06050l42856o39503p46710k97841K58978K55319j65175j64449N51920
41666a303616J207382J017274K59962k54309l52340m07130l74954J36363Q34701
41657G63333P86403j46910p85032j68134J009963J272420L07210p47620q71673
41648A419960k84629J41004J1424l67312n69451m82821k37930K5007K31704L26089
41638B13045K71358J17249j8894q9620j51105k00644j29021L4405K9198k31435
41628a55464l68115m3826L90748L10105j68460k71182J76448L71021j58733o45974
$$ plain form
41618 -563432 -812754 -314268 133996 -157543 -629367 -376481 305931 268379 -756179 -1758142
41608 -1758142 -1902847 -1417691 -713407 399581 1938683 2983235 2660605 1507937 886793
41599 886793 1220614 1765175 2060885 2515770 3293290 3695137 3246384 2546228 2290192 2118978
41589 2118978 1325173 230848 -145783 368099 818273 415863 -652599 -1754544 -2410551
41580 -2410551 -2271434 -1261446 19775 701861 707667 787287 1248943 1403967 735442 -77675
41570 -77675 -1143 932141 1766630 1943318 1763517 1609135 1388790 941663 507907 466459
41560 466459 771289 905070 450639 -377640 -925517 -883684 -667118 -796280 -1164794 -1349520
41550 -1349520 -1411692 -1722205 -2071304 -1792322 -925774 -364708 -474317 -481958 167785 753479
$$ packed form
41618e63432k49322M98486M48264k91539m71824K52886O82412l7552j024558j001963
41608a758142j44705M85156P04284J112988J539102J044552l22630j152668o21144
41599H86793L33821N44561K95710M54885P77520M01847m48753p00156k56036j71214
41589B118978p93805j094325l76631N13882M50174m02410j068462j101945o56007
41580b410551J39117J009988J281221O82086N806P9620M61656J55024o68525q13117
41570g7675P6532R33284Q34489J76688j79801j54382k20345m47127m33756m1448
41560D66459L04830J33781m54431q28279n47877M1833K16566j29162l68514j84726
41550a349520o2172l10513l49099K78982Q66548N61066j09609p641O49743N85694
$$ plain form
41540 753479 448124 -191828 -10510 939032 1534341 1297810 808261 453335 -45699 -671852
41530 -671852 -775634 -118308 633548 932661 1127447 1701323 2361414 2450453 1827232 853123
41520 853123 -132912 -912076 -1314245 -1450629 -1692244 -2029739 -1785868 -425607 1566628
41511 1566628 3065607 3454847 3044633 2435975 1832716 1047050 -19706 -1041641 -1495803
41502 -1495803 -1289733 -990687 -1141060 -1462671 -1196068 -249515 534701 472868 -100279 -410889
41492 -410889 -277096 -113286 -173550 -297672 -358131 -538489 -1039045 -1699289 -2048771 -1747375
41482 -1747375 -961907 -211482 229830 585623 1031683 1170419 511619 -649938 -1396923
41473 -1396923 -1250228 -538969 296115 1110982 1652211 1513107 861831 541241 964738
$$ packed form
41540G53479l05355o39952J81318R49542N95309k36531m89549l54926m99034o26153
41530f71852j03782O57326P51856K99113J94786N73876O60091Q9039o23221r74109
41520H53123r86035p79164m02169j36384k41615l37495K43871J360261J992235
41511A566628J498979L89240m10214o08658o03259p85666j066756j021935m54162
41502a495803K06070K99046j50373l21611K66603R46553P84216o1833n73147l10610
41492d10889J33793J63810o0264j24122o0459j80358n00556o60244l49482L01396
41482a747375P85468P50425M41312L55793M46060J38736o58800j161557p46985
41473a396923J46695P11259Q35084Q14867N41229j39104o51276l20590M23497
$$ plain form
41464 964738 1487784 1387039 893237 633204 577787 320001 11834 134702 486729 267568
41454 267568 -748528 -1829149 -2221459 -1891760 -1177648 -279034 609710 1104217 988816
41445 988816 621228 653630 1283948 1899749 1611552 243644 -1310528 -1952554 -1514817
41436 -1514817 -679556 113975 1004905 1837133 1836764 727841 -549898 -1009053 -943710 -1221970
41426 -1221970 -1735679 -1636040 -868411 -304681 -324066 -384083 -212690 -352034 -1098277 -1820128
41416 -1820128 -1859756 -1380243 -832352 -276424 256004 410617 117127 -56756 206722 294144
41406 294144 -407369 -1361421 -1488933 -665747 160731 229486 -345829 -1081487 -1663665 -1923953
41396 -1923953 -1772529 -1242744 -345628 927614 2111912 2179454 654469 -1386714 -2263821
$$ packed form
41464I64738N23046j00745m93802k60033n5417k57786l08167J22868L52027k19161
41454B67568j016096j080621l92310L29699P14112Q98614Q88744M94507j15401
41445I88816l67588L2402O30318O15801k88197j367908j554172o42026M37737
41436a514817Q35261P93531Q90930Q32228l69j108923j277739m59155O5343k78260
41426a221970n13709R9639P67629N63730j9385o0017J71393j39344p46243p21851
41416a820128l9628M79513N47891N55928N32428J54613k93490j73883K63478Q7422
41406B94144p01513r54052j27512Q23186Q26478O8755n75315p35658n82178k60288
41396a923953J51424N29785Q97116J273242J184298O7542j524985k041183q77107
$$ plain form
41387 -2263821 -1665574 -878806 -926324 -1342768 -1179982 -451835 48313 -109413 -641641 -1067534
41377 -1067534 -1095287 -733688 -409940 -678915 -1413219 -1666475 -891233 80332 19536 -951691
41367 -951691 -1472338 -815411 248479 695461 493038 151502 -195220 -597212 -757346
41358 -757346 -468593 -217322 -570585 -1187410 -1217135 -557064 77045 293731 392186 487369
41348 487369 163609 -657010 -1279751 -1161088 -667149 -424563 -455663 -464853 -459416 -498727 -289597
41337 -289597 315253 793633 603146 25532 -340224 -611923 -1336032 -2377670 -2989503
41328 -2989503 -2929111 -2630964 -2260362 -1543686 -688410 -466995 -986524 -1269025 -615781 351076
41318 351076 636729 233319 -166609 -305603 -431714 -563152 -478562 -326826 -545171 -1118602
$$ packed form
41387b263821N98247P86768m7518m16444J62786P28147N00148j57726n32228m25893
41377a067534k7753L61599L23748k68975p34304k53256P75242R71565o0796r71227
41367i51691n20647O56927J063890M46982k02423l41536l46722m01992j60134
41358g57346K88753K51271l53263o16825k9725O60071O34109K16686R8455R5183
41348D87369l23760q20619o22741J18663M93939K42586l1100r190N437l9311K09130
41337b89597O04850M78380j90487n77614l65756k71699p24109j041638o11833
41328b989503O0392K98147L70602P16676Q55276K21415n19529k82501O53244R66857
41318C51076K85653m03410l99928j38994j26111j31438Q4590J51736k18345n73431
$$ plain form
41308 -1118602 -1438588 -1003751 37624 1025965 1259089 512664 -617601 -1130318 -714429
41299 -714429 -145591 -183768 -459269 -101411 811171 1286210 891433 326709 295213 577739
41289 577739 637476 497083 454528 380140 -69393 -759081 -1190251 -1266028 -1444241 -2020724
41279 -2020724 -2606063 -2511514 -1546518 -343160 121565 -573561 -1787207 -2330040 -1616294
41270 -1616294 -204394 896313 1244812 1101058 809515 482801 233218 239577 438532
41261 438532 518657 423359 527891 1035528 1488568 1276292 469078 -270252 -529104 -462655
41251 -462655 -293056 -14472 262151 189441 -287481 -708409 -763501 -769102 -1021783 -1102194
41241 -1102194 -509262 277308 220139 -790745 -1737632 -1969021 -2036937 -2583332 -3154435 -2854398
$$ packed form
41308a118602l19986M34837J041375R88341K33124p46425j130265n12717M15889
41299g14429N68838l8177k75501L57858R12582M75039l94777n64724l1496K82526
41289E77739N9737j40393m2555p4388m49533o89688m31170p5777j78213n76483
41279b020724n85339R4549R64996J203358M64725o95126j213646n42833P13746
41270a616294J411900J100707L48499j43754k91543l26714k49583O359J98955
41261D38532Q0125r5298J04532N07637M53040k12276q07214p39330k58852O6449
41251d62655J69599K78584K76623p2710m76922m20928n5092n601k52681q0411
41241a102194N92932P86570n7169j010884r46887k31389o7916n46395n71103L00037
$$ plain form
41231 -2854398 -1711683 -630795 -229470 -412136 -918923 -1572075 -2010886 -1880489 -1385826
41222 -1385826 -1064190 -901157 -284737 980604 2246957 2921967 3197787 3430128 3330106
41213 3330106 2443278 1136363 366774 478923 855529 895739 783090 979557 1366261
41204 1366261 1338633 633701 -314475 -893945 -947259 -775303 -655612 -531109 -197609 316253
41194 316253 696325 713486 544989 585880 942886 1267894 1180799 742198 350649 210079
41184 210079 89128 -316657 -927366 -1341982 -1330302 -1115587 -1109826 -1455058 -1920174 -2212462
41174 -2212462 -2245567 -2028396 -1443889 -402195 760567 1366788 1155098 745083 936787
41165 936787 1612918 1840249 1177986 341523 216589 672424 886974 556802 160312 135238
$$ packed form
41231b854398J142715J080888M01325j82666n06787o53152m38811J30397M94663
41222a385826L21636J63033O16420J265341J266353O75010K75820K32341j00022
41213C330106q86828j306915p69589J12149L76606M0210j12649J96467L86704
41204A366261k7628p04932r48176n79470n3314J71956J19691J24503L33500N13862
41194C16253L80072J7161j68497M0891L57006L25008q7095m38601l91549j40570
41184B10079j20951m05785o10709m14616J1680K14715N761l45232m65116k92288
41174b212462l3105K17171N84507J041694J162762O06221k11690m10015J91704
41165I36787O76131K27331o62263q36463j24934M55835K14550l30172l96490k5074
$$ plain form
41155 135238 423664 853964 1374786 1797725 1879763 1840072 2229418 3031257 3461469 3032670
41145 3032670 2290341 2006753 2101606 1977354 1615791 1634297 2304536 3116415 3423378 3112707
41135 3112707 2530140 2029923 1698432 1392723 1076634 1126258 1974702 3272936 3889106
41126 3889106 3231343 2186566 2079310 2937284 3565533 3266952 2629092 2434983 2615852
41117 2615852 2691066 2589620 2489300 2293406 1871523 1593017 2035571 3120679 3913879
41108 3913879 3462818 1778105 -61633 -850443 -389387 419513 732291 734810 1086551
41099 1086551 1708923 1857818 1362139 923187 912755 725251 -115357 -914858 -665242 486983
41089 486983 1443027 1589156 1241310 766537 104416 -689657 -1150417 -1003928 -615218 -532905
$$ packed form
41155A35238K88426M30300N20822M22939Q2038l9691L89346Q01839M30212m28799
41145C032670p42329k83588R4853j24252l61563J8506O70239Q11879L06963l10671
41135C112707n82567n00217l31491l05709l16089M9624Q48444J298234O16170
41126C889106o57763j044777j07256Q57974O28249k98581o37860j94109J80869
41117B615852P5214j01446j00320j95894m21883k78506M42554J085108P93200
41108C913879m51061j684713j839738p88810M61056Q08900L12778K519L51741
41099A086551O22372J48895m95679m38952j0432j87504q40608p99501K49616J152225
41089D86983R56044J46129l47846m74773o62121p94073m60760J46489L88710Q2313
$$ plain form
41079 -532905 -901157 -1529866 -2203980 -2658077 -2550719 -1838894 -1054784 -861244 -1279981 -1571029
41069 -1571029 -1004090 307356 1453548 1659240 1078291 498538 297737 21618 -811219
41060 -811219 -1798273 -1983194 -1051245 196469 670247 44208 -1097474 -1925281 -2043388
41051 -2043388 -1669959 -1279358 -1022528 -528386 571243 1957459 2733616 2339454 1188110
41042 1188110 271121 243617 977271 1869205 2448179 2722135 2995446 3324593 3244700 2264904
41032 2264904 647743 -642143 -986562 -835116 -1010289 -1462209 -1265515 9592 1445740
41023 1445740 1743223 783244 -289112 -489598 37119 590635 879698 1020414 1000461
41014 1000461 722927 402029 356308 479862 461813 470489 938020 1563178 1305645 -228870
$$ packed form
41079e32905l68252o28709o74114m54097J07358P11825P84110J93540m18737k91048
41069a571029N66939J311446J146192K05692n80949n79753k00801k76119q32837
41060h11219r87054j84921R31949J247714M73778o26039j141682q27807j18107
41051b043388L73429L90601K56830M94142J099629J386216P76157l94162j151344
41042A188110r16989k7504P33654Q91934N78974K73956K73311L29147p9893r79796
41032B264904j617161j289886l44419J51446j75173m51920J96694J275107J436148
41023A445740K97483r59979j072356k00486N26717N53516K89063J40716j9953
41014A000461k77534l20898m5721J23554j8049Q676M67531O25158k57533j534515
$$ plain form
41004 -228870 -2037965 -2889978 -2736687 -2377244 -2188625 -1954899 -1670751 -1657528 -1899190 -1995501
40994 -1995501 -1836957 -1673519 -1455389 -814340 123500 606018 254032 -394419 -690075
40985 -690075 -690990 -782816 -973238 -1035824 -974510 -873185 -591071 -55071 425539 582530 670396
40974 670396 1079568 1715247 2220666 2562048 2867153 2916490 2417635 1655344 1210561 1066291
40964 1066291 679480 22434 -161124 583708 1692947 2275138 2083403 1447355 658448
40955 658448 -139133 -747483 -1070216 -1311357 -1629669 -1714516 -1092127 174506 1417671
40946 1417671 2031661 1980887 1622346 1222652 728890 -45946 -1015131 -1622825 -1252999 28528
40936 28528 1307350 1620859 878093 -162043 -736649 -718354 -479792 -363364 -385163 -391079
$$ packed form
41004b28870j809095q52013J53291L59443J88619K33726K84148J3223k41662r6311
40994a995501J58544J63438K18130O41049R37840M82518l51986o48451k95656
40985f90075r15r1826j90422o2586O1314J01325K82114N36000M80610J56991Q7866
40974F70396M09172O35679N05419L41382L05105M9337m98855p62291m44783j44270
40964A066291l86811o57046j83558P44832J109239N82191j91735o36048p88907
40955F58448p97581o08350l22733k41141l18312q4847O22389J266633J243165
40946A417671O13990n0774l58541l99694m93762p74836r69185o07694L69826J281527
40936B8528J278822L13509p42766j040136n74606J8295K38562J16428k1799n916
$$ plain form
40926 -391079 -396946 -628335 -1118792 -1452432 -1252614 -872595 -1098461 -2004921 -2644099 -2255472
40916 -2255472 -1318483 -844463 -963752 -910548 -261459 550121 1000895 1069613 883579 402471
40906 402471 -233797 -550663 -321885 31322 -40957 -559887 -1145442 -1550563 -1824976 -2161124
40896 -2161124 -2741073 -3479935 -3815089 -3128794 -1554437 45664 1091156 1769595 2266638
40887 2266638 2185904 1298538 316234 154430 722589 1150695 977554 405427 -389405 -1362533
40877 -1362533 -2112235 -2155075 -1741487 -1565186 -1573928 -1001836 164912 780092 186483 -592094
40867 -592094 -160465 1298544 2305159 2049512 1192720 716341 759548 837271 662270 387302
40857 387302 271008 378940 572330 691355 745477 884552 1148303 1346459 1275057 964390
$$ packed form
40926c91079n867k31389m90457l33640J99818L80019k25866r06460o39178L88627
40916b255472R36989M74020j19289N3204O49089Q11580M50774O8718j86034m81108
40906D02471o36268l16866K28778L53207p2279n18930n85555m05121k74413l36148
40896b161124n79949p38862l35154O86295J574357J600101J045492O78439M97043
40887B266638q0734q87366r82304j61804N68159M28106j73141n72127p94832r73128
40877a362533p49702m2840M13588J76301q742N72092J166748O15180n93609p78577
40867e92094M31629J459009J006615k55647q56792m76379M3207P7723j75001k74968
40857C87302j16294J07932J93390J19025N4122J39075K63751J98156p1402l10667
$$ plain form
40847 964390 639580 532702 772376 1298536 1812847 1978822 1756092 1392761 1062176 715899
40837 715899 312152 -91109 -512885 -984577 -1243064 -902278 -83673 563930 698115 677097
40827 677097 830146 852692 399202 -167788 -235626 124986 296234 10233 -484327 -1036049
40817 -1036049 -1745938 -2488962 -2834007 -2555654 -1834814 -927396 -20571 619309 827779
40808 827779 896610 1273340 1843098 1994222 1521646 979971 923761 1224916 1426043 1416785
40798 1416785 1401001 1401299 1177391 648745 160413 174822 690067 1098283 846344 224265
40788 224265 122838 842675 1601629 1619313 1250633 1402277 2096202 2394456 1725388 546388
40778 546388 -420481 -935449 -1047167 -809914 -498256 -576196 -1119510 -1644394 -1716513 -1339886
$$ packed form
40847I64390l24810j06878K39674N26160N14311J65975k22730l63331l30585l46277
40837G15899m03747m03261m21776m71692k58487L40786Q18605O47603J34185k1018
40827F77097J53049K2546m53490n66990o7838L60612J71248k86001m94560n51722
40817a036049p09889p43024l45045K78353P20840R07418R06825O39880K08470
40808H27779O8831L76730N69758J51124m72576n41675n6210L01155K01127r258
40798A416785j5784K98k23908n28646m88332J4409N15245M08216k51939o22079
40788B24265j01427P19837P58954J7684l68680J51644O93925K98254o69068j179000
40778E46388r66869n14968j11718K37253L11658p7940n43314n24884p2119L76627
$$ plain form
40768 -1339886 -624271 414856 1531573 2259636 2492816 2551200 2465487 1807231 530747
40759 530747 -667903 -1251209 -1478169 -1666502 -1479110 -605670 407149 801248 709191
40750 709191 828884 1271421 1526048 1410900 1272275 1267980 1163504 890879 692316 629781
40740 629781 493423 281267 286960 615776 996927 1099823 708819 -288414 -1642559 -2612718
40730 -2612718 -2632130 -2028106 -1563278 -1413136 -1250845 -1205221 -1854690 -3139717 -4122276 -4127204
40720 -4127204 -3409327 -2403830 -1115581 284094 1049668 795217 311281 646250 1643183
40711 1643183 2120847 1402973 53802 -875398 -821666 45391 1072569 1550948 1247388
40702 1247388 582215 107207 -58138 -52694 153403 552082 716078 283763 -220906 226534
$$ packed form
40768a339886P15615J039127J116717P28063K33180N8384q5713o58256j276484
40759E30747j198650n83306k26960j88333J87392Q73440J012819L94099r2057
40750G09191J19693M42537K54627j15148j38625m295j04476k72625j98563o2535
40740F29781j36358k12156N693L28816L81151J02896l91004r97233j354145r70159
40730b612718j9412O04024M64828J50142J62291M5624o49469j285027r82559m928
40720d127204P17877J005497J288249J399675P65574k54451m83936L34969R96933
40711A643183M77664p17874j349171r29200N3732Q67057J027178M78379l03560
40702A247388o65173m75008j65345N444K06097L98679J63996m32315n04669M47440
$$ plain form
40692 226534 1756508 3239691 3658929 3295977 3074943 3175870 2970680 2169892 1345361
40683 1345361 1165173 1577984 1998567 2021621 1722318 1413453 1300696 1318241 1224568 936548
40673 936548 762311 1096115 1801874 2140724 1528955 252109 -766426 -839381 -30957
40664 -30957 1055946 1790317 1902474 1610344 1357805 1291867 1107634 598723 163777 379227
40654 379227 1142080 1700104 1611637 1234619 1093106 1187712 1221826 1151136 1121074 1079527 840487
40643 840487 433887 87332 -59420 32582 459870 1249564 2120910 2644749 2656326 2342369
40633 2342369 1961398 1640441 1392648 1180322 991000 901650 931245 822765 304367 -289601
40623 -289601 -96902 1190969 2666917 3138961 2529878 1826027 1749461 2058157 2202426
$$ packed form
40692B26534J529974J483183M19238l62952k21034J00927k05190q00788q24531
40683A345361j80188M12811M20583K3054k99303l08865j12757J7545r3673k88020
40673I36548j74237L33804P05759L38850o11769j276846j018535p2955Q08424
40664c0957J086903P34371J12157k92130k52539o5938j84233n08911m34946K15450
40654C79227P62853N58024q8467l77018j41513R4606L4114p0690l0062m1547k39040
40643H40487m06600l46555j46752R2002M27288P89694Q71346N23839J1577l13957
40633B342369l80971l20957k47793k12326j89322q9350K9595j08480n18398n93968
40623b89601J92699J287871J475948M72044o09083p03851p6566L08696J44269
$$ plain form
40614 2202426 2128566 2199775 2619191 3108422 3054614 2061079 549797 -390011 -112577 808249
40604 808249 1334062 1267792 1226837 1496206 1694491 1642897 1772826 2385429 3143916 3617701
40594 3617701 3780084 3685815 3240456 2623582 2346942 2493394 2494574 2135282 2146896 3147180
40584 3147180 4517460 5114783 4731703 4033575 3327635 2336362 1144445 408165 377128
40575 377128 488343 309393 257847 895235 1940347 2535364 2313813 1747083 1463965 1590761
40565 1590761 1856040 2101363 2473022 3119816 3864101 4323252 4336198 4104403 3872604 3654958
40555 3654958 3355680 2941539 2365293 1583123 872862 852161 1802950 3144230 3986691
40546 3986691 4120948 4036477 4040525 3918426 3591819 3554726 4282529 5555668 6805449 7965764
$$ packed form
40614B202426p3860P1209M19416M89231n3808r93535j511282r39808K77434R20826
40604H08249N25813o6270m0955K69369J98285n1594J29929O12603P58487M73785
40594C617701J62383r4269m45359o16874k76640J46452J180l59292J1614J000284
40584C147180J370280N97323l83080o98128p05940r91273j191917p36280l1037
40575C77128J11215j78950n1546O37388J045112N95017k21551n66730k83118J26796
40565A590761K65279K45323L71659O46794P44285M59151J2946k31795k31799k17646
40555C654958k99278m14141n76246p82170p10261k0701R50789J341280Q42461
40546C986691J34257q4471M048j22099l26607l7093P27803J273139J249781J160315
$$ plain form
40536 7965764 9549153 11868273 14533722 16855439 18517194 19699029 20716693 21805075
40528 21805075 23218864 25216140 27714595 30098399 31623176 32004959 31418057 29980361
40520 29980361 27601615 24456980 21238334 18588795 16439033 14234128 11779756 9564299
40512 9564299 8169748 7558628 7064930 6051234 4548900 3241225 2748838 2947751 3163669
40503 3163669 3064352 3049785 3527500 4080955 3818601 2545246 1162550 696881 1170074
40494 1170074 1694026 1589593 1125356 1056276 1656929 2491344 3086080 3437307 3659340 3522951
40484 3522951 2806088 1884376 1376199 1235666 850405 157560 -59640 661450 1668417
40475 1668417 2109179 2093250 2261303 2615311 2594980 2132010 1798589 1875860 2016393 2003219
$$ packed form
40536G965764J583389K319120K665449K321717J661755J181835J017664J088382
40528B1805075J413789J997276K498455K383804J524777L81783n86902j437696
40520B9980361k378746l144635l218646k649539k149762k204905k454372k215457
40512I564299j394551o11120m93698j013696j502334j307675m92387J98913K15918
40503C163669r9317j4567M77715N53455k62354j273355j382696m65669M73193
40494A170074N23952j04433m64237o9080O00653Q34415N94736L51227K22033j36389
40484C522951p16863r21712n08177j40533l85261o92845k17200P21090J006967
40475A668417M40762j5929J68053L54008k0331m62970l33421P7271J40533j3174
$$ plain form
40465 2003219 2193550 2889301 3728488 4072155 3764304 3238235 2964137 2922250 2612395 1650507
40455 1650507 388878 -316020 -128639 327309 378623 221806 391043 721425 654294 365397
40445 365397 632680 1509225 2045602 1609569 690073 30575 -326596 -704038 -1116922 -1402999
40435 -1402999 -1526207 -1352260 -625014 442459 1085862 941554 575801 626047 974529
40426 974529 1289866 1761858 2553662 3009496 2289857 574951 -1127751 -2202037 -2735460
40417 -2735460 -2824859 -2427887 -1906734 -1912446 -2555276 -3294767 -3752392 -4032076 -4151152 -3832948
40407 -3832948 -3094866 -2440685 -2161083 -1928493 -1373193 -605729 134280 901684 1738208
40398 1738208 2301799 2236374 1713161 1256464 1171992 1401924 1752858 1966784 1718546 889316
$$ packed form
40465B003219J90331O95751Q39187L43667l07851n26069k74098m1887l09855r61888
40455A650507j261629p04898J87381M55948N1314j56817J69237L30382o7131k88897
40445C65397K67283Q76545N36377m36033r19496o59498l57171l77442m12884k86077
40435a402999j23208J73947P27246J067473O43403j44308l65753N0246L48482
40426I74529L15337M71992P91804M55834p19639j714906j702702j074286n33423
40417b735460q9399L96972N21153n712o42830p39491m57625k79684j19076L18204
40407c832948P38082O54181K79602K32590N55300P67464P40009P67404Q36524
40398A738208N63591o5425n23213m56697q4472K29932L50934K13926k48238q29230
$$ plain form
40388 889316 -168565 -883859 -1011606 -785425 -541136 -339194 -14541 469972 830674
40379 830674 735579 258613 -161245 -351046 -718455 -1611244 -2611559 -3007797 -2877475 -3013011
40369 -3013011 -3611762 -3755439 -2642897 -782434 651557 1268775 1581463 1905933 1954209
40360 1954209 1590269 1253885 1303218 1449652 1245836 793566 551567 641774 746896 614462
40350 614462 304193 -77044 -584589 -1282149 -2059899 -2683353 -2905193 -2532332 -1598362 -558962
40340 -558962 -86965 -431822 -1061702 -1178374 -582927 213924 797905 1440000 2578028
40331 2578028 3901064 4447923 3760841 2533053 1767029 1564867 1248078 576507 207966
40322 207966 705634 1625969 2076552 1860163 1505472 1332536 1126894 759007 466922 308547
$$ packed form
40388H89316j057881p15294j27747K26181K44289K01942L24653M84513L60702
40379H30674r5095m76966m19858j89801l67409q92789j000315l96238J30322j35536
40369c013011n98751j43677J112542J860463J433991O17218L12688L24470M8276
40360A954209l63940l36384M9333J46434k03816m52270k41999R0207J05122j32434
40350F14462l10269l81237n07545o97560p77750o23454k21840L72861R33970J039400
40340e58962M71997l44857o29880j16672N95447P96851N83981O42095J138028
40331B578028J323036N46859o87082j227788p66024k02162l16789o71571l68541
40322B07966M97668R20335M50583k16389l54691j72936k05642l67887k92085j58375
$$ plain form
40312 308547 -56434 -668719 -902662 -330826 467768 615656 180850 -14288 296689 519066
40302 519066 309769 183116 616512 1191798 1195019 690389 411578 740721 1292051 1491012
40292 1491012 1191310 674922 310237 289632 553962 893203 1117990 1105625 761039 120594
40282 120594 -542400 -972291 -1274236 -1678812 -1983896 -1711743 -938280 -422013 -638652 -1213083
40272 -1213083 -1660645 -2121952 -2842244 -3455929 -3473944 -3056151 -2533371 -1574171 162201
40263 162201 1754916 1634842 -286423 -2177744 -2470296 -1595761 -954565 -978346 -1085474
40254 -1085474 -1003630 -1076783 -1355500 -1317298 -735637 -185361 -313963 -988443 -1557860 -1787661
40244 -1787661 -2112623 -2860235 -3547753 -3339859 -2182950 -1015788 -583972 -488674 41877
$$ packed form
40312C08547l64981o12285k33943N71836P98594J47888m34806j95138L10977K22377
40302E19066k09297j26653M33396N75286L221n04630k78811L29143N51330J98961
40292A491012k99702n16388l64685k0605K64330L39241K24787j2365l44586o40445
40282A20594o62994m29891l01945m04576l05084K72153P73463N16267k16639n74431
40272a213083m47562m61307p20292o13685j8015M17793N22780R59200J736372
40263A62201J592715j20074j921265j891321k92552Q74535O41196k3781j07128
40254a085474Q1844p3153k78717L8202N81661N50276j28602o74480n69417k29801
40244a787661l24962p47612o87518K07894J156909J167162M31816R5298N30551
$$ plain form
40235 41877 783859 793687 33253 -314055 412171 1213046 844449 -280101 -641934 187372
40225 187372 977990 587805 -641387 -1588242 -1727850 -1291831 -568930 303681 1023159
40216 1023159 1163089 637529 -162171 -776512 -1052436 -1078017 -939633 -684755 -438155 -360266
40206 -360266 -415366 -321944 82172 481735 352614 -347455 -1035911 -1232517 -1173389 -1414304
40196 -1414304 -2014951 -2484743 -2442979 -1929989 -1074842 89721 1323141 2082017 2042416
40187 2042416 1533094 1186470 1248517 1424180 1330427 924103 499958 378268 592939 860024
40177 860024 900761 764703 691492 684351 485459 46459 -296051 -324492 -316606 -569886 -782762
40166 -782762 -411843 391935 747628 140141 -869513 -1329522 -981410 -305347 268357
$$ packed form
40235D1877P41982R828p60434l47308P26226Q00875l68597j124550l61833Q29306
40225A87372P90618l90185j229192r46855j39608M36019P22901Q72611P19478
40216A023159J39930n25560p99700o14341k75924k5581J38384K54878K46600P7889
40206c60266n5100R3422M04116L99563j29121p00069o88456j96606N9128k40915
40196a414304o00647m69792M1764N12990Q55147J164563J233420P58876l9601
40187B042416n09322l46624O2047J75663r3753m06324m24145j21690K14671K67085
40177H60024M0737j36058p3211p141j98892m39000l42510k8441P886k53280k12876
40166g82762L70919Q03778L55693o07487j009654m60009L48112O76063N73704
$$ plain form
40157 268357 708651 996708 898843 337582 -314554 -578195 -387815 -100520 -72354 -357263
40147 -357263 -751043 -1011821 -1078453 -1139416 -1416395 -1820835 -1922217 -1344404 -135868 1273233
40137 1273233 2362810 2778172 2540646 2110355 1989278 2101959 1852332 1025942 276385
40128 276385 263372 576384 170988 -1135736 -2282140 -2300882 -1465782 -717440 -400145 -111665
40118 -111665 416220 876106 894568 582768 377062 492793 702341 661043 391223 323634
40108 323634 740875 1290626 1340048 830104 421176 618426 1072163 1028723 261849 -728203
40098 -728203 -1281044 -1081281 -273219 619024 995843 702891 203438 53723 354899 889710
40088 889710 1481721 1877518 1643240 771398 149572 655334 1801986 2123715 1134386
$$ packed form
40157B68357M40294K88057r7865n61261o52136k63641J90380K87295K8166k84909
40147c57263l93780k60778o6632o0963k76979m04440j01382N77813J208536J409101
40137A273233J089577M15362k37526m30291j21077J12681k49627q26390p49557
40128B76385j3013L13012m05396j306724j146404j8742Q35100P48342L17295K88480
40118a11665N27885M59886J8462l11800k05706J15731K09548m1298k69820o7589
40108C23634M17241N49751M9422n09944m08928J97250M53737m3440p66874r90052
40098g28203n52841J99763Q08062Q92243L76819k92952m99453j49715L01176N34811
40088H89710N92011L95797k34278q71842o21826N05762J146652L21729r89329
$$ plain form
40079 1134386 76741 247659 1312350 2000811 1921233 1730299 1745009 1475504 763934
40070 763934 435368 1176518 2318508 2503187 1408982 132807 -253665 34634 12093
40061 12093 -660785 -1287391 -1151872 -487104 -171609 -668799 -1587593 -2278843 -2557245 -2668287
40051 -2668287 -2743267 -2584780 -2020448 -1246988 -664097 -436710 -371535 -238405 -71491 -42842
40041 -42842 -122898 -73117 156967 222378 -199229 -844357 -1013616 -401105 460382 801704
40031 801704 501141 62939 -205146 -565182 -1252059 -1894872 -1906619 -1264125 -491381 77015
40021 77015 579697 1099119 1300444 891438 155186 -329093 -360624 -201972 -87038 6034
40011 6034 65853 -148716 -835411 -1788695 -2441360 -2306767 -1439951 -465903 -14508 -87596
$$ packed form
40079A134386j057645J70918J064691O88461p9578j90934J4710k69505p11570
40070G63934l28566P41150J141990J84679j094205j276175l86472K88299k2541
40061A2093o72878o26606J35519O64768L15495m97190r18794o91250k78402j11042
40051b668287p4980J58487N64332P73460N82891K27387O5175J33130J66914K8649
40041d2842q0056M9781K30084O5411m21607o45128j69259O12511Q61487L41322
40031H01704l00563m38202k68085l60036o86877o42813j1747O42494P72744N68396
40021G7015N02682N19422K01325m09006p36252m84279l1531J58652J14934R3072
40011F034N9819k14569o86695r53284o52665J34593Q66816R74048M51395p3088
$$ plain form
40001 -87596 -185912 -102088 -196632 -644327 -864617 -243877 851041 1428569 1131000 485953
39991 485953 -35977 -438960 -580177 -2017 1213336 2141878 2108973 1547720 1269748 1419066
39981 1419066 1719054 2208002 2968174 3512226 3279372 2532145 1937085 1389387 181362
39972 181362 -1562538 -2551571 -1874334 -259005 735653 462097 -320891 -529918 47450
39963 47450 696385 738929 355818 274390 727231 1146277 1048071 709019 561202 423084
39953 423084 -36897 -469103 -270585 390882 834026 1017343 1511002 2326643 2780852 2696657
39943 2696657 2722796 3105977 3125703 2267710 1077037 234313 -400518 -1126738 -1559023 -1284441
39933 -1284441 -733519 -506671 -367741 143607 570387 106851 -961130 -1527474 -1326137
$$ packed form
40001h7596r8316Q3824r4544m47695k20290O20740J094918N77528k97569o45047
39991D85953n21930m02983j41217N78160J215353R28542l2905n61253k77972J49318
39981A419066K99988M88948P60172N44052k32854p47227n95060n47698j208025
39972A81362j743900r89033O77237J615329R94658k73556p82988k09027N77368
39963D7450O48935M2544l83111q1428M52841M19046r8206l39052j47817j38118
39953D23084m59981m32206J98518O61467M43144J83317M93659Q15641M54209q4195
39943B696657K6139L83181J9726q57993j190673q42724o34831p26220m32285K74582
39933a284441N50922K26848J38930N11348M26780m63536j067981n66344K01337
$$ plain form
39924 -1326137 -1214358 -1680529 -2139146 -2020353 -1584999 -1188524 -605169 269968 736271
39915 736271 106022 -1168044 -1941060 -1805318 -1426420 -1474790 -1816349 -1934190 -1712179 -1483802
39905 -1483802 -1483121 -1535060 -1323271 -837940 -472221 -648687 -1332255 -1918543 -1676796 -414378
39895 -414378 1267580 2481332 2882542 2872758 2878124 2671937 1760210 308502 -820335 -1045539
39885 -1045539 -624149 -63685 512462 1086709 1312258 875274 25115 -740255 -1325691
39876 -1325691 -1925083 -2444673 -2540658 -2142150 -1498012 -797442 -158997 152901 -648 -249375
39866 -249375 -121113 254100 395897 321512 455554 699581 396838 -559617 -1364660 -1460990
39856 -1460990 -1398038 -1978729 -3045905 -3743441 -3678142 -3215657 -2782745 -2435848 -2095427 -1749345
$$ packed form
39924a326137J11779m66171m58617J18793M35354L96475N83355Q75137M66303
39915G36271o30249j274066p73016J35742L78898m8370l41559j17841K22011K28377
39905a483802O81n1939K11789M85331L65719j76466o83568n86288K41747J262418
39895d14378J681958J213752M01210r784N366k06187r11727j451708j128837k25204
39885a045539M21390N60464N76147N74247K25549m36984q50159p65370n85436
39876a325691n99392n19590r5985L98508O44138P00570O38445L11898j53549k48727
39866b49375J28262L75213J41797p4385J34042K44027l02743r56455q05043r6330
39856a460990O2952n80691j067176o97536O5299M62485M32912L46897L40421L46082
$$ plain form
39846 -1749345 -1374764 -997694 -870370 -1283762 -2108897 -2744982 -2653673 -1865964 -916394 -330042
39836 -330042 -181017 -114903 207215 719640 1052092 953916 498487 -80618 -575422 -829294
39826 -829294 -768837 -471523 -112060 132075 58557 -481898 -1270993 -1726968 -1617049 -1578885
39816 -1578885 -2382456 -3725418 -4397891 -3762133 -2445885 -1353847 -657487 -165391 -63057
39807 -63057 -620301 -1491255 -1945545 -1699219 -1083533 -519019 -200780 -141062 -136087 153998
39797 153998 721649 1006523 603773 -17319 -34643 577829 991512 658531 -23933 -341455
39787 -341455 -111194 323370 599328 550918 126131 -609322 -1371734 -1698860 -1208564 33931
39777 33931 1351223 1871771 1350535 468682 90712 329702 599046 462552 84158 -123204
$$ packed form
39846a749345L74581L77070J27324m13392q25135o36085R1309P87709R49570N86352
39836c30042J49025O6114L22118N12425L32452r8176m55429n79105m94804k53872
39826h29294O0457K97314L59463K44135p3518n40455p89095m55975J09919L8164
39816a578885q03571j342962o72473O35758J316248J092038O96360M92096J02334
39807f3057n57244q70954m54290K46326O15686N64514L18239N9718M975K90085
39797A53998N67651K84874m02750o21092j7324O12472M13683l32981o82464l17522
39787c41455K30261M34564K75958m8410m24787p35453p62412l27126M90296J242495
39777C3931J317292N20548n21236q81853l77970K38990K69344j36494l78394k07362
$$ plain form
39767 -123204 76832 708176 1604783 2337865 2437852 1914334 1371455 1385608 1842764 2062577
39757 2062577 1576572 672035 101524 272184 813868 1027543 665013 85001 -277811
39748 -277811 -281899 82845 799959 1601056 2038987 2033668 1947840 1836713 1128877 -447486
39738 -447486 -2079627 -2707210 -2363515 -1943362 -1831819 -1617133 -1141059 -895552 -1099758
39729 -1099758 -1171578 -557697 466623 1231311 1466943 1345930 1169270 1323680 2095098
39720 2095098 3155842 3629952 3030869 1791271 583187 -424684 -1251395 -1552983 -990502
$$ packed form
39767a23204K00036O31344Q96607P33082R9987n23518n42879J4153M57156K19813
39757B062577m86005r04537n70511J70660N41684K13675l62530n80012l62812
39748b77811m088L64744P17114Q01097M37931n319q5828j11127p07836j576363
39738d47486j632141o27583L43695M20153J11543K14686M76074K45507k04206
39729a099758p1820O13881J024320P64688K35632j21013j76660J54410P71418
39720B095098J060744M74110n99083j239598j208084j007871q26711l01588N62481
$$ [...]
##END NTUPLES=NMR SPECTRUM
##END=
