##TITLE=31P_DE-80H_X3
 64 sc D2O
 26.2.2025
##JCAMPDX= 6.0         $$ Bruker NMR JCAMP-DX V2.0
##DATA TYPE= NMR SPECTRUM
##DATA CLASS= NTUPLES
##ORIGIN= UXNMR, Bruker Analytische Messtechnik GmbH
##OWNER= root
$$ XWIN-NMR		Version 3.5
$$ Thu May 22 18:14:06 2025 Russian Standard Time (UT+4h)  Yarkov@DPX200
##.OBSERVE FREQUENCY= 81.013821
##.OBSERVE NUCLEUS= ^31P
##.ACQUISITION MODE= SIMULTANEOUS
##.ACQUISITION SCHEME= undefined
##.AVERAGES= 64
##.DIGITISER RES= 17
##SPECTROMETER/DATA SYSTEM= spect
##.PULSE SEQUENCE= zgpg30
##.SOLVENT NAME= CDCl3
##.SHIFT REFERENCE= (INTERNAL, CDCl3, 0, 198.062)
##AUDIT TRAIL= $$ (NUMBER, WHEN, WHO, WHERE, WHAT)
$$ ##TITLE= Audit trail, XWIN-NMR		Version 3.5
$$ ##JCAMPDX= 5.01
$$ ##ORIGIN= Bruker BioSpin GmbH
$$ ##OWNER= Yarkov
$$ C:/Bruker/XWIN-NMR/data/yarkov2/nmr/P31/2/pdata/1/auditp.txt
$$ ##AUDIT TRAIL=  $$ (NUMBER, WHEN, WHO, WHERE, WHAT)
(   1,<2025-05-22 18:13:14.70 +0400>,<Yarkov>,<DPX200>,
      <created by zg, POWCHK disabled, PULCHK disabled
       configuration hash MD5:
       00 E9 B6 7A A2 85 ED C7 34 08 36 98 17 FE 4E 26
       data hash MD5: 32K
       06 E4 05 43 BE 2D 54 D8 13 85 F7 54 86 29 3F 9D>)
(   2,<2025-05-22 18:13:21.32 +0400>,<Yarkov>,<DPX200>,
      <Start of raw data processing
       efp BC_mod = 2 LB = 1.5 FT_mod = 6 PKNL = 1 PHC0 = 1769.444 PHC1 = 73.15951 SI = 64K 
       data hash MD5: 64K
       76 1A A2 68 F1 4F 0B 98 BD 7E A5 5E 68 B6 3D 3A>)
(   3,<2025-05-22 18:13:39.35 +0400>,<Yarkov>,<DPX200>,
      <pk PHC0 = -100.3978 PHC1 = -2.2 
       data hash MD5: 64K
       DC 0F F1 E3 A8 09 E7 31 26 10 41 DA 0E F9 D7 8D>)
$$ ##END=
$$ 
$$ hash MD5
$$ 97 8B C4 CD F0 3F DF A4 1E 2D B5 18 92 18 49 45
##$RELAX= 
##$RELAX= 
##$RELAX= 
##$RELAX= 
##$RELAX= 
##$RELAX= 
##$RELAX= 
##$RELAX= 
$$ Bruker specific parameters
$$ --------------------------
##$DU= <C:/Bruker/XWIN-NMR>
##$EXPNO= 2
##$NAME= <P31>
##$PROCNO= 1
##$TYPE= <nmr>
##$USER= <yarkov2>
##$AMP= (0..31)
100 100 100 100 100 100 100 100 100 100 100 100 100 100 100 100 100 100 
100 100 100 100 100 100 100 100 100 100 100 100 100 100 
##$AQSEQ= 0
##$AQ_mod= 1
##$AUNM= <au_zg>
##$AUTOPOS= <>
##$BF1= 81.014009
##$BF2= 200.13
##$BF3= 200.13
##$BF4= 200.13
##$BF5= 200.13
##$BF6= 200.13
##$BF7= 200.13
##$BF8= 200.13
##$BYTORDA= 1
##$CFDGTYP= 0
##$CFRGTYP= 5
##$CHEMSTR= <none>
##$CNST= (0..31)
1 1 145 1 1 1 1 1 1 1 1 1 1 1 1 1 1 1 1 1 1 1 1 1 1 1 1 1 1 1 1 1 
##$CPDPRG= <waltz16>
##$CPDPRG1= <>
##$CPDPRG2= <waltz16>
##$CPDPRG3= <>
##$CPDPRG4= <mlev>
##$CPDPRG5= <mlev>
##$CPDPRG6= <mlev>
##$CPDPRG7= <mlev>
##$CPDPRG8= <mlev>
##$CPDPRGB= <>
##$CPDPRGT= <>
##$D= (0..31)
0 1 0 0 0 0 0 0 0 0.06 0 0.03 2e-05 3e-06 0 0 0.0002 0 0 0 0 0 0 0 0 0 
0 0 0 0 0 0 
##$DATE= 1747923194
##$DBL= (0..7)
120 120 120 11 120 120 24 19 
##$DBP= (0..7)
150 150 150 150 150 150 150 150 
##$DBP07= 0
##$DBPNAM0= <>
##$DBPNAM1= <>
##$DBPNAM2= <>
##$DBPNAM3= <>
##$DBPNAM4= <>
##$DBPNAM5= <>
##$DBPNAM6= <>
##$DBPNAM7= <>
##$DBPOAL= (0..7)
$$ [...]
##$SUBNAM2= <"">
##$SUBNAM3= <"">
##$SUBNAM4= <"">
##$SUBNAM5= <"">
##$SUBNAM6= <"">
##$SUBNAM7= <"">
##$SUBNAM8= <"">
##$SUBNAM9= <"">
##$SW= 400.765351723535
##$SWIBOX= (0..15)
0 1 3 0 0 0 0 0 0 0 0 0 0 0 0 0 
##$SW_h= 32467.5324675325
##$TD= 32768
##$TD0= 1
##$TE= 0
##$TE2= 300
##$TE3= 300
##$TEG= 300
##$TL= (0..7)
0 120 53 12 22 120 120 120 
##$TP= (0..7)
150 150 150 150 150 150 150 150 
##$TP07= 0
##$TPNAME0= <>
##$TPNAME1= <>
##$TPNAME2= <>
##$TPNAME3= <>
##$TPNAME4= <>
##$TPNAME5= <>
##$TPNAME6= <>
##$TPNAME7= <>
##$TPOAL= (0..7)
0.5 0.5 0.5 0.5 0.5 0.5 0.5 0.5 
##$TPOFFS= (0..7)
0 0 0 0 0 0 0 0 
##$TUNHIN= 0
##$TUNHOUT= 0
##$TUNXOUT= 0
##$USERA1= <user>
##$USERA2= <user>
##$USERA3= <user>
##$USERA4= <user>
##$USERA5= <user>
##$V9= 5
##$VALIST= <valist>
##$VCLIST= <CCCCCCCCCCCCCCC>
##$VD= 0
##$VDLIST= <DDDDDDDDDDDDDDD>
##$VPLIST= <PPPPPPPPPPPPPPP>
##$VTLIST= <TTTTTTTTTTTTTTT>
##$WBST= 1024
##$WBSW= 4
##$XGAIN= (0..3)
0 0 0 0 
##$XL= 0
##$YL= 0
##$YMAX_a= 1929
##$YMIN_a= -427
##$ZGOPTNS= <>
##$ZL1= 120
##$ZL2= 120
##$ZL3= 120
##$ZL4= 120
##$ABSF1= 0
##$ABSF2= 0
##$ABSG= 0
##$ABSL= 0
##$ALPHA= 0
##$AQORDER= 0
##$ASSFAC= 0
##$ASSFACI= 0
##$ASSFACX= 0
##$ASSWID= 0
##$AUNMP= <proc_1d>
##$AZFE= 0.1
##$AZFW= 0.5
##$BCFW= 0
##$BC_mod= 2
##$BYTORDP= 0
##$COROFFS= 0
##$CY= -3
##$DATMOD= 1
##$DC= 0
##$DFILT= <>
##$DTYPP= 0
##$F1P= 0
##$F2P= 0
##$FCOR= 1
##$FTSIZE= 65536
##$FT_mod= 6
##$GAMMA= 0
##$GB= 0
##$INTBC= 1
##$INTSCL= 9.790993e-09
##$ISEN= 30
##$LB= 1.5
##$LEV0= 0
##$LPBIN= 0
##$MAXI= 10000
##$MC2= 0
##$MEAN= 0
##$ME_mod= 0
##$MI= 50
##$NCOEF= 0
##$NC_proc= -10
##$NLEV= 6
##$NOISF1= 182.463
##$NOISF2= 159.3651
##$NSP= 0
##$NTH_PI= 0
##$NZP= 0
##$OFFSET= 198.0616
##$PC= 4
##$PHC0= 1669.046
##$PHC1= 70.95951
##$PH_mod= 1
##$PKNL= yes
##$PPARMOD= 0
##$PSCAL= 0
##$PSIGN= 0
##$REVERSE= no
##$SF= 81.0140089999434
##$SI= 65536
##$SIGF1= 159.3651
##$SIGF2= -187.1042
##$SINO= 113.3802
##$SIOLD= 16384
##$SREGLST= <1H.CDCl3>
##$SSB= 0
##$STSI= 65536
##$STSR= 0
##$SW_p= 32467.5324675325
##$SYMM= 0
##$S_DEV= 0
##$TDeff= 32768
##$TDoff= 0
##$TI= <>
##$TILT= no
##$TM1= 0
##$TM2= 0
##$TOPLEV= 0
##$USERP1= <user>
##$USERP2= <user>
##$USERP3= <user>
##$USERP4= <user>
##$USERP5= <user>
##$WDW= 1
##$XDIM= 65536
##$YMAX_p= 400266318
##$YMIN_p= -30121870
$$ End of Bruker specific parameters
$$ ---------------------------------
##NTUPLES= NMR SPECTRUM
##VAR_NAME=  FREQUENCY,     SPECTRUM/REAL,   SPECTRUM/IMAG
##SYMBOL=    X,             R,               I
##VAR_TYPE=  INDEPENDENT,   DEPENDENT,       DEPENDENT
##VAR_FORM=  AFFN,          ASDF,            ASDF
##VAR_DIM=   65536,         65536,           65536
##UNITS=     HZ,            ARBITRARY UNITS, ARBITRARY UNITS
##FACTOR=    0.49542278885378, 1,            1
##FIRST=     16045.7642231865, 0,            0
##LAST=      -16421.768244346, 0,            0
##MIN=       -16421.768244346, -30121870,    0
##MAX=       16045.7642231865, 400266318,    0
$$ Real data points
##PAGE= N=1
##DATA TABLE= (X++(R..R)), XYDATA
$$ [...]
42818e86134j85900Q3073N23386O60309L05544m1650J03788M65364M23506o6099
42808A685187m70577m64357k25829J6064K57126M50746L65787q2023n80427o95585
42798B56112l22370K20732N02650L74186Q7711n682J23179J88120L7930j18923
42788A343645o8721N1582k1918k52776l48130j53585J91995M32731L88205P9290
42778A642318k12827j69900J52404L47200K28891P6311Q1064n2045n41772r26701
42768F24943o21382J17715M40789Q3755l47116l39500q0958R0681K30436M48406
42758F47769N30765L08460M3845M8822J89327J41506q6876k49275k75937k36537
42748A061869n9267L19701O26141M73824o4420m47063l04733J43276L87152J73597
$$ plain form
42818 -586134 -772034 -688961 -165575 494734 800278 758628 862416 1327780 1751286 1685187
42808 1685187 1214610 750253 524424 540488 797614 1248360 1614147 1532124 951697 256112
42798 256112 -66258 154474 657124 1031310 1119021 1113339 1236518 1424638 1462568 1343645
42788 1343645 1274924 1326506 1304588 1051812 703682 550097 742092 1174823 1563028 1642318
42778 1642318 1429491 1259591 1411995 1759195 1988086 2064397 2145461 2093416 1551644 624943
42768 624943 3561 121276 562065 645820 298704 -40796 -121754 -31073 199363 647769
42758 647769 1178534 1486994 1530839 1579661 1768988 1910494 1823618 1574343 1298406 1061869
42748 1061869 1002602 1322303 1948444 2422268 2357848 1910785 1606052 1749328 2136480 2310077
42738B310077k95773n87137m29572K1622L26751K32779o7630k30471j86131j15138
42728I79377j17060j24550r6392p9921q8787r7813j38735k19267j84093J15581
42718e1660N14911O50455M38136J94255J84695K90132K63578R8504o5309k22814
42708B294883m27616n40984l53689M5334K94616K20603L8123j4423j2133j30617
42698A414097k78984k23004r658L6125j96060l84099k23913R6737J34920j73247
42688A92914m03301k21551J80210L88480L22691K45267K95853L01570J17959q8419
42678A331673q1306O8835Q1111j07162k37893r8325K03716M13425M11750K15558
42668B201382j38464n31085o94255m35664P9416M50100M61074K42722K0099j19407
$$ plain form
42738 2310077 2014304 1427167 997595 1019217 1345968 1578747 1511117 1280646 1094515 979377
42728 979377 862317 737767 641375 561454 472667 374854 236119 16852 -167241 -51660
42718 -51660 463251 1113706 1551842 1746097 1930792 2220924 2484502 2583006 2517697 2294883
42708 2294883 1867267 1326283 972594 1017928 1312544 1533147 1571270 1556847 1544714 1414097
42698 1414097 1135113 912109 902451 938576 742516 358417 134504 231241 366161 192914
42688 192914 -210387 -431938 -251728 136752 459443 704710 1000563 1302133 1420092 1331673
42678 1331673 1250367 1319202 1400313 1293151 1055258 956933 1160649 1574074 1985824 2201382
42668 2201382 2062918 1531833 837578 401914 481330 931430 1392504 1635226 1655325 1535918
42658A535918j74969j39538o4969q7313k54859l95708k75156J19488N16753O02883
42648A382530L23097o2803k55473k37106k20274k60476j20267L24094P32611O46149
42638B252082R9861m05475n13978k99948K1887L02145L44298R490m25444m20610
42628I64308R2904M99585L01694j98799l67694j14539J05699L157k38824l18356
42618G29135j59553R8714K52149J94172M1761j3133l1440k40514n19287l86039
42608c4035K30253O58173L72310j78227k09356K28992M08901Q6069k38332k19861
42598A104887j07832j29947r7034J09899J96668p2363m49696n43454k91697J02458
42588a78111M30785N28946L58350J59250K25701M51811M41788J25293j49352k15685
$$ plain form
42658 1535918 1360949 1221411 1156442 1069129 814270 418562 143406 262894 779647 1382530
42648 1382530 1705627 1642824 1387351 1150245 929971 669495 549228 873322 1605933 2252082
42638 2252082 2351943 1946468 1432490 1132542 1154429 1456574 1800872 1810362 1384918 964308
42628 964308 1057212 1556797 1858491 1659692 1291998 1177459 1283158 1286315 1047491 729135
42618 729135 569582 668296 920445 1114617 1156378 1143245 1111805 871291 352004 -34035
42608 -34035 196218 854391 1226701 1048474 839118 1068110 1477011 1563080 1324748 1104887
42598 1104887 997055 867108 770074 879973 1076641 1004278 554582 11128 -280569 -178111
42588 -178111 252674 781620 1139970 1299220 1524921 1976732 2418520 2543813 2394461 2178776
42578B178776l03420m96715m81819r7011L08945L70188J83146J8488p8397j28344
42568A473837l6458J41060J19378j29378k04526P2233K38817j47006p60564q89863
42558a22470l44721M10220Q36002O96074Q6578n57381p00194k78160J75442K35338
42548D36728J02823J28994K25587J71564J17056K61382L56848J06701k10653j26339
42538A570691K12103K49912q5968l30392k47104n6427P4459J92675K11778l4227
42528A757500l52499l38528j7301J61456K0520j44536j21992n1630n0192k9482
42518H33316J8544k3638r5111j3057J47970J59610R7322K06448L48718J60090
42508A840212k29662k80441O5553K48102J7155j86542l9454J43554M6876j03759
$$ plain form
42578 2178776 1875356 1378641 896822 799811 1108756 1478944 1662090 1680578 1602181 1473837
42568 1473837 1437379 1578439 1697817 1568439 1363913 1436146 1674963 1527957 767393 -122470
42558 -122470 -467191 -56971 779031 1475105 1561683 1004302 304108 25948 201390 436728
42548 436728 539551 668545 894132 1065696 1182752 1444134 1800982 1907683 1697030 1570691
42538 1570691 1782794 2032706 1946738 1616346 1369242 1312815 1387274 1579949 1791727 1757500
42528 1757500 1405001 1066473 1049172 1210628 1231148 1086612 964620 912990 862798 833316
42518 833316 851860 828222 733111 720054 868024 1027634 1124956 1331404 1680122 1840212
42508 1840212 1610550 1330109 1395662 1643764 1660919 1474377 1434923 1578477 1625353 1521594
42498A521594n3038j6431k07640l47664j32419K07693K79978J12097o1064k37508
42488A065598m43128m35653p6014L02769L42002J90285J67462K05314Q8503m1090
42478A366048O6197K50566J92490p992p007J80036K37875Q9250q3815k35022m32369
42467A616257n69962n23340m38292m43690k94024K00092O14514M04486j88548
42458C77493l90474k247M15787M66879L26928J55750j72017n44322n06175J2658
42448A40260M45766L89674J27262L4512N333j48468k36146p9756P6976K3973L6965
42437H16351L62126O35380M08815n2726j53719O7018N2137k87415m30187j57174
42427A260606Q0188p6415l40977l04319m7548J12984J44395K03431K72103K21823
$$ plain form
42498 1521594 1468556 1452125 1244485 896821 764402 972095 1252073 1364170 1303106 1065598
42488 1065598 622470 186817 110803 413572 755574 945859 1113321 1318635 1407138 1366048
42478 1366048 1432245 1682811 1875301 1867309 1860302 2040338 2278213 2367463 2283648 2048626 1616257
42467 1616257 1046295 522955 84663 -359027 -653051 -452959 161555 566041 377493
42458 377493 -12981 -15228 400559 867438 1194366 1350116 1178099 633777 127602 140260
42448 140260 586026 975700 1102962 1137474 1142807 994339 758193 678437 755413 779386 816351
42437 816351 1178477 1813857 2222672 2169946 2016227 2083245 2135382 1847967 1417780 1260606
42427 1260606 1340794 1264379 923402 619083 571535 684519 828914 1032345 1304448 1526271
42417A526271P6589o0875j99981l44817l46906j23616J20822J46869K4970k0990
42407G98336K3426M5430J18814L77803O39292N45952J23930j75894j02966O1606
42397B455729m1823l58753n79558n54681l41746l3194K49174L42088K24548R1007
42387A452791Q3529J02186L7163p043P0270J18704k5595k11848j80622J5415J01810
42376A556760J5034o0349l5797M227M1738J39610K17649J02935j75948l99362
42366A406497m61676m20421k78204m720K48411K64390Q5923p3769j95657l78494
42356A92280m61890j79591K99651M75169K42150K7194Q2601J69627J19296J49468
42346A115955L49876L95246J28399p4802O6128K17484P934l16009l38543j88328
$$ plain form
42417 1526271 1602860 1541985 1342004 997187 650281 526665 647487 794356 819326 798336
42407 798336 821762 867192 986006 1363809 2003101 2549053 2672983 2497089 2394123 2455729
42397 2455729 2413906 2055153 1475595 920914 579168 545974 795148 1137236 1361784 1452791
42387 1452791 1536320 1638506 1675669 1668626 1738896 1857600 1832005 1620157 1439535 1454950 1556760
42376 1556760 1571794 1511445 1475648 1479875 1521613 1661223 1878872 1981807 1805859 1406497
42366 1406497 944821 524400 246196 241476 489887 754277 840200 766431 570774 192280
42356 192280 -269610 -449201 -149550 325619 567769 594963 677564 847191 966487 1115955
42346 1115955 1465831 1861077 1989476 1914674 1980802 2198286 2206220 1890211 1551668 1363340
42336A363340k21254l17355j27442K14311K67986K7308j33845j41210k30356l43845
42326C57638j45587L38662O63191O06267L80159J73595k6581j50911r3913n3266
42316B049254k96896n94027m61484J056J75452q2775k16207Q2399M07948M25432
42306A490152L98745N31144M69211K523l60900j66743J56438k8670m81231m94967
42296A515702j24961q9078m99259o17862p8163M80668M07272J0181j6767L09024
42286A296757L81300K0973k77099j60321O9627M199k11098j44194J98341L55379
42276A533864J26146j14130L223K67996K13186j80538m67382l73493j05928K8108
42266I31052K0511N7563K11217L60893L28244N5662k62569k88001O1097M04050
$$ plain form
42336 1363340 1142086 824731 697289 911600 1179586 1206894 1073049 931839 701483 357638
42326 357638 212051 550713 1213904 1820171 2200330 2373925 2347344 2196433 2102520 2049254
42316 2049254 1752358 1158331 696847 697903 873355 790580 574373 656772 1064720 1490152
42306 1490152 1888897 2420041 2889252 2891775 2530875 2364132 2520570 2491900 2010669 1515702
42296 1515702 1390741 1301663 802404 184542 106379 587047 994319 1004500 987733 1296757
42286 1296757 1678057 1699030 1421931 1261610 1331237 1335436 1124338 980144 1178485 1533864
42276 1533864 1660010 1545880 1549103 1817099 2030285 1849747 1382365 1008872 902944 931052
42266 931052 951563 1009126 1220343 1581236 1909480 1965142 1702573 1414572 1475669 1879719
42256A879719L32454k8854k06776p4673L0211q9719k13972j66731j24571k25125
42246A111963k53878l2607J93896J15715j23484j27080J72746M53641M41416J58868
42236B111196j81154l25931j31825K47259M38789K82737K2091r7971j80023l75756
42226A809412m92869k71327J04565J80944j19753l99305l55676j29596k742j8460
42216C05193l0453M0074J24607J26673N7956L7126J12187J25666q7205l71222
42206D40602l67063k3026K94245L31538K70035L09510K85755L0786j95241n5171
42196A321970K91430L98721J77007q4483k06417k14175o8870K44527M48973K61038
42186B569721j17260k65489k34008m22319p91617q24269l73519P0980J75441K19437
$$ plain form
42256 1879719 2212173 2183319 1976543 1901870 1932081 1842362 1628390 1461659 1337088 1111963
42246 1111963 858085 825478 1019374 1135089 1011605 884525 1057271 1510912 1952328 2111196
42236 2111196 1930042 1604111 1472286 1719545 2158334 2441071 2463162 2365191 2185168 1809412
42226 1809412 1316543 1045216 1149781 1330725 1210972 811667 455991 326395 323653 305193
42216 305193 274740 314814 439421 566094 624050 661176 773363 899029 811824 440602
42206 440602 73539 50513 344758 676296 946331 1255841 1541596 1572382 1377141 1321970
42196 1321970 1613400 2012121 2189128 2104645 1898228 1684053 1615183 1859710 2308683 2569721
42186 2569721 2452461 2186972 1952964 1530645 739028 -85241 -458760 -387780 -212339 7098
42176G098M60154O10121L71265J9023l3973J04460Q6828k8197M6447J98509M4953
42165A886688l61078m95854j26098L37633M10787J25414j36794j56294j2999J40495
42155A611900K40935K84627K64278J58963m3820l13513n58278o52316m92760p2627
42145D27389M39152P23559N55226P1654l13122l35090j27227K0762K5915K2369
42135A510587J01933J87620J45905o0351l10925l83624j45750K52508M68338L31902
42125B098143L2557j48097j75803j97591k38530j74028R239J33062P5268n9765
42115A354455j19674j32102k09866k92072j65834K05817N26186M65814O4382k98029
42105A399077l22479o8991J87790K49141J07958r0493j43743K8952K42156K12425
$$ plain form
42176 7098 467252 1077373 1448638 1467661 1433688 1538148 1624976 1596779 1643226 1841735 1886688
42165 1886688 1525610 1029756 903658 1241291 1652078 1777492 1640698 1484404 1471405 1611900
42155 1611900 1852835 2137462 2401740 2560703 2516883 2203370 1645092 992776 500016 427389
42145 427389 866541 1590100 2145326 2216980 1903858 1568768 1441541 1462303 1488218 1510587
42135 1510587 1612520 1800140 1946045 1885694 1574769 1191145 1045395 1297903 1766241 2098143
42125 2098143 2130700 1982603 1806800 1609209 1370679 1196651 1205890 1338952 1414220 1354455
42115 1354455 1234781 1102679 892813 600741 434907 640724 1166910 1632724 1697106 1399077
42105 1399077 1076598 1007607 1195397 1444538 1552496 1462003 1318260 1347212 1589368 1801793
42095A801793o5551k76177k05666j2087N9496J2352m5949j56935l47959m08582
42085C54735j62402J76166K69382J68122J72830K76459J94699p1599j86902n3655
42075A137835M1526k9657k6143J50655K04321m0563k94360k69613j05405j5486
42065G53110R3618K86312K72924j07809m03008j00264N22769O79191J48618m55546
42055A689915n37654j86453J17359J03284j15988k40509p1085K48178L18372m652
42045A320767l24206k07990J61982K34427q6430l12885j16174K38919L44993J73589
42035A426992l9017j40071j07327L0521J61532J51451L4352l0015k4742p5305
42025A388371j62119j25989m719j9207j34109k6917L34371M99005J93772k11280
$$ plain form
42095 1801793 1736242 1460065 1254399 1242312 1301808 1314160 1268211 1111276 763317 354735
42085 354735 192333 368499 637881 806003 978833 1255292 1449991 1378392 1191490 1137835
42075 1137835 1179361 1149704 1123561 1274216 1478537 1437974 1143614 874001 768596 753110
42065 753110 846728 1133040 1405964 1298155 895147 794883 1317652 1996843 2145461 1689915
42055 1689915 1152261 965808 1083167 1186451 1070463 829954 758869 1007047 1325419 1320767
42045 1320767 996561 788571 950553 1184980 1098550 785665 669491 908410 1253403 1426992
42035 1426992 1387975 1247904 1140577 1171098 1332630 1484081 1518433 1488418 1463676 1388371
42025 1388371 1226252 1100263 1095544 1076337 942228 915311 1249682 1748687 1942459 1731179
42015A731179k59703r1119j19328k97838k44276M0104J44928m8249j73391m858
42005F77449J99704J70898K3702o2224j80544m02589m67639j66119J92482J42537
41995A27657k16719l26290M833L36468K83182M3815J3894K08432L72838M16583
41985A264693L97804K55986o9784l55369l01092N8J58172N0698p2697p2351r1276
41974A164842j48728j1212L18193M12539M0636l98099m41134k38939k12777l15689
41964A69632j82248J53644K90340J68268J55576L60073M22945J49457j79475l24021
41954A184191m04756m61493k26164L00672N47889J45501l96161l53007J53898
41945D90570M00500J89070L3518K10035L29664P5615k36357k01857J5065N715
$$ plain form
42015 1731179 1471476 1380357 1261029 963191 718915 759019 903947 855698 682307 677449
42005 677449 877153 1048051 1071753 1009529 828985 426396 -41243 -207362 -14880 127657
41995 127657 -89062 -415352 -410519 -74051 209131 252946 266840 475272 848110 1264693
41985 1264693 1662497 1918483 1848699 1493330 1192238 1192296 1350468 1401166 1328469 1256118 1164842
41974 1164842 1016114 1004902 1323095 1735634 1776270 1378171 937037 698098 485321 169632
41964 169632 -12616 141028 431368 599636 755212 1115285 1538230 1687687 1508212 1184191
41954 1184191 779435 317942 91778 392450 940339 1085840 689679 336672 490570
41945 490570 891070 1080140 1113658 1323693 1653357 1728972 1492615 1290758 1305823 1311538
41935A311538k01039k44906o3399M7295k2536j5717K21985M34350L14965n0150
41925A732386l19018l30885j88045q08J91053K65295P1993k71486l98750j78402
41915E73333M2236p5047l10858j80824L01477N80080L53427m031m2499J00396
41905A337690o170l64748n53027l77805j17627n7066j16823q2965M4182J03923
41895a90436L5387o2358o1374Q3250K94813M14740L47302J70437K8345n5514j48497
41884H56095k37528k41876j67885q0902M2321K29223L22563J52196j06668q5398
41874F82141J96865K82781k7118l22342k05988J01551J80726J23172L00182N98131
41864A910101M82681j58722p79989r03369o18916k14175K17677N64400N47698
$$ plain form
41935 1311538 1110499 865593 802194 849489 826953 811236 1033221 1467571 1782536 1732386
41925 1732386 1413368 1082483 894438 893630 1084683 1349978 1421971 1150485 751735 573333
41915 573333 615569 540522 229664 48840 350317 930397 1283824 1279793 1237294 1337690
41905 1337690 1331520 966772 413745 35940 -81687 -138753 -255576 -338541 -294359 -190436
41895 -190436 -155049 -217407 -278781 -195531 99282 514022 861324 1031761 1060106 1004592 856095
41884 856095 618567 376691 208806 127904 170225 399448 722011 874207 767539 682141
41874 682141 879006 1161787 1134669 812327 606339 707890 888616 1011788 1311970 1910101
41864 1910101 2392782 2234060 1454071 550702 -68214 -282389 -64712 499688 1047386
41855A047386J46695j83721j10383N1900j53521n31978m77307R0975N70842N11901
41845I62789J30509j45178k18179j90826m9154K16364M04309L20776P5870q8917
41835A418363j60361k87152m30716l62756k6686L36403M89487M39995K96593O5216
41825A778386k59878n14113m70656j33812K26492L76886L33685K16739M4280j77842
41815A420167k86553j26006J46092J91581j6169j26359L5033J64216k5483l10537
41805A065982l17398j28109o8596p3383J64861M71347K88818l62253p07313l34729
41795g73J37270J3325l96341l24127J90009L89038L9296k34861J3642M01538M06287
41784F34303J45396M9266J49929J54573N394p1018K477L1812j10912k83838k78955
$$ plain form
41855 1047386 1194081 1010360 899977 951877 798356 266378 -210929 -119954 450888 962789
41845 962789 1093298 948120 729941 539115 489961 706325 1110634 1431410 1507280 1418363
41835 1418363 1258002 970850 540134 177378 150692 487095 976582 1416577 1713170 1778386
41825 1778386 1518508 1004395 533739 399927 626419 1003305 1336990 1553729 1598009 1420167
41815 1420167 1133614 1007608 1153700 1345281 1329112 1202753 1237786 1402002 1376519 1065982
41805 1065982 748584 620475 551879 478496 643357 1114704 1403522 1041269 333956 -773
41795 -773 136497 149822 -246519 -570646 -380637 8401 47697 -187164 -173522 228016 634303
41784 634303 779699 828965 978894 1133467 1138861 1067843 1070320 1102132 991220 707382 428427
41773D28427q1024J36537K01726J03409r105R421J37699K33281K21921J51994
41763A534286O8907l6154j27293j15195r395M9534n165m2787P4283K55514K63394
41752A909929J6938k71725k94718K4529M10271M81380J50516k78266m59777l69189
41742A319888k23536j50647r8767q300J10120K35670L10247K10346n9727k24480
41732A420814m8874K56180K58331o1505k59655r9918J01425r787k91496l55134
41722I10381j27104J12373J22885p5316k77882k54588M8112L68968L71002R8381
41712A297212n3802O3731J15672j47418m23838l05075Q6756L14012K93638L12165
41702A553053M54371M57245J74302j67129k74516j33631K0355n8448l88681o52004
$$ plain form
41773 428427 347403 483940 685666 789075 779970 789391 927090 1160371 1382292 1534286
41763 1534286 1603193 1567039 1439746 1324551 1315156 1364690 1359525 1316738 1391021 1646535 1909929
41752 1909929 1926867 1655142 1360424 1384953 1795224 2276604 2427120 2148854 1689077 1319888
41742 1319888 1096352 945705 846938 838638 948758 1184428 1494675 1705021 1645294 1420814
41732 1420814 1371940 1628120 1886451 1824946 1565291 1465373 1566798 1557011 1265515 910381
41722 910381 783277 895650 1018535 943219 665337 410749 458861 827829 1198831 1297212
41712 1297212 1243410 1307141 1422813 1275395 851557 546482 633238 947250 1240888 1553053
41702 1553053 2007424 2464669 2638971 2471842 2197326 2063695 2084050 2025602 1636921 984917
41692I84917m56456J29496N12732K98066j50308k17086J03998L01581J47028j12138
41682A541830k87931m16174l66286J03503P44318Q60349K47980m05960m24106
41673A597523j9036J35114j27848l89907l31981m3190K52999L96302K60458j39464
41663A590970n16111n56478l02294o6533K873M3280J63571K55090K00302R9884
41653I14554J57287L83133N22276L39277m9176k61447j49811l3698k13241m21395
41643A187759j63564M38684O55284J53480m96306o18227k96962l8085N9739K48017
41633A129819M62819L19447k23947o79979o08332o8840N21040P14400K96790m40496
41623A422721p69965k76785N07823O73733J20200l47946j86590K15905K72004
$$ plain form
41692 984917 528461 657957 1170689 1468755 1318447 1101361 1205359 1506940 1653968 1541830
41682 1541830 1253899 837725 471439 574942 1319260 2179609 2427589 2021629 1597523
41673 1597523 1578487 1713601 1585753 1195846 863865 820675 1073674 1469976 1730434 1590970
41663 1590970 1074859 518381 216087 149554 152427 195707 359278 614368 814670 914554
41653 914554 1071841 1454974 1977250 2316527 2267351 2005904 1856093 1822395 1609154 1187759
41643 1187759 1024195 1462879 2118163 2271643 1775337 1157110 860148 822063 881802 1129819
41633 1129819 1592638 1912085 1688138 1008159 399827 330987 852027 1566427 1863217 1422721
41623 1422721 652756 375971 883794 1557527 1677727 1329781 1143191 1359096 1631100
41614A631100L5582r6854q3193j33901k02849r4003Q9244R1295J0159J69025M90074
41603A905679M89945K1655m18409l61229k702J46053K2780M2981M07265P45481
41593B999499N96277J6304n00858o15892m39201k56910j93005k19389k90202l10131
41583G86492j37618J78482L11213O5048k42355j46696K58780L91954K8547l43530
41573A150317k27784J90488L70213J64722j04950j63732l9178J02179J05176r6170
41563A451281l26986k45690J79686M63128J99141l16980m78075k22511j0615l4182
41553F58197l2337P0002k5467l36861l63447J40883O53641N91745J50151n7443
41543A449064R1778K04261P4729j13304k21270k95358k68191J8806M20897N32179
$$ plain form
41614 1631100 1666682 1569828 1486635 1352734 1149885 1055882 1145126 1236421 1246580 1415605 1905679
41603 1905679 2395624 2417279 1998870 1637641 1634939 1780992 1803772 1846753 2254018 2999499
41593 2999499 3595776 3612080 3111222 2495330 2056129 1799219 1606214 1386825 1096623 786492
41583 786492 648874 827356 1138569 1203617 961262 814566 1073346 1465300 1493847 1150317
41573 1150317 922533 1113021 1483234 1647956 1543006 1379274 1340096 1442275 1547451 1451281
41563 1451281 1124295 878605 1058291 1521419 1720560 1403580 925505 702994 692379 658197
41553 658197 625860 695862 670395 333534 -29913 110970 764611 1356356 1506507 1449064
41543 1449064 1540842 1745103 1819832 1706528 1485258 1189900 921709 940515 1361412 1893591
41533A893591K53605l5315l4192O3849p1633l82595n08532k74076J24095L70199
41523A398996L22672Q0085j37387j66029j6425J56135J85939K0974k13850k69716
41513A361394j5987L19059L16562j10546n44572n76832k96769m1308J25487L40887
41503H77375N16498M14918J03656r4612j10514j59045k35596o9551K96249L89509
41493A928887K5183l11774j43114L00052M31641J03656l31214n56212n34225l50812
41483E62068j29308j2692J332Q5349K65453K93299N3615j59792o2276J84290K83833
41472A365171K91778L89180M20407J43607k32525k93337j03895j07117l67111
41463A506158m70957k36444K6176Q5274J12515K52670L30653K16852Q2477M9320
$$ plain form
41533 1893591 2147196 2111881 2077689 2141538 2069905 1687310 1178778 904702 1028797 1398996
41523 1398996 1721668 1801753 1664366 1498337 1481912 1638047 1823986 1844960 1631110 1361394
41513 1361394 1345407 1664466 1981028 1870482 1325910 749078 452309 411001 536488 877375
41503 877375 1393873 1808791 1912447 1817835 1707321 1548276 1312680 1243129 1539378 1928887
41493 1928887 1954070 1642296 1499182 1799234 2230875 2334531 2003317 1447105 912880 562068
41483 562068 432760 420068 421400 506749 772202 1065501 1119116 959324 897048 1081338 1365171
41472 1365171 1656949 2046129 2466536 2610143 2377618 2084281 1980386 1873269 1506158
41463 1506158 1035201 798757 824933 910207 1022722 1275392 1606045 1822897 1905374 1954694
41453A954694m9853l05238m57502k73179P6915K78301K79091K01348P8468p8873
41443A704172j59429j17693p6827q2538K0143K67396L88475J88306j08157j68336
41433A855512j3884J06713J23020J19605O3419j19450k87864k18228M5197K33867
41423A907907K23099J34011R8032J22450J65964J76747Q9146p9127j93849j94138
41413B450242k03776l08604l68339k40628m7247J5347O222J13200K79094K45437
41403A940948l6557k92262k69536k7620J60129Q9024j88802l95158k98364Q129
41393F89931K18118K25175K08349K50477J84374k5332j04982N5037J04574k15486
41383A590235n45748l98460P3323L15681J98027M1112m3798k28196m22480k98511
$$ plain form
41453 1954694 1904841 1599603 1142101 868922 945837 1224138 1503229 1704577 1783045 1704172
41443 1704172 1544743 1427050 1350223 1267685 1287828 1555224 1943699 2132005 2023848 1855512
41433 1855512 1841628 1948341 2071361 2190966 2254385 2134935 1847071 1628843 1674040 1907907
41423 1907907 2131006 2265017 2363049 2485499 2651463 2828210 2917356 2838229 2644380 2450242
41413 2450242 2246466 1937862 1569523 1328895 1281648 1296995 1303217 1416417 1695511 1940948
41403 1940948 1904391 1612129 1342593 1314973 1475102 1564126 1375324 980166 681802 689931
41393 689931 908049 1133224 1341573 1592050 1776424 1751092 1646110 1701147 1805721 1590235
41383 1590235 1044487 646027 719350 1035031 1233058 1274170 1230372 1002176 579696 281185
41373B81185Q4778K88153K28667K95554N73591N93600J25819l82234n00961l92742
41363A195410l17309j38930J91514K17978l21604q11181n04149L20139P10531
41354E42399M16189J16602K59161M56349K75881m9980j02515L6940M0321o1827
41344A929520p653J46524P2759k61307m76358l24926m0487L1309o1015J8820L57710
41333A384896O23727N09473J51503n8831J9047J52464Q1926k11368n89924q94085
41323A168828r36497n91788j8644L95208M54207L54945L27712K87317N7294k46688
41313A251894l54560k58470j81797j74737n9102J95896L51145K58117Q6524L3814
41303A148724L819k15542n50562o39828k74707K93025N98636M97972L17575L81552
$$ plain form
41373 281185 365963 654116 882783 1178337 1751928 2345528 2471347 2089113 1588152 1195410
41363 1195410 878101 739171 930685 1148663 827059 15878 -488271 -168132 542399
41354 542399 958588 1075190 1334351 1790700 2066581 2016601 1914086 1951026 1991347 1929520
41344 1929520 1921867 2068391 2141150 1879843 1403485 1078559 1038072 1069381 1008366 1027186 1384896
41333 1384896 2008623 2518096 2669599 2610768 2629815 2782279 2864205 2652837 2062913 1168828
41323 1168828 232331 -359457 -378101 17107 471314 826259 1153971 1441288 1498582 1251894
41313 1251894 897334 638864 457067 282330 223228 419124 770269 1028386 1114910 1148724
41303 1148724 1152543 937001 386439 -253389 -528096 -235071 363565 861537 1179112 1560664
41293A560664N25811L31826j91434n20828l54427o1524r1971k62053r5076L34251
41283A175239M76448J92316m7693K7200P5535j84251m35154l18518q8244j75775
41273F97103m10653k82646J68990L62473R0479j65996j4167K70078K32709o7011
41263H81359k16354p3898J19214J56283R7184Q8796J59623K28459K11047J01429
41253A753142j6536o6611q1902j23521j29646r907J27720Q5330o1303j2141K45707
41242A710332L30987O7436j90456j37145l7549k29209m53915k79142O6860O699
41232H54898l45960k80659K92041N85423J99526k09838m4222K25481r8463o81312
41222D96915o40156N9540O21438O82424O38751O90147M66423j61620o82986p11920
$$ plain form
41293 1560664 2086475 2418301 2226867 1706039 1351612 1290088 1198117 936064 840988 1175239
41283 1175239 1651687 1844003 1796310 1823510 1899045 1714794 1279640 961122 872878 697103
41273 697103 286450 3804 172794 535267 625746 459750 445583 715661 948370 881359
41263 881359 665005 591107 710321 866604 963788 1052584 1212207 1440666 1651713 1753142
41253 1753142 1736606 1669995 1588093 1464572 1334926 1325019 1452739 1538069 1476766 1464625 1710332
41242 1710332 2041319 2108755 1918299 1781154 1743605 1514396 1060481 781339 848199 854898
41232 854898 508938 228279 520320 1105743 1305269 1095431 1051209 1276690 1178227 496915
41222 496915 -143241 -83701 537737 1220161 1858912 2549059 3015482 2853862 2170876 1458956
41212A458956n22127m46548l11924R7545M94838M91556J90083p1821k55807m54628
41202F70123m79187j30596K89971K67214j73199m46500j86272L19082N45916L24421
41192A000973p7375k79107j29472J87092L70837L40491K40701J26730j02307l74845
41182A303718l90076j01272Q3111j06364l27185j58391J79897J76537q3767k2413
41172E53795M39084O32220J07299o67826r15990n27256p1706o563j89608j76938
41162h23489J78213N15534L93616j00390l73292j04426K59285J33499k82725k47026
41152d51201L87591Q73855O10795m4412l55620j92291O843m358l4966J01989L13525
41141A211750M37617M48218L75618K04968p3051l95105o26699o09452k93578J22329
$$ plain form
41212 1458956 936829 490281 178357 275902 770740 1262296 1452379 1380558 1124751 670123
41202 670123 190936 60340 350311 617525 444326 -2174 -188446 130636 676552 1000973
41192 1000973 923598 644491 515019 702111 1072948 1413439 1654140 1780870 1678563 1303718
41182 1303718 913642 812370 895481 789117 461932 303541 483438 659975 576208 553795
41172 553795 992879 1625099 1732398 1064572 148582 -378674 -450380 -456943 -646551 -823489
41162 -823489 -645276 -129742 263874 163484 -209808 -314234 -54949 78550 -204175 -451201
41152 -451201 -63610 810245 1421040 1376628 1021008 828717 835560 831202 796236 898225 1211750
41141 1211750 1649367 2097585 2473203 2678171 2605120 2210015 1583316 973864 680286 802615
41131H02615L22810K55821K24945M29971N71967J99902n88752j106303q54372
41122B58604j37808K87504Q7070l33667l93929k1199L73355M76875L80249K88482
41112A265536K09501R5274N9611J93128L18028K31215P8146J26513K37466J0359
41102B824777m98656o99147l19484J19420M4347l11397k69272K61107O34514L76269
41092B162478k13590n31613m27385k30923j85677j51428Q2412L99024M63223J82300
41082A548821j62854l21274l77844m71235m37898p6533L75119M64810K03478N3996
41072G98586J90716K81601J54050J11935K95814K94047j48604n30572k97081K32979
41062A383471L21290o2203k94043j48443k9745j45830k12652j32237k38160n87195
$$ plain form
41131 802615 1125425 1381246 1606191 2036162 2608129 2808031 2219279 1112976 258604
41122 258604 120796 408300 495370 161703 -232226 -253425 119930 596805 977054 1265536
41112 1265536 1475037 1570311 1629922 1823050 2141078 2372293 2450439 2576952 2814418 2824777
41102 2824777 2326121 1626974 1307490 1426910 1471257 1159860 890588 1151695 1786209 2162478
41092 2162478 1948888 1417275 989890 758967 573290 421862 504274 903298 1366521 1548821
41082 1548821 1385967 1064693 686849 215614 -222284 -298817 76302 541112 744590 798586
41072 798586 989302 1270903 1424953 1536888 1832702 2126749 1978145 1447573 1150492 1383471
41062 1383471 1704761 1642558 1348515 1200072 1170327 1024497 811845 679608 441448 -145747
41052a45747o64467j81508L85200M92891L01635K66888L64446K69330L0608r37
41042A118339K11635L47950K50499P8426j2308J2106J82823M06552L35328k18187
41032B713163q17075q34969l34924J3415n7327r0489K06950L88855J8692n10609
41022F95682n02936m607L16314K01155N3365J30986J39928j38711l72510k02952
41012C15714J62669L12131K70776L02012K96323n4060n33137m94824J53423O33243
41002A364270L18088l58803m96682L4382M86386K95914k61840n80321m57305j19019
40992B25070J74943K88281J65362j03571k60774j23860J99430M67884N80369N50652
40982B163786L48363j628k51222j58740J05966R2250k98912o06786m24504L1410
$$ plain form
41052 -145747 -810214 -991722 -606522 -113631 188004 454892 819338 1088668 1119276 1118339
41042 1118339 1329974 1677924 1928423 2006849 1994541 2006647 2189470 2596022 2931350 2713163
41032 2713163 1896088 1061119 726195 739610 682283 591794 798744 1187599 1206291 695682
41022 695682 192746 188139 504453 705608 758973 889959 1029887 891176 518666 315714
41012 315714 478383 790514 1061290 1363302 1659625 1605565 1072428 577604 731027 1364270
41002 1364270 1682358 1323555 826873 861255 1347641 1643555 1381715 801394 344089 225070
40992 225070 400013 688294 853656 750085 489311 365451 564881 1032765 1613134 2163786
40982 2163786 2512149 2510521 2259299 2100559 2206525 2298775 1999863 1393077 968573 999983
40972I99983K43115J03480m4208r8N4662l4404j36162j48131k23283m21639m31402
40961c8087k936N31551N95285J53964k52822k79501j54427j88909l05653k61977
40951b03512l2955K50509M91916N59372L00184j43598l20415o1163J91376M433
40941A036147l53652l06749J26009L68204J78277o7425o8512k3637j45562k47664
40931D95436j37032j6811j00355j34138K27766P50009Q12631K67563l41672n13189
40921A310208l63231k75607k77940r0777L18908N79948M00756k4267k76887k54244
40911A046867k03234k46668j81247J14860L48789J81176k20457l52677q4203J63067
40901E66273L7731k53510k77628K9100L34364L66051J87233M7877J00435K65398
$$ plain form
40972 999983 1243098 1346578 1302370 1302272 1356934 1322530 1186368 1038237 814954 393315 -38087
40961 -38087 -41023 490528 1085813 1239777 986955 707454 553027 364118 58465 -203512
40951 -203512 -236467 14042 505958 1065330 1365514 1221916 901501 840338 1031714 1036147
40941 1036147 682495 375746 501755 869959 1048236 980811 912299 888662 743100 495436
40931 495436 358404 341593 241238 107100 334866 1084875 1897506 2165069 1823397 1310208
40921 1310208 946977 671370 393430 302653 621561 1201509 1602265 1577998 1301111 1046867
40911 1046867 843633 596965 415718 530578 879367 1060543 840086 487409 403206 566273
40901 566273 604004 350494 72866 101966 436330 802381 989614 1037491 1137926 1403324
40891A403324L27063J74746p6395k70102m22570n77415n51851j48953L84111N13916
40881G55874J69674o8830K17489O55365O14209Q1812m17869n81507n40218m21833
40871D64166j75251J50404L57845M01208M08278L69990J46566j71137k70612r2328
40861A589129M3100q2796k90530l37448k38944q1431J71292M55059M80558J25833
40851A833822k68477l09040r0364q729j58842k57209j25982P1382J20271K9198
40841H36030o0090o6233j5729m861j08581k29907j21611K76981O18754N09970
40831A634723N0678k71371k44808j77763l70924o55302o68276l62272K0723L31567
40821g13025N93083P72896P54460N39860K56862n1507m22244p22393o60686j85709
$$ plain form
40891 1403324 1730387 1905133 1828738 1558636 1136066 558651 6800 -142153 241958 755874
40881 755874 925548 856718 1074207 1729572 2343781 2425593 2007724 1426217 885999 464166
40871 464166 288915 439319 797164 1198372 1606650 1976640 2123206 1952069 1681457 1589129
40861 1589129 1632229 1549433 1258903 921455 682511 601080 772372 1227431 1707989 1833822
40851 1833822 1565345 1256305 1165941 1157212 998370 741161 615179 686561 806832 836030
40841 836030 775940 709707 693978 689117 580536 350629 229018 505999 1124753 1634723
40831 1634723 1685401 1414030 1169222 991459 620535 -34767 -703043 -1065315 -1044592 -713025
40821 -713025 -119942 652954 1407414 1947274 2204136 2152629 1730385 1007992 347306 161597
40811A61597L26789M72945K80067P5962K746r3120l00963m37911l11348j7040
40801A59724J78098J68327Q4388O8954J05377R3558O666q7119j25871j11159m4366
40790D96577J31035M26475O55456N43095R6829k72605k04706J15616J81718j27823
40780B041667l91359k87835m7888l2928j76327j89781r1521r2898r2583K07891
40770H46438O75892P61700L05189j45057j00192J81636J54641j75226l42014j98177
40760A964830j01444k91402n02200l65984O7723M11827M07962J67355K36Q3094
40750A841997K83679L21773J18753j01425j33567q1575j66572l61641m52313l98186
40740H70923l58067l50905j87120J69665M32662L41488K103k73902l31351k38430
$$ plain form
40811 161597 488386 961331 1241398 1317360 1320106 1226986 926023 488112 176764 159724
40801 159724 337822 506149 590537 659491 764868 858426 865092 777973 652102 540943 496577
40790 496577 627612 1054087 1709543 2252638 2349467 2076862 1872156 1987772 2169490 2041667
40780 2041667 1650308 1362473 1314585 1281657 1105330 915549 824028 731130 638547 846438
40770 846438 1522330 2284030 2589219 2444162 2343970 2525606 2680247 2505021 2163007 1964830
40760 1964830 1863386 1571984 1069784 703800 771523 1183350 1591312 1758667 1758903 1841997
40750 1841997 2125676 2447449 2566202 2464777 2331210 2249635 2083063 1721422 1269109 870923
40740 870923 512856 161951 -25169 144496 577158 918646 920749 646847 315496 77066
40730G7066j16627m2315k8656L415J52030L55052M00906K08982l1516j16303r1242
40719G70792j25727k32242k68717j51372O5612K62536L08365J35179j32569k27323
40709D04534m1480K17332K90139J67352O118r7712j00854M3446K25560J53233
40699A267668k42232n51431l82837K9068J29077j25005k21987Q1400M19467M55298
40689H58486L58447L66747L17992J3428k91627k26448O9781J28662j38308l56231
40679A100929k97209j49847j05895o4438Q0118J59060r491k47338j71258K90499
40669E85130P31144P10095K88863j8999J14136L85450K54163k87017o48317m37358
40659A677290K1503J96390P5547K3484J23399J25202k0505n9338P2131R4296j12507
$$ plain form
40730 77066 -39561 -81876 -110532 -107117 44913 399965 800871 1009853 978337 862034 770792
40719 770792 645065 412823 144106 -7266 58346 320882 629247 764426 631857 404534
40709 404534 363054 580386 870525 1037877 1043995 946283 845429 888875 1114435 1267668
40699 1267668 1025436 474005 91168 120236 249313 124308 -97679 -16279 403188 858486
40689 858486 1216933 1583680 1901672 1915100 1623473 1397025 1466806 1595468 1457160 1100929
40679 1100929 803720 653873 547978 483540 563658 722718 713227 465889 294631 585130
40669 585130 1316274 2026369 2315232 2296233 2410369 2795819 3049982 2762965 2114648 1677290
40659 1677290 1698793 1895183 1970730 1994214 2117613 2242815 2222310 2162972 2235103 2329399 2216892
40648B216892k46289o4456J93595J59278j19636k96006k35647j08086m7498j3370
40638A438777K3401P914m3730j2249J31648K34750J35861j39615m03012m71251
40628I02494k93456L6914L51889M96431L89651P6710k36254k87834l3877K26368
40618A629036J62776j55274l38734k08922M262Q2954J42561L15248L82045P6367
40608B092319l85289m78982q1373L60056M37615K27609p477k24461m60826n52489
40598I26702l25852N2811K41103J80946R3135M8077r1440k43649n1582N06042
40588A336293Q23384M02334l47009n48065m4091L94586J62991l99860o11538l86802
40578G82223j46454p9350l192J55898K30201J68638J29007J66137J73115J67194
$$ plain form
40648 2216892 1970603 1906147 2099742 2259020 2139384 1843378 1607731 1499645 1452147 1438777
40638 1438777 1462178 1470092 1426362 1414113 1545761 1780511 1916372 1776757 1373745 902494
40628 902494 609038 645952 997841 1494272 1883923 1960633 1724379 1436545 1402668 1629036
40618 1629036 1791812 1636538 1297804 1088882 1093144 1176098 1318659 1633907 2015952 2092319
40608 2092319 1707030 1228048 1146675 1506731 1944346 2171955 2164478 1940017 1479191 926702
40598 926702 600850 653661 894764 1075710 1168845 1216922 1125482 881833 830251 1336293
40588 1336293 2159677 2562011 2215002 1666937 1622846 2017432 2180423 1780563 1169025 782223
40578 782223 635769 556419 553227 709125 939326 1107964 1236971 1403108 1576223 1743417
40568A743417K76721L93418K30098j63235l40054j00121J78045R1094k28039l83669
40558A697675k74049p6984Q0420J33589j6006k90439l37265J2210L79447L16132
40548A624730k5678j36025O9699K11221J40094J17445K08604O9274m06256p14619
40538A158489m20651J36864K81585m8759k77600q3749J66386M6731k49221j88429
40528E21646L12860P41823O49796J58868l19566o12097p80884p73009m40508Q7541
40518d53530M03254L19962J12173J10900K96913M55701M91167L82036P0382l43431
40508A845527n07382k29467J72899K45655j2762k46337k81941k14621p4031J74975
40498H72515L50882K09658j08747k09869n7207j3961j91244k32119O5159L57243
$$ plain form
40568 1743417 2020138 2413556 2643654 2480419 2140365 2040244 2218289 2309383 2081344 1697675
40558 1697675 1423626 1346642 1427062 1560651 1544645 1254206 916941 929151 1308598 1624730
40548 1624730 1599052 1463027 1532726 1743947 1884041 2001486 2210090 2279364 1873108 1158489
40538 1158489 737838 874702 1156287 1107528 829928 746179 912565 959296 710075 521646
40528 521646 834506 1576329 2226125 2384993 2065427 1453330 672446 -100563 -541071 -453530
40518 -453530 -50276 269686 381859 492759 789672 1245373 1736540 2118576 2188958 1845527
40508 1845527 1338145 1108678 1281577 1527232 1514470 1268133 986192 771571 697540 872515
40498 872515 1223397 1433055 1324308 1114439 1057232 1043271 852027 619908 685067 1042310
40488A042310K81952K0137q758K30266L99276K75712l9891l08549l55039j85276
40478A352140l0390j34356l98222m34402r3124L05856M27511L46091K94396K44979
40468A880479N0688j67746j18470K16011M90764L77844r7091n69243o26310j98782
40458A238144K93189L63879P2382p4163R3543J35403k36922n75846l34887K38569
40448A213291M27257R5277j95334r6839J03772R9087L3750R8622J09465j38853
40438A749495l98193k57069K18555M94368K35664k83109n26594l22580j3761J0584
40428I07360j76311j43727K72220O61052N31750l1820m69847m45095j61813K6861
40418I70630M1647R977K2077J03373K53197L65876K59712p1059l59440l68432
$$ plain form
40488 1042310 1324262 1344399 1335641 1565907 1965183 2240895 2201004 1892455 1537416 1352140
40478 1352140 1321750 1187394 789172 354770 261646 567502 995013 1341104 1635500 1880479
40468 1880479 1931167 1763421 1644951 1860962 2351726 2729570 2632479 2063236 1436926 1238144
40458 1238144 1531333 1895212 1967594 1893431 1986974 2122377 1885455 1309609 974722 1213291
40448 1213291 1640548 1735825 1540491 1443652 1547424 1646511 1680261 1778883 1888348 1749495
40438 1749495 1351302 1094233 1312788 1807156 2042820 1759711 1233117 910537 896776 907360
40428 907360 731049 587322 859542 1520594 2052344 2020524 1550677 1105582 943769 970630
40418 970630 1012277 1022254 1044331 1147704 1400901 1766777 2026489 1955430 1595990 1227558
40408A227558j81148l4317L1173J52350L34476L98209K74189J31118R2622J1508
40398B437738k71015n60632m93628q9136K03547J42448M9921K50793M54208J74944
40388B299188l79789m61610R6050N28292K10470m61408p07147m33517j03142J29598
40378G16985M55556P32090N18240j23141n20490l17497M7628P1648r8407n7078
40368A425534J52200J87273K5235l7245R1306J77695P3574p9411j12821n7847
40358A845493k6854m1038o9151j31342k65940m17379m26684j89752J63468L32512
40348G73333J87692j8773N5686L73673N51968L89455J19225L7333J12611J26594
40338B708797J0694j46750k77555l20352j69850J32163K64662m4638n92694q57747
$$ plain form
40408 1227558 1046410 1012093 1043266 1195616 1530092 1928301 2202490 2333608 2426230 2437738
40398 2437738 2166723 1606091 1112463 1023327 1226874 1369322 1419243 1670036 2124244 2299188
40388 2299188 1919399 1457789 1553839 2082131 2292601 1831193 1124046 690529 587387 716985
40378 716985 1172541 1904631 2422871 2299730 1779240 1461743 1509371 1581019 1482612 1425534
40368 1425534 1577734 1765007 1790242 1752997 1844303 2021998 2095572 2016161 1903340 1845493
40358 1845493 1818639 1777601 1708450 1577108 1311168 893789 467105 277353 440821 773333
40348 773333 961025 942252 997938 1371611 1923579 2313034 2432259 2469592 2582203 2708797
40338 2708797 2719491 2572741 2295186 1974834 1804984 1937147 2201809 2157171 1564477 706730
40328G06730o05060j20062J98073K58787K19136K04010K30526K86752L40861L30092
40318B049845K36146J16488K53j47870k81790k43573m4747k3646m25435q88405
40308C47266p49368K8328O40772M44104j70526l30960J19119N22179M27377R6386
40298A374677j18506k89685n09203m96516n5399M52800N68446L92702L18023L41580
40288A978919J76034j11904j40507J39770L52596K80541R1593n1738j73938k38499
40278B302867j50939n5173j92347m25188l73663p5206K3655j56935j50276K45307
40268I92102N62844M05326N7855m0796K8094k8710j34721o3070P7968O7980K4457
40257A949329J54709K89358J49295j14927j46238Q074J5446j10414j6383L57886
$$ plain form
40328 706730 101670 -18392 179681 438468 657604 861614 1092140 1378892 1719753 2049845
40318 2049845 2285991 2402479 2402732 2254862 1973072 1729499 1684752 1661106 1235671 347266
40308 347266 -402102 -373774 266998 711102 540576 209616 328735 850914 1278291 1374677
40298 1374677 1256171 966486 457283 -39233 -94632 358168 926614 1319316 1637339 1978919
40288 1978919 2154953 2043049 1902542 2042312 2394908 2675449 2767042 2715304 2541366 2302867
40278 2302867 2151928 2096755 1904408 1479220 1105557 1030351 1054006 897071 746795 992102
40268 992102 1554946 1960272 2018127 1977331 2005425 1976715 1841994 1778924 1856892 1924872 1949329
40257 1949329 2104038 2393396 2542691 2427764 2281526 2289600 2305046 2194632 2178249 2536135
40247B536135O27521N10089J52110j57587k96026k85730k20883k23734k77383
40238B364512j84252R7067K44419L781l49935l62665o8211J13440L2219r1818
40228A798557j52226k58094l65045k76558m0276R7485J41881K91024M25858J92760
40218A855366l31132o06269m06607r5869L5016J41961L08083K41553j47660l94505
40208E99937j39344K88965L93008K18470Q7066p75j68667j97083J48966N46941
40198A777484M83860O8949j17079Q4572K71552K29886J95487K60836J37212k50326
40188C142433m68684k13970J81806K46997K5304j53015k48878m01256m48448r9075
40178A563214M57923O27586K03478l32334m74046k82115p7420Q9214K89990L11924
$$ plain form
40247 2536135 3163656 3673745 3825855 3668268 3372242 3086512 2865629 2641895 2364512
40238 2364512 2180260 2277327 2521746 2525527 2175592 1812927 1744716 1858156 1890375 1798557
40228 1798557 1646331 1388237 1023192 746634 706358 803843 945724 1236748 1662606 1855366
40218 1855366 1524234 917965 511358 415489 450505 592466 900549 1142102 994442 599937
40208 599937 460593 749558 1142566 1361036 1448102 1447327 1278660 1081577 1230543 1777484
40198 1777484 2261344 2330293 2213214 2297786 2569338 2799224 2994711 3255547 3392759 3142433
40188 3142433 2673749 2459779 2641585 2888582 2913886 2760871 2511993 2110737 1662289 1563214
40178 1563214 2021137 2648723 2852201 2519867 2045821 1763706 1686286 1775500 2065490 2377414
40168B377414r9195o54429o99475r9834M87153M54195K673k40902q0548J54072
40158A601124J88344O6939j04525l00129m27372l54138j35587L8852J43461K98294
40148A015263M49217L76489P8698j55088j40089J7358J86610L42679L57598N6839
40138B585574l57791l58180J73253O35267M73569p1950l70656k63429p2514K4558
40128B397701J13705J47992l7514l05553k95162m555J36071r1952l67979l31436
40118A361318p7133P0718J9144r1203j49462j18057M4305K98605M60793L90505
40108B209533J74347j562p2283p0095Q814J53042K25379Q7540j67035k60943o6968
40097B219769K03298K24888n7408l50025l48294r9505O3252m8894k39592j90978
$$ plain form
40168 2377414 2278219 1623790 924315 824481 1311634 1765829 1768502 1527600 1447052 1601124
40158 1601124 1789468 1856407 1751882 1451753 1024381 670243 534656 573508 716969 1015263
40148 1015263 1464480 1840969 1919667 1764579 1624490 1641848 1828458 2171137 2528735 2585574
40138 2585574 2227783 1869603 2042856 2678123 3151692 3079742 2709086 2445657 2373143 2397701
40128 2397701 2511406 2659398 2621884 2316331 2021169 2016614 2152685 2060733 1692754 1361318
40118 1361318 1284185 1354903 1374047 1282844 1133382 1015325 1059630 1358235 1819028 2209533
40108 2209533 2383880 2382318 2310035 2239940 2248754 2401796 2627175 2714715 2547680 2286737 2219769
40097 2219769 2423067 2647955 2590547 2240522 1892228 1792723 1855975 1807081 1567489 1376511
40087A376511J33306M64473N42015L33859L204k19068j84599J7675J15347o435
40077B576288j13620M1317K98789K77459o7760l81525m15590k80086j26504P7373
40067A886141L14825L81873J84887q0634k37426l46230m22662k59031J74119M61497
40057B057359K82725k7520N8445M01711L56680k34361p77262p75049m21517j29531
40047G91680O7463L21644N40650N31761L56854K12466J23755M8169J02031L50300
40037C446773N10159K38941l28828o81364n76796k73776p4010M7170K27185L91970
40027B927424L44694O1472k49982l49028j66865J33463K85239J69358o5505j83627
40017B906643j02343J21769M20172O65693O31075K44785j93289l40235k96586
$$ plain form
40087 1376511 1509817 1974290 2516305 2850164 2853368 2634300 2449701 2467376 2582723 2576288
40077 2576288 2462668 2503985 2802774 3080233 3012473 2630948 2215358 1935272 1808768 1886141
40067 1886141 2200966 2582839 2767726 2687092 2449666 2103436 1680774 1421743 1595862 2057359
40057 2057359 2340084 2312564 2371009 2772720 3129400 2895039 2117777 1342728 921211 791680
40047 791680 859143 1180787 1721437 2253198 2610052 2822518 2946273 2994442 3096473 3446773
40037 3446773 3956932 4195873 3867045 3185681 2608885 2335109 2261099 2308269 2535454 2927424
40027 2927424 3272118 3333590 3083608 2734580 2567715 2701178 2986417 3155775 3090270 2906643
40017 2906643 2804300 2926069 3346241 4011934 4643009 4887794 4694505 4354270 4057684
40008D057684m14756o41672n12354O6334N06778L39138n9660K1356O18251J091217
39998E072316J053916Q01987P15792O62815K59540n00936j170760j354025j100783
39989D439862p60673n57921m08734j49587J73653L64242L72925L55916L96753
39980D226436L62144J47985j02745j99565j92744k53968l49182k73231j7881J27881
39970C475130m2188l14538k65989K01426O78294O97453K93902n3239m2286J30506
39960D758471J93106K36226M11127M47118j1152o68145p82387k16152L05501K27479
39950D901192r9404p9853K26581L45656J46931j46014m09328n78375m10272J75457
39940D072571P02110O18258O7119l06771k13762Q4249L22287M87463N85557O05359
$$ plain form
40008 4057684 3642928 3001256 2488902 2555236 3062014 3401152 3341492 3362848 3981099 5072316
39998 5072316 6126232 6928219 7644011 8306826 8566366 8065430 6894670 5540645 4439862
39989 4439862 3679189 3121268 2712534 2562947 2736600 3100842 3473767 3829683 4226436
39980 4226436 4588580 4736565 4633820 4434255 4241511 3987543 3638361 3365130 3347249 3475130
39970 3475130 3432942 3118404 2852415 3053841 3732135 4429588 4723490 4670251 4627965 4758471
39960 4758471 4951577 5187803 5598930 6046048 6034896 5366751 4584364 4368212 4673713 4901192
39950 4901192 4801788 4721935 4948516 5294172 5441103 5295089 4885761 4307386 3897114 4072571
39940 4072571 4774681 5392939 5460058 5153287 4939525 5023774 5346061 5833524 6419081 7024440
39930G024440O71904Q43250Q57032M78506m2383k83078k38031j46157L6349M44494
39920I646326P99547P12775L54563K31050M34018O76220Q71708J091272J195111
39911A6012590J123247J215249J610831J860076J902762K676296M610600O311623
39903C7323274O242415N012227M293220M313964M621618O380735J0937353J7017952
39895I6142758K3559245L4648976N4627016P5277287P5268010M0743026j5269477
39888C84996841o1297370p6166820o4646442m5263286l0206825k0364759j3310241
39881G3741098q643485o389007n467661n086504n318316n848279n827822n111262
39873B6048762m276696l465418k399664j383032j083142j388421j513413j171200
$$ plain form
39930 7024440 7696344 8539594 9396626 9875132 9832749 9549671 9311640 9165483 9201832 9646326
39920 9646326 10445873 11158648 11513211 11744261 12178279 12854499 13726207 14817479 16012590
39911 16012590 17135837 18351086 19961917 21821993 23724755 26401051 31011651 37323274
39903 37323274 43565689 48577916 52871136 57185100 61806718 68187453 79124806 96142758
39895 96142758 119702003 154350979 208977995 284255282 359523292 400266318 384996841
39888 384996841 323699471 247532651 182886209 137622923 107416098 87051339 73741098
39881 73741098 65097613 58708606 53240945 48154441 42836125 36987846 31160024 26048762
39873 26048762 21772066 18306648 15906984 14523952 13440810 12052389 10538976 9367776
39865I367776p48448m51997j55642J0465k54385p73697j006624p73415l57420
39856D856613l5890M1844k20828o05898n83195l8331M09600K91593j7185l3707
39846D064616p984l28242o48161m34910O3899K43883J37482J44340J63731j08680
39836C289974l68615j26464L38186L76810P4543K5371K66120L99209N09157R11244
39826E695535J235206R05335L40250M29539R51029R08354M41789Q29473K340247
39817A4076757L780767M754520O552644R574043J1331264Q794741K164527n087354
39809E5941909r618244j0546074q852545n981192l277529j678767j271565j437650
39801A3278343j590299j531523j240583p96766m78209m92412o17764m94599k06727
$$ plain form
39865 9367776 8619328 8167331 8011689 8022154 7767769 6994072 5987448 5214033 4856613
39856 4856613 4820723 4862567 4641739 4035841 3452646 3414315 3823915 4115508 4098323 4064616
39846 4064616 4056632 3728390 3080229 2645319 2709218 2953101 3090583 3234923 3398654 3289974
39836 3289974 2921359 2794895 3133081 3509891 3584434 3609805 3875925 4275134 4784291 5695535
39826 5695535 6930741 7836076 8176326 8605865 9556894 10465248 10907037 11736510 14076757
39817 14076757 17857524 22612044 29164688 38738731 50069995 58864736 61029263 55941909
39809 55941909 46323665 35777591 26925046 20943854 17666325 15987558 14715993 13278343
39801 13278343 11688044 10156521 8915938 8119172 7640963 7148551 6530787 6036188 5829461
39792E829461j50901l72442m84261k70370O9491L61350P17987J165252J336840
39783H202407Q33379k23617j195665j491208j075697m42257j03687j39114k78248
39774D086293l44890m08049m84328l88995o0190K07456J12692k13630l80396k56061
39764A869902o3974r914o2614j05536r1359j2382J10135J67257L9833k13817l67323
39753A260208k89558j14600p1508j84463k28291j1358L53491N48685M30625K02213
39743A895444J40968K58996L47874K73256P5217j58092l45892l88307k62197j14022
39733A723245q8258j12218l9896O6171M7356k2594N6778J91744O2485k98206l89459
39722A197148P0493O50219O96833J47218m28719n12842j45314K27434K52488m749
$$ plain form
39792 5829461 5678560 5306118 4821857 4551487 4620978 4982328 5700315 6865567 8202407
39783 8202407 9035786 8812169 7616504 6125296 5049599 4607342 4503655 4364541 4086293
39774 4086293 3741403 3333354 2849026 2460031 2399841 2607297 2719989 2506359 2125963 1869902
39764 1869902 1805928 1796014 1733400 1627864 1536505 1524123 1634258 1801515 1841348 1627531 1260208
39753 1260208 970650 856050 784542 600079 371788 360430 713921 1262606 1693231 1895444
39743 1895444 2036412 2295408 2643282 2916538 2991755 2833663 2487771 2099464 1837267 1723245
39733 1723245 1634987 1522769 1482873 1549044 1596400 1573806 1630584 1822328 1884813 1586607 1197148
39722 1197148 1267641 1917860 2614693 2761911 2333192 1820350 1675036 1902470 2154958 2150209
39712B150209j84406o8865J68269K31506J06144j3465j09489l43728o60789p16939
39702E58447l24268K82407P29144Q32188N82242Q4176l68121m35645j28544J50655
39692A962681R7252j58528l09792k45824n6291J11743R5938j54475m10564l73338
39682E58802j11476J5991o7716n2319J73366K83794R7320m7379J71993N23285
39672A545661N96056M05173K26262R1171j41412m02823m85469l60526j18920K34553
39662A589726O38142Q26453O35098K58964p0047m06576p80725q79164m71358R3349
39652A433862K84724J02516o6923j19358k59297m90294n86251n05237l81401j90817
39642g78476J30958L61011K71526J20541L12688O61340N99931J05745k35613j51031
$$ plain form
39712 2150209 1965803 1896938 2065207 2296713 2402857 2389392 2279903 1936175 1275386 558447
39702 558447 234179 516586 1245730 2077918 2660160 2744336 2376215 1940570 1812026 1962681
39692 1962681 2059933 1901405 1591613 1345789 1289498 1401241 1497179 1342704 932140 558802
39682 558802 447326 463317 395601 343282 516648 800442 897762 850383 1022376 1545661
39672 1545661 2141717 2546890 2773152 2864323 2722911 2320088 1834619 1474093 1355173 1589726
39662 1589726 2227868 3054321 3689419 3948383 3878336 3471760 2691035 1811871 1340513 1433862
39652 1433862 1718586 1821102 1754179 1634821 1375524 885230 298979 -206258 -587659 -778476
39642 -778476 -647518 -286507 -14981 105560 418248 1079588 1679519 1785264 1549651 1398620
39632A398620j1702r8194j74223l1530J27302J45378K20510M32572M56060J17387
39622B582180j98663j08840J66937J75487j08392l96232n80716o90881n87577
39613B53303j59014L22820M66449K95289J36988O3698j38911m47615m77842l1619
39603B83546N44161P59743N60687K93322J89018J21429p7554k73515k16486L759
39593B188110n02l15287m88962j74722K54750J70875l62568o29229k86128J82968
39583E39305K36669K1673K2303L24293O18025P07460O31448M07739J7162l87190
39573C138887n39974l62417l8121J90997J82273p8381m41659o26500m38922J3744
39563I99927L81981L58769n4749m96136n24883j06169K69904J71192j70292j70171
$$ plain form
39632 1398620 1386918 1288724 1114501 1082971 1210273 1355651 1576161 2008733 2464793 2582180
39622 2582180 2383517 2274677 2441614 2617101 2508709 2112477 1531761 840880 253303
39613 253303 94289 417109 883558 1178847 1315835 1379533 1240622 793007 315165 283546
39603 283546 827707 1587450 2148137 2441459 2630477 2751906 2674352 2400837 2184351 2188110
39593 2188110 2187608 1872321 1383359 1208637 1463387 1634262 1271694 642465 356337 539305
39583 539305 775974 797647 819950 1144243 1762268 2469728 3101176 3508915 3526077 3138887
39573 3138887 2598913 2236496 2198375 2389372 2571645 2493264 2051605 1425105 986183 999927
39563 999927 1381908 1740677 1685928 1189792 664909 558740 828644 999836 829544 659373
39553F59373K37287M91431K53056j29141k28140j58905k43494m25672m27953k30329
39543b02487l689K12226L92838L23482p1290l91113k13103K52273M24867J80087
39533I04091p7762j23187j59162k88590k55420O9722L44797J87256k78567n51292
39523b28114l23331K17844N92896M93544J07584p3167J30079L16483P4813l72100
39513I36531m64943j33884J40709R0703k2282K9315N5028j30503l20178k57956
39503g7460m0319J29131K84573M74718M84837J66843j78355j61582J11968K34008
39493A428362J33747P4144R0135n5137l22416l34476k2301J62695m2882k37132
39483H74739J9902M48580M26629o1569l98974k44063N1495N5394j67108l11316
$$ plain form
39553 659373 896660 1388091 1641147 1512006 1283866 1124961 881467 455795 27842 -202487
39543 -202487 -206176 6050 398888 722370 651080 259967 46864 299137 724004 904091
39533 904091 826329 703142 543980 255390 -30 69692 414489 601745 323178 -228114
39523 -228114 -551445 -333601 259295 752839 860423 787256 917335 1233818 1308631 936531
39513 936531 471588 337704 478413 569116 546834 576149 631177 500674 180496 -77460
39503 -77460 -117779 11352 295925 770643 1255480 1422323 1243968 1082386 1194354 1428362
39493 1428362 1562109 1636253 1726388 1671251 1348835 1014359 992058 1154753 1111871 874739
39483 874739 894641 1343221 1769850 1708281 1309307 1065244 1116739 1172133 1005025 693709
39473F93709k97878j91655M1471L52182M15865K8589m38898m14132Q2960M43360
39463G15573L12821J1555k8046J49544K32011J26130m3786j96644k79602j77347
39453H22209R2545K52895J09917j20258j16513M8867M8737j46860k22376k2350
39443G46813K31320K87520J50909m6657k06376k25105l4347K43088L74205L04414
39433A825784J77222O9987m6728j02786j180Q6026j15753m36812l38990K51965
39423A368735O55854L33215l35242o22164m66096l39500l41449j21086L15586
39414D47853M38143L7963l59602k63690Q3712J83933O3033Q1439K24692J43985
39404A081461j75912l21657r5187J85877J76154o3119k85760l98278l64565o3623
$$ plain form
39473 693709 395831 204176 245647 597829 1013694 1042283 603385 189253 272213 715573
39463 715573 1028394 1039949 1011903 1161447 1393458 1519588 1475802 1279158 999556 822209
39453 822209 914754 1167649 1277566 1157308 1040795 1089662 1138399 991539 769163 746813
39443 746813 978133 1265653 1416562 1369905 1163529 938424 904077 1147165 1521370 1825784
39433 1825784 2003006 2072993 2026265 1923479 1922299 2008325 1892572 1455760 1116770 1368735
39423 1368735 2024589 2357804 2022562 1400398 934302 594802 253353 132267 447853
39414 447853 885996 923959 564357 300667 384379 568312 631345 712784 937476 1081461
39404 1081461 905549 583892 488705 674582 850736 787617 501857 103579 -260986 -324609
39394c24609M63516Q22484O52724J25349k33566j81706L9631J28149O4988j3400
39384A543560l6186J2587J33214K35138J83668P087j11531j28100k12109m06524
39374A220804m60485k16633O4049P4541j7574J68628N14509M44980j89330p36843
39364H66646n57080J29708N95209N73496M07275L24614J24743k81056n15856k65067
39354A402632J66567K39173n4251k35610j00392K7821j02662k39042m6396L26169
39344A384009M25157J05241l23142n10200m04750j92912p6377j06200j24675O4014
39334B40165L60891L62623j11431o34843o26914j20996K70080J74973j05621j00339
39324b91412K16447M95390M77482K05287q3468j46888M4307K13942P1128k72995
$$ plain form
39394 -324609 138907 961391 1614115 1739464 1505898 1324192 1363823 1491972 1556960 1543560
39384 1543560 1507374 1519961 1653175 1888313 2071981 2079068 1967537 1839437 1627328 1220804
39374 1220804 760319 543686 607735 682276 664702 833330 1347839 1792819 1603489 866646
39364 866646 309566 439274 1034483 1607979 2015254 2339868 2464611 2183555 1667699 1402632
39354 1402632 1569199 1808372 1754121 1518511 1418119 1445940 1343278 1104236 1057840 1384009
39344 1384009 1809166 1914407 1591265 1081065 676315 483403 407026 300826 176151 240165
39334 240165 601056 963679 852248 217405 -409509 -530505 -260425 -85452 -191073 -291412
39324 -291412 -74965 420425 897907 1103194 1019726 872838 917145 1131087 1202215 929220
39314I29220m12128k12934K1333M6123j1538L081j1562j02756l4366K90911N03234
39303A008618K72630j13014j29690K17575M78042M43817K60431j4017l95227n85007
39293A444158k33950L40462L42596l84506j016681q29436j05173M09219M79589
39284D46278L55383J53519j60103l91840k90921k9128j4223k31081k32652J49534
39274b45234N19135M88206J82454j8422K7814J86251K69152J17237l16154p47858
39264D62581o64576N4399P84965Q08881K40788j25467P7543L39476J36675k53810
39254A861455k54342N8116J12785j81259k95407J3716L09845K30315M3224P3155
39244A971603R4837j84762m58775k64778J70803K11290j86875m30546k52700m7638
$$ plain form
39314 929220 517092 304158 325491 371614 360076 363157 351595 248839 214473 505384 1008618
39303 1008618 1281248 1168234 1038544 1256119 1734161 2177978 2438409 2424392 2029165 1444158
39293 1444158 1210208 1550670 1893266 1508760 492079 -337357 -442530 -33311 446278
39284 446278 801661 955180 795077 403237 112316 83188 68965 -162116 -394768 -245234
39274 -245234 273901 762107 944561 926139 953953 1140204 1409356 1526593 1210439 462581
39264 462581 -201995 -147596 637369 1446250 1687038 1561571 1639114 1978590 2115265 1861455
39254 1861455 1607113 1665229 1778014 1596755 1301348 1315064 1624909 1855224 1898448 1971603
39244 1971603 2066440 1881678 1422903 1158125 1328928 1540218 1353343 922797 670097 622459
39234F22459j17034k11637o8179J40250J92356J95573K56620J94461p1041k27760
39224I06068n4049J48598K9485k05423j46747Q3485n45m25704o44181l19698J98066
39213d30645L44577K744m46363n45219j48732M49152P32749M55764p1429l31535
39203A1063k06259k9070n1016j32711o2834P6378P2220l7253M525K72224N05125
39192D22392M42171J70488l090M0110J26088Q6907m0619j82489l62736n07139
39182A92083l45583J99966O93232O22131J01374k48597j30992J18911J19578q0843
39172A241260k61651l67287l79550k02358R6519K44181J77481J67863L18058L26942
39162A361458M1648j76790k8474J76774J9609l16523l68079j53358l6348m6177
$$ plain form
39234 622459 505425 293788 225609 365859 558215 753788 1010408 1204869 1133828 906068
39224 906068 852019 1000617 1030102 824679 677932 761417 760872 335168 -309013 -628711 -430645
39213 -430645 -86068 -83324 -529687 -1074906 -1223638 -774486 -41737 414027 342598 11063
39203 11063 -195196 -224266 -275282 -407993 -470827 -394449 -322229 -359482 -354957 -82733 422392
39192 422392 864563 1035051 1031961 1072071 1198159 1285066 1244447 1061958 699222 192083
39182 192083 -153500 46466 739698 1361829 1463203 1214606 1083614 1202525 1322103 1241260
39172 1241260 979609 612322 232772 30414 126933 371114 548595 716458 1034516 1361458
39162 1361458 1403106 1226316 1197842 1374616 1394225 1077702 709623 556265 519917 473740
39152D73740M9085J46969l7913k93616r4509M76755O97592K82992j63825q4477
39142A452793K22521J38597l40434o57458m58668N1581M05097L03189j33010m35274
39132E48934k62099J65178L22595P4978k12241k61719j71947m1882K15458N04741
39122H81996M76207J01740j17111J39774M86475M08084J3996k22455j90915j40333
39112A837458j55540j10825k2238j4584j9732J04137K28669J04152k08315m05759
39102A337423l88704l04134k14051o6952O4698P0425O2560J98205L30725K41194
39092A331389J16134K93465N77936M10061j96638n28836k29849J36694j1546l58146
39082A540664k50547K10170L44294K058k21370L4917L35091J52061l20908m67968
$$ plain form
39152 473740 522825 669794 631881 338265 243756 720511 1418103 1701095 1537270 1452793
39142 1452793 1675314 1813911 1473477 816019 357351 408932 814029 1117218 984208 548934
39132 548934 286835 452013 774608 849586 637345 375626 203679 161797 377255 881996
39122 881996 1358203 1459943 1342832 1482606 1969081 2377165 2391161 2168706 1977791 1837458
39112 1837458 1681918 1571093 1548855 1534271 1514539 1618676 1847345 1951497 1743182 1337423
39102 1337423 948719 644585 430534 363582 428280 498705 561265 759470 1090195 1331389
39092 1331389 1447523 1740988 2318924 2728985 2532347 2003511 1773662 1910356 1898810 1540664
39082 1540664 1290117 1500287 1844581 1846639 1625269 1660186 1995277 2147338 1826430 1358462
39072A358462j21290K69303K76597k9336k99149l39819j98656K1540K43574L64770
39062A545996L04398J36981M5044P5584O3382j07790k89331k71844j14096m4913
39052A343411o3379Q6828M59268O89611M41522j09743m79366m58714k60339j35803
39042A513296j07593r6513p5751k0152J17819K97109L87398L28929J56871j40404
39032B361009n74970r30767q66374l98679j3292n4886k41235r2470L46679O05299
39022A40314N09249L64951L93282M09119K08503q4562k55667k93685k45079m7530
39012A098895K54212L71585J34988j87428k24524k6185L6298j86346m53027m86031
39002C32437k79092n7437o3337l21518n26381l17095K17147N46126M02298J67243
$$ plain form
39072 1358462 1237172 1506475 1783072 1753736 1454587 1114768 916112 937652 1181226 1545996
39062 1545996 1850394 1987375 2032419 2108003 2171385 2063595 1774264 1502420 1388324 1343411
39052 1343411 1280032 1366860 1826128 2515739 2957261 2847518 2368152 1909438 1649099 1513296
39042 1513296 1405703 1309190 1233439 1213287 1331106 1628215 2015613 2344542 2501413 2361009
39032 2361009 1786039 855272 -11102 -409781 -423073 -477959 -719194 -811664 -464985 140314
39022 140314 649563 1014514 1407796 1816915 2025418 1940856 1685189 1391504 1146425 1098895
39012 1098895 1353107 1724692 1859680 1672252 1447728 1421543 1457841 1271495 818468 332437
39002 332437 53345 -4092 -67429 -388947 -915328 -1232423 -1015276 -469150 -66852 100391
38992A00391K42117L74047J13827l15616k83457J84505L44838j08264n26455k87925
38982a61992K89992M91513K26882k0598j0264L4626o6192j79310j27941P2252
38972E48968K82265L49744J82459j13528k41834m7271K40031K80404N9775j51954
38962A389059j99572j74244j75345j52103k1589J72510K53006O0447l06950m33899
38952D11320k358O73397Q42494K49561m38715m62282L2514K53714j17585n64511
38942H77549n19599o8611K88209K60619l3492k89710k82628m0240J65442J21414
38932D78953k5812M0082L06833L90741R1685k76452l11805p9800L1422q2775r3695
38921D69377K38020O42340O46168J96136k62304l56301k09259j52677k12836j55766
$$ plain form
38992 100391 342508 716555 830382 514766 231309 415814 760652 652388 125933 -161992
38982 -161992 128000 619513 846395 825797 815533 850159 783967 604657 476716 548968
38972 548968 831233 1180977 1363436 1249908 1008074 960803 1200834 1481238 1541013 1389059
38962 1389059 1189487 1015243 839898 687795 666206 838716 1091722 1152169 845219 411320
38952 411320 408962 1082359 1924853 2174414 1735699 1273417 1305931 1559645 1442060 877549
38942 877549 357950 289339 577548 838167 804675 514965 232337 192097 357539 478953
38932 478953 453141 493223 800056 1190797 1282482 1006030 694225 614425 645847 563072 469377
38921 469377 707397 1349737 1995905 2192041 1929737 1573436 1364177 1211500 998664 842898
38911H42898N1141J69987J23681J42595L24607L73094L9487m12254n02727j61196
38901I91313K45387M09985L20043O9843k39568m11244k64420Q4979K70968Q7473
38891A564759k90349n28347m44564r0967L30802O02217O30057M69642J86700j93934
38881B236016n33182n61772k09450J92493K59249k599l00317m59024m63914k49802
38871i2302K06274O46345P30567M74795J97842N7767m4957j24115l7741J76001
38861B190476K34998R946k76625l58365k18954r653J21287P7218j01743j88899
38851A479686j9274K33812K66554O9311j42511l27691n59710o31484k20730M79812
38841F27775P98163M27260j92543n17865n06588l65400j29942J92614M06451L75863
$$ plain form
38911 842898 894039 1064026 1187707 1330302 1654909 2028003 2067490 1655236 1152509 991313
38901 991313 1236700 1646685 1966728 2036571 1797003 1385759 1121339 1206318 1477286 1564759
38891 1564759 1274410 746063 301499 210532 541334 1143551 1773608 2243250 2429950 2236016
38881 2236016 1702834 1141062 931612 1124105 1383354 1380755 1080438 621414 157500 -92302
38871 -92302 113972 760317 1490884 1965679 2163521 2221288 2176331 2052216 2014475 2190476
38861 2190476 2425474 2435420 2158795 1800430 1581476 1571823 1693110 1770328 1668585 1479686
38851 1479686 1460412 1694224 1960778 2030089 1887578 1559887 1000177 368693 147963 627775
38841 627775 1425938 1853198 1660655 1142790 636202 270802 140860 333474 739925 1115788
38831A115788K42946J58718O2106p4831j03596k3398r8365l92134n46476l18519
38821B2239K8578J94222K98419M76155M38553k4165m49042k54466L19262M98197
38811A547952J23142j74395n662K28305O2392k98964l46817l4588K10373J11310
38801A423048j35811j80501L0802K23849J77968J6697J2075J75816K52722J18180
38791B114845p3083j86575k67701l09154j85306L9600R1043n2180o9804J14356
38781A216041J39154r6701j03927L57569O76659K92270l03406k92792J25953J13311
38771B124131l15926k96338L36853O40637N4846p01033p56960l00782k7070k9162
38761G29196N9005K64732L04356J50055J1352o1439j12899k5959K60501M72105
$$ plain form
38831 1115788 1358734 1517452 1579558 1504727 1401131 1377733 1279368 887234 340758 22239
38821 22239 50817 245039 543458 1019613 1458166 1434001 984959 730493 1049755 1547952
38811 1547952 1671094 1496699 1491037 1719342 1781734 1482770 1135953 1101365 1311738 1423048
38801 1423048 1287237 1106736 1137538 1361387 1539355 1556052 1568127 1743943 1996665 2114845
38791 2114845 2041762 1855187 1587486 1278332 1093026 1132626 1223669 1171489 1101685 1216041
38781 1216041 1355195 1258494 1154567 1512136 2188795 2481065 2177659 1884867 2010820 2124131
38771 2124131 1808205 1511867 1848720 2489357 2544203 1843170 1086210 785428 758358 729196
38761 729196 788201 1052933 1357289 1507344 1518696 1457257 1344358 1318399 1578900 2051005
38751B051005L21398o3095l60320n02721n73197m96390k08979O6862J08205Q2270
38741D25038K78257O01238P10298N38189L11636J58179L3600o0130j09503k30149
38731B656653m50888m94950j45878K82547K56746k32071o25159n18578r3110K10710
38721H46022J58350j67567m77233m84393k00378M1794M2201N1402L56599P40887
38711I07684P50252L76421L1593r7057k06400l98234n10241m75562m05855k57320
38701b84719J20822N24507M98273O2756j85390N2783L21072J67040j26963l7228
38691A112953L50111N12889K89261j1115j57685j86739j17636O5933J75453j4711
38681B018714l36638l64991m2768K10748J20121q6066j03285j0044n4067k15442
$$ plain form
38751 2051005 2372403 2309308 1948988 1446267 873070 376680 167701 234563 342768 425038
38741 425038 703295 1304533 2014831 2553020 2864656 3022835 3056435 2996305 2886802 2656653
38731 2656653 2205765 1710815 1564937 1847484 2104230 1872159 1247000 728422 635312 846022
38721 846022 1004372 836805 359572 -124821 -325199 -283405 -241204 -189802 166797 907684
38711 907684 1657936 2034357 2065950 1968893 1762493 1364259 854018 378456 -27399 -284719
38701 -284719 -163897 360610 858883 921639 736249 789032 1110104 1277144 1150181 1112953
38691 1112953 1463064 1975953 2265214 2254099 2096414 1909675 1792039 1857972 2033425 2018714
38681 2018714 1682076 1317085 1274317 1485065 1605186 1519120 1415835 1405791 1351724 1136282
38671A136282k57557q7630J69299L81114M87059M14642J30196k08531l30449j63959
38661A670466M0274L360k20731l02140o9556K36667K54989k2378k38199j51604
38651A201148O4727J19880J3805n6814p5059j94923l72397l24887K1784L09340
38641G06604J79250k35713m79014l35813n484K46553L71429M34719M36479L42889
38631A661899J86673L7768p4156j56386k20158k75923l05856k38990m3035J51591
38621G23427J48815l9491j53576k1133J89359J98875J5500q6938L0574J82542
38611A187954J20098j61149m44381n15723l04020Q8288M02005L73481R671l38127
38601D18097l22178j4819J72039K1654j97674j07175K40603M19170K20410o4481
$$ plain form
38671 1136282 878725 791095 960394 1341508 1828567 2243209 2373405 2164874 1834425 1670466
38661 1670466 1710740 1714100 1493369 1191229 1121673 1358340 1613329 1590951 1352752 1201148
38651 1201148 1265875 1385755 1399560 1342746 1267687 1072764 700367 375480 397264 706604
38641 706604 885854 650141 171127 -164686 -170170 76383 447812 882531 1319010 1661899
38631 1661899 1848572 1886340 1812184 1655798 1435640 1159717 853861 614871 571836 723427
38621 723427 872242 832751 679175 658042 847401 1046276 1061776 974838 1005412 1187954
38611 1187954 1308052 1146903 702522 186799 -117221 -28933 373072 746553 756224 418097
38601 418097 95919 81100 253139 274793 77119 -30056 210547 629717 850127 785646
38591G85646q0418J00201J62770P0746N7060J41281P1313j52665j41148K25810
38581A240596M17097j5990o24600n82319R9693N50182L06497q1521n693K70549
38571A574491J43037l20146n17206k40096J32867K90921K96586K39051Q8264l5175
38561A652594Q6824L23806K46873j94968m72143k15297K02764J69797l33650p66417
38551G00183p36841l35491J58166N62923P71048P04543L90758l8773m46052p01244
38541A029220o61645k87380K36916O24928P31752N95059L02248m4969k80910k66459
38531A978760n7552J34597J80343J47131J68922K69019L17914J37244l02431p44221
38521B229726q08378m01188J22336L27050J49928j40662l16742l21690j34344
$$ plain form
38591 785646 705228 805429 968199 1038945 1096005 1237286 1308599 1155934 1014786 1240596
38581 1240596 1657693 1641703 1017103 434784 534477 1084659 1391156 1309635 1303942 1574491
38571 1574491 1717528 1397382 880176 640080 772947 1063868 1360454 1599505 1687769 1652594
38561 1652594 1739418 2063224 2310097 2115129 1642986 1427689 1630453 1800250 1466600 700183
38551 700183 -36658 -372149 -213983 348940 1119988 1824531 2215289 2176516 1730464 1029220
38541 1029220 367575 80195 317111 942039 1673791 2268850 2571098 2526129 2245219 1978760
38531 1978760 1921208 2055805 2236148 2383279 2552201 2821220 3139134 3276378 2973947 2229726
38521 2229726 1421348 1020160 1142496 1469546 1619474 1478812 1162070 840380 706036
38512G06036K08742M58957L18101j53903n24761m90918j98496L2823R3667N7105
38502E07353k3073q7888J83K83954N46909N16698J88421k01006m51233n01100
38492G79218l44281m5689J97471K12671P3637J919N8250J06942Q4292J00690K24739
38481A449859L41282L05616J13922j36092l32479l57111j56187J25095K16042
38472A569947K0655k62995l93034l27477j43562J20677L94986M80386K36499j67807
38462A528275l75519k40454K0920J12475l124j04471j255K38379L73193K82198
38452A830617R9863L173m8300k09991m34798m77462k57154J1945J47904K18389
38442H84186K75596J40575k66675n86261l92671J54100M20219J15200l40757l95919
$$ plain form
38512 706036 914778 1373735 1691836 1537933 1013172 522254 323758 356581 450248 507353
38502 507353 484280 396392 396575 680529 1227438 1744136 1932557 1731551 1280318 779218
38492 779218 434937 389248 586719 799390 873027 874946 933196 1040138 1124430 1225120 1449859
38481 1449859 1791141 2096757 2210679 2074587 1742108 1384997 1228810 1353905 1569947
38472 1569947 1590602 1327607 934573 607096 463534 584211 979197 1459583 1696082 1528275
38462 1528275 1152756 912302 933222 1045697 1042573 938102 936847 1175226 1548419 1830617
38452 1830617 1930480 1933653 1885353 1675362 1240564 763102 505948 517893 665797 884186
38442 884186 1159782 1300357 1033682 447421 54750 208850 629069 744269 403512 7593
38432G593l7548L02034L21834J27889O995P6930J75664P9521j62225k12895J03849
38421G89641M68250M38639R7408l6055K10655L70224L6601m93505o19810k57010
38411A005038J28142K04438J29195J87100L81037M97129L92780J09719j97231
38402B837347l70370l50404k13978q8774l7424m2365n5305k1708Q2765J89067
38392A928851J70419p384k31216l69252l81982k98626j95556j93799l12710l27693
38382b18948j0545M52110N86508K89924J3425Q4429K25655Q2924j26333K2389
38372A401538L88607M25639K3214l59084m06191k72057j29670P7204K88662K34622
38362A672484q8431k77553j12811R8878L3368j67242k17834j49904j12905l0178
$$ plain form
38432 7593 -29955 272079 593913 721802 728797 805727 981391 1060912 898687 685792 789641
38421 789641 1257891 1696530 1793938 1757883 1968538 2338762 2375363 1881858 1262048 1005038
38411 1005038 1133180 1337618 1466813 1653913 2034950 2532079 2924859 3034578 2837347
38402 2837347 2466977 2116573 1902595 1813821 1776397 1734032 1678727 1657019 1739784 1928851
38392 1928851 2099270 2091886 1860670 1491418 1109436 810810 615254 421455 108745 -218948
38382 -218948 -229493 222617 809125 1099049 1112474 1196903 1422558 1505482 1379149 1401538
38372 1401538 1790145 2215784 2238998 1879914 1473723 1201666 1071996 1149200 1437862 1672484
38362 1672484 1584053 1306500 1193689 1292567 1325935 1158693 940859 790955 678050 647872
38352F47872J78464L07884J96123R3464K72650M88841L20801r9987k47097l5552
38342B123463P2763j26647k40028L5959L76293L32463K4520q6403Q0995J55634
38332B749012q5146m10254n05097l78995k63520k68603l03870k75500k04975j33978
38322h0926l0884J31235K71486K78367J63780L2043q8967k38933l27089j39603
38312b9491L31334P23384O57023J78237l13408n11765m14570j64819R6044K31398
38302G83367J90740J29173K54054M97354N28554J85932k63878m13885j55738K62502
38292A998175N12027M23425O0609l19889m49677l00978j13837q8170j26843j1566
38282A583276K30294L21115J18660j68979k57041j48076o4262p4825q50K48153
$$ plain form
38352 647872 826336 1134220 1330343 1423807 1696457 2185298 2506099 2406112 2159015 2123463
38342 2123463 2196226 2069579 1829551 1865510 2241803 2574266 2598786 2512383 2593378 2749012
38332 2749012 2663866 2253612 1748515 1369520 1106000 837397 533527 258027 53052 -80926
38322 -80926 -111810 19425 290911 569278 733058 765101 676134 437201 110112 -29491
38312 -29491 301843 1025227 1682250 1860487 1547079 1035314 620744 455925 551969 783367
38302 783367 974107 1103280 1357334 1854688 2383242 2569174 2305296 1891411 1735673 1998175
38292 1998175 2510202 2933627 2994236 2674347 2224670 1923692 1809855 1721685 1594842 1583276
38282 1583276 1813570 2134685 2253345 2084366 1827325 1679249 1614987 1540162 1539312 1787465
38272A787465M37527K89572r2202l03732j44182J75295L73229M14423L59934J38381
38262C435710k82567o35838n71588j27589K68223L04118Q4103j20910j99263j78926
38252A975473p9963N6547J10000k63j93392l21505l27150k34501o6194J37047
38242A056099K82287L11093K73216K26858J22705j00201l36490l69746j43984
38233A321837J13327J16368j51275l93187l10316P0283M22000M73774K73519O4009
38223B000339k2537n6081j46079k96309m02696l09781P1753N67527P26935K42630
38213B375701n83531j028254p14508j0486M54915M77813L08120J87352J36906
38204A604028J27718J69495J97180R0485j26825k74760k64951k06477j94461j47204
$$ plain form
38272 1787465 2224992 2514564 2422362 2118630 1974448 2149743 2522972 2937395 3297329 3435710
38262 3435710 3153143 2517305 1945717 1818128 2086351 2390469 2474572 2353662 2154399 1975473
38252 1975473 1895510 1952057 2062057 2061794 1868402 1546897 1219747 985246 919052 1056099
38242 1056099 1338386 1649479 1922695 2149553 2272258 2172057 1835567 1465821 1321837
38233 1321837 1435164 1551532 1400257 1007070 696754 767037 1189037 1662811 1936330 2000339
38223 2000339 1977802 1921721 1775642 1479333 1076637 766856 838609 1406136 2133071 2375701
38213 2375701 1792170 763916 49408 38922 493837 971650 1279770 1467122 1604028
38204 1604028 1731746 1901241 2098421 2188906 2062081 1787321 1522370 1315893 1121432 974228
38194I74228L5379K68213L64784K52826m409l26644o14968o86010m03049Q7788
38184e1862M27558M57952M26872O18792Q77237P39019O7490o89131r99816q24697
38174A049414n12229k89564j21042R456L749j07949j12574P2127K56005K88445
38164E35838K89364L81680M04570J58607k04825l40254j92722l2852k4101n3503
38154I21802k9344m0560j08018n9262J67046L22890J89129n5549o9834J39370
38144A377670K23738Q330k59171k53823K0762K82146L02832R4513j51628k16910
38134A428459j9379K81652L95655J97616j27820l07417k76925j59045k6854J32130
38124A518072K38075J35490j24766k29796q765K61171J97594j19898k26991N0057
$$ plain form
38194 974228 1009607 1277820 1642604 1895430 1891021 1564377 949409 263399 -139650 -51862
38184 -51862 375696 833648 1260520 1879312 2756549 3495568 3563058 2873927 1874111 1049414
38174 1049414 537185 247621 126579 136035 139784 31835 -80739 -8612 247393 535838
38164 535838 825202 1206882 1611452 1770059 1565234 1224980 1032258 999406 975305 921802
38154 921802 892458 851898 743880 684618 851664 1174554 1363683 1308134 1238300 1377670
38144 1377670 1601408 1609738 1350567 1096744 1117506 1399652 1702484 1796997 1645369 1428459
38134 1428459 1409080 1690732 2086387 2284003 2156183 1848766 1571841 1412796 1385942 1518072
38124 1518072 1756147 1891637 1766871 1537075 1528310 1789481 1987075 1867177 1640186 1690243
38114A690243L13494J58828k34080l55847q1725J95012J51935m2740l5854J92798
38104A952064L25429J47316j85499l36381j43173K44365N19024M79490J79133
38095C181768j49934l15321l10833k58835k42640k26799j33138M1952K05577K50049
38085B041846J40216o7420k61286l32486k48009r9409l4053q7148j27203m0601
38075H84447Q5371Q7936J226K1310J74879K35669P4013j19068j31965p1656j57274
38064A084888l10372k59181p24J66948J00844j3921k5972l4091r3351j6217K83246
38053H82097M85799K26081l63511p66964o97998l43712k1037J48933J89648J30823
38043a29841K9619j1819N2712J66640K61441L19333L29857K70927J63261Q4596
$$ plain form
38114 1690243 2003737 2162565 1928485 1572638 1490913 1685925 1837860 1795120 1759266 1952064
38104 1952064 2277493 2424809 2239310 1902929 1759756 2004121 2523145 3002635 3181768
38095 3181768 3031834 2716513 2405680 2146845 1904205 1677406 1544268 1586220 1791797 2041846
38085 2041846 2182062 2114642 1853356 1520870 1272861 1173452 1139399 1052251 925048 884447
38075 884447 969818 1057754 1058980 1080290 1255169 1490838 1564851 1445783 1313818 1242162 1084888
38064 1084888 774516 515335 514611 681559 782403 768482 742510 708419 615068 598851 882097
38053 882097 1367896 1593977 1230466 463502 -234496 -578208 -599245 -450312 -260664 -129841
38043 -129841 -100222 -112041 -59329 107311 368752 688085 1017942 1288869 1452130 1536726
38033A536726J07645K40257L92742L91078J24109k62461m51410l42683k08583
38024A527420l00225m63703l93974j36282r040q3698j00001P3597K46451K59604
38014F20149K04319J66070P0488n9701j4231K32338L60413J68947p7580n5085
38004A616127J22962J52422N7873O3121J00585r0796m19415m53280o5662L17821
37994A401758K85958k6568j72358J7883K66259K15191j40179m08071k24302K76366
37984A491937N54982L09251j80497m89864n72058n77549m32351k0893L93354M31744
37974I08056K08192J62969L20027K67785p7132k88437j56837K714o796P1967L23505
37963A736013L14113j63953n54948l19719J94667K97399P348j19413M6285J39497
$$ plain form
38033 1536726 1644371 1884628 2277370 2668448 2792557 2530096 2078686 1736003 1527420
38024 1527420 1227195 763492 369518 233236 224196 140498 40497 114094 360545 620149
38014 620149 824468 990538 1061026 1001325 987094 1219432 1579845 1748792 1671212 1616127
38004 1616127 1739089 1891511 1949384 2012505 2113090 2022294 1602879 1149599 1083937 1401758
37994 1401758 1687716 1661148 1488790 1506673 1772932 1988123 1847944 1439873 1215571 1491937
37984 1491937 2046919 2356170 2175673 1685809 1113751 536202 103851 82958 476312 908056
37974 908056 1116248 1279217 1599244 1867029 1789897 1501460 1344623 1347337 1340541 1412508 1736013
37963 1736013 2050126 1886173 1331225 1011506 1206173 1503572 1510920 1391507 1437792 1577289
37953A577289N4750M2942R3909p6505l77029l53426K6587K37293K9968j95787
37943A059991j01350P4541K6953q7933j4684J21221R2899R217Q4385K25100K10415
37932A700755P6254j0840p5587k07999k79109j04026K21328M26315M22656L28289
37922B498036K33028J46055P9090J4288r2510j56525r323K67708L32092J03435
37912C415374k5322K02202M19841J86885k60140l46385q7677o6261m69192p53348
37902B215977m53657J61832N13626M28368J49179j04897k87218l79943l65495
37893A877772k96256k36670j71343n5860R4127K11964K16299M1920k54287m29606
37883I98060k58767J68497N00015N02176K50288o4303l30502m79253m39461k24040
$$ plain form
37953 1577289 1632039 1674981 1768890 1692385 1315356 961930 988517 1225810 1255778 1059991
37943 1059991 958641 1033182 1060135 972202 957518 1078739 1171638 1180855 1265240 1490340 1700755
37932 1700755 1777009 1766169 1690582 1482583 1203474 1099448 1320776 1747091 2169747 2498036
37922 2498036 2731064 2877119 2956209 2970497 2877987 2721462 2712139 2979847 3311939 3415374
37912 3415374 3390052 3592254 4012095 4198980 3938840 3592455 3504778 3438517 2969325 2215977
37902 2215977 1762320 1924152 2437778 2866146 3015325 2910428 2623210 2243267 1877772
37893 1877772 1581516 1344846 1173503 1117643 1211770 1423734 1640033 1681953 1427666 998060
37883 998060 739293 907790 1407805 1909981 2160269 2095966 1765464 1286211 846750 622710
37873F22710N9262L21355M97903M72054J99058r1751q0187J99333L62024K19005
37863B780766L5947R4016K78003L25888K36913J52687L9608j82068l38336k00801
37853C222623O4874K2056m09101p62079n92574j7217M52310M65000J08596k51165
37843B303323l04384m0071K72259L72824K73953J68579J38685J04531K8497l6209
37833C281987j17904l14774n28878m50983K1058N31563O36855L01532j61238n06023
37823B693195o67898n72796j71472L11445M69393J82215k15548l52722k25198
37814A450614o2789J7022M9078N6669M2829O6377J62036K45572K34272J83138
37804B444818J62840J02570p1590k35396k12691n8209K6655J1453K9093Q2961
$$ plain form
37873 622710 681972 1003327 1501230 1973284 2172342 2080591 2000404 2199737 2561761 2780766
37863 2780766 2816713 2910729 3188732 3514620 3751533 3904220 3943828 3761760 3423424 3222623
37853 3222623 3287497 3309553 2900452 2138373 1545799 1528582 1980892 2445892 2554488 2303323
37843 2303323 1998939 1958868 2231127 2603951 2877904 3046483 3185168 3289699 3318196 3281987
37833 3281987 3164083 2849309 2320431 1869448 1890506 2422069 3058924 3360456 3199218 2693195
37823 2693195 2025297 1452501 1281029 1592474 2061867 2244082 2028534 1675812 1450614
37814 1450614 1387825 1404847 1453925 1510594 1553423 1619800 1781836 2027408 2261680 2444818
37804 2444818 2607658 2710228 2638638 2403242 2190551 2132342 2158997 2170450 2199543 2282504
37794B282504L8549p4550m1710J75884L21052J95878q0689k71437k63606l0163
37784B251712L94411P73877P71300L66725n2471j75433q7395N4215L26580P54441
37774E377962J052083J030688R81642J214342J475113J377124J200750J559884
37766A5269588K331326K782446L002726M270156P234384J0288190J0730883P540869
37758F3450568K273607k813084o678883r235880j0129219q884883o124591l575630
37750A8282005k412291k170750j766345j052917o96180q61022r43898o51459m79806
37741G247337p94835j148690r97682n45837l11524k87782j48550L8785l1486k45057
37731B774679k22058j1570R65j94128k47939j44498k05487l76914k17011K69821
$$ plain form
37794 2282504 2321053 2246503 2204793 2380677 2701729 2897607 2816918 2545481 2281875 2251712
37784 2251712 2646123 3420000 4191300 4558025 4505554 4330121 4242726 4296941 4623521 5377962
37774 5377962 6430045 7460733 8442375 9656717 11131830 12508954 13709704 15269588
37766 15269588 17600914 20383360 23386086 27656242 34890626 45178816 55909699 63450568
37758 63450568 65724175 62911091 56232208 46996328 36867109 27982226 21857635 18282005
37750 18282005 15869714 13698964 11932619 10879702 10183522 9322500 8378602 7727143 7247337
37741 7247337 6452502 5303812 4306130 3760293 3448769 3160987 3012437 3051222 3019736 2774679
37731 2774679 2552621 2541051 2542016 2347888 2099949 1955451 1749964 1373050 1156039 1425860
37721A425860M83280J47559k61088k99524j62200j51149j20431J16881L19551
37712A498739K22641J3392k7327J4977n385P2900L31698M20688J05095j98020
37702B449398o072M08623M05269m0465l79177l73374k90883k70376j39696Q6920
37692A850167J25986m1282p6738J21190K12296O7k05057o2469K85329M41514K74179
37681B925182k4558k50320l62087m11878m23193l46911j43718R1405K04351K27745
37671A486018L51391N37738M48063k1743m33966l81316r4217m4229j79082r1594
37661A577063J95966K33686o7377k45361r321L60330M94993L80412J58810j00587
37651B978614k73004k02250o063k836k23425l74983l67827m13915m84166k20261
$$ plain form
37721 1425860 1909140 2056699 1795611 1496087 1333887 1182738 1062307 1179188 1498739
37712 1498739 1721380 1734772 1707445 1722422 1717037 1789937 2121635 2542323 2647418 2449398
37702 2449398 2443326 2851949 3257218 3216753 2837576 2464202 2173319 1902943 1763247 1850167
37692 1850167 1976153 1934871 1858133 1979323 2191619 2191686 1986629 1924160 2209489 2651003 2925182
37681 2925182 2900624 2650304 2288217 1876339 1453146 1106235 962517 1053922 1258273 1486018
37671 1486018 1837409 2375147 2823210 2801467 2367501 1986185 1891968 1847739 1668657 1577063
37661 1577063 1773029 2006715 1939338 1693977 1684656 2044986 2539979 2920391 3079201 2978614
37651 2978614 2705610 2503360 2497297 2494461 2271036 1896053 1528226 1114311 630145 409884
37641D09884L62520O31047J81331n11250p24506m21133r8042P566P1617K08489
37631A17523L03452K77496J83481O2284o5094j29124j14822j14023j20961L6087
37621D36299L72661N77536M02647K8340k03829k32432k05474j72629j24057j49257
37611G29805k64568k48262N2603L95517M21726J40135j46620k71066k73426j74117
37601C61727K3138J86125J77982N0355q6507k34748l44682k14204J61891L96203
37591D77280K28209l832J49191N07665N45390K61923J55825L47433L75174L724
37581C047982l58665l11924n0241K0975j19210k25355k22357k06768k02118j81655
37571A190664j93640k49362k14113P485K90373M37789L97836K26890j3065k08587
$$ plain form
37641 409884 772404 1403451 1584782 1073532 349026 -72107 -170149 -162583 -90966 117523
37631 117523 420975 698471 881952 944236 879142 750018 635196 521173 400212 436299
37621 436299 808960 1386496 1789143 1817483 1613654 1381222 1175748 1003119 879062 729805
37611 729805 465237 216975 269578 665095 1086821 1226956 1080336 809270 535844 361727
37601 361727 384865 570990 748972 799327 712820 478072 133390 -80814 81077 477280
37591 477280 705489 701657 850848 1358513 1903903 2165826 2321651 2669084 3044258 3047982
37581 3047982 2689317 2377393 2327152 2348127 2228917 2003562 1781205 1574437 1372319 1190664
37571 1190664 997024 747662 533549 541034 831407 1269196 1667032 1893922 1880857 1672270
37561A672270k16279p2102k5434k08828m07694l25990J8012L21135L56867J78366
37551A290323Q050K3399K12643L82742L63834K28403J98979L00156K62741j01037
37541C170233n47867o18897k01615K77317L06760j25241n25480n02023k25642
37532A007545j14378j74543q689M54343O65106K04145m93988o29045r2105M52910
37522A271301N01880K27459j877j34024k69348l66875l56322k84012j68544N2152
37512D71790L02769L69724K42772J60668J83491O1564k84300n13252l55319k6240
37502F13667J40902J73084K39956K49451M5556k13604k63165j37631j3537J41065
37492I75744L61711L68412l9669m44915k68883K88413M21145q5008m99520k56530
$$ plain form
37561 1672270 1455991 1383889 1358455 1149627 741933 415943 433955 755090 1111957 1290323
37551 1290323 1298373 1321772 1534415 1917157 2280991 2509394 2708373 3008529 3271270 3170233
37541 3170233 2622366 2003469 1801854 2079171 2385931 2260690 1735210 1233187 1007545
37532 1007545 893167 718624 709935 1164278 1829384 2033529 1539541 910496 818391 1271301
37522 1271301 1773181 2000640 1998763 1864739 1595391 1228516 872194 588182 419638 471790
37512 471790 774559 1144283 1387055 1547723 1731214 1792778 1508478 995226 639907 613667
37502 613667 754569 927653 1167609 1417060 1462616 1249012 985847 848216 834679 975744
37492 975744 1337455 1705867 1666198 1221283 952400 1240813 1661958 1576950 1077430 820900
37482H20900K01452J50116l03831m30953J0127M64956M13836L5860j38439O1649
37472A285673L19553K89500k0987l25488l91162k35653l3288R4224J50915J72575
37462A305862J40786J8573j61050k73261j90989O9213K99388K75766J4188k28845
37452A269631k51870j07296M9964J74552K76640K90702J70909K8626k189L2731
37442A932400Q750o1488j04042j72789l20473l75932j51299J87365L03185K21510
37432A467187K76574M80157M10317r0343n60305n67318l22089k56791l12663j26019
37422C98707K78411M97480L85362K00405J12633K0343q1304p636J85151J04391
37412B093943l84103q03561o35061j9519M37307M30935K09644J08051J35836J04017
$$ plain form
37482 820900 1022352 1172468 868637 437684 447811 912767 1326603 1362463 1224024 1285673
37472 1285673 1605226 1894726 1873739 1548251 1157089 921436 888148 982372 1133287 1305862
37462 1305862 1446648 1465221 1304171 1030910 839921 909134 1208522 1484288 1498476 1269631
37452 1269631 1017761 910465 960429 1134981 1411621 1702323 1873232 1901858 1899669 1932400
37442 1932400 1941150 1879662 1775620 1602831 1282358 906426 755127 942492 1245677 1467187
37432 1467187 1743761 2223918 2634235 2543892 1983587 1416269 1094180 837389 524726 398707
37422 398707 677118 1174598 1559960 1760365 1872998 1893341 1812037 1804401 1989552 2093943
37412 2093943 1709840 906279 271218 251699 689006 1119941 1329585 1437636 1573472 1677489
37402A677489m3383j55571p5352J64512L68039L98783L20085K38904Q6473k56779
37392B723200o34188o78098k99877J39806L06622K80765K53531J22745k46443
37383A968063n63821l91334J67445N16989L60884R016k04368l41236m85201m10942
37373F25495k809L45835K14306j72858k30198J33329M14207K61477j29270m40855
37363A018659o15865o50076m08892P5702M25644L54287Q4592J8380J46876J44175
37353E93482l9195q0944J64667M02480L55894J84591J76357K42025P4423k72739
37343A801041l66750m9081K51547J02500k90022l65282j6701K76158J58154j36771
37333A364793k04189m3749N9467K3909J3974P6685N5139j15503k80429k87814
$$ plain form
37402 1677489 1634106 1478535 1403183 1567695 1935734 2334517 2654602 2893506 2979979 2723200
37392 2723200 2089012 1410914 1111037 1250843 1557465 1838230 2091761 2214506 1968063
37383 1968063 1404242 1012908 1180353 1697342 2058226 2067242 1862874 1521638 1036437 625495
37373 625495 622686 968521 1182827 1009969 779771 913100 1327307 1588784 1459514 1018659
37363 1018659 402794 -247282 -656174 -580472 -154828 199459 284051 302431 449307 593482
37353 593482 554287 473343 638010 1040490 1396384 1580975 1757332 1999357 2073780 1801041
37343 1801041 1434291 1385210 1636757 1739257 1449235 1083953 1067252 1343410 1501564 1364793
37333 1364793 1160604 1116855 1176322 1200231 1214205 1290890 1346029 1230526 950097 662283
37323F62283j41279J04021L90768N61228M43857J38243r816J32924K59757O5351
37313B607337k53737k31456J89488N22096L59316j12024l90699k96627j02533
37304B291161q3297j86147k32962k36808l10257l69700k07133J22108K61313M4908
37294A093186j98464o8679L23995M81982J79409k83776n20773m88376l66086k19659
37284f7241K0163L29652N25650M66305K48207J36429K60919M19829L00519q8340
37274B552092l81844l46996j89511j82283k12760j7587K95375L68077J73000L6016
37264B093579O2069o062k59986m20337l36823k46685k91904k17980J20503L61560
37254H57934J54087k55129l94013k46121r6145M1579K98193M50875J67454l19004
$$ plain form
37323 662283 521004 625025 1015793 1577021 2020878 2159121 2149305 2282229 2541986 2607337
37313 2607337 2353600 2122144 2311632 2833728 3193044 3081020 2690321 2393694 2291161
37304 2291161 2207864 2021717 1788755 1551947 1241690 871990 664857 786965 1048278 1093186
37294 1093186 894722 826043 1150038 1632020 1811429 1527653 1006880 518504 152418 -67241
37284 -67241 -47078 282574 808224 1274529 1522736 1659165 1920084 2339913 2640432 2552092
37274 2552092 2170248 1823252 1633741 1451458 1238698 1221111 1516486 1884563 2057563 2093579
37264 2093579 2155648 2149586 1889600 1469263 1132440 885755 593851 375871 496374 857934
37254 857934 1012021 756892 362879 116758 20613 62192 360385 811260 978714 659710
37244F59710m09171n2919J48343j09712l88851k66801K0692Q0506L8420K20057
37234e9726M73241L63261q7865l81033k72123p1752r8456k16071j34925J03435
37224c82014K35314K26364K97536N04038N86180L65978N9969k1519O7380L5161
37214A974387j35250j51352O6382J94514J1350k40343k57662j56007k02427l08324
37204G95268k12367j6561n0371k36228j12065L96981P05967L25453m46691q75931
37194B73455o24538J176M68280M67181P9669k99330k92262N8614L02742J12536
37184E47523l04696m61729j68632K89813N05523L46336M486k62784l77087l99204
37174b80451l07557N136M39469O18172L32435j09669k70705j75804j53772k05887
$$ plain form
37244 659710 250539 197620 345963 236251 -152600 -419401 -398709 -318203 -279783 -59726
37234 -59726 413515 776776 688911 307878 35755 -35997 -134453 -350524 -485449 -382014
37224 -382014 -146700 79664 377200 881238 1467418 1833396 1893365 1871846 1939226 1974387
37214 1974387 1839137 1687785 1754167 1948681 1960031 1719688 1462026 1306019 1103592 795268
37204 795268 582901 566340 515969 279741 167676 564657 1270624 1596077 1149386 273455
37194 273455 -351083 -349907 118373 585554 665223 365893 73631 132245 434987 547523
37184 547523 242827 -218902 -387534 -97721 407802 754138 758624 495840 118753 -280451
37174 -280451 -588008 -582872 -143403 474769 807204 697535 426830 251026 97254 -108633
37164a08633j7222L97800N90642L63547P0491J8626L5906q0477j32347Q6844L39295
37153A564472K98345O2280r0202j77131l19147l39083m2127L18151L69952K51425
37143A896935L56738N69948L67066l04832q44631q09826l96672J9921L14374M06739
37133A575760J55017k76299m01655q8146J71825J2749j98492K5586M32148L80370
37123A788863j30288m36362k23283O5431J4986j29527J6638K55575J21816k86841
37113A057008l60891J02451N35819L82033j37322l75113j49398J24619J16501
37104A295707k0733j3708J14951J71540R6669l8640j72991k36796j55554j0576
37094A029869j4376j70696j71828J51286M86038M27894N1790k23816k28401j50247
$$ plain form
37164 -108633 -125855 271945 862587 1226134 1296625 1315251 1351157 1270680 1138333 1225177 1564472
37153 1564472 1862817 1925097 1834895 1657764 1338617 999534 957407 1275558 1645510 1896935
37143 1896935 2253673 2823621 3190687 2885855 2041224 1231398 834726 854647 1169021 1575760
37133 1575760 1730777 1454478 1052823 964677 1136502 1149251 950759 976345 1408493 1788863
37123 1788863 1658575 1222213 998930 1064361 1079347 949820 966458 1222033 1343849 1057008
37113 1057008 696117 798568 1334387 1716420 1579098 1203985 1054587 1179206 1295707
37104 1295707 1274974 1261266 1376217 1547757 1644426 1605786 1432795 1195999 1040445 1029869
37094 1029869 1015493 844797 672969 824255 1310293 1738187 1789977 1566161 1337760 1187513
37084A187513j19359m5080J13101K39133K74150K56857J28413j97459n34789n38345
37074G64135k10207M2638q406j09436L962J54760K7505l07645m77639k82851J50992
37063b52192N73451P38951M75635j03286n34789m25281P3296M22878L30408J6883
37053A315954j53833j03303j5421l4573j06692q2189Q8590K75653K95007J15096
37043A594289j01529j71787n5134J49873K77597J66460j91176n24596m85411p6353
37033E82233K87117K83071P8768K2083J02259K0759k63555m10666k06649J00045
37023E95465J58973J8709K1367K69530M49860K55468j83194m33451k77536M6720
37013I21911J60902o859j91615j53510O7878K74194L47430K93648J46433o3572
$$ plain form
37084 1187513 1068154 1023074 1136175 1375308 1649458 1906315 2034728 1837269 1302480 764135
37074 764135 553928 596566 588160 478724 482686 637446 664951 357306 -120333 -403184 -252192
37063 -252192 321259 1060210 1535845 1432559 897770 472489 545785 968663 1299071 1315954
37053 1315954 1162121 1058818 1043397 1008824 902132 819943 908533 1184186 1479193 1594289
37043 1594289 1492760 1320973 1265839 1415712 1693309 1859769 1668593 1143997 658586 582233
37033 582233 869350 1152421 1231189 1253272 1355531 1376290 1112735 702069 495420 595465
37023 595465 754438 773147 794514 1064044 1513904 1769372 1586178 1152727 875191 921911
37013 921911 1082813 1075954 884339 730829 798707 1072901 1420331 1713979 1860412 1796840
37003A796840k78410m34410m96343m25239j74170J95355M44200L44429l0534l12446
36993F29272k10259J76052M78838M55254J67824j94186n12043o82884n39226m8375
36983b79733M57619N27921J49529j90616j47381K9980o5573l32902l11272R8312
$$ plain form
37003 1796840 1518430 1084020 587677 162438 -11732 183623 627823 972252 941718 629272
36993 629272 419013 595065 1073903 1529157 1696981 1502795 990752 307868 -231358 -279733
36983 -279733 177886 705807 855336 664720 517339 547319 481746 148844 -162428 -64116
$$ [...]
##END NTUPLES=NMR SPECTRUM
##END=
