##TITLE=31P_DE-80H_X3
 64 sc D2O
 26.2.2025
##JCAMPDX= 6.0         $$ Bruker NMR JCAMP-DX V2.0
##DATA TYPE= NMR SPECTRUM
##DATA CLASS= NTUPLES
##ORIGIN= UXNMR, Bruker Analytische Messtechnik GmbH
##OWNER= root
$$ XWIN-NMR		Version 3.5
$$ Tue May 20 19:01:51 2025 Russian Standard Time (UT+4h)  Yarkov@DPX200
##.OBSERVE FREQUENCY= 81.013821
##.OBSERVE NUCLEUS= ^31P
##.ACQUISITION MODE= SIMULTANEOUS
##.ACQUISITION SCHEME= undefined
##.AVERAGES= 64
##.DIGITISER RES= 17
##SPECTROMETER/DATA SYSTEM= spect
##.PULSE SEQUENCE= zgpg30
##.SOLVENT NAME= CDCl3
##.SHIFT REFERENCE= (INTERNAL, CDCl3, 0, 198.062)
##AUDIT TRAIL= $$ (NUMBER, WHEN, WHO, WHERE, WHAT)
$$ ##TITLE= Audit trail, XWIN-NMR		Version 3.5
$$ ##JCAMPDX= 5.01
$$ ##ORIGIN= Bruker BioSpin GmbH
$$ ##OWNER= Yarkov
$$ C:/Bruker/XWIN-NMR/data/yarkov2/nmr/P31/2/pdata/1/auditp.txt
$$ ##AUDIT TRAIL=  $$ (NUMBER, WHEN, WHO, WHERE, WHAT)
(   1,<2025-05-20 19:01:09.12 +0400>,<Yarkov>,<DPX200>,
      <created by zg, POWCHK disabled, PULCHK disabled
       configuration hash MD5:
       00 E9 B6 7A A2 85 ED C7 34 08 36 98 17 FE 4E 26
       data hash MD5: 32K
       F9 B4 F1 F1 AA 32 49 BA 9A 95 10 55 5E D3 53 69>)
(   2,<2025-05-20 19:01:13.35 +0400>,<Yarkov>,<DPX200>,
      <Start of raw data processing
       efp BC_mod = 2 LB = 1.5 FT_mod = 6 PKNL = 1 PHC0 = 1756.908 PHC1 = 73.15951 SI = 64K 
       data hash MD5: 64K
       56 09 63 9F 90 A2 8A 37 57 96 90 5C FD F2 DB 6B>)
(   3,<2025-05-20 19:01:30.79 +0400>,<Yarkov>,<DPX200>,
      <pk PHC0 = 12.53655 PHC1 = 0 
       data hash MD5: 64K
       2B 30 04 21 BF 9C DB 8F D2 F6 30 81 62 63 3C CD>)
$$ ##END=
$$ 
$$ hash MD5
$$ C3 1C 09 D5 13 91 98 34 D7 BA B1 BF A9 E8 98 5A
##$RELAX= 
##$RELAX= 
##$RELAX= 
##$RELAX= 
##$RELAX= 
##$RELAX= 
##$RELAX= 
##$RELAX= 
$$ Bruker specific parameters
$$ --------------------------
##$DU= <C:/Bruker/XWIN-NMR>
##$EXPNO= 2
##$NAME= <P31>
##$PROCNO= 1
##$TYPE= <nmr>
##$USER= <yarkov2>
##$AMP= (0..31)
100 100 100 100 100 100 100 100 100 100 100 100 100 100 100 100 100 100 
100 100 100 100 100 100 100 100 100 100 100 100 100 100 
##$AQSEQ= 0
##$AQ_mod= 1
##$AUNM= <au_zg>
##$AUTOPOS= <>
##$BF1= 81.014009
##$BF2= 200.13
##$BF3= 200.13
##$BF4= 200.13
##$BF5= 200.13
##$BF6= 200.13
##$BF7= 200.13
##$BF8= 200.13
##$BYTORDA= 1
##$CFDGTYP= 0
##$CFRGTYP= 5
##$CHEMSTR= <none>
##$CNST= (0..31)
1 1 145 1 1 1 1 1 1 1 1 1 1 1 1 1 1 1 1 1 1 1 1 1 1 1 1 1 1 1 1 1 
##$CPDPRG= <waltz16>
##$CPDPRG1= <>
##$CPDPRG2= <waltz16>
##$CPDPRG3= <>
##$CPDPRG4= <mlev>
##$CPDPRG5= <mlev>
##$CPDPRG6= <mlev>
##$CPDPRG7= <mlev>
##$CPDPRG8= <mlev>
##$CPDPRGB= <>
##$CPDPRGT= <>
##$D= (0..31)
0 1 0 0 0 0 0 0 0 0.06 0 0.03 2e-05 3e-06 0 0 0.0002 0 0 0 0 0 0 0 0 0 
0 0 0 0 0 0 
##$DATE= 1747753268
##$DBL= (0..7)
120 120 120 11 120 120 24 19 
##$DBP= (0..7)
150 150 150 150 150 150 150 150 
##$DBP07= 0
##$DBPNAM0= <>
##$DBPNAM1= <>
##$DBPNAM2= <>
##$DBPNAM3= <>
##$DBPNAM4= <>
##$DBPNAM5= <>
##$DBPNAM6= <>
##$DBPNAM7= <>
##$DBPOAL= (0..7)
$$ [...]
##$SUBNAM3= <"">
##$SUBNAM4= <"">
##$SUBNAM5= <"">
##$SUBNAM6= <"">
##$SUBNAM7= <"">
##$SUBNAM8= <"">
##$SUBNAM9= <"">
##$SW= 400.765351723535
##$SWIBOX= (0..15)
0 1 3 0 0 0 0 0 0 0 0 0 0 0 0 0 
##$SW_h= 32467.5324675325
##$TD= 32768
##$TD0= 1
##$TE= 0
##$TE2= 300
##$TE3= 300
##$TEG= 300
##$TL= (0..7)
0 120 53 12 22 120 120 120 
##$TP= (0..7)
150 150 150 150 150 150 150 150 
##$TP07= 0
##$TPNAME0= <>
##$TPNAME1= <>
##$TPNAME2= <>
##$TPNAME3= <>
##$TPNAME4= <>
##$TPNAME5= <>
##$TPNAME6= <>
##$TPNAME7= <>
##$TPOAL= (0..7)
0.5 0.5 0.5 0.5 0.5 0.5 0.5 0.5 
##$TPOFFS= (0..7)
0 0 0 0 0 0 0 0 
##$TUNHIN= 0
##$TUNHOUT= 0
##$TUNXOUT= 0
##$USERA1= <user>
##$USERA2= <user>
##$USERA3= <user>
##$USERA4= <user>
##$USERA5= <user>
##$V9= 5
##$VALIST= <valist>
##$VCLIST= <CCCCCCCCCCCCCCC>
##$VD= 0
##$VDLIST= <DDDDDDDDDDDDDDD>
##$VPLIST= <PPPPPPPPPPPPPPP>
##$VTLIST= <TTTTTTTTTTTTTTT>
##$WBST= 1024
##$WBSW= 4
##$XGAIN= (0..3)
0 0 0 0 
##$XL= 0
##$YL= 0
##$YMAX_a= 27909
##$YMIN_a= -22112
##$ZGOPTNS= <>
##$ZL1= 120
##$ZL2= 120
##$ZL3= 120
##$ZL4= 120
##$ABSF1= 0
##$ABSF2= 0
##$ABSG= 0
##$ABSL= 0
##$ALPHA= 0
##$AQORDER= 0
##$ASSFAC= 0
##$ASSFACI= 0
##$ASSFACX= 0
##$ASSWID= 0
##$AUNMP= <proc_1d>
##$AZFE= 0.1
##$AZFW= 0.5
##$BCFW= 0
##$BC_mod= 2
##$BYTORDP= 0
##$COROFFS= 0
##$CY= -3
##$DATMOD= 1
##$DC= 0
##$DFILT= <>
##$DTYPP= 0
##$F1P= 0
##$F2P= 0
##$FCOR= 1
##$FTSIZE= 65536
##$FT_mod= 6
##$GAMMA= 0
##$GB= 0
##$INTBC= 1
##$INTSCL= 9.790993e-09
##$ISEN= 30
##$LB= 1.5
##$LEV0= 0
##$LPBIN= 0
##$MAXI= 10000
##$MC2= 0
##$MEAN= 0
##$ME_mod= 0
##$MI= 50
##$NCOEF= 0
##$NC_proc= -5
##$NLEV= 6
##$NOISF1= 182.463
##$NOISF2= 159.3651
##$NSP= 0
##$NTH_PI= 0
##$NZP= 0
##$OFFSET= 198.0616
##$PC= 4
##$PHC0= 1769.444
##$PHC1= 73.15951
##$PH_mod= 1
##$PKNL= yes
##$PPARMOD= 0
##$PSCAL= 0
##$PSIGN= 0
##$REVERSE= no
##$SF= 81.0140089999434
##$SI= 65536
##$SIGF1= 159.3651
##$SIGF2= -187.1042
##$SINO= 113.3802
##$SIOLD= 16384
##$SREGLST= <1H.CDCl3>
##$SSB= 0
##$STSI= 65536
##$STSR= 0
##$SW_p= 32467.5324675325
##$SYMM= 0
##$S_DEV= 0
##$TDeff= 32768
##$TDoff= 0
##$TI= <>
##$TILT= no
##$TM1= 0
##$TM2= 0
##$TOPLEV= 0
##$USERP1= <user>
##$USERP2= <user>
##$USERP3= <user>
##$USERP4= <user>
##$USERP5= <user>
##$WDW= 1
##$XDIM= 65536
##$YMAX_p= 429465963
##$YMIN_p= -44245130
$$ End of Bruker specific parameters
$$ ---------------------------------
##NTUPLES= NMR SPECTRUM
##VAR_NAME=  FREQUENCY,     SPECTRUM/REAL,   SPECTRUM/IMAG
##SYMBOL=    X,             R,               I
##VAR_TYPE=  INDEPENDENT,   DEPENDENT,       DEPENDENT
##VAR_FORM=  AFFN,          ASDF,            ASDF
##VAR_DIM=   65536,         65536,           65536
##UNITS=     HZ,            ARBITRARY UNITS, ARBITRARY UNITS
##FACTOR=    0.49542278885378, 1,            1
##FIRST=     16045.7642231865, 0,            0
##LAST=      -16421.768244346, 0,            0
##MIN=       -16421.768244346, -44245130,    0
##MAX=       16045.7642231865, 429465963,    0
$$ Real data points
##PAGE= N=1
##DATA TABLE= (X++(R..R)), XYDATA
$$ [...]
40749a99735j93496K6806K21663L04396K66694J53060q815k12224l93137m05178
40739d39966j55115K21922M09396K26238j28867k62678l6319K84124L70421J93912
40729F83068n0923k48297m06479m67997k94509J08125M93765N85161L26547q3512
40719F44949l52868l16110q5011M8752m0062j19514Q9158M64629N82850K84139
40709A200912j12211k60891k11662k02169k46420j91272n9440m4438j80415k69713
40699e77719j80682j4621Q1116Q6443K3519j25674l01863l11560m2387L38295
40689a025133N41127M78997L20412K42109K38670J82285j3245k97162m92737m26841
40679b51518j28864J28159J00899j12222j70408O2853L27139L17149R0076m5350
$$ y = [-199735, -393231, -366425, -144762, 159634, 426328, 579388, 570573, 358349, -34788, -439966, -595081, -373159, 36237, 262475, 133608, -129070, -165389, 118735, 489156, 683068, 632145, 383848, -22631, -490628, -785137, -677012, -183247, 401914, 728461, 644949, 292081, -24029, -109040, -60288, -100350, -219864, -130706, 333923, 916773, 1200912, 1088701, 827810, 616148, 413979, 167559, -23713, -83153, -127591, -308006, -577719, -758401, -773022, -691906, -605463, -581944, -707618, -1009481, -1321041, -1363428, -1025133, -484006, -5009, 315403, 557512, 796182, 978467, 965222, 668060, 175323, -251518, -380382, -252223, -151324, -263546, -433954, -371101, -43962, 273187, 363263, 317913]
40669C17913K4163Q0223q9396l76714m71105k22057J90263M31698L36742O6159
40659B87889o5204O8597K80994L29744K08936P8570j2934j52666l30331l93000
40649C00595k86650j53937j01987m6399R6041K23274K11155J25141R1911O8059
40639E27203o6200k60018l50268l25338l14921l29372k38999m8087M2116n6518
40629a420402j43652j3937K29850L27627K40994J80010K54920K93192R7060k35928
40619a90266l93203k23214J02429L35876M31826M77393M51260K45004p7798k38729
40609I20578n2831L37919O23989O28572L84951K9034k87439m59005m89026m37468
40599A199274k93998k9217K23578K56696J26352J37156L47359L87943J8071m26752
$$ y = [317913, 342076, 422299, 332903, -43811, -514916, -736973, -546710, -115012, 221730, 287889, 222685, 291282, 572276, 902020, 1110956, 1189526, 1176592, 1023926, 693595, 300595, 13945, -139992, -241979, -288378, -192337, 30937, 242092, 367233, 459144, 527203, 461003, 200985, -149283, -474621, -789542, -1118914, -1357913, -1406000, -1363884, -1420402, -1564054, -1577991, -1348141, -1020514, -779520, -599510, -344590, -51398, 45662, -190266, -583469, -806683, -704254, -368378, 63448, 540841, 992101, 1237105, 1159307, 920578, 867747, 1205666, 1829655, 2458227, 2843178, 2872212, 2584773, 2125768, 1636742, 1199274, 905276, 876059, 1099637, 1356333, 1482685, 1619841, 1967200, 2355143, 2373214, 1946462]
40589A946462m83026k20555n2142p2859o2532k0770j53488l44964k18818J79581
40579D96889L25784K7790k49636j45579L5913r0946l10011j94573J51372K77594
40569C24597J14727K549Q8261J65694R4120k6762j17190k13911k86275k48683
40559a02873j65593j76765k24481j18862J29351K95347K61984J31963M0243O2169
40549A32483K43030M90921N38101K71808k2365n9850l7975k97001o42425n63578
40539E3149j06558J04503j46453l01648N1348M80014L75885j29395m34979l37756
40529c91890j00436J16118L37482M17728J53302k42263k79258R8903L79368K06918
40519F95972j23564j27374J90216L90390K09031j40111k74475j03128J00581O2186
$$ y = [1946462, 1463436, 1242881, 1190739, 1117880, 1055348, 1034578, 881090, 536126, 317308, 496889, 822673, 850463, 600827, 455248, 491161, 400215, 90204, -104369, 47003, 324597, 439324, 441873, 530134, 695828, 789948, 763186, 645996, 432085, 145810, -102873, -268466, -445231, -669712, -788574, -659223, -363876, -101892, 30071, 70314, 132483, 375513, 866434, 1404535, 1676343, 1653978, 1594128, 1556153, 1259152, 616727, 53149, -53409, 51094, -95359, -397007, -345659, 134355, 510240, 380845, -54134, -391890, -492326, -376208, -38726, 379002, 532304, 290041, 10783, 109686, 489054, 695972, 572408, 445034, 635250, 1025640, 1234671, 1094560, 820085, 716957, 817538, 879724]
40509H79724j46242k25448q8272J4230j12415k95801k67635p8409M083r4129k00790
40498f11104j94321j05966K4556J48928J23979r6905k37066J2470M82617O60003
40488B07191L73155j8295j95565k39223k64027j20945K52707N32378M06381L8820
40478I72577j89802j90226r5630Q2471L43912M34721J35110k94497m01551k12887
40468E84198j52433l10717l21656n1004J37999K2543q2762J02442K92351J09456
40458C30417k35750k41789R8267L20457K20618N4280k0331j95981n40485o94046
40448i04343l45978K47646N40586L61476L2296j08973n1689K3905J2635n6366
40438b48805r8511m6957P6725J39270L5575j21155p6479K14274M39670K97921
$$ y = [879724, 733482, 508034, 419762, 433992, 321577, 25776, -241859, -320268, -316185, -410314, -611104, -805425, -911391, -886835, -737907, -613928, -710833, -947899, -935429, -452812, 207191, 580346, 562051, 366486, 127263, -136764, -257709, -5002, 527376, 933757, 972577, 782775, 592549, 496919, 579390, 923302, 1358023, 1493133, 1198636, 797085, 584198, 431765, 121048, -200608, -251612, -113613, -91070, -173832, -71390, 220961, 330417, 94667, -147122, -48855, 271602, 492220, 546500, 526169, 330188, -210297, -904343, -1250321, -1002675, -462089, -100613, -68317, -177290, -228979, -205074, -192439, -248805, -347316, -394273, -317548, -178278, -142703, -263858, -340337, -126063, 313607, 611528]
40428F11528p3608k61899j61229j03156k91289m18330j30765L56605N21144L05782
40418C54783J54117K35656J60149l08025p27751n71390m147L81059L83226K66411
40408C24088J63712m7848k85584k15010J88851M72434L06282p8087k62960j74544
40398C91334k4650M4923M1266O511j891N9967J19225O1440m9627l8848O4569N6017
40386G30236n6222l8903J01957N8086k09754k89817J4412K85257J39001j43138
40376E91115j06852J15478J01105q6897n4091J62964J53230j00358j59736J12290
40366G28248L37681K67439P9232q7939l27403n27177l21590K62217O44889M85327
40356A540924J35878p705q6668l00820l66078o338M05462L21691j19350l30035
$$ y = [611528, 537920, 276021, 114792, 11636, -279653, -697983, -828748, -472143, 49001, 354783, 508900, 744556, 904705, 596680, -131071, -702461, -706608, -325549, 57677, 324088, 487800, 439952, 154368, -60642, 128209, 600643, 906925, 828838, 565878, 391334, 366684, 411607, 452873, 459384, 457493, 517460, 636685, 698125, 648498, 609650, 674219, 730236, 674014, 635111, 737068, 795154, 585400, 295583, 309995, 595252, 734253, 591115, 484263, 599741, 700846, 613949, 559858, 722822, 876052, 775694, 615958, 728248, 1065929, 1333368, 1412600, 1324661, 997258, 470081, 148491, 410708, 1055597, 1540924, 1676802, 1669097, 1582429, 1281609, 915531, 909193, 1314655, 1636346, 1516996, 1186961]
40346A186961k04338j66391l39912l28745M9929L81709K55128j61379m09750l20890
40336e7678n5792K14882M19441M80929L12533p4644n17432p47962n54768j5821
40326e96312M66117N14496J62213k36907m22803l85044j77512J57933M58905M86727
40316D27813K04660j49171l31185k99424j42957J5743L5496j18082k35754q3198
40306f76059K10805K65387K6416r4365J63804M81758M36130J33747o926P0773
40296A011470N0546j46332k02244M7061L03724K43864m5532k87545m07787m45831
40286A21394l11603L3333L08558K10849q7522j28877J38404K78110O8492j55529
40276D75609q1075P8632M439j51107n8394J57495J02496j82250k48226J9310K15946
$$ y = [1186961, 982623, 816232, 476320, 147575, 197504, 579213, 834341, 672962, 263212, -57678, -113470, 101412, 520853, 1001782, 1314315, 1239671, 722239, -25723, -580491, -596312, -130195, 384301, 546514, 309607, -113196, -498240, -675752, -517819, -58914, 427813, 632473, 483302, 152117, -147307, -290264, -274521, -239025, -357107, -592861, -676059, -465254, -199867, -173451, -267816, -104012, 377746, 813876, 947623, 940697, 1011470, 1062016, 915684, 713440, 760501, 1064225, 1308089, 1262557, 975012, 567225, 121394, -190209, -156876, 151682, 362531, 275009, 146132, 284536, 562646, 631138, 475609, 394534, 473166, 477605, 326498, 268104, 425599, 528095, 345845, 97619, 116929, 332875]
40265C32875P6479j74782k94345l61456m21911k58913J58883M14125K14071j12492
40255d27466j04687J40976K18523R2997L1279L7531j03021l04924k43058O7806
40245e94044K49238J63926Q3237J69793K36832J52513P8169J37055J91029J11184
40235I78932k5242j32674k20017k12644q608K03520P8773l01083m13349o9940
40225a22332K39925Q4914k48574k34362Q5662K32597K2686k72923l82936k67589
40215h62932J8088L49606M88266L12579K9074r8325j02736j31511r8575J16374
40205A9908K89230J24625j84758j73100J31141J91419j72672m50018k26588J64156
40195b86657J70788j35007k15114J03140M19734L91457J77603J24217K66961L43465
$$ y = [332875, 409354, 234572, -59773, -421229, -843140, -1102053, -943170, -529045, -314974, -427466, -532153, -391177, -172654, -79657, -48378, -10847, -113868, -418792, -661850, -594044, -344806, -180880, -97643, 72150, 308982, 461495, 539664, 676719, 867748, 978932, 953690, 821016, 600999, 388355, 379747, 583267, 662040, 360957, -52392, -122332, 117593, 202507, -46067, -280429, -194767, 37830, 60516, -212407, -595343, -862932, -844844, -495238, -6972, 305607, 334681, 236356, 133620, 2109, -96466, 19908, 309138, 433763, 249005, 75905, 207046, 398465, 225793, -224225, -450813, -286657, -115869, -250876, -465990, -362850, 56884, 448341, 625944, 750161, 1017122, 1360587]
40185A360587J83053r2544k44962j75530L0934K32597L06805J36506l15760q29900
40175E91786r62679m65530L43561Q13606O20995O3540l37800l61812j41243J01647
40165B66071J96623M7639k49456l72679j05190L02588L70004N1751j28320K03783
40155E82814O85892O72974J15233m15859n38849m54087m28324l51413q0303J59919
40145e2003J13797l0331N9808K71007K30842k6932j05074N9981Q6090j69605l38064
40134I9516j50939J41905K21710J49539Q4936m5664k73122l45307j30045O4868
40124a82603m2275k26568j54674L2248O751j25361k0756K64572L82611L25498
40114B59443L87077N30421L64218j77128o27915n93655j73782K91041N31205L85810
$$ y = [1360587, 1543640, 1451096, 1206134, 1030604, 1061538, 1294135, 1600940, 1737446, 1421686, 591786, -370893, -836423, -492862, 320744, 941739, 1005279, 667479, 305667, 164424, 266071, 462694, 510333, 260877, -111802, -216992, 85596, 455600, 507351, 379031, 582814, 1268706, 1941680, 2056913, 1641054, 1102205, 648118, 219794, -131619, -211922, -52003, 61794, 31463, 91271, 362278, 593120, 566188, 461114, 521095, 607185, 437580, 99516, -51423, 90482, 312192, 461731, 546667, 501003, 227881, -117426, -247471, -182603, -224878, -451446, -606120, -573872, -567121, -692482, -713238, -448666, -66055, 259443, 646520, 1176941, 1541159, 1364031, 736116, 142461, -31321, 259720, 790925, 1176735]
40104A176735o9949m00993k23129K31367L75200R5610j59175j40276q0255j23541
40094F81594q9366P150j67944n69371n77132P2337P14375O39728R7665j56415
40084F52621M4990K52589K13640Q9505j2814j48876k19242n7031J65617Q4556
40074A065555k60998l98812p6654L95775N54134K69096k27353n78929n40859j83162
40064A7793J33630J50333J9285M5202K30416L22247K13335J9076j69374l30784
40054F51159l79687k68611j57598j92615j98885O8028M33082M60764J07742j93729
40044C29650j82572r2613j61572j87341J31902O31962P83579L43219l04702n45066
40034G46446k19044J98404K00966p2082l7074M37476P42721L74473l20771o46153
$$ y = [1176735, 1106786, 705793, 482664, 714031, 1089231, 1184841, 1025666, 885390, 805135, 681594, 592228, 599378, 431434, -137937, -715069, -642732, 71643, 711371, 809036, 652621, 697611, 950200, 1163840, 1253345, 1240531, 1091655, 872413, 815382, 980999, 1065555, 804557, 405745, 329091, 724866, 1279000, 1548096, 1320743, 741814, 200955, 17793, 151423, 301756, 321041, 366243, 596659, 918906, 1132241, 1151317, 981943, 651159, 271472, 2861, -154737, -347352, -546237, -478209, -45127, 415637, 523379, 329650, 147078, 54465, -107107, -294448, -162546, 469416, 1252995, 1596214, 1291512, 746446, 527402, 725806, 926772, 854690, 817616, 1255092, 1997813, 2372286, 2051515, 1405362]
40024A405362m97148l07226k76476k35332j61815k15837k69896k5678L44808L12920
40014G3682j18241k99748M8287L68533J84745j30031k0021L18914K91846j28304
40004E89662m10548k83739Q294K03346K94433L12267K31267J20958R0913Q7144
39994A243997n626j11056p1479N2290O7708j1566K786J23354J43830k7719k22517
39983A184002k47270j03632N9332R9816o516j37413j50238o9533k9573j8119R1332
39972F72188J97715M457m34953n91481j94658K72258K44978o4604l4220L52780
39962D24460N00241J69400j87197j80598m279J6139r3019j89864l28548n19180
39952c92445m99818r3491M23113O28350M90304L09772K33712J11627j74284m69041
$$ y = [1405362, 908214, 600988, 324512, 89180, -72635, -288472, -558368, -584046, -239238, 73682, -44559, -344307, -296020, 72513, 257258, 127227, 107206, 426120, 717966, 589662, 179114, -104625, -96331, 107015, 401448, 713715, 944982, 1065940, 1156853, 1243997, 1238371, 1127315, 1055836, 1108126, 1175834, 1164268, 1167054, 1290408, 1434238, 1406519, 1184002, 936732, 833100, 892432, 992248, 985732, 848319, 698081, 628548, 598975, 580856, 672188, 869903, 874360, 439407, -152074, -346732, -74474, 170504, 105900, 71680, 424460, 924701, 1094101, 906904, 726306, 722027, 738166, 645147, 455283, 126735, -392445, -892263, -985754, -562641, 65709, 556013, 865785, 1099497, 1211124, 1036840, 567799]
39942E67799n13200k49647J04577K79525K14266O1710m5520j08989j05610Q3373
39932B88284M25508O16129M54166J71946Q0330M6482k58034o85361p08509k44718
39922A86223J40219L6806k60161k70624j164K15895K40193J55185K5930p8110
39912C90392k9060J33169J48674m1674r9886J83184M58419L04338j08524k95013
39902A044019k06961j91449k98992j97736J82497M56175L85781K13812J69787
39893A556933O2819l15394o96652o39550j79719J83541J23571j75528l44399k55135
39883f79513l8688J45653K22862J79816P8633P0598K56789N00924N13051K10193
39873A460318j20600j62947J1945O4120j25368l24662l23006j63653O4852L71409
$$ y = [567799, 54599, -195048, -90471, 189054, 403320, 465030, 419510, 310521, 204911, 288284, 713792, 1329921, 1784087, 1956033, 2036363, 2082845, 1824811, 1139450, 430941, 186223, 326442, 363248, 103087, -167537, -168701, 47194, 287387, 442572, 468502, 390392, 361332, 494501, 643175, 601501, 501615, 684799, 1143218, 1447556, 1339032, 1044019, 837058, 645609, 346617, 148881, 331378, 787553, 1173334, 1387146, 1556933, 1619752, 1304358, 607706, -31844, -211563, -28022, 95549, -79979, -424378, -679513, -718201, -572548, -349686, -169870, -91237, -20639, 236150, 737074, 1250125, 1460318, 1339718, 1176771, 1188716, 1252836, 1127468, 802806, 479800, 316147, 380999, 752408]
39863G52408O39234N59710N9293m31207m56529j42252J5488j26205k14826P902
39853F63016L32079M15862K32104J3794q9678j44434k73348m55298n01043k64569
39843g1515J14596L06115K04924Q7818K01000L74381K97640L4705o8267P1110
39833A552507J71772O3492p4304m9762M5871K5695j09156k08235j62326K6316
39823A281870K56095L79408L45074K54403J63411m1738l66206m85409j62549K40061
39813A864420J44673l62706n73373j84672K65217K30186j01107k57041k22674
39804H02923k58385l07037r9357L15744N97087N79416L64327N9562k34103l04660
39794A515517n6336K44767K91654J90946K46018M17532M16344K49871K23069M11039
$$ y = [752408, 1391642, 1951352, 2010645, 1579438, 1122909, 980657, 996145, 869940, 655114, 663016, 995095, 1410957, 1643061, 1656855, 1567177, 1422743, 1149395, 694097, 193054, -71515, 43081, 349196, 554120, 641938, 842938, 1217319, 1514959, 1549664, 1481397, 1552507, 1724279, 1787771, 1713467, 1663705, 1709576, 1735271, 1626115, 1417880, 1255554, 1281870, 1537965, 1917373, 2262447, 2516850, 2680261, 2638523, 2272317, 1786908, 1624359, 1864420, 2009093, 1646387, 1073014, 888342, 1153559, 1383745, 1282638, 1025597, 802923, 544538, 237501, 138144, 453888, 1050975, 1630391, 1994718, 2054280, 1820177, 1515517, 1459181, 1703948, 1995602, 2186548, 2432566, 2850098, 3266442, 3516313, 3739382, 4150421]
39784D150421N81550O73842Q95561J240617J350010J041911O42405O11184J104130
39775A2291631K004487L094230M150639N245534O928893R446073J1499148J0578794
39767F5239429N406635k129222q216169j0422958r391059p373491n820690m692157
39759B2600318l509645k307940j470358j102881r24990p21141o39954r00841j328760
39750I693808j443705j078380o57091o47614r07061q85279m26299j639l4849l18205
39740C293686l55486p9386J03638o6018l55797l99335j57283J28652K70489K36081
39730B619241K6087l23746o23838o14901k45532K41523N44272N36412K70874j00806
39720B329586l64710l55687j34251N2410O3996L247j5362o5160k30259l78712
$$ y = [4150421, 4731971, 5405813, 6301374, 7541991, 8892001, 9933912, 10576317, 11187501, 12291631, 14296118, 17390348, 21540987, 26786521, 33715414, 43161487, 54660635, 65239429, 70646064, 68516842, 60300673, 49877715, 40486656, 33113165, 27292475, 22600318, 19090673, 16782733, 15312375, 14209494, 13284504, 12563363, 11923409, 11022568, 9693808, 8250103, 7171723, 6514632, 5867018, 4959957, 4074678, 3648379, 3646740, 3611891, 3293686, 2938200, 2858814, 2962452, 2896434, 2540637, 2141302, 1984019, 2112671, 2383160, 2619241, 2645328, 2321582, 1697744, 1082843, 837311, 1078834, 1623106, 2159518, 2430392, 2329586, 1964876, 1609189, 1474938, 1527348, 1591344, 1594591, 1579229, 1514069, 1283810, 905098]
39710I05098l14041o5977J61758K64472K69411J71506m1577k43569k81663k22491
39700F02927k58542l72264l41901j12925R7112J47620J83601L59956N54391N24402
39690A384377K37218r1677k27698j18228P1731J11422k6234r1325J07762L76193
39680A733541L73480J23696l2179L961m5843l12089n14579m16981j85474m6222
39670F81311P3637K57698K80632k7112l49305k70360O9462J69841o5896k38959
39660E80949j23680M6491O1326P1079K41901M08314L25026N5891j32457j54915
39650A379925j81295l51229n51468n21254j65334K71213M25180K36986J4360k009
39640E55075N1789m7848k13339k05460m9808K2468l0289m8922j0636m4403j29682
$$ y = [905098, 591057, 525080, 686838, 951310, 1220721, 1392227, 1350650, 1107081, 825418, 602927, 344385, -27879, -369780, -482705, -385593, -237973, -54372, 305584, 859975, 1384377, 1621595, 1529918, 1302220, 1183992, 1255723, 1367145, 1340911, 1249586, 1357348, 1733541, 2107021, 2230717, 2198538, 2202499, 2156656, 1844567, 1329988, 913007, 727533, 681311, 754948, 1012646, 1293278, 1266166, 916861, 646501, 715963, 885804, 819908, 580949, 457269, 503760, 565086, 636165, 878066, 1286380, 1611406, 1667297, 1534840, 1379925, 1198630, 847401, 295933, -225321, -390655, -119442, 305738, 542724, 557084, 555075, 606864, 559016, 345677, 140217, 90409, 112877, 82588, 33666, 23030, -21373, -151055]
39629a51055j21270p0223j56480k89371j84925R6655J42267j37130k78445L4680
39619a115297M61193N24734L01289J91744K60578K29791N333j80646j32104Q1212
39609F27827K42992J67370j57054m52930l47336J37571M92518L54242k218j13317
39599I49665k6544j19791l88728m42590j94585k3077j23478j87825L4057K69501
39589b53395J62689j05893m4400M17224P92884O76889K38857m1659K9496J99753
39579B072445J56793j01430l63206n29059o40792o31301l36283J33637L22729
39570H3533m742m30512l56360J87159N80204M53896J03341l1996O9248J69048
39560H22819J94833K25051K22829O8881j93034l57078k98105q0600J56479L16390
$$ y = [-151055, -272325, -342548, -499028, -788399, -973324, -876669, -734402, -871532, -1149977, -1115297, -654104, -129370, 171919, 363663, 624241, 854032, 859365, 678719, 546615, 627827, 870819, 1038189, 881135, 428205, 80869, 218440, 710958, 1065200, 1062982, 949665, 923121, 803330, 414602, -27988, -222573, -245650, -369128, -556953, -522896, -253395, -90706, -196599, -240999, 176225, 969109, 1645998, 1884855, 1843196, 1872692, 2072445, 2229238, 2127808, 1764602, 1235543, 594751, -36550, -372833, -239196, 83533, 78791, -351721, -708081, -520922, 59282, 513178, 616519, 584523, 653771, 822819, 1017652, 1242703, 1465532, 1534413, 1341379, 984301, 686196, 605596, 762075, 1078465]
39550A078465L62473L04607J70586k7407k54076l85744k93408j7863K66543N06093
39540A710269Q18640J189821J299010Q54552K2655o84823r40480q49828o71281
39531B748535m91675k80189j07427j07701k31902k25869L5491L10964K67750m7979
39521A869998k39539j06891Q1065R701k22043l14059k44122j99530j54821P0320
39511E50079L48117K82789j73921n47824m67014j14454J45414K43362K55032J21090
39501F42670j42715k45063j6317K21208Q6024k51608l27411r2935J13336J91585
39491A78774L34022M75755K79510k16219m84275k59101Q0026J29309J1422k710
39481E26513M718j30343k32346q0435J36903J10454n0599k1626J61046K00616
$$ y = [1078465, 1440938, 1745545, 1916131, 1888724, 1634648, 1248904, 955496, 937633, 1204176, 1710269, 2528909, 3718730, 5017740, 5872292, 5894947, 5210124, 4269644, 3419816, 2748535, 2256860, 1976671, 1869244, 1761543, 1529641, 1303772, 1339263, 1650227, 1917977, 1869998, 1630459, 1523568, 1604633, 1614334, 1392291, 1078232, 834110, 634580, 479759, 550079, 898196, 1180985, 1007064, 459240, -7774, -122228, 23186, 266548, 521580, 642670, 499955, 254892, 238575, 459783, 545807, 294199, -33212, -126147, -12811, 178774, 512796, 988551, 1268061, 1051842, 567567, 308466, 388492, 517801, 529223, 526513, 531231, 400888, 168542, 88107, 225010, 335464, 284865, 263239, 424285, 624901]
39471F24901R1914O9159Q0247j32881m26736l29326J50999L87277O5165k99193
39461B81526j51752K67411L71318J34408j4180K9244k4434k31853l14821k17180
39451A29687k15209l48524k60747J62048M55465K16664k65867m08940j33225J25827
39441e42821P8552j18721j85418k1928L11123O48796P38205M50219J8942j59410
39431A217539k6119O4940j41589m48058n24056l89730l24874l68211k03353L44263
39421g99248R04528R03523K84018l60798m88806k37988j28425k89249l43695o1773
39411f17913K81262L62777K69105K29363J95818K6212j58023j80273j79160l41116
39401a11948m26006p3860M87983O15383J77189k48034k48290r6106j48753k58939
$$ y = [624901, 716815, 785974, 866221, 733340, 306604, -22722, 128277, 515554, 580719, 281526, 129774, 397185, 768503, 902911, 888731, 917975, 893541, 661688, 346867, 129687, -85522, -434046, -694793, -532745, -77280, 139384, -126483, -535423, -668648, -542821, -464269, -582990, -768408, -790336, -479213, 169583, 907788, 1358007, 1376949, 1217539, 1191420, 1256360, 1114771, 666713, 142657, -247073, -571947, -940158, -1143511, -799248, 105280, 1008803, 1292821, 932023, 443217, 205229, 76804, -212445, -556140, -617913, -336651, 26126, 295231, 524594, 720412, 746624, 588601, 408328, 229168, -111948, -537954, -611814, -123831, 491552, 668741, 420707, 172417, 76311, -72442, -331381]
39391c31381j42413R2269J77888J21845M2676j05485k79272j57887L56108P52385
39381E26733N23560p2090l63079j90376L8466O5403o17r3087k60549l57630j86146
39370c69412O8418N0238j49032j37833L8560n0058l80927l97627N4251M12304
39360h61118L09895J34614K85371M94924L82194J37208R6099Q2107k24262n95508
39350B41524n44332p5523L78652N69318N05865J79630k76069m18066n1942K93617
39340H02674O6069l91454l42828J20601K21651j89288l97651n7474K60020J00909
39330A93229j27625M0915K97380J48561k09430k84193j42934j83603l37668k05161
39320h10529J64272L01964J04602k4837J24500K85792K48456J78123K18469K11083
$$ y = [-331381, -473794, -381525, -203637, -81792, -39116, -144601, -423873, -581760, -225652, 526733, 1050293, 978203, 615124, 424748, 463214, 528617, 528000, 434913, 174364, -183266, -369412, -300994, -250756, -399788, -537621, -499061, -549119, -930046, -1327673, -1273422, -861118, -551223, -416609, -131238, 363686, 745880, 883088, 979187, 1061294, 837032, 241524, -302808, -378331, 321, 569639, 1075504, 1255134, 979065, 560999, 509057, 802674, 868743, 477289, 134461, 255062, 476713, 287425, -110226, -167700, 92320, 193229, 65604, 106519, 403899, 552460, 343030, 58837, -84097, -267700, -605368, -810529, -646257, -344293, -239691, -264528, -140028, 145764, 394220, 572343, 790812, 1001895]
39310A001895N3841l1847J14446K31350j3m15426n47190k73251M9850J29794J02396
39299D15845K08052L47617K28542j33332l58889k24967J6482K1792j35896j23763
39289B61483Q2902J46132p3810k54427r2541K25839L02204R3214r1528o7259M5954
39278E78163J08750J47077J77688P9817k05140m71299m23951n7801K66404K07088
39268D06796j40335l33918j27551K27991L54404K55340J99462K01969J1215l49935
39258G05438m66176j57845J62790Q1959j89213j80910Q2622J72949j7764j39880
39248E3970Q591J90638J60513K3624L084J04368J62887N7958j94849m21959l76460
39237b27635l2137K67733K05323n0137j01230M6560N6359o5357P0023M67707N47265
$$ y = [1001895, 1055736, 1023889, 1138335, 1369685, 1369672, 954246, 407056, 133805, 183655, 313449, 415845, 623897, 971514, 1200056, 1066724, 707835, 482868, 499350, 521142, 385246, 261483, 344385, 490517, 416707, 162280, 69739, 295578, 597782, 690996, 599468, 532209, 578163, 686913, 833990, 1011678, 1091495, 886355, 415056, -8895, -66696, 199708, 406796, 266461, -67457, -195008, 32983, 387387, 642727, 842189, 1044158, 1055373, 705438, 239262, 81417, 244207, 326166, 136953, -43957, 38665, 211614, 193850, 53970, 62561, 253199, 413712, 437336, 440420, 544788, 707675, 765633, 570784, 148825, -227635, -259772, 7961, 213284, 163147, 61917, 108477, 164836, 99479, 169502, 637209, 1184474]
39226A184474K6958n20150m53957l4J43425j54544l95834k89647p0798J8758N1227
39215d60122J12962J02277j5840o4672P8489K95618M18073M15462L26480J88626
39205A397353Q6526P9916M9889j69576m66098n00751j79814J58163J72219n1818
39195E76009j75623q0496K4283q0400l45467n13046l92885o2911K07851K44604
39185e98081J30763M9954N1675P4449J13129K01889K77487K32971Q9788m3732
39175E80292j52981k73831l10669j37269J16496J45931r1334k70245j42285J40495
39165c95400K83984K33467J30681N6136K052p594N2833J16864R0017l1333j73920
39154C57787k53911j91799K7111K60521L08597J58031j3356j08223j90097k39002
$$ y = [1184474, 1211432, 691282, 237325, 237291, 380716, 226172, -169662, -459309, -530107, -511349, -460122, -347160, -244883, -260723, -325395, -246906, 48712, 466785, 882247, 1208727, 1397353, 1483879, 1563795, 1613684, 1444108, 978010, 477259, 297445, 455608, 627827, 576009, 400386, 319890, 344173, 263773, -81694, -594740, -987625, -1050536, -842685, -598081, -467318, -417364, -365689, -291240, -178111, 23778, 301265, 534236, 624024, 580292, 427311, 153480, -157189, -294458, -177962, -32031, -123365, -393610, -535895, -395400, -111416, 122051, 252732, 308868, 310920, 303326, 356159, 473023, 563040, 531707, 357787, 103876, -87923, -60812, 199709, 508306, 666337, 652981, 544758, 354661, 115659]
39144A15659r0240K32926L76652Q3602m04010o06018l58891Q8230M14466M65772
39134C18148K64703j1896j41713r6118o3117j24764j28768m3983j33725m68691
39124f29924n82063q0993O14660P18854J85461k44535j50094N3205q3027l18544
39114e17000k00221J82771L87101K91519J45761R5325M0926r7333k70096m04319
39104c45566m17257k34181K4733N3745k07401l54598m3418M45777N51226K29076
39094b97864k0883Q5121K69110K05230j0659r9386k2602N1747L3242k3705l2622
39083A36729N0418J69660J52230j06411m20105m73499k48342n7220p4415r5334
39073i66289Q9254L29980L48790J47065m9387j20102j00542j1041J37514K36474
$$ y = [115659, 25419, 258345, 634997, 718599, 314589, -291429, -650320, -562090, -147624, 318148, 582851, 570955, 429242, 333124, 270007, 145243, 16475, -27508, -161233, -629924, -1211987, -1292980, -678320, 40534, 225995, -18540, -168634, -115429, -198456, -517000, -717221, -534450, -147349, 144170, 289931, 385256, 426182, 328849, 58753, -345566, -762823, -997004, -972271, -918526, -1125927, -1480525, -1523943, -1078166, -526940, -297864, -318747, -233626, 35484, 240714, 230055, 130669, 108067, 159814, 193056, 169351, 136729, 187147, 356807, 509037, 402626, -17479, -490978, -739320, -796540, -870955, -966289, -877035, -547055, -198265, -51200, -100587, -220689, -321231, -332272, -194758, 41716]
39063D1716J82845L9986o9343j43563j98594j07742K02730M85742M05273K4599
39053H63649k39447j93192r8032k14709l86601k73757J58666N77937O46301L31334
39043A172149r9356l28903k72100j08406N295J49109M10092N69247L34596j38179
39033A693544l38128j05313J32449M341k94018l95083l08817k25588p9398K42988
39023C26977M72689K50514k39732m30848j67304J29861J46936N8835R6301J71325
39013H15554J45934J09893J49667J39292j647j05788m7070J5878p1234j59537
39003I90942n7298J08409P8905j27372k61362j96437j0251J78614K52585J01950
38993A058685j98973l53114j90325Q1413J82253J43690J38969J26938j1859j42800
$$ y = [41716, 224561, 264547, 195204, 51641, -146953, -254695, -51965, 433777, 839050, 863649, 624202, 431010, 332978, 118269, -268332, -542089, -383423, 194514, 840815, 1172149, 1072793, 743890, 471790, 363384, 368679, 517788, 927880, 1497127, 1831723, 1693544, 1355416, 1250103, 1382552, 1386893, 1092875, 697792, 388975, 163387, 83989, 326977, 799666, 1050180, 810448, 379600, 212296, 342157, 489093, 547928, 644229, 815554, 961488, 1071381, 1221048, 1360340, 1358693, 1252905, 1205835, 1221713, 1150479, 990942, 933644, 1042053, 1120958, 993586, 732224, 535787, 525536, 704150, 956735, 1058685, 859712, 506598, 316273, 397686, 579939, 723629, 862598, 989536, 977677, 834877]
38983H34877n3274J37722J26973p5930j88432j60185k16153l59371k66902J73876
38973d6799N91138N92647K45566q4199j76041j01401p8132k51383m91702m49375
38963b49681j3067L87104K70080j72649k87722R1437M19860K97274J7783J357
38953G61776J59258J81998O0338o6049k35967m50147m51205j39506R9907n0316
38943a29913k52611j7482M44465M92404N2996k95909k29366l1303L8133J11204
38933A82618K47120J62392k56882o11746n09815j06884J88130K71953K94308K86710
38923A47904J84103N6514M436o3392k59174m15364k54729J62846M37670L22182
38913C22996J5641j05229P9030L36564L62078J02968j85701k22610k2142J38585
$$ y = [834877, 781603, 919325, 1046298, 970368, 781936, 621751, 405598, 46227, -220675, -46799, 544339, 1136986, 1382552, 1298353, 1122312, 1020911, 942779, 691396, 199694, -249681, -262748, 124356, 394436, 221787, -65935, 25502, 445362, 742636, 760419, 761776, 921034, 1103032, 1163370, 1097321, 861354, 411207, -39998, -179504, -79597, -129913, -382524, -400006, 44459, 536863, 589859, 293950, 64584, 33281, 71414, 182618, 429738, 592130, 335248, -276498, -786313, -893197, -705067, -433114, -138806, 147904, 332007, 388521, 392957, 329565, 70391, -344973, -599702, -436856, 814, 322996, 338637, 233408, 312438, 649002, 1011080, 1114048, 928347, 705737, 683595, 822180]
38903H22180P6095j03504k19506k75001l56255l76494j35924L27523O16713L56514
38893G32341l14110p64705n07482K21954O78252M55652n8698k30321J0783J91961
38883D15627L5737k05409k16158n6842N4085J04866J75671J66732n1332l18063
38873A04914l16360k2547K18179J15149k33095m73207l54957N8645M37933M48869
38863a6477P7513l09956l35150k5478K48835K42019Q7146M8188J68310K67157
38853D52107J99407k71j98458k87997k26751l5761J95064L37569L16337J79482
38843I30728O0110N6939J49448K19020J55665k2964j49654o8222J40809J86763
38833A658642o9498l72933l86492j89155j75433m19538m91644j00668M05119N02357
$$ y = [822180, 898275, 794771, 575265, 300264, -55991, -432485, -568409, -240886, 375827, 732341, 418231, -346474, -853956, -632002, 46250, 501902, 443204, 212883, 223666, 415627, 451364, 245955, 29797, -27045, 27040, 131906, 307577, 474309, 422977, 104914, -211446, -233993, -15814, 99335, -133760, -606967, -961924, -903279, -465346, -16477, 61036, -248920, -584070, -609548, -360713, -118694, -31548, 16640, 184950, 452107, 651514, 651243, 452785, 164788, -61963, -97724, 97340, 434909, 751246, 930728, 990838, 1047777, 1197225, 1416245, 1571910, 1548946, 1399292, 1331070, 1471879, 1658642, 1589144, 1216211, 829719, 640564, 465131, 45593, -446051, -546719, -141600, 360757]
38823C60757K18287L46J8698M5548l3654o8054m2505j55140l54219k52651K48115
38812a4472O39504M48269p6471k82441L2730M21545L87039p4421n40443o24456
38802C16383l51114q9160o4095m2794K69835O30600M90646j30329n34452l34081
38792A61439r432q6792k70265J7346N93783P34266K77974j90231k68716j83638
38782G75734j82420j09791J42590K72501J4156l89237n01763k63359L7997J91671
38772a1921K16043K07576K41861L42889M13218K88029l3099l14457l47981j93508
38762H08650o8519q7530j85960k27519j31541N2302J83885J95348J66010J62189
38752H67315J10926l0596j18739m9842o727j90578m14099l20103M0551K44103
$$ y = [360757, 579044, 579390, 598088, 643636, 609982, 541928, 499423, 344283, -9936, -262587, -14472, 625032, 1073301, 996830, 714389, 747119, 1168664, 1555703, 1481282, 940839, 316383, -34731, -123891, -187986, -230780, 39055, 669655, 1160301, 1029972, 495520, 161439, 152007, 65215, -205050, -187704, 406079, 1140345, 1418319, 1228088, 959372, 775734, 593314, 483523, 626113, 898614, 912770, 523533, 21770, -241589, -203592, -11921, 204122, 411698, 653559, 996448, 1409666, 1697695, 1664596, 1350139, 1002158, 808650, 740131, 652601, 466641, 239122, 107581, 159883, 343768, 539116, 705126, 867315, 978241, 947645, 828906, 779064, 772337, 581759, 167660, -152443, -111892, 132211]
38742A32211J23238m8552p2019r1338j97484j78412R6903L85077M17813K71502
38732H38939J58822J16177J18872K29268L83077K99087j16446n09394n09630k25713
38722G83059m0794j05623k87625m23261l68966k1611M42184N81232K36270j84050
38712F10815k74420j98460k87955l82053j07289L76984N18893K06086j14744j63757
38702A84100j20610j29627o9688M4498l4146k80660l04433j2803J27862j67283
38692g62790m58699k24816L11365N15024K76327P9539K18505M46673M54328K72559
38682A128015P7379q2960k07599k29650j45002q8713j43502j97458j11242P8332
38672G7600K29665K75259K22396P2988j19412j84614K791L12362M68258L83348
$$ y = [132211, 255449, 206897, 134878, 43540, -153944, -332356, -235453, 149624, 567437, 838939, 997761, 1113938, 1232810, 1462078, 1845155, 2144242, 2027796, 1518402, 1008772, 783059, 742265, 636642, 349017, -74244, -443210, -464821, -22637, 558595, 794865, 610815, 336395, 137935, -150020, -532073, -639362, -262378, 256515, 462601, 347857, 184100, 63490, -66137, -135825, -91327, -125473, -406133, -710566, -723369, -595507, -762790, -1221489, -1446305, -1134940, -619916, -343589, -264050, -45545, 401128, 855456, 1128015, 1205394, 1122434, 914835, 685185, 540183, 451470, 307968, 110510, -732, 77600, 307265, 582524, 804920, 877908, 758496, 573882, 576673, 889035, 1357293, 1740641]
38662A740641K22897J09804k6877k11604k57359m8811J86071J66545n60j0945
38652A869802P5682j02827n30670o74450k53877K72603L43457P4280k7009J31378
38642A178369J97072R207k46341m55850o41149o13946j27954N20137O19793K7273
38632D66611n08162l62657Q6170J02167k49741k42902L26358P77916N42124l1769
38622I06115k25365K7998J37619k15389o01992m71858N0593L27505P2492l07923
38612c00205l33577q7059K7114o0513l8652K27948M68714M16941J52921r2910
38602C80722k36603k87300k07084j1198J39837J29650O7052J26253K90561L87324
38592G79214L06666P9986j80053l23989k41455N749K01566K04835P9591n2910
$$ y = [1740641, 1963538, 2073342, 2046465, 1834861, 1577502, 1528691, 1714762, 1881307, 1880747, 1869802, 1945484, 1842657, 1311987, 637537, 383660, 656263, 999720, 1074000, 1046991, 1178369, 1375441, 1384648, 1138307, 682457, 41308, -572638, -700592, -180455, 439338, 466611, -41551, -404208, -318038, -215871, -465612, -708514, -382156, 395760, 937884, 906115, 680750, 708748, 846367, 630978, 28986, -442872, -392279, -64774, 7718, -300205, -633782, -720841, -693727, -754240, -792892, -564944, -96230, 320711, 473632, 380722, 144119, -143181, -350265, -361463, -221626, -91976, -24924, 101329, 391890, 779214, 1085880, 1165866, 985813, 661824, 420369, 426118, 627684, 832519, 912110, 859200]
38582H59200j66117k58247k66608j53505K6252K11099L65125L90998K01270n7459
38572A152008q7371J30731K37207m101l52183m60904l59348k74315j96784R648
38562b05412K16043J50771j28121k58054q6423J65908K84519K96254K77723K21009
38552I34217J53681J29661N7579j84280m30509l60317k6365J19241j11287l26506
38542d4885j62041J42565J40863r9948j28618J45896L12364J20576j24542l3119
38532B69111K87617L98379J55039r9686o211L30252M55881J25940l75593n46554
38522I94175k47823J45778K10845k8184j88947n3926J75079J89722j4760j80403
38512A001556j61608p9628q0212j10176n2241L8276J4342q5971n3446J53468K79536
$$ y = [859200, 693083, 434836, 168228, 14723, 40975, 252074, 617199, 1008197, 1209467, 1152008, 1064637, 1195368, 1432575, 1428474, 1076291, 615387, 256039, -18276, -215060, -205412, 10631, 161402, 33281, -224773, -311196, -145288, 139231, 435485, 713208, 934217, 1087898, 1217559, 1275138, 1090858, 660349, 300032, 273667, 392908, 281621, -44885, -206926, -64361, 76502, -23446, -152064, -6168, 306196, 426772, 302230, 269111, 556728, 955107, 1110146, 1010460, 1004249, 1334501, 1790382, 1916322, 1540729, 994175, 746352, 892130, 1102975, 1074791, 885844, 831918, 1006997, 1196719, 1181959, 1001556, 839948, 760320, 680108, 569932, 517691, 555967, 570309, 484338, 430892, 584360, 863896]
38501H63896J08141k17763l72776k56309m9610P8008J28033J40251R0942j3246
38491D99567p7265m0465K2029n899j25521k09063j31643P9338K18758R4132j99589
38480A24379k92639L1634M86348N56741J30520l54596m58280k34279n1978q4386
38470a46536j68591j10959O1373J84229J70807P9018R005j3888l4856n4459K8436
38459C579K83625N69149N91261K12610l45990o76854n60365j57363J58027J60705
38449B38384j0791k5427K28892M74885L77933j1578l00695k36838J6632J39947
38439H91344M0371j22242j82335j21547k7403R106k4814n1704j9592k2326j83738
38428A85120m01630l90570q5146J86349J24943q7763l4498L01088M68284J93040
$$ y = [863896, 972037, 754274, 381498, 125189, 75579, 153587, 281620, 421871, 512813, 499567, 422302, 381837, 403866, 397967, 272446, 63383, -68260, 11078, 229836, 323968, 124379, -168260, -136626, 349722, 906463, 1036983, 682387, 224107, -10172, -62150, -146536, -315127, -426086, -364713, -180484, -9677, 69341, 78346, 64458, 29602, -24857, 3579, 287204, 856353, 1447614, 1660224, 1314234, 637380, 77015, -80348, 77679, 238384, 227593, 202166, 431058, 905943, 1283876, 1272298, 971603, 734765, 751397, 891344, 931715, 809473, 627138, 505591, 478188, 487294, 462480, 410776, 391184, 368858, 185120, -216510, -607080, -692226, -505877, -380934, -468697, -503195, -202107, 266177, 459217]
38418D59217k18304l18883j36917n5755j87288k20276M5654L38920L00811J7632
38408B4811j22775j1602P2632l1842q7532J43000M62154M71883J25625k20722
38398H25632k71191o1150K30134M86414O08990M96581K12795J9939Q5949K39444
38388B873537J56678k41697o83566q20044n40760l8449L73220N01738L77797J55291
38378B113745m2769j59495j65447q3617j4788k5817l8956L8815J03561m3923l50979
38367A330330m66481j60345L43261N88553L75955p0679l64647l03447j5234J64196
38357A421462P872l51459n38990l50416J9914K10018P5137k13275l81004k96991
38347c97732n3261J49503K15669K39248L16279L34762J14188k51615m02978j53869
$$ y = [459217, 240913, -77970, -214887, -270642, -457930, -678206, -632552, -293632, 7179, 24811, -97964, -109566, -36934, -68776, -156308, -13308, 448846, 920729, 1046354, 825632, 554441, 493291, 723425, 1209839, 1818829, 2315410, 2528205, 2548144, 2634093, 2873537, 3030215, 2788518, 2104952, 1284908, 744148, 705699, 1078919, 1580657, 1958454, 2113745, 2070976, 1911481, 1746034, 1662417, 1647629, 1621812, 1582856, 1621671, 1725232, 1681309, 1330330, 863849, 703504, 1046765, 1635318, 2011273, 1940594, 1575947, 1272500, 1257266, 1421462, 1429334, 1077875, 538885, 188469, 208383, 418401, 493538, 280263, -100741, -397732, -450993, -301490, -85821, 153427, 469706, 804468, 918656, 667041, 264063, 110194]
38337A10194K48486M25053K93020O2151q8087j72768k77025l78106l17512L1074
38327f3520N20898P40967M33492j36349m50024l69732k28841k50831k25283O9360
38317D0137M36411N16459K57580j12227l96864m95483l55609j01013l564q4091
38307b98264J6939M68248Q13341N27946j76835n89062m39283j17603K8462R6518
38297C30407K35738L23855K36185Q6262J616o8003j62264j80591p7527M1929J25760
38286H93367K32498L02230J54165j67998l37766j89416M9445J38443J66901L01481
38276A543350M29919L17983k3078l48785m66989l58002j16320J01336J75603J56480
38266A411497J70413J64718m4081m07884n98402m44010j57033K3164J46111L21286
$$ y = [110194, 358680, 783733, 1076753, 1138904, 1050817, 878049, 601024, 222918, -94594, -63520, 457378, 1198345, 1631837, 1495488, 1045464, 675732, 446891, 196060, -29223, 40137, 476548, 993007, 1250587, 1138360, 741496, 246013, -109596, -210609, -214173, -298264, -281325, 186923, 1000264, 1528210, 1351375, 762313, 323030, 205427, 233889, 330407, 566145, 890000, 1126185, 1212447, 1214063, 1146060, 983796, 803205, 725678, 767607, 893367, 1125865, 1428095, 1582260, 1414262, 1076496, 887080, 936525, 1074968, 1241869, 1543350, 1973269, 2291252, 2268174, 1919389, 1452400, 1094398, 978078, 1079414, 1255017, 1411497, 1581910, 1746628, 1702547, 1294663, 696261, 252251, 95218, 118382, 264493, 585779]
38256E85779M37239L52343J59381K4165o0451j46064j44267M388J50098J34455
38246A497066N387j37286k86450l42802q7875M01220O28513L08618j75013l23532
38236A487846k33437k87175m14391k52889J15834K30552J5501j32967o1834n6124
38226D10916k10912k16171K5989J39787p5641k41815m371L83935M80115L04426
38216I96258J62429R3945n9432k26662j91081j8279o404k15672l68588k55539
38206h9025N192J63388J20103k9491j29082j11471n0229k8219K3508K11747M05385
38195D91806L11951p8202l77952l01472m7771K2777j08409j82402o7057J53147
38185a83584L60193M41332K82688l1214j56319R5422M11564L60722Q487k02480
$$ y = [585779, 1023018, 1375361, 1534742, 1558907, 1498456, 1352392, 1208125, 1212513, 1362611, 1497066, 1502453, 1365167, 1078717, 735915, 648040, 1049260, 1677773, 1986391, 1811378, 1487846, 1254409, 967234, 552843, 299954, 415788, 646340, 661841, 528874, 467040, 410916, 200004, -16167, 9822, 149609, 73968, -167847, -172218, 211717, 691832, 996258, 1158687, 1252632, 1193200, 966538, 775457, 757178, 750774, 535102, 166514, -89025, -83833, 79555, 199658, 170167, 41085, -70386, -120615, -148834, -125326, 86421, 491806, 803757, 725555, 347603, 46131, -1640, 21137, -87272, -269674, -336731, -183584, 176609, 617941, 900629, 869415, 713096, 808518, 1220082, 1580804, 1589291, 1386811]
38175A386811j29290r1140l09147n50580m83677j35726J72728K21966J15471J54522
38165C51938M73490P63741N33632k05870p66160o05346r1015K7276k65930k97971
38155h2215J32607L83926K3340m30509l04939K05103M11223J83560j0880O4329
38145E75545J87112K30196L37495M72235L37714p0324k99166q4320K09378R4867
38135A990732l52817o35124m89775j17767J60302K05659M0266k35611m38897l70645
38125b43677j191M39314O24241M29503P4228r2738J0563R3436j16010m55305m92947
38114B69417j05713L19020L40790l2101m02360m29610j20503K30775L05625M8123
38104D23463k43748k03808J72795M98950M49864J06830k28962l92667l89250k34473
$$ y = [1386811, 1257521, 1166381, 857234, 306654, -177023, -312749, -140021, 81945, 197416, 351938, 825428, 1589169, 2122801, 1916931, 1150771, 545425, 454410, 481686, 215756, -82215, 50392, 434318, 457658, 27149, -277790, -72687, 338536, 522096, 511216, 575545, 762657, 992853, 1330348, 1802583, 2140297, 2069973, 1770807, 1686487, 1895865, 1990732, 1637915, 1002791, 513016, 395249, 555551, 761210, 801476, 565865, 126968, -243677, -244868, 194446, 818687, 1248190, 1322418, 1229680, 1240243, 1333679, 1217669, 762364, 269417, 163704, 482724, 823514, 791413, 389053, -40557, -161060, 69715, 375340, 423463, 179715, -24093, 148702, 647652, 1097516, 1204346, 975384, 582717, 193467, -41006]
38094d1006L1578K53928K76495J18758q0590k25563k58337j25286Q1323R2977
38084A24277j79135l80235j26305L77016N19838J46082j86377r98M07169M12715
38074A114047m5150m20776l49042p5164p251j54183k14716n3243J50588J94858
38064A39968J04725K6416p772q9249k34524l02849j81610J5238N0595j21011k45145
38053h45218n4978L71705O43157M80294M8248k25984j50808M5151Q3128K3597
38043D18292Q9089K09449P5127l07795m76793j40683L46579M49835J70236p0796
38033G62540j03496j22649j93978j36286M5885Q5973m2307Q78L21702M99700K13398
38022A331360k11454k68158L988J80758J23209L7583N746q1137j69973o7050J62900
$$ y = [-41006, -9428, 244500, 520995, 639753, 559163, 333600, 75263, -50023, 31300, 124277, -54858, -435093, -561398, -184382, 335456, 481538, 295161, 294163, 701332, 1114047, 1068897, 648121, 299079, 223915, 216664, 62481, -152235, -205478, -54890, 139968, 244693, 271109, 263337, 174088, -60436, -363285, -544895, -529657, -479062, -600073, -845218, -900196, -528491, 114666, 594960, 643208, 417224, 266416, 311567, 394695, 418292, 507381, 716830, 791957, 484162, 7369, -133314, 213265, 663100, 833336, 762540, 659044, 536395, 342417, 206131, 252016, 337989, 295682, 296560, 618262, 1117962, 1331360, 1119906, 851748, 855736, 1036494, 1159703, 1197286, 1203032, 1121895, 951922, 884872, 1047772]
38011A047772K06278k6801k69842l01902j76764J775K13618L48788K20999j07178
38001A156743k86038j23974J48441K03758J6862j89016k26791p3384J27900J29275
37991H83776j69818m84381l90189J16965N57299N55430K28991j11810l34785l85149
37981D66329j54947K65288M77755K49522j10073j73914j0856O474j32271n9498
37971H23809L17049N88040M19903L0601j24927N6116K61520J94310j11179l96182
37961B059060m89213m49622m03834l16258n2851L20893M96953L03018l3256j75220
37951A259670j10997q5796j87021k44619j36566K9356Q8703K7249k7203O0146
37941F72922K81930M16167K17792k08356m03804j29369K46823K39297l9791p6498
$$ y = [1047772, 1254050, 1227249, 957407, 655505, 478741, 480516, 694134, 1042922, 1263921, 1156743, 870705, 746731, 895172, 1098930, 1115792, 926776, 699985, 626601, 754501, 883776, 713958, 229577, -160612, -43647, 513652, 1069082, 1298073, 1186263, 851478, 466329, 311382, 576670, 1054425, 1303947, 1193874, 1019960, 1009104, 1015578, 883307, 823809, 1140858, 1728898, 2148801, 2179402, 2054475, 2110591, 2372111, 2566421, 2455242, 2059060, 1569847, 1120225, 716391, 400133, 347282, 668175, 1165128, 1468146, 1434890, 1259670, 1148673, 1062877, 875856, 631237, 494671, 524027, 612730, 639979, 612776, 672922, 954852, 1371019, 1588811, 1380455, 976651, 847282, 1094105, 1333402, 1293611, 1217113]
37931A217113K03581L00230n4301m46209l93806k2672K00798J34156P679j6111
37921A130458K991j2130n8103j08817r3934Q0166L26979L58170P5357j93650j22515
37910A384972J13190J03491j43336k19721K8441K84517K75610J18322M243j02563
37900A847166k38559k25219L5651K91135K82031J82521L32806O24422N59679j8063
37890C673570o15646o92948l20557K664L4937J1704J94171M59965M86015K18320
37880C452195k0574Q7055M82765Q17603Q47201O39777M06036K46853J26507K435
37870G087853j15543j98231k18694j79249j70231l18735n78578o69370m01488
37861D237734m390R8990j49209l65964k79508p7060m5635j45205j96388k50569
$$ y = [1217113, 1420694, 1720924, 1666623, 1220414, 826608, 803936, 1004734, 1138890, 1146569, 1130458, 1133449, 1121319, 1063216, 954399, 860465, 940631, 1267610, 1625780, 1701137, 1507487, 1384972, 1498162, 1601653, 1458317, 1238596, 1267037, 1551554, 1827164, 1945486, 1949729, 1847166, 1608607, 1383388, 1419039, 1710174, 1992205, 2174726, 2507532, 3131954, 3691633, 3673570, 3057924, 2364976, 2044419, 2047083, 2082020, 2093724, 2287895, 2747860, 3233875, 3452195, 3431621, 3518676, 4001441, 4819044, 5666245, 6306022, 6712058, 6958911, 7085418, 7087853, 6972310, 6774079, 6555385, 6376136, 6205905, 5887170, 5308592, 4639222, 4237734, 4233344, 4332334, 4183125, 3817161, 3537653, 3460593, 3414958, 3269753, 3073365, 2822796]
37851B822796m15909m81993j62316L33546M48529Q3714k10138m0496K70562K50971
37841B899266J4105m658K18196L24187K13627J53704K46660K58200P3571q1400
37831D315458l0244Q1532P7069J6239n540m6794j10956k3301K42385L70573J34657
37820E021078j86071j59881J68205L64477K54134J05451J50169K78874L23283
37811F319719L42220M47700N49678M74912K48363J04998K38722N88549Q41766
37802A0156627O75913J11057l89647l26642K96835R85604J322209J338972J274290
37793A5445218J211880J147251J221699J604409K173075K562304K618052K666126
37785C0650014L205744M352483N671397O635725P234099P977364R210389J0623121
$$ y = [2822796, 2406887, 1924894, 1762578, 2096124, 2544653, 2628367, 2418229, 2377733, 2648295, 2899266, 2913371, 2908713, 3126909, 3451096, 3664723, 3818427, 4065087, 4323287, 4396858, 4315458, 4285214, 4366746, 4443815, 4460054, 4454514, 4407720, 4296764, 4273463, 4515848, 4886421, 5021078, 4835007, 4675126, 4843331, 5207808, 5461942, 5567393, 5717562, 5996436, 6319719, 6661939, 7109639, 7659317, 8134229, 8382592, 8487590, 8726312, 9314861, 10156627, 10832540, 10943597, 10553950, 10227308, 10524143, 11509747, 12831956, 14170928, 15445218, 16657098, 17804349, 19026048, 20630457, 22803532, 25365836, 27983888, 30650014, 33855758, 38208241, 43879638, 50515363, 57749462, 65726826, 74937215, 85560336]
37777H5560336J1760474J2930025J5141282J9032109K4345183L0684441L8018597
37770B37472447M5492641M9984069M7127467L4666699J4722640p399555k6349624
37763C95716784l8848282m3983713m2817538l7817936l1724205k6230462k1678814
37756A52615834j7901590j4950674j2927055j1581810j0473951r377840q306498
37749F7096416p271685o248659n301988m550543m021385l642020l332384l030873
37741B9696879k704028k396323k171660j947907j544506j004372o89455q52097
37733A6386531j228348j303324r44170n27221m07330m91123m55340k31313r3379
37724A0704983k90055p21831j041008j012805p03562l32981n9679L4450j05760
$$ y = [85560336, 97320810, 110250835, 125392117, 144424226, 168769409, 199453850, 237472447, 282965088, 332949157, 380076624, 414743323, 429465963, 422066408, 395716784, 356868502, 312884789, 270067251, 232249315, 200525110, 174294648, 152615834, 134714244, 119763570, 106836515, 95254705, 84780754, 75402914, 67096416, 59824731, 53576072, 48274084, 43723541, 39702156, 36060136, 32727752, 29696879, 26992851, 24596528, 22424868, 20476961, 18932455, 17928083, 17238628, 16386531, 15158183, 13854859, 12910689, 12383468, 11976138, 11485015, 11029675, 10798362, 10704983, 10414928, 9693097, 8652089, 7639284, 6935722, 6602741, 6543062, 6577512, 6471752]
37715F471752m03903n86859m58490k15941k28602m78093n33392j90431K05008
37706C581049K82734J67420J62577K03213L6777k44160l22268k21939k69836m82455
37696B893112m80617j23923K23092K48973J18884R5191R3602o3198k29899j54962
37686B620255M6704J6919k86537m80455k69023J61067L70831J84524j30782j94203
37676B039300M7959L01338L56678L64869N07487N72521K19823l67294n39802l8887
37666C463992O04026P76934N58151M44549N79550O66645N18099K81179J29184
37657H022309M9444l4375j70042m08894p14970q60712o34881j54435K21407K73678
37647E588529N4953k89080o09082p26067n77060l70829l52683m34568l30502n2292
$$ y = [6471752, 6067849, 5480990, 5022500, 4806559, 4577957, 4099864, 3566472, 3376041, 3581049, 3863783, 4031203, 4193780, 4396993, 4433770, 4189610, 3867342, 3645403, 3375567, 2893112, 2412495, 2288572, 2511664, 2760637, 2879521, 2974712, 3068314, 3005116, 2775217, 2620255, 2666959, 2683878, 2397341, 1916886, 1647863, 1808930, 2179761, 2364285, 2233503, 2039300, 2087259, 2388597, 2745275, 3110144, 3617631, 4190152, 4409975, 4042681, 3502879, 3463992, 4068018, 4844952, 5403103, 5847652, 6427202, 7093847, 7611946, 7893125, 8022309, 8071753, 8037378, 7867336, 7458442, 6743472, 5882760, 5247879, 5093444, 5314851, 5588529, 5643482, 5354402, 4745320, 4019253, 3442193, 3071364, 2718681, 2284113, 1953611, 1901319]
37637A901319N5867j45302l34635j77746K11047M49718L66861J10391j14408k39335
37627B083777l04593l55908l73810k80747n5590J76636K60918K05134J38660Q8220
37617A582697n1890l01081n00653n02719l32054j09981P2561J65963J59352J12766
37607B94961R9182R5151L0943m8994p073J83501L76821M17935K66066k8792l41255
37596A338446m89353l97848k22222j42971q6100J26297L91037L95093J08682j09231
37586I11830m616K58388M03346L76988K31765k7451k82283k84509n2960J113l33589
37575A198022o12716k92557M20825P55430L87505j78120l34807q9518J32165R3124
37565A479353q9979k12162j76510k943J81756K00956J2090j85499j43041J30433
$$ y = [1901319, 1957186, 1811884, 1477249, 1299503, 1510550, 1960268, 2327129, 2437520, 2323112, 2083777, 1779184, 1423276, 1049466, 768719, 713129, 889765, 1150683, 1355817, 1494477, 1582697, 1530807, 1229726, 729073, 226354, -105700, -215681, -143120, 22843, 182195, 294961, 394143, 489294, 520237, 471243, 464170, 647671, 1024492, 1442427, 1708493, 1679701, 1338446, 849093, 451245, 229023, 86052, -48, 126249, 517286, 912379, 1021061, 911830, 907214, 1165602, 1568948, 1945936, 2177701, 2150250, 1867967, 1583458, 1530498, 1531611, 1198022, 585306, 292749, 713574, 1469004, 1856509, 1678389, 1343582, 1254064, 1386229, 1479353, 1389374, 1177212, 1000702, 997759, 1179515, 1380471, 1392561, 1207062, 1064021, 1194454]
37555A194454L46934K58927o3586l25623l36750j70343M266J35884K50206K76323
37545A570692Q0828l00496o04786n99832l31454n3640L9462k6115o7327N3554
37535b39114K61567L38514K14517R4286J52396K20169M1781k18407j06997L94310
37525A153022O87856L57009k01895l19047J4800K05646m9512m01190m42907k45914
37515G57868j01829m2221R7911K86504K61934p7197m42987m44877n8150L14898
37505E51854L01589j6403k54985k40584j68298k29023l21706k65473r3955M4712
37495f92272J22280J66430J05402r3110k36865j13480J83819L71286L62884L06851
37485D83225K87037K52202K14860K30243J67679j75287o44870p38638k36065M12799
$$ y = [1194454, 1541388, 1800315, 1736729, 1411106, 1074356, 904013, 908279, 1044163, 1294369, 1570692, 1651520, 1351024, 746238, 146406, -185048, -238688, -199226, -225341, -292668, -239114, 22453, 360967, 575484, 669770, 822166, 1042335, 1084116, 865709, 758712, 1153022, 1840878, 2197887, 1995992, 1676945, 1691745, 1897391, 1847879, 1446689, 1003782, 757868, 656039, 613818, 711729, 998233, 1260167, 1182970, 739983, 295106, 236956, 551854, 853443, 837040, 582055, 341471, 173173, -55850, -377556, -643029, -736984, -692272, -569992, -403562, -298160, -391270, -628135, -741615, -557796, -186510, 176374, 483225, 770262, 1022464, 1237324, 1467567, 1635246, 1459959, 815089, 76451, -159614, 253185]
37475B53185N74128J80243k39299k29102J03056L09752J59428j54603l17428k62326
37465C77034j56410j11018p6448k0043j0668n2685k2045J21287K39927K65825
37455E54756L25188M38859L48861p3493m70553m26616j03691k0033k66773m15238
37445a08733k30089M978R824p9124l8133O1667O2846K6665N4861L4932j48646
37434c48952l11931j73712K12300M72708L55699l794k62132k09557O4956K98718
37424I4303L34131K39116J25579k6245k28568l13049j38016J20647J63741r212
37414C62427j69226k64585l79967l57504N0798O18507P64726L67738p2976k55442
37404F64496m50000p71251p41466q7417N94162O15870K21286J23745L46905L12052
$$ y = [253185, 827313, 1007556, 768257, 539155, 642211, 951963, 1111391, 956788, 639360, 377034, 220624, 109606, 33158, 13115, 2447, -50238, -72283, 49004, 288931, 554756, 879944, 1318803, 1667664, 1594171, 1123618, 697002, 593311, 573278, 306505, -108733, -338822, -333844, -324020, -403144, -441277, -379610, -316764, -290099, -235238, -200306, -348952, -660883, -834595, -622295, -149587, 206112, 202318, -59814, -269371, -204415, 94303, 428434, 667550, 793129, 766884, 538316, 225267, 87251, 207898, 371639, 362427, 193201, -71384, -451351, -808855, -758057, -139550, 625176, 992914, 919938, 664496, 214496, -556755, -1298221, -1385638, -791476, -175606, 45680, 169425, 516330, 828382]
37394H28382q4890l09567j32869J8829j68637m18268l91755j70421M2866K36806
37384e49524L51281J61767k96361n65883l56289J7774J14086k91M2180K74337
37374h06923L79266K31022P4024J26895K91910L52488K70225J69280J24884Q0180
37364A293251l8573j98370l00136l26457l70030m67697m77159k21343K51959O33419
37354b21136O08966J65360l37616m57911j42103J62320O3218j83986K782O00695
37344B60589Q73004M20582j79129k21564R1391P6553l02994m75322k71894j16786
37334A54430j84902j42508J10034J65343j36160l27404n8962L30274L86926K10098
37324E07169J33781J64926J53516J48937J86573P4130k26174l73078j91952l4518
$$ y = [828382, 743492, 433925, 301056, 319885, 151248, -267020, -658775, -829196, -786330, -549524, -198243, -36476, -332837, -898720, -1255009, -1237235, -1123149, -1123440, -1081260, -806923, -427657, -196635, -122611, 4284, 296194, 648682, 918907, 1088187, 1213071, 1293251, 1254678, 1056308, 756172, 429715, 59685, -408012, -885171, -1106514, -854555, -221136, 387830, 553190, 215574, -242337, -384440, -222120, -158902, -342888, -340106, 260589, 1133593, 1554175, 1375046, 1153482, 1244873, 1321426, 1018432, 543110, 271216, 154430, -30472, -172980, -62946, 102397, -33763, -361167, -420129, -89855, 297071, 507169, 640950, 805876, 959392, 1108329, 1294902, 1369032, 1142858, 769780, 577828, 543310]
37314E43310j58709k10158J18812L65681l6560o91809o77715O8653O29688M20981
37304C72174j28637l73385k56877o5757P4474J55554J35294P6099J27181K28522
37294C44642J55701n4290r5514R7735K30475J36881j9546j34774l01463m32760
37284g2913k47913J76199L50187J17934o0801J15303K68597K0431l08483k18526
37274A40015J32724K09629m8247k40777k07024j48707j47888p6457N5795J09042
37264b21895J18179J88170J91762L848j06047J61435M88871K75524l87805p24917
37254a2875l66848J87075L93666L39866L00612J94232j10907l87788l80074k15712
37244e8753j28134q2316j7442j03794l64917m04533K1063M80995M49966J30878
$$ y = [543310, 384601, 174443, 293255, 658936, 622376, -69433, -747148, -678495, -48807, 372174, 243537, -129848, -386725, -452482, -378008, -222454, -87160, -11061, 116120, 344642, 500343, 446053, 350539, 448274, 678749, 815630, 796084, 661310, 359847, -72913, -320826, -144627, 205560, 323494, 262693, 377996, 646593, 667024, 358541, 140015, 272739, 482368, 434121, 193344, -13680, -162387, -310275, -386732, -330937, -221895, -103716, 84454, 276216, 280064, 174017, 335452, 824323, 1099847, 712042, -12875, -379723, -192648, 201018, 540884, 841496, 1035728, 924821, 537033, 156959, -58753, -186887, -269203, -286645, -390439, -755356, -1159889, -1138826, -657831, -207865, -76987]
37234g6987R5256L16764K61797j30682l01266m097L03769K46291R1098J84671
37224I86614L33469J73969k07879m59511n05889n05321m52032k20681R5390K41019
37214e20852J56028Q903p9371j12609p5357O2736K28142L06294K76667J51531
37204D02112r6392l64456l39033J33145O80904P33031K16539l36388m23834r3318
37194E12310K29350K33474l5901k96638l18274j52779o5307j78921k87633j50108
37184e10427J45865L02940K13749L7188n2029J4779K38034M76135M37431K7213
37174A330878l91253m03673j22834J5708n1895r700J65237J01299k54380m06402
37164b7015q6421K66830J96256n7589o242K81868L64196J69509J8100L7835O6519
$$ y = [-76987, 18269, 335033, 596830, 466148, 164882, 160785, 464554, 710845, 801943, 986614, 1320083, 1494052, 1286173, 826662, 320773, -184548, -636580, -857261, -761871, -520852, -364824, -355921, -435292, -547901, -623258, -560522, -332380, -26086, 250581, 402112, 305720, -58736, -397769, -264624, 416280, 1149311, 1365850, 1029462, 605628, 512310, 741660, 975134, 939233, 642595, 324321, 171542, 106235, -72686, -360319, -510427, -364562, -61622, 152127, 189315, 137286, 152065, 390099, 866234, 1303665, 1330878, 939625, 535952, 413118, 428826, 376931, 367231, 532468, 633767, 379387, -27015, -113436, 153394, 349650, 292061, 285819, 567687, 931883, 1101392, 1119492, 1157327, 1223846]
37153A223846M9980O2884K574k56342m46899j66567M21697O65748L15870j47157
37143A725634k49386j26561j35647k65379k65814r0031J12080K57258L29094K77150
37133A568398J36081P9311J43280Q1375k60178n90088n03521p8824J80395J8598
37123G74827k40550j56793K24182M28802J84719j97572k11619J56924L82281J24867
37113A470068k81429l36624j25738j22635l63676l81065k7296K29752Q5926q2537
37103F4746J12786L67049J87645k42840l34104k5125J86250Q7535l556J04772
37093E05158J68092J7525j29551r6090m6483j09474q9049J55968L69552K57065
37083A002713n3657k11395j21566L0143P2203n5149l22225n23135l70438R4362
$$ y = [1223846, 1273826, 1336710, 1339284, 1082942, 636043, 469476, 891173, 1556921, 1872791, 1725634, 1476248, 1349687, 1214040, 948661, 682847, 592816, 704896, 962154, 1291248, 1568398, 1704479, 1783790, 1927070, 2008445, 1748267, 1158179, 654658, 575834, 756229, 774827, 534277, 377484, 601666, 1030468, 1215187, 1017615, 805996, 962920, 1345201, 1470068, 1188639, 852015, 726277, 603642, 239966, -141099, -168395, 61357, 147283, 64746, 177532, 544581, 732226, 489386, 155282, 130157, 316407, 403942, 400386, 505158, 673250, 690775, 561224, 465134, 418651, 309177, 220128, 376096, 745648, 1002713, 949056, 737661, 616095, 646238, 718441, 663292, 341067, -182068, -552506, -458144]
37073d58144M05164K56320l8404K256L20809M67664L15672J68879J82124J33160
37063A755500j23715l60861l10770l1239K20944K87534J68604m2266j99247k28752
37053A135732k38599l38078l87747j84084J33050J96384k5822j58383j3070J53048
37043B72431J51441J96613M25551M96134J02348m16805m89984j45310Q9613Q801
37033F90833r6576o5530r7386k36735j70368K08625M82996K93295j02929k27036
37023F79189q1939m4537j96747k03073J24883N09759N82521L25786q412k44618
37013A442812l64544l47116j51826J13589J94601j4894k80176k92743q7036J1902
37003B24569j21349k18596m0125K40784K96298J10717q0628j84554k65175k52554
$$ y = [-458144, -52980, 203340, 164936, 167192, 488001, 955665, 1271337, 1440216, 1622340, 1755500, 1631785, 1270924, 960154, 928915, 1149859, 1437393, 1605997, 1563731, 1364484, 1135732, 897133, 559055, 171308, -12776, 120274, 316658, 290836, 132453, 119383, 272431, 423872, 620485, 1046036, 1542170, 1644518, 1227713, 737729, 592419, 682032, 690833, 594257, 528727, 431341, 194606, 24238, 232863, 715859, 1009154, 906225, 679189, 597250, 552713, 355966, 152893, 277776, 787535, 1370056, 1695842, 1687430, 1442812, 1078268, 731152, 579326, 692915, 887516, 872622, 592446, 299703, 212667, 224569, 103220, -115376, -155501, 85283, 381581, 492298, 411670, 227116, -38059, -290613]
36993b90613m898L37080M25372K04105O86L0104J39543J52938J18446O5399j16038
36982A062124l42820k55986K38555O63531N42384K7673l70392m42730l21496j02875
36972F97968J57209K48440L9859k08323j77440j9465j12101l82833l86529m9301
36962a92516J95323J10803n284J18743K74230J54503j40584k84831j97047o6267
36952c2927l5493o8628o8691p184L5434m0706j61301q9953J94842L10759k0507
36941A5645m32920l43092J55164L86685J34311n2305J96603M55125K37789j91553
36931E61452k80588n8419L8221o5587q8476j4154j14463l77885m40649j46671
36921i87219K47360M85154N55553M79218K27532n9405j16770O8322K10866J50737
$$ y = [-290613, -295511, 41569, 466941, 671046, 671732, 701836, 841379, 994317, 1112763, 1178162, 1062124, 719304, 463318, 701873, 1365404, 1907788, 1935461, 1565069, 1122339, 800843, 697968, 855177, 1103617, 1143476, 935153, 757713, 738248, 626147, 243314, -143215, -192516, 2807, 113610, 108326, 227069, 501299, 655802, 515218, 230387, 33340, -32927, -68420, -137048, -205739, -212923, -177489, -218195, -379496, -469449, -274607, 36152, 15645, -417275, -760367, -605203, -218518, -84207, -136512, 60091, 515216, 753005, 561452, 280864, 222445, 260666, 195079, 106603, 92449, -22014, -399899, -840548, -987219, -739859, -254705, 300848, 780066, 1007598, 948193, 831423, 899745, 1110611, 1261348]
36911A261348L5644j3060j08166l10638m15280k52807j9819n7164l71417n80010
36901h31369l52543J89701N54770L75483j65296m84793k58640J82103K87500K2741
36891d80343j25423J14399L99073K89505j02492k93506j35309J1280j28489k88477
36881g39782m9976M75051O99276L48954j34420k00154O8189J70483j3359j19616
36871E04646J2392P9354q7300j70097O1112K66164P0585k64114k38704N6204J02325
36860C92567j78244l39101k02889j23420l10219m47110k41349R6229K23010J65721
36850i64805J40051J48272P4856j2336M6302K25826L61760L80858L16951J95128
36840I12863M4715o1617q6423n7556J6106J12377P7340k16253n46842m89361j3318
$$ y = [1261348, 1296992, 1283932, 1175766, 865128, 449848, 197041, 177222, 120058, -251359, -831369, -1183912, -994211, -439441, -63958, -229254, -714047, -972687, -790584, -503084, -480343, -605766, -491367, -92294, 197211, 94719, -198787, -334096, -322816, -451305, -739782, -789758, -314707, 384569, 733523, 599103, 398949, 467138, 637621, 624262, 504646, 517038, 596392, 509092, 338995, 400107, 666271, 736856, 472742, 234038, 290242, 392567, 214323, -124778, -327667, -451087, -761306, -1208416, -1449765, -1353536, -1130526, -964805, -824754, -676482, -601626, -613962, -567660, -341834, 19926, 400784, 717735, 912863, 957578, 895961, 809538, 751982, 768088, 880465, 957805, 741552, 194710, -294651, -307969]
36829c07969L76814K97375j3354j02451O2075J81609J39466N9912k0480j80270
36819D92727l54308l62139j99992n2020p412J1844M7191M4556M158r032q825n3409
36807d46661p1211P0748K96911L31665O3692k53319k73881M2708L84521M01113
36797E46286L7269m20673o25475m92849k02936Q9345L87338O47961O65491L58381
36787I90138K3295L1987L17830M30906J34524k99789m85997l98842k92696k86128
36777A65228k44461o2619J29668J47561L3816R566J50761K76640K33188J27530
36767I66878J27705J69570R7927J756R0517K53023J22349l12601n49472k57622
36757G10030K15733L38317J13272p5824j25632k53641m65540m71468k00280K2027
$$ y = [-307969, 68845, 366220, 352866, 250415, 312490, 494099, 633565, 693477, 672997, 492727, 138419, -223720, -423712, -475732, -483144, -471300, -424109, -379553, -375395, -384427, -393252, -446661, -517872, -447124, -150213, 181452, 245144, -8175, -282056, -239348, 145173, 546286, 583555, 162882, -462593, -955442, -1158378, -1069033, -681695, -33734, 631757, 990138, 1013433, 1045420, 1363250, 1794156, 1928680, 1628891, 1142894, 744052, 451356, 165228, -79233, -141852, -12184, 135377, 169193, 178759, 329520, 606160, 839348, 966878, 1094583, 1264153, 1362080, 1363836, 1454353, 1707376, 1829725, 1517124, 967652, 710030, 925763, 1264080, 1377352, 1301528, 1175896, 922255, 456715, -14753, -215033, -193006]
36747a93006l6731j73583r1974J63804L22354K64343R9438k5356m1467L8921J22666
36736D49409J08096L6761P5748K55864L36002P5625m06114o98530n53952j65717
36726d86808P4086L3125m5971J01016L99506N29914L33624p258k03452j46291
36716E81491O1867K28451J79369j02130l76668l45871l5920J85083Q1798j48013
36706C09457j97293o5883O0278J49862K64003L00769J29190j00355j15627L4030
36696G68431L2088j83886k97570j06897J65968K15328O1111o7355q5169r8109
36686D03940j81509k63248k11017J7204K84293L55431J49432j25831k04282q3548
36676A40865L2326N8566Q8970J42799R9308n1460j16930J9867J97883J91588K0492
$$ y = [-193006, -229737, -403320, -495294, -331490, -9136, 255207, 354645, 329289, 287822, 326743, 449409, 557505, 594266, 670014, 925878, 1261880, 1337505, 931391, 232861, -321091, -486808, -412722, -379597, -425568, -324552, 74954, 604868, 938492, 931234, 727782, 581491, 643358, 871809, 1051178, 949048, 572380, 226509, 190589, 375672, 457470, 309457, 112164, 46281, 106559, 256421, 520424, 821193, 950383, 850028, 734401, 768431, 800519, 616633, 319063, 212166, 378134, 593462, 654573, 587218, 502049, 403940, 222431, -40817, -251834, -234630, 49663, 405094, 554526, 428695, 224413, 140865, 173191, 231757, 320727, 463526, 562834, 511374, 394444, 414311, 612194, 803782, 824274]
36665H24274q6390M375J54654J09319j75264m00307k37374K10576M51947K21287
36655A077097j65222k68264j17837m6940j16937j02506M0648J18041J01342J73799
36645F93221L14243K38940j20464m32216m00447r8157K33139M22630L41801k2367
36635A170323l76684l62607q6578j9962k58134l39927l972L59205L20622M0432
36625D42718r8906j07473k00290l00152j97777l30L0860m7899L3489K74621L93383
36614B22244K50470m597j55094p5493K04478M12794K27174k39216m33480j11680
36604B97600K52007J60128j77832k79833j90910k47935l45437j54891J09835n1517
36594f28785m50992l48069L14659O69618K39734k91216j28110M57892O39907K80004
$$ y = [824274, 737884, 742259, 896913, 1006232, 830968, 430661, 193287, 403863, 855810, 1077097, 911875, 643611, 525774, 478834, 361897, 259391, 300039, 418080, 519422, 693221, 1007464, 1246404, 1125940, 693724, 293277, 195120, 428259, 850889, 1192690, 1170323, 793639, 431032, 344454, 324492, 66358, -273569, -277541, 81664, 402286, 442718, 343812, 236339, 36049, -264103, -461880, -462210, -431350, -479249, -445760, -171139, 222244, 472714, 468117, 313023, 237530, 442008, 854802, 1081976, 842760, 409280, 297600, 549607, 709735, 531903, 252070, 61160, -186775, -532212, -687103, -577268, -628785, -1079777, -1427846, -1113187, -443569, -203835, -495051, -623161, -165269, 474638, 754642]
36584G54642l8570p231N9283j19199l36065k84194m8646J9684k09451m57515l50933
36573a018195J30436N92975O68530M22340J82573N8354j18182l90337n34256m14363
36563d20125k05108j10429q9495j9979O6186Q0355N0766M7617O9539J14755K12975
36552b02943K94857K15616J1169p5803N3433J95105J71881Q3670O2170K8229q5314
36541G52070j16864L5330J21603j21587m87312n18447j49661K22362L01948J88235
36531B27677O1266r2175l01583m22269l15933p5482R4336J30682J18516J17675
36521d57290J16135J22117J77004K55143K38301M7764k27592l88078l15357p9706
36511e11559J44795K31085J61578J1510q9379m9814O5513Q1196n4730j72359j15910
$$ y = [754642, 716072, 708841, 768124, 648925, 312860, 28666, -19980, -296, -209747, -667262, -1018195, -887759, -294784, 373746, 796086, 978659, 1037013, 918831, 528494, -5762, -420125, -625233, -735662, -825157, -845136, -778950, -698595, -647829, -600212, -530673, -415918, -202943, 91914, 307530, 318699, 242896, 296329, 491434, 663315, 746985, 809155, 837384, 752070, 635206, 670536, 792139, 670552, 183240, -335207, -484868, -262506, 39442, 227677, 288943, 196768, -104815, -527084, -843017, -918499, -824163, -693481, -574965, -457290, -341155, -219038, -42034, 213109, 451410, 499174, 271582, -116496, -431853, -511559, -366764, -135679, 25899, 37409, -51970, -101784, -36271, 44925, -9805, -182164, -298074]
36500b98074L2515J15005J64780K88164L70681K00172j26851k49809o9682R0985
36490E17886r17j26967K60K46966K64766M2675q5055M1147J86501J10231n7816
36479A139677j5475K23742K61960j56978o81487o61897J4949O60392N73612r2128
36469A266367n61592m15431M2310L53747M06010K78695K3067k13850j99547L0179
36459A009955J33235k1361j27361L0425J73215k2489l76829m82742k95182p0467
36449d9601P6450J70445J22833j02139k16573N0497M32983M03024n5309l81602
36439D51008j88226L05912O48896O24753K90700j36457l58361k34672m01j998
36429A401154k15148k99062j19141R8241J43643L4618j69466m17563m97979k00301
$$ y = [-298074, -265559, -150554, 14226, 302390, 673071, 873243, 746392, 496583, 426901, 517886, 516969, 390002, 390262, 637228, 901994, 944669, 859614, 900761, 1087262, 1197493, 1139677, 1124202, 1347944, 1609904, 1452926, 771439, 109542, 124491, 784883, 1358495, 1266367, 704775, 289344, 331654, 685401, 1091411, 1370106, 1393173, 1179323, 979776, 1009955, 1143190, 1121829, 994468, 1024893, 1198108, 1175619, 798790, 316048, 20866, -49601, 26849, 197294, 320127, 217988, 1415, 51912, 484895, 887919, 832610, 451008, 262782, 568694, 1217590, 1842343, 2133043, 1996586, 1638225, 1403553, 1403152, 1401154, 1186006, 886944, 767803, 866044, 1009687, 1044305, 874839, 457276, -40703, -241004]
36419b41004K62681L75446R192l60265l04595J1285J53819J5795j57213j43188
36409c78047N9100K74200K73091L962k53084j85026P7415J01620j65104k60435
36399d52308P5547M68892M80391K25842O5822L341j65513l31036j93120J85710
36389C63568L98726K66097J7768j14652j54102j74380j36587k1117R3590J56689
36379F95600J81923J32231n7427l13236m41892l52507j37287O4447J60257J02860
36369C4969n0852j15005K2872K04848J83295l0210j83913j29721N3975K64201
36359B54459M63573N50003L85837L6026k36160l05424l22036m13800m57270l02973
36349c47765o1203L5615l5987q3478J5523J76672K57033K22090J45540J10466
$$ y = [-241004, 21677, 397123, 406315, 46050, -258545, -247260, -93441, -77646, -234859, -378047, -318947, -44747, 228344, 232306, -20778, -205804, -128389, -26769, -191873, -452308, -376761, 92131, 572522, 798364, 864186, 867527, 702014, 370978, 177858, 363568, 762294, 1028391, 1046159, 931507, 777405, 603025, 466438, 445321, 538911, 695600, 877523, 1009754, 952327, 639091, 197199, -155308, -292595, -228148, -67891, 34969, -15883, -130888, -108016, 96832, 280127, 249917, 66004, -63717, -9742, 254459, 718032, 1268035, 1653872, 1689898, 1453738, 1148314, 826278, 412478, -44792, -347765, -408968, -373353, -409340, -492818, -477295, -300623, -43590, 178500, 324040, 434506]
36339D34506J20843Q5652p5460k83844l30198j16831J92607L49842K90562J26028
36329G93707o8549k92167m46759l25682J09077N53895O21402K50159k45815n17001
36319D32267m65582k10059R3073L26398M04849K97676O0845j81342k90936j93681
36309B73508K7254J43206M922k36319k70585k7476K27334K63669J71349J44621
36299G21483J66332J08427Q657M915O9808M6320r3397k36783l26889l51603k10008
36288i2738J36367M21846L04073j39557m39304l10367O6161L70191M51818K77686
36278A046176q9690l77975l12421k7193Q8901K2637J44833M58798M26235j41056
36268A239245o03422m04137M9333M5024k97306l03291R0512K78997N1910j00127
$$ y = [434506, 555349, 641001, 565541, 281697, -48501, -165332, 27275, 377117, 667679, 793707, 725158, 432991, -13768, -339450, -230373, 323522, 944924, 1195083, 949268, 432267, -33315, -243374, -150301, 176097, 580946, 878622, 939467, 758125, 467189, 273508, 300762, 443968, 448890, 212571, -58014, -85490, 141844, 405513, 576862, 721483, 887815, 996242, 1004899, 1009814, 1079622, 1125942, 1032545, 795762, 468873, 117270, -92738, 43629, 465475, 769548, 629991, 190687, -119680, -53519, 316672, 768490, 1046176, 956486, 578511, 266090, 238897, 327798, 350435, 495268, 954066, 1380301, 1239245, 635823, 231686, 281019, 326043, 28737, -274554, -184042, 94955, 146865, 46738]
36258D6738J17218L25228J59371j69725l23830l46014l80998l10550l1161K39568
36248f74155K80330K17646K51083K81853J22902j39246k81109k47832p6109K60912
36238c725O65008Q10055N43393J81826P6062Q0622j61047n65911o89390l97032
36228E39861k7280J41099J85756K18229J34078j34174l79281l44892m9304K61120
36218E45212L79046K55698m6046m04726o76611p37435n11911l4937M61527O41304
36208a28879M01172M6127m9600R7741J65270K1286j28519j19639o4169q5254o9935
36197H5601J12628L21971L08857P9365j22532j68873j82883k87852l87699k95202
36187e36619K280L03818M07773K96710R8657p2504j74869j67701L08K69809M25853
$$ y = [46738, 163956, 489184, 648555, 478830, 155000, -191014, -572012, -882562, -913723, -674155, -393825, -176179, 74904, 356757, 479659, 340413, 59304, -188528, -264637, -3725, 661283, 1471338, 2014731, 2196557, 2272619, 2353241, 2192194, 1626283, 936893, 539861, 512581, 653680, 839436, 1057665, 1191743, 1057569, 678288, 333396, 284092, 545212, 924258, 1179956, 1133910, 729184, 52573, -684862, -1196773, -1231710, -770183, -128879, 272293, 318420, 268820, 366561, 531831, 553117, 424598, 304959, 240790, 155536, 85601, 198229, 520200, 829057, 908422, 785890, 617017, 434134, 146282, -241417, -536619, -534339, -230521, 177252, 473962, 572619, 500115, 325246, 157545, 157853, 427662, 853515]
36176H53515K93484m0737l05861l45891k46364j51997o5730J08072L72583N54118
36166A025192M32286j5363m97477o29745l42369K3174J25815K1533j0798Q5640
36156B17888J37229J09693J52743K51344J92739j3075n8613J23298J40287k31970
36146A021563n73454m07605L3623J75450K5823Q7707M09430M50208L8686k44721
36136A016710J6646L87786K75681j81201m51352m38275l75693k15516K02692N67591
36126H05069M09100n8278j34248K62618M26004k294m51430l46204K2973O2905
36116I96215j87356k74651j41714j00973j90934j52141K5639P2663l3949k00K49343
36105B61942L96347K29760k8147p0459Q3144J96840J52475K1440p6865q6334o1040
$$ y = [853515, 1146999, 1106262, 800401, 454510, 208146, 56149, -9581, 98491, 471074, 1025192, 1457478, 1442115, 944638, 314893, -27476, -4302, 121513, 143046, 132248, 217888, 355117, 464810, 617553, 868897, 1061636, 1048561, 989948, 1113246, 1253533, 1021563, 448109, 40504, 74127, 249577, 275400, 363107, 772537, 1222745, 1261431, 1016710, 1033356, 1421142, 1696823, 1515622, 1064270, 625995, 250302, 34786, 237478, 805069, 1214169, 1155891, 1021643, 1284261, 1710265, 1707971, 1256541, 910337, 933310, 996215, 808859, 534208, 392494, 291521, 100587, -51554, -25915, 46748, 12799, 12599, 261942, 658289, 888049, 859902, 789443, 872587, 1069427, 1221902, 1243342, 1166477, 1080143, 1019103]
36094A019103j30637l33799n04709m41696j62924J24955K67179K48452J21830
36085B07754J489L2687J98066K63526J04178o3250q995J25649Q6571k5871M6526
36074I68330J89224P1134k21188k48227M0797J95312K7610q6287Q5697J83090
36064A205492j15146m85956m49653j06601R2153M9804K0318P5667M2080j09663
36054B18495k05758j72085r1507p583P3637P0420m5249j17423m0509K4894p4785
36043c67453j75046n7615J46948J60920J1958p4969r2170j62176j69399P2046
36033g06956L61685L05831l9044j94574J5545K35565J78875J5157r991M9289M2777
36022B54159k1950j14058k74700m14517l09253L6105L07143L30479L06167M06221
$$ y = [1019103, 888466, 554667, 49958, -391738, -554662, -429707, -162528, 85924, 207754, 209243, 241930, 439996, 703522, 807700, 744450, 735455, 861104, 947675, 921804, 968330, 1157554, 1228688, 1007500, 759273, 800070, 995382, 1022992, 936705, 1022402, 1205492, 1090346, 604390, 154737, 48136, 140289, 190093, 210411, 286078, 328158, 218495, 12737, -159348, -250855, -258438, -184801, -114381, -159630, -277053, -317562, -292668, -367453, -542499, -600114, -453166, -292246, -280288, -355257, -447427, -609603, -779002, -706956, -345271, -39440, -78484, -273058, -257513, -21948, 156927, 172084, 162093, 211382, 254159, 232209, 118151, -156549, -571066, -880319, -844214, -537071, -206592, 99575, 505796]
36012E05796M57006K65733k1352j69460k21152l07383l05757m6404K66094K18078
36002F41199k17150n57332l81877J64635N49064M40448L0174k37345j89746p5710
35992A66360j54318l07653k50662O418J95382K26856K48186K71776J39102p9336
35982D62111p9778J29872J29927k29104m98612l20905j718N3874O3158M23124
35972A31949Q47501O79419k0166m35990j54834L07200L58401J09897m5042j14179
35962A664156k96594m48271k92084J1987J8760l04049m76743j94247K50354L97675
35952C30944K15421M0648P7523J83177J25949j20597l81016m67304l15404r618
35942c20277K62150L22916J59002l9711m9953J58508L98351M60283K88661k1901
$$ y = [505796, 962802, 1228535, 1207183, 1037723, 816571, 509188, 203431, 157027, 423121, 641199, 424049, -133283, -515160, -350525, 198539, 638987, 669161, 431816, 242070, 166360, 12042, -295611, -546273, -539855, -344473, -117617, 130569, 402345, 541447, 462111, 382333, 512205, 642132, 413028, -85584, -406489, -408207, -354333, -291175, 131949, 979450, 1658869, 1638703, 1202713, 1047879, 1355079, 1713480, 1823377, 1778335, 1664156, 1367562, 919291, 627207, 639194, 657954, 353905, -122838, -317085, -66731, 330944, 546365, 587013, 664536, 847713, 973662, 853065, 472049, 4745, -310659, -320277, -58127, 264789, 423791, 384080, 334127, 492635, 890986, 1351269, 1639930, 1618029]
35932A618029l23905m88643m54067k53898K0063K83439M51265M13318J38099j99624
35922A204076l40043k31885p2129r811J6092N7875n680k23301l40400j01812K93458
35911B46440L63652P293l09856j72846K23477L63369J12377j52116j03874J09821
35901F87737J41211m4619j56868l7677J06707K8199j86897k39192k9390K36051
35891E05262L32123K37859O1846r2076j45843p6388K5217L5968l7499j03859j80716
35880E61894l51304n07583l80464O6010M83869N33962K68597j0035j15979p4038
35870D74929m431l9611k04309k89048n6284L28075L67736o9318m50896k67185
35860b10342K76037O13048N99902M95367L76556J16134j49364j02292J62751J61764
$$ y = [1618029, 1294124, 805481, 351414, 97516, 117579, 401018, 852283, 1265601, 1403700, 1204076, 864033, 632148, 560019, 550208, 566300, 624175, 618495, 395194, 54794, -47018, 246440, 610092, 617385, 307529, 134683, 358160, 721529, 833906, 681790, 577916, 687737, 828948, 784329, 627461, 589784, 696491, 724690, 537793, 298601, 269211, 505262, 837385, 1075244, 1137090, 1045014, 899171, 822783, 848000, 883968, 846469, 742610, 561894, 210590, -296993, -677457, -611447, -127578, 406384, 674981, 664946, 548967, 474929, 470498, 430887, 226578, -62470, -118754, 209321, 577057, 507739, 56843, -210342, 65695, 678743, 1278645, 1774012, 2150568, 2266702, 2117338, 2015046, 2177797, 2339561]
35850B339561k32213n46297m01938k6745J57186Q0030j02377l46757o20926p12901
35840d13377m66113o1657J95154K60268L11137M23478M80321L42768n943m06275
35830F59761n59483k81500K06221M36623K44412o1347j73230j60263j95645k04950
35820h9401o6527O7322q550j45103m744M03784O67766M85667J3775l49303l61788
35809F12898r5048J71357J78222r6043m19048n32296l63866j5114L50383N62232
35799C53677N22114L05340Q2428q5161k23272k35702J3677L57592M02543R9963
35789A593199j13529K2433J65366m4693l22530j54837L42642N45129K28350j75370
35779B086160k68933j56613j06733j64690k60862l67728l91141j85914J79240
$$ y = [2339561, 2107348, 1561051, 1159113, 1132368, 1289554, 1369584, 1267207, 920450, 299524, -413377, -879490, -941147, -745993, -485725, -174588, 248890, 729211, 1071979, 1066036, 659761, 100278, -181222, 24999, 461622, 706034, 644687, 471457, 311194, 115549, -89401, -155928, -88606, -97156, -242259, -247003, 156781, 824547, 1310214, 1323989, 974686, 612898, 517850, 689207, 867429, 771386, 352338, -179958, -543824, -558938, -208555, 353677, 875791, 1181131, 1263559, 1178398, 955126, 719424, 733101, 1090693, 1493236, 1593199, 1479670, 1502103, 1667469, 1622776, 1300246, 1145409, 1488051, 2033180, 2261530, 2086160, 1817227, 1660614, 1553881, 1389191, 1128329, 760601, 369460, 183546, 362786]
35770C62786M13217L62735J54648o8468k74488l59242j85755Q7478Q3373k18489
35760C57795l45139k000M60902N54963L26081J59179J43095N2464j53024k33888
35750A320428q5052R3851J02777l7483k18559l76025m31685l06642p3880N4444
35740D2174k7778j89182k16043j0807L63413P13234P85055M62533m4247l35335
35730A543017k30406M9081J76383R3189k2953p6814j61402l28826m25404k81295
35720C34570J2413J72325P9409p0536l7521J56433K98265K74010J44102k5735
35710A337735k35924m33601m82689l40301j65291j50418k77990l12476m8890M41401
35700f68444Q30638Q51909O02891M25911M32736L20580j65492p42959q67044m60332
$$ y = [362786, 776003, 1138738, 1293386, 1224918, 950430, 591188, 405433, 492911, 576284, 357795, 12656, 10656, 471558, 1026521, 1352602, 1511781, 1654876, 1707340, 1554316, 1320428, 1235376, 1329227, 1432004, 1394521, 1175962, 799937, 368252, 61610, -12270, 42174, 14396, -174786, -390829, -401636, -38223, 675011, 1460066, 1922599, 1878352, 1543017, 1312611, 1361692, 1538075, 1631264, 1608311, 1531497, 1370095, 1041269, 615865, 334570, 346983, 519308, 598717, 528181, 490660, 647093, 945358, 1219368, 1363470, 1337735, 1101811, 668210, 185521, -154780, -320071, -470489, -748479, -1060955, -1109845, -668444, 162194, 1014103, 1616994, 2042905, 2475641, 2796221, 2630729, 1887770, 1020726, 560394]
35690E60394l5771j4840k31878k80830r2968P4059O2539k6030m5768J0701M3423
35679B3031l6687j93004k34804j1103L24109M07483J25547j98200k20170j4061
35669b7859R2311k5247k06363k79283j94003M8307L79753O11674N88734L81926
35659A369950J79407M0604p7343j31859o0150R762j29961m14780n03773k21876
35649E9981J70254K73879K5244k41918j91358J21686L05908J19231j82187j52377
35639C08343K09037M11776J67923j89747k18239O362J18757P3064O9332L7695
35629I94303k63823o64839o55858j56850K93247K98956R5247L7284N9249k0133
35619A6783m2252K07632N14100M71780Q6617k45206k92351j89394j15816p7348
$$ y = [560394, 524623, 509783, 277905, -2925, -95893, -21834, 40705, 14675, -31093, -20392, 23031, -13656, -206660, -441464, -452567, -128458, 279025, 404572, 206372, -13798, -27859, 64452, 39205, -167158, -446441, -640444, -592137, -212384, 399290, 988024, 1369950, 1549357, 1589961, 1512618, 1380759, 1320609, 1330371, 1200410, 785630, 281857, 59981, 230235, 504114, 529358, 287440, 96082, 217768, 523676, 642907, 460720, 308343, 517380, 929156, 1097079, 907332, 689093, 695455, 814212, 887276, 956608, 994303, 730480, 65641, -590217, -747067, -453820, -154864, -59617, -22333, 36916, 16783, -25469, 182163, 696263, 1168043, 1254660, 1009454, 717103, 527709, 411893, 334545]
35609C34545l1390J274j905k5340l9305R188J52591K81753K14636j8124j52499
35598G25424r0467p4587k56160l60000r6525L16121M31186K24378M8734L1467
35588H99571l5070k13510k88396j89942j36418k19464k12523L6831L32919M28780
35578D02778L36873J87469K9490p5896k0045J25282R1388j93383m29729l62535
35568I1692j38592l2863m0150R115J18469J85125K36879L29010L26277Q0836k44943
35557I20855l17407p4064K05130K53022M6917k69571m90755m25445r3861J85878
35547e9301J34779r5251j16312J23320K53447K9582l11330l78969j06939K49087
35537b77887M40511M07847K40233Q6738N3108J08682J45522J45527J74427J86059
$$ y = [334545, 303155, 304429, 302524, 277184, 237879, 247067, 399658, 681411, 896047, 877923, 725424, 634957, 560370, 304210, -55790, -152315, 163806, 594992, 819370, 868104, 899571, 864501, 650991, 362595, 172653, 36235, -183229, -395752, -358921, -26002, 402778, 739651, 927120, 956610, 880714, 860669, 985951, 1077339, 883956, 454227, 91692, -46900, -79763, -119913, -110798, 7671, 192796, 429675, 758685, 1084962, 1165798, 920855, 603448, 529384, 734514, 987536, 1034453, 764882, 274127, -151318, -245179, -59301, 75478, -19773, -136085, -12765, 240682, 270264, -41066, -420035, -526974, -277887, 162624, 570471, 810704, 897442, 950550, 1059232, 1204754, 1350281, 1524708, 1710767]
35527A710767J3971l30528n21115k81644J81648L35347n1415n92596o99602k27710
35517d62877L98190O71520M95198J50791r5999k13703k60817k04493J8823L43662
35507H40295N70103N05037J09919m12442o92695n18438j25834K0162j84737l48343
35497b36973j77316P8975N8040j02993l347L19331M16540J56114p0109J6091J81901
35486F36254J28897m6732r7613k5299K2449L424r4462l16133n09527l51528J16143
35475e34127L27052m4520m87857l38234K00839L56500O14j60698K64186P07326
35465B91081N02470j33163m60053k38706J13424K42180K49067L26915L86895K29543
35455A509653j04128l42607l10678j24609j3653j0387N5980K30837K78997K5527
$$ y = [1710767, 1724738, 1394210, 873095, 591451, 773099, 1108446, 1057031, 464435, -235167, -462877, -64687, 606833, 1102031, 1252822, 1156823, 943120, 682303, 477810, 496633, 840295, 1410398, 1915435, 2025354, 1612912, 920217, 401779, 275945, 296107, 111370, -236973, -414289, -335314, -277274, -380267, -383614, -64283, 352257, 508371, 438262, 454353, 636254, 765151, 718419, 620806, 595507, 617956, 621380, 526918, 210785, -298742, -650270, -534127, -207075, -251595, -739452, -1077686, -876847, -520347, -519733, -680431, -416245, 291081, 793551, 660388, 200335, -38371, 75053, 317233, 566300, 893215, 1280110, 1509653, 1405525, 1062918, 752240, 627631, 613978, 603591, 659571, 890408, 1169405, 1194932]
35445A194932k97258l26839j25862r6065k96369k71502K21888P01493N56163p4582
35435A185999m66560k87047L6938N480k81717l58924o4973K91067L69548J85789
35425F15600L743l3319m7663j92908l77944l52116n7711K61946L77641L37715
35415E34984K79535J37901k12946o01391o51838l00756N1479O1661r3363m957
35405g99691L39656N09544K37711j82249k70744J2879K49008J49920o0036J0577
35395A96575L46878N26417K80426j57454l53306j74848J31194K62885J29027j46609
35385A041185l47737l13004p8094J32306J40452J9794k8914L3047M9781p2161
35375E76655k11004j84402L0157K73807L52914K01139m3163j35155J8903K22832
$$ y = [1194932, 897674, 570835, 444973, 348908, 52539, -218963, 2925, 704418, 1260581, 1185999, 719439, 432392, 469330, 474810, 193093, -165831, -230804, 60263, 429811, 615600, 619343, 586024, 538361, 345453, -32491, -384607, -442318, -180372, 197269, 534984, 814519, 952420, 739474, 138083, -513755, -814511, -763032, -701371, -794734, -799691, -460035, 49509, 287220, 104971, -165773, -152894, 96114, 246034, 185998, 196575, 543453, 1069870, 1350296, 1192842, 839536, 664688, 795882, 1058767, 1187794, 1041185, 693448, 380444, 302350, 434656, 575108, 594902, 565988, 599035, 648816, 576655, 365651, 181249, 211406, 485213, 838127, 1039266, 996103, 860948, 879851, 1102683]
35365A102683K13086o956j99387k44893k63054l29678l03558q8135J21836Q4541
35355H6485j04878j34874M4958J42087j2183j68823j6787L29475M45117J69694
35345G80271j60020j35995K06706M33459K19765k94777o70034o13050k39175P7884
35335c94966R5435n9106n9123K08994M80717M31471Q9937k02161k22794r3838
35325B74566l5117p4557j08996r3399j4494J86554M60463N26092J70605l53159
35315I38558n23620k09275J45190J23121j29084j81100O7301L26024L62707K26768
35305A146590M9656j14369k10768j75597p4768o3253j35054j07892M9897R0636
35295D55078j52727m64675n27821l69107k58168k40645r3224K34203M58978L80680
$$ y = [1102683, 1315769, 1308813, 1109426, 864533, 601479, 271801, -31757, -119892, 1944, 86485, -18393, -153267, -108309, 33778, 21595, -147228, -164015, 165460, 610577, 780271, 620251, 484256, 690962, 1124421, 1344186, 1049409, 379375, -233675, -472850, -394966, -299531, -358637, -417760, -208766, 271951, 703422, 793359, 591198, 368404, 274566, 239449, 164892, 55896, -37503, -51997, 134557, 595020, 1121112, 1291717, 938558, 414938, 205663, 350853, 473974, 344890, 163790, 231091, 557115, 919822, 1146590, 1196246, 1081877, 871109, 695512, 620744, 557491, 422437, 314545, 364442, 455078, 302351, -162324, -690145, -1059252, -1317420, -1558065, -1651289, -1417086, -958108, -577428]
35285e77428J78991R8503P1142p9258k36408j44977J07472J50014o9464j16728
35275f18141K94428P93577P83123K23877l25407m17704j77600J350k8463j05119
35265D23921o8933M2241J01227P7154M9591O2357L7163j04396k69058k64710p6446
35254A0111P0801K2633o9326J0743J73276J36401j17226k68757j25418R3336R4549
35243C1123n4193n8864J32909K54728J21896j16064k14470j57316r4953n6362
35233b11566Q5919L57128N58890M98068K27766n0825k35140l19191k27240J03103
35223G86912M48247L92531j37113o42378n98565j01488K81948K27219o3151k61419
35213C32743k89472k14625m7254J88584L51578L19926J52921J2996j1191M5133
$$ y = [-577428, -398437, -299934, -228792, -308050, -544458, -689435, -581963, -431949, -501413, -618141, -323713, 469864, 1252987, 1476864, 1151457, 733753, 556153, 557503, 529040, 423921, 354988, 397229, 498456, 575610, 625201, 687558, 724721, 620325, 351267, 86557, 10111, 80912, 103545, 34219, 44962, 218238, 354639, 237413, -31344, -156762, -63426, 31123, -23070, -81934, 50975, 305703, 427599, 311535, 97065, -60251, -155204, -211566, -125647, 231481, 790371, 1288439, 1516205, 1465380, 1230240, 911049, 683809, 786912, 1235159, 1627690, 1490577, 848199, 249634, 148146, 430094, 657313, 594162, 332743, 43271, -171354, -218608, -30024, 321554, 641480, 794401, 807397, 796206, 841339]
35203H41339O8964m9741k71639l51753j02577K76293L56442L4164l11508l23699
35193A66285q4957J27824K51239L59257L88198K36601J8141p3722p6852j63270
35183A148744k92862k53511k9466J52677J63444Q9212j7726k19256m34323l89047
35173h2114l892L77127L63555J5781k33194j11874J98253L20841J24404j52464
35163H16423j89325M9537K82929K48556j1798k59362l53125l13878j67801Q8247
35153A90403L56950M46878K78590j3000k27855k79147k09391j16696q5694j19917
35143B21121j31065m4298J11433K61648L53815K96314k5007n08142p57793m98972
35133g20946J6248K91684K15214Q6066N7461l4887k17148j96472J41660M24592
$$ y = [841339, 910303, 860562, 588923, 237170, 134593, 410886, 767328, 801492, 489984, 166285, 81328, 209152, 460391, 819648, 1207846, 1444447, 1462588, 1388866, 1312014, 1148744, 855882, 602371, 572905, 725582, 889026, 978238, 960512, 741256, 306933, -82114, -86006, 291121, 654676, 670457, 437263, 325389, 523642, 844483, 968887, 816423, 627098, 676635, 959564, 1208120, 1196322, 936960, 583835, 269957, 102156, 190403, 547353, 994231, 1272821, 1259821, 1031966, 752819, 543428, 426732, 341038, 221121, 90056, 45758, 157191, 418839, 772654, 1068968, 1043961, 535819, -221974, -720946, -704698, -413014, -197800, -111734, -54273, -89160, -306308, -502780, -361120, 63472]
35123F3472K83093j20506l62615l31654k06623n1824J99607M59328N35421M41576
35113I09275L58877L11944J62737q5752k58371k94708l08850l38494k86590j52624
35103A7444p3288o8390J8675K40171M17720L98746K53259J13789n071j16922j55785
35092A040348q4203J6681P2530J11627J39601N4760j82307m02268l92976j54141
35082B19652J20842K64351K45890J20689l6085j63056k33668k29109j04436J34022
35072C39092L29321K96334Q0355o1546n455P6942M585j31456j29982Q147J14303
35061I20640J12846O7063K3091k0913l4946r631m1070j89389k97143j52985J72186
35050E49749L61063K47021j7170k14919k80934k14512j8802J64659R7690k07424
$$ y = [63472, 346565, 226059, -136556, -468210, -674833, -726657, -527050, -67722, 467699, 909275, 1268152, 1580096, 1742833, 1657081, 1398710, 1104002, 795152, 456658, 170068, 17444, -55844, -124234, -105559, 134612, 552332, 951078, 1204337, 1318126, 1313055, 1196133, 1040348, 956145, 972826, 1045356, 1156983, 1296584, 1351344, 1169037, 766769, 373793, 219652, 340494, 604845, 850735, 971424, 935339, 772283, 538615, 309506, 205070, 339092, 668413, 964747, 1045102, 983556, 978101, 1055043, 1059628, 928172, 798190, 806337, 920640, 1033486, 1100549, 1123640, 1102727, 1067781, 1058150, 1017080, 827691, 530548, 377563, 549749, 910812, 1157833, 1140663, 925744, 644810, 430298, 411496, 576155, 673845, 466421]
35040D66421l91161k12735P5968J02092l7768O1087M01711M84683O2967m04031
35030F09234l62550M3134J99324p3785l03824j24689J64170N9125l90563o35845
35020h16269l59146J68614N02516N19353L59991R2746l08144o99709p51084l08754
35010a599886L53415P94986Q52751O72259L58851j31910o65192p92773k69142
35001d26641M41999N90832J03510k94593q1936L53302L48304m6239k26605l564
34991G58369J91331Q7620l5478N2009Q0256k08003n09526l87389K3018K25371
34981B77578J27767R5620K79585L87492K16790j7350o5520j7756p6175k04318
34971A003713k27803j15710L0361J42196J87248J20393l5609j64562k07684k20130
$$ y = [466421, 75260, -137475, -61507, 40585, 2817, 63904, 465615, 950298, 1013265, 609234, 246684, 289818, 489142, 415357, 111533, -13156, 151014, 210139, -180424, -816269, -1175415, -1006801, -504285, 15068, 375059, 467805, 159661, -540048, -1291132, -1599886, -1246471, -451485, 401266, 1073525, 1432376, 1300466, 635274, -157499, -426641, 15358, 606190, 709700, 415107, 333171, 686473, 1034777, 988538, 761933, 758369, 949700, 1037320, 1001842, 1053851, 1134107, 926104, 416578, 29189, 52207, 277578, 405345, 500965, 780550, 1168042, 1384832, 1367482, 1301962, 1284206, 1208031, 1003713, 775910, 660200, 690561, 832757, 1020005, 1140398, 1104789, 940227, 732543, 512413]
34961E12413k08406q6677J05776J50154l6317k31302k41827k02382k89703l27882
34951h56153j7566N26782Q24748O36137K22992m7288r6464n4876l0806q1977k28300
34940G97229l63134k90148L5426M00820N48716M06840P0488l08488n51771n12016
34930B33962k09664J50895L56637L27468J03341j86592l49773k83695j18290m2995
34920a8706o39K14113N27005N65828K11560j31943o7200K25788K52348j02909
34910A675245m63951m91269k29873P3294K43669K25937O4207r6327j27177p0370
34900H03385n9736j00162p1616N2176J52645J52905J01881M6931k3652p4293j9197
34889I61267J03730J00787j27254l97835m27111j59765J74747L31639L03684K68672
$$ y = [512413, 304007, 217330, 323106, 473260, 436943, 205641, -36186, -238568, -528271, -856153, -873719, -346937, 477811, 1113948, 1336940, 1289652, 1193188, 1138312, 1107506, 1025529, 797229, 434095, 143947, 179373, 580193, 1128909, 1535749, 1606237, 1297749, 745978, 233962, 24298, 175193, 531830, 859298, 962639, 776047, 426274, 142579, 24289, -18706, -19345, 194768, 721773, 1287601, 1499161, 1367218, 1300018, 1525806, 1778154, 1675245, 1211294, 720025, 490152, 563446, 807115, 1033052, 1097259, 1000932, 873755, 803385, 743649, 643487, 571871, 624047, 776692, 929597, 1031478, 1078409, 1054757, 980464, 961267, 1064997, 1165784, 1038530, 640695, 213584, 53819, 228566, 560205, 863889, 1132561]
34879A132561L23537L57761K36122K0472j16336j50202k02762k85780k70404j57643
34869H87326j24379j94646j45182Q9146K13414L0257j92917j51827k6256j40380
34859B44556l30953j92791J70202K41816n6434k25231j5806J97517R7893p4883
34849E5886k5197Q1589j0954j57785r9019P5720J43298J44993J78984P5771k83466
34838A79820n67269l96824K0977J62873j1962n0343K21612M32119K85244R426
34828B85673k3209J80422L17976K20447J0275r3084j3915J21479J46827N4472
34818A207363n2228j80953m14409o08100m31021J18736N51626N04152K20326R0073
34808A005565K3008k62760n83458m93553m3033K40122J35235k2251N7134K41274
$$ y = [1132561, 1456098, 1813859, 2049981, 2070453, 1954117, 1803915, 1601153, 1315373, 1044969, 887326, 762947, 568301, 423119, 512265, 725679, 755936, 563019, 411192, 384936, 244556, -86397, -279188, -108986, 132830, 76396, -148835, -164641, 32876, 130769, 55886, 30689, 112278, 101324, -56461, -155480, -79760, 63538, 208531, 387515, 463286, 179820, -387449, -784273, -763296, -600423, -612385, -662728, -441116, -8997, 276247, 285673, 262464, 442886, 760862, 981309, 991584, 898500, 884585, 1006064, 1152891, 1207363, 1155135, 974182, 559773, -48327, -479348, -360612, 191014, 695166, 915492, 1005565, 1028573, 765813, 182355, -311198, -354231, -114109, 21126, -1125, 56009, 297283]
34798B97283L08037K34832N3627k02321l29760j18237K50201L55736J47926k5458
34788I71866m1583j54802m13377m61251j44472J69485J48685m8498j35833j12433
34778b22213n8175P8438K27360J47026j03632q9459K93812N07553J51628l94793
34768E37545n64871m17885l51269l66561j91050J36277L55394M57921N62632N28059
34758F86192K03900j26520q3511J93975K79462J24076l5622k25163n78712q06997
$$ y = [297283, 605320, 840152, 893779, 691458, 361698, 243461, 493662, 849398, 997324, 971866, 930283, 775481, 362104, -99147, -243619, -74134, 74551, 26053, -109780, -222213, -280388, -201950, 25410, 172436, 68804, -20655, 273157, 780710, 932338, 537545, -27326, -445211, -796480, -1163041, -1354091, -1217814, -862420, -404499, 158133, 686192, 890092, 763572, 680061, 874036, 1153498, 1277574, 1241952, 1016789, 438077, -368920]
$$ [...]
##END NTUPLES=NMR SPECTRUM
##END=
