##TITLE=31P_DE-80H_X3
 64 sc D2O
 26.2.2025
##JCAMPDX= 6.0         $$ Bruker NMR JCAMP-DX V2.0
##DATA TYPE= NMR SPECTRUM
##DATA CLASS= NTUPLES
##ORIGIN= UXNMR, Bruker Analytische Messtechnik GmbH
##OWNER= root
$$ XWIN-NMR		Version 3.5
$$ Thu May 15 14:31:48 2025 Russian Standard Time (UT+4h)  Yarkov@DPX200
##.OBSERVE FREQUENCY= 81.013821
##.OBSERVE NUCLEUS= ^31P
##.ACQUISITION MODE= SIMULTANEOUS
##.ACQUISITION SCHEME= undefined
##.AVERAGES= 64
##.DIGITISER RES= 17
##SPECTROMETER/DATA SYSTEM= spect
##.PULSE SEQUENCE= zgpg30
##.SOLVENT NAME= CDCl3
##.SHIFT REFERENCE= (INTERNAL, CDCl3, 0, 198.062)
##AUDIT TRAIL= $$ (NUMBER, WHEN, WHO, WHERE, WHAT)
$$ ##TITLE= Audit trail, XWIN-NMR		Version 3.5
$$ ##JCAMPDX= 5.01
$$ ##ORIGIN= Bruker BioSpin GmbH
$$ ##OWNER= Yarkov
$$ C:/Bruker/XWIN-NMR/data/yarkov2/nmr/P31/2/pdata/1/auditp.txt
$$ ##AUDIT TRAIL=  $$ (NUMBER, WHEN, WHO, WHERE, WHAT)
(   1,<2025-05-15 14:30:56.96 +0400>,<Yarkov>,<DPX200>,
      <created by zg, POWCHK disabled, PULCHK disabled
       configuration hash MD5:
       00 E9 B6 7A A2 85 ED C7 34 08 36 98 17 FE 4E 26
       data hash MD5: 32K
       DB E6 0F 1A BE 48 4F 50 13 9A E0 BC 89 42 C5 BE>)
(   2,<2025-05-15 14:31:01.51 +0400>,<Yarkov>,<DPX200>,
      <Start of raw data processing
       efp BC_mod = 2 LB = 1.5 FT_mod = 6 PKNL = 1 PHC0 = 1737.484 PHC1 = 159.3595 SI = 64K 
       data hash MD5: 64K
       96 04 22 65 0B 65 96 D2 AB 69 8E 97 C8 92 AB 9B>)
(   3,<2025-05-15 14:31:20.17 +0400>,<Yarkov>,<DPX200>,
      <pk PHC0 = 25.57893 PHC1 = -49.79999 
       data hash MD5: 64K
       B7 B8 75 F7 52 68 A8 2B 1D 6D 77 B3 33 E7 38 52>)
$$ ##END=
$$ 
$$ hash MD5
$$ 2B 65 82 87 7B AA 8D 07 4C C6 FF 3A 81 8D F5 0B
##$RELAX= 
##$RELAX= 
##$RELAX= 
##$RELAX= 
##$RELAX= 
##$RELAX= 
##$RELAX= 
##$RELAX= 
$$ Bruker specific parameters
$$ --------------------------
##$DU= <C:/Bruker/XWIN-NMR>
##$EXPNO= 2
##$NAME= <P31>
##$PROCNO= 1
##$TYPE= <nmr>
##$USER= <yarkov2>
##$AMP= (0..31)
100 100 100 100 100 100 100 100 100 100 100 100 100 100 100 100 100 100 
100 100 100 100 100 100 100 100 100 100 100 100 100 100 
##$AQSEQ= 0
##$AQ_mod= 1
##$AUNM= <au_zg>
##$AUTOPOS= <>
##$BF1= 81.014009
##$BF2= 200.13
##$BF3= 200.13
##$BF4= 200.13
##$BF5= 200.13
##$BF6= 200.13
##$BF7= 200.13
##$BF8= 200.13
##$BYTORDA= 1
##$CFDGTYP= 0
##$CFRGTYP= 5
##$CHEMSTR= <none>
##$CNST= (0..31)
1 1 145 1 1 1 1 1 1 1 1 1 1 1 1 1 1 1 1 1 1 1 1 1 1 1 1 1 1 1 1 1 
##$CPDPRG= <waltz16>
##$CPDPRG1= <>
##$CPDPRG2= <waltz16>
##$CPDPRG3= <>
##$CPDPRG4= <mlev>
##$CPDPRG5= <mlev>
##$CPDPRG6= <mlev>
##$CPDPRG7= <mlev>
##$CPDPRG8= <mlev>
##$CPDPRGB= <>
##$CPDPRGT= <>
##$D= (0..31)
0 1 0 0 0 0 0 0 0 0.06 0 0.03 2e-05 3e-06 0 0 0.0002 0 0 0 0 0 0 0 0 0 
0 0 0 0 0 0 
##$DATE= 1747305056
##$DBL= (0..7)
120 120 120 11 120 120 24 19 
##$DBP= (0..7)
150 150 150 150 150 150 150 150 
##$DBP07= 0
##$DBPNAM0= <>
##$DBPNAM1= <>
##$DBPNAM2= <>
##$DBPNAM3= <>
##$DBPNAM4= <>
##$DBPNAM5= <>
##$DBPNAM6= <>
##$DBPNAM7= <>
##$DBPOAL= (0..7)
$$ [...]
##$SUBNAM3= <"">
##$SUBNAM4= <"">
##$SUBNAM5= <"">
##$SUBNAM6= <"">
##$SUBNAM7= <"">
##$SUBNAM8= <"">
##$SUBNAM9= <"">
##$SW= 400.765351723535
##$SWIBOX= (0..15)
0 1 3 0 0 0 0 0 0 0 0 0 0 0 0 0 
##$SW_h= 32467.5324675325
##$TD= 32768
##$TD0= 1
##$TE= 0
##$TE2= 300
##$TE3= 300
##$TEG= 300
##$TL= (0..7)
0 120 53 12 22 120 120 120 
##$TP= (0..7)
150 150 150 150 150 150 150 150 
##$TP07= 0
##$TPNAME0= <>
##$TPNAME1= <>
##$TPNAME2= <>
##$TPNAME3= <>
##$TPNAME4= <>
##$TPNAME5= <>
##$TPNAME6= <>
##$TPNAME7= <>
##$TPOAL= (0..7)
0.5 0.5 0.5 0.5 0.5 0.5 0.5 0.5 
##$TPOFFS= (0..7)
0 0 0 0 0 0 0 0 
##$TUNHIN= 0
##$TUNHOUT= 0
##$TUNXOUT= 0
##$USERA1= <user>
##$USERA2= <user>
##$USERA3= <user>
##$USERA4= <user>
##$USERA5= <user>
##$V9= 5
##$VALIST= <valist>
##$VCLIST= <CCCCCCCCCCCCCCC>
##$VD= 0
##$VDLIST= <DDDDDDDDDDDDDDD>
##$VPLIST= <PPPPPPPPPPPPPPP>
##$VTLIST= <TTTTTTTTTTTTTTT>
##$WBST= 1024
##$WBSW= 4
##$XGAIN= (0..3)
0 0 0 0 
##$XL= 0
##$YL= 0
##$YMAX_a= 26938
##$YMIN_a= -26522
##$ZGOPTNS= <>
##$ZL1= 120
##$ZL2= 120
##$ZL3= 120
##$ZL4= 120
##$ABSF1= 0
##$ABSF2= 0
##$ABSG= 0
##$ABSL= 0
##$ALPHA= 0
##$AQORDER= 0
##$ASSFAC= 0
##$ASSFACI= 0
##$ASSFACX= 0
##$ASSWID= 0
##$AUNMP= <proc_1d>
##$AZFE= 0.1
##$AZFW= 0.5
##$BCFW= 0
##$BC_mod= 2
##$BYTORDP= 0
##$COROFFS= 0
##$CY= -3
##$DATMOD= 1
##$DC= 0
##$DFILT= <>
##$DTYPP= 0
##$F1P= 0
##$F2P= 0
##$FCOR= 1
##$FTSIZE= 65536
##$FT_mod= 6
##$GAMMA= 0
##$GB= 0
##$INTBC= 1
##$INTSCL= 9.790993e-09
##$ISEN= 30
##$LB= 1.5
##$LEV0= 0
##$LPBIN= 0
##$MAXI= 10000
##$MC2= 0
##$MEAN= 0
##$ME_mod= 0
##$MI= 50
##$NCOEF= 0
##$NC_proc= -4
##$NLEV= 6
##$NOISF1= 182.463
##$NOISF2= 159.3651
##$NSP= 0
##$NTH_PI= 0
##$NZP= 0
##$OFFSET= 198.0616
##$PC= 4
##$PHC0= 1763.063
##$PHC1= 109.5595
##$PH_mod= 1
##$PKNL= yes
##$PPARMOD= 0
##$PSCAL= 0
##$PSIGN= 0
##$REVERSE= no
##$SF= 81.0140089999434
##$SI= 65536
##$SIGF1= 159.3651
##$SIGF2= -187.1042
##$SINO= 113.3802
##$SIOLD= 16384
##$SREGLST= <1H.CDCl3>
##$SSB= 0
##$STSI= 65536
##$STSR= 0
##$SW_p= 32467.5324675325
##$SYMM= 0
##$S_DEV= 0
##$TDeff= 32768
##$TDoff= 0
##$TI= <>
##$TILT= no
##$TM1= 0
##$TM2= 0
##$TOPLEV= 0
##$USERP1= <user>
##$USERP2= <user>
##$USERP3= <user>
##$USERP4= <user>
##$USERP5= <user>
##$WDW= 1
##$XDIM= 65536
##$YMAX_p= 297610448
##$YMIN_p= -18709261
$$ End of Bruker specific parameters
$$ ---------------------------------
##NTUPLES= NMR SPECTRUM
##VAR_NAME=  FREQUENCY,     SPECTRUM/REAL,   SPECTRUM/IMAG
##SYMBOL=    X,             R,               I
##VAR_TYPE=  INDEPENDENT,   DEPENDENT,       DEPENDENT
##VAR_FORM=  AFFN,          ASDF,            ASDF
##VAR_DIM=   65536,         65536,           65536
##UNITS=     HZ,            ARBITRARY UNITS, ARBITRARY UNITS
##FACTOR=    0.49542278885378, 1,            1
##FIRST=     16045.7642231865, 0,            0
##LAST=      -16421.768244346, 0,            0
##MIN=       -16421.768244346, -18709261,    0
##MAX=       16045.7642231865, 297610448,    0
$$ Real data points
##PAGE= N=1
##DATA TABLE= (X++(R..R)), XYDATA
$$ [...]
48874 393260 173566 -40334 -98664 -20472 82206 108098 37915 -49923 -54629 40874 169266
48863 169266 281097 392605 524932 659650 773517 856437 874821 783253 601434 416824
48853 416824 283113 186205 140575 223354 439563 633601 639941 483088 328481 258500 205235
48842 205235 109064 28590 35061 72555 8323 -188936 -379567 -379704 -137754 224572 532171
48831 532171 699261 754212 753902 715921 642820 567657 526627 494477 399497 231232 103650
48820 103650 160924 408353 673422 769117 680098 548116 484225 459119 402209 341284 371458
48809 371458 505654 627011 609771 456976 306411 306046 467011 632382 632272 488398 396904
48798 396904 459496 522308 392446 143548 37765 154117 281364 236044 111491 94766
48788 94766 173174 183107 78508 -13558 8416 100821 168063 171778 126664 74096 86821 225437
48776 225437 449208 616228 608060 432593 194186 -3036 -105833 -103235 -14179 102323
48766 102323 148677 52611 -134345 -238912 -135638 99987 292250 407871 567246 783014
48756 783014 858721 671029 413054 370464 535157 651719 616778 596529 705056 793975
48746 793975 684307 441439 269116 237583 261751 272457 267061 241946 212971 267616 455299
48735 455299 641066 618383 389510 195914 219285 372175 456513 421594 359691 321247 267858
48724 267858 193245 169232 238461 341659 393322 376785 328741 277475 238868 234138 259652
48713 259652 262798 200678 113479 95061 199180 416253 720892 1069811 1350909 1424497 1265232
48702 1265232 1003793 769699 540109 218212 -166944 -434795 -452837 -294675 -146829 -88019
48692 -88019 -21610 162199 412707 569619 578543 569165 663739 781163 743857 550622 398440
48681 398440 403714 450489 398820 307659 313842 387980 382874 279845 210399 235676 272437 263091
48669 263091 255389 259291 182676 619 -143787 -123439 -15511 11224 -77787 -185005 -240087
48658 -240087 -225583 -94408 180996 477676 591438 486991 366881 421099 583811 616695
48648 616695 395061 40671 -220416 -276899 -194890 -95132 -8126 125729 328897 519093
48638 519093 607736 621772 652944 695964 628856 393825 121923 -3632 23987 38567 -54692
48627 -54692 -135090 -39049 184745 310670 234093 116543 165356 359560 508764 535178 550504
48616 550504 639596 714798 661865 520171 406258 324805 183596 -20845 -155187 -117618
48606 -117618 30271 144152 155526 108319 77762 102491 180949 283950 352650 314125 142679
48595 142679 -83200 -223786 -218557 -160743 -176113 -245009 -230944 -93751 40866 85115 147464
48584 147464 363740 640713 727137 537260 261286 122523 148225 230988 297516 328573
48574 328573 300143 217034 166010 234555 383220 475017 435692 328647 269705 316808 442292
48563 442292 562379 589983 511793 428644 469785 638593 782091 750738 564564 383492
48553 383492 329432 381568 444612 468676 474933 498016 546161 607942 657754 651606 557093 407156
48541 407156 297053 301908 406032 522232 561109 475244 277514 55121 -59328 16094
48531 16094 235736 466675 600340 607404 511891 364203 236997 193300 235203 308063 360433
48520 360433 373465 339080 259785 183614 190114 308214 472806 584982 595818 524101 428054
48509 428054 374220 390314 420607 368243 216324 68140 25383 64855 88522 57533 3734
48498 3734 -62649 -153129 -199787 -71431 237415 516348 546589 370425 243340 305775 411568
48487 411568 344505 121246 -29572 34476 207380 303394 294507 301049 393709 504894 549285
48476 549285 552505 604989 719167 788374 696575 443662 154088 -22054 -11626 149214 347881
48465 347881 457334 405820 228245 49211 -14555 53242 182896 312691 432304 535530
48455 535530 588613 580444 561553 581709 608843 558906 398639 178536 -26189 -163065 -199964
48444 -199964 -135826 -34976 -7928 -118059 -304950 -407540 -277979 85104 488920 675870
48434 675870 563582 338286 246179 309035 330371 183590 -12478 -52195 110300 346114
48424 346114 521205 589823 545477 378807 117216 -144981 -303742 -337414 -327179 -365731
48414 -365731 -435985 -410409 -211311 53451 187111 136573 42750 34226 69641 50269 -2968
48403 -2968 3224 59348 54554 -41222 -107702 -31491 139176 255402 255491 244337 371943 638764
48391 638764 849077 809839 582038 449040 570118 744683 644963 252067 -91468 -98968
48381 -98968 128086 272361 203681 79981 81920 185647 245201 212608 187166 259385 386529
48370 386529 468196 500051 570234 695572 750481 622652 384641 229120 258275 411330
48360 411330 576065 685436 721742 728447 813452 1019890 1179160 1039058 602537 198376
48350 198376 104852 217739 233212 72895 -51219 35180 259963 454304 555054 585700
48340 585700 549753 438464 289780 167990 110818 127450 202481 269337 234768 80003 -96045
48329 -96045 -173845 -127353 -20736 64935 72531 -18276 -181917 -381263 -620409 -897436 -1084705
48318 -1084705 -965442 -484417 104163 453202 465983 334446 266656 288894 312232 271697
48308 271697 161077 20185 -72469 -67422 -30627 -76723 -183307 -173783 48822 340736 475785
48297 475785 393346 197915 -11230 -176998 -196717 28255 409757 668888 602994 297141
48287 297141 7176 -116781 -123921 -117918 -105598 -12086 196520 443588 602305 617890 554328
48276 554328 511441 516417 523263 500128 469248 457135 453145 439787 430747 451889 503733 563176
48264 563176 606984 616516 573590 474224 350085 268247 294073 428471 574479 600740 467981
48253 467981 266694 100753 -22387 -131049 -170781 -52922 180310 344791 301536 78463
48243 78463 -210417 -465814 -587090 -481458 -190438 73850 134145 49228 14174 104600
48233 104600 232822 326600 409823 484455 464555 303988 113893 69583 223594 462848
48223 462848 637723 692009 664095 594824 474467 303762 175704 212083 382095 467696
48213 467696 305140 18423 -106654 17456 165930 90848 -176237 -385177 -361543 -151485
48203 -151485 91416 265588 352436 361605 304425 216516 167382 213303 335384 451060 506271
48192 506271 529620 563059 570632 479802 308373 178219 176581 257830 316057 308432 263565 205072
48180 205072 126624 35922 -29803 -51758 -62179 -96758 -120028 -36153 196184 478772 651271
48169 651271 656782 579761 510120 444278 361940 314793 347127 386459 330147 215982 182257
48158 182257 256280 311080 264395 198155 218483 298941 342285 322526 284359 255714 234122
48147 234122 216237 178710 78416 -61202 -113543 16923 249295 394313 358280 212510
48137 212510 67405 -49266 -167101 -277416 -309124 -208327 -28644 92067 76815 5542
48127 5542 11275 101294 164590 151971 138508 178720 220018 227267 281830 452847 646590 695072
48115 695072 552856 321260 126305 52626 132721 295850 375311 274578 92308 -11945
48105 -11945 -26517 -52686 -113490 -133701 -86257 -26912 5636 5568 -58076 -180732 -232110 -91142
48093 -91142 132743 190284 26125 -158940 -219442 -239109 -306752 -315782 -138416 141198 335078
48082 335078 401570 432152 457497 428121 359884 352199 450898 594207 702132 741978 708542
48071 708542 613320 498349 408008 349012 311969 306620 334406 356593 333600 268542 182194
48060 182194 90931 38529 78670 175418 200141 99904 -8216 -1311 63765 39957 -94425
48049 -94425 -237062 -335707 -415806 -446977 -335967 -87590 152913 274600 327112 417138 548003
48038 548003 619737 554244 388662 261668 297587 467396 591116 534612 367874 250030
48028 250030 206064 142545 57434 65031 178313 233407 119196 -51834 -115645 -95227 -134805
48017 -134805 -262908 -358994 -327302 -178291 56133 367986 708329 972181 1093565 1098994
48007 1098994 1034420 889600 634273 298462 -20626 -223640 -267173 -176565 -26859 92863
47997 92863 126106 89486 68868 143033 283746 355577 259979 66440 -59188 -57582 -32636
47986 -32636 -81757 -155514 -153533 -94004 -85468 -147533 -163247 -43912 124191 153694 -33635
47975 -33635 -301436 -419287 -293734 -63694 64841 66190 111173 320338 589889 729493
47965 729493 695665 584346 448326 267365 98179 101192 352202 724456 1016770 1116562
47955 1116562 993960 658225 227759 -48071 13649 325343 625810 759383 757031 675682
47945 675682 510878 298321 163153 190534 329666 482726 607207 676505 638227 499576
47935 499576 372456 328668 274849 90558 -154922 -256453 -126948 127745 375167 555222
47925 555222 608384 478103 251199 140926 220928 296876 171494 -58549 -120460 79833
47915 79833 375685 582285 662144 647352 557969 445615 391095 398953 393911 365277 394667
47904 394667 472328 419643 125271 -229957 -345312 -171654 42323 94965 82152 229058
47894 229058 564409 866678 915056 718666 483265 392794 448209 506713 449086 284829
47884 284829 99596 -53818 -171504 -234082 -201071 -94694 -30570 -103355 -255737 -315629
47874 -315629 -174323 107187 375816 526843 547303 473752 370565 330927 421596 601492
47864 601492 747384 791006 786712 811383 850175 837082 765767 685470 610675 519229 437373
47853 437373 438233 533066 640028 695367 730600 799443 885584 928426 896608 802332 693106
47842 693106 657042 761202 930881 969135 782084 526644 438610 559090 733176 832316
47832 832316 840668 739649 477803 110113 -173360 -252099 -215186 -205840 -209143 -109309 94099
47821 94099 261473 308101 309765 370066 458606 446615 281023 75400 15369 178728 452526
47810 452526 640447 662058 628754 701529 890470 1031309 961585 687346 362593 130862
47800 130862 18339 -18854 15962 168468 419156 622986 638543 504652 403172 425677
47790 425677 464867 389142 238310 152398 165242 188798 180901 199424 273768 347324 394238
47779 394238 475681 601553 642214 498788 295221 254657 395323 493008 385666 191044
47769 191044 134618 244011 334478 279801 179086 205153 360421 466673 385006 171789
47759 171789 -8902 -70630 -52769 -22765 -3021 10117 24937 65202 139258 185148 124872
47748 124872 901 -38302 51761 121314 46107 -63577 -24766 120787 168251 85628 61039
47737 61039 173534 254253 192225 160124 345670 620427 704526 559619 381753 271009
47727 271009 170286 115400 258310 571576 785397 743501 611507 589140 616054 555210
47717 555210 497869 628507 865711 902795 621000 251569 74395 118037 221371 258336
47707 258336 221607 171560 167734 197157 153078 -36169 -250400 -266302 -42771 204213 283415
47696 283415 268592 347601 522949 610890 510363 331612 232460 230911 229553 161521 56946
47685 56946 -11338 -8112 42330 103327 177834 284746 384273 385387 269841 158945 185288
47674 185288 322650 422938 415582 383648 425610 526729 605582 611022 519865 315167 52014
47663 52014 -110309 -55636 119062 192055 99954 28767 160513 409425 505411 309637 -39667
47652 -39667 -290718 -309070 -134972 108167 310119 421428 466796 515515 612218 730956
47642 730956 804072 792529 726497 683681 718747 793659 788589 621692 365022 200650 238510
47631 238510 403288 518105 474565 309874 153995 122396 224599 349352 365068 251011
47621 251011 98075 -17217 -86560 -81160 78965 383899 653269 720929 647909 620090 674945
47610 674945 694244 662713 734805 968906 1168999 1126284 901460 713909 626823 513234
47600 513234 310817 137771 115481 208832 313096 406740 532090 675999 759610 742952
47590 742952 676964 634414 626754 614977 582753 561004 569872 568723 499603 367907 236699 141726
47578 141726 63550 -4430 -23302 20502 72490 94794 139208 257586 383756 414313 395819
47567 395819 498581 753657 931204 786577 369875 -24657 -201531 -236860 -282295 -322801
47557 -322801 -240310 -58326 28202 -93291 -280406 -304147 -126637 92190 232912 335696
47547 335696 460179 546980 496893 319866 127649 20296 42288 198048 422724 568276
47537 568276 516066 303653 65658 -137652 -339299 -518960 -564040 -428121 -220749 -55224
47527 -55224 108678 355312 596388 612328 341782 14163 -85654 76950 297297 406757
47517 406757 428898 451288 458245 377511 233716 144618 164491 223396 245837 249521 288137 370035
47505 370035 485899 647524 829046 929424 880158 747943 639713 545609 387635 199069
47495 199069 116030 170367 225594 175747 92953 97444 176356 233642 256091 319271 454629
47484 454629 603997 697145 701980 612494 461523 336129 303729 323489 305226 256695 284560
47473 284560 428245 584296 644094 624666 591406 523208 362059 161973 61618 92938
47463 92938 135391 110425 105153 202912 285773 165659 -112265 -270798 -152799 74529 154518
47452 154518 56640 -65193 -133533 -202866 -290343 -318678 -252199 -159630 -101014 -56998 -11544
47441 -11544 -7406 -68277 -147048 -198189 -224147 -207718 -88822 126680 312301 349596 256970
47430 256970 135000 51589 42494 143440 328389 475848 496134 451392 458454 515800 528111
47419 528111 468617 407386 396912 439753 559173 777184 999509 1038241 808606 434728
47409 434728 114488 -66060 -148310 -188973 -188115 -113308 34654 185200 243572 193386 124410
47398 124410 116449 127856 63194 -72231 -167262 -153268 -78850 -22203 2690 31858 98301
47387 98301 208748 327043 379168 328571 244885 238093 328096 444921 547381 652432 740160
47376 740160 730243 593055 409745 282236 240236 258636 299617 313082 262898 178736 121212
47365 121212 84990 11041 -99238 -177904 -213939 -272917 -361549 -390349 -322796 -245924 -226681
47354 -226681 -208968 -126512 -6909 116607 279441 477445 605824 617151 615758 664546 635377
47343 635377 428771 216047 230151 394509 424797 277000 208124 338372 432549 260612
47333 260612 -39329 -152757 -16505 140925 136672 43117 44670 189556 329588 288865 85525
47322 85525 -40627 121806 491324 768345 782673 657583 593783 615686 617360 560249 506307
47311 506307 499387 515045 511608 459479 337799 165460 26238 14507 153606 377204 565741
47300 565741 606123 479212 304915 233402 274474 313100 303385 326544 414206 458549 394057
47289 394057 336787 407261 520356 513278 410173 385351 501198 651704 747139 786498 751206
47278 751206 602181 402943 274093 186990 -23988 -379956 -658970 -675942 -510796 -340499
47268 -340499 -182950 36233 261399 333924 214545 33340 -78929 -96619 -46490 32595
47258 32595 63524 -30932 -225220 -391761 -431644 -357383 -238789 -124856 -35338 24021 66822
47247 66822 116100 169022 188398 138543 25699 -87121 -109929 -14832 91069 49347 -146976
47236 -146976 -303839 -251856 -54257 111309 216221 380097 627503 815403 847011 813747
47226 813747 848181 947703 1027206 1050348 1014936 887794 658191 404095 214589 91333
47216 91333 3124 -26129 20659 71143 65484 86688 238519 419063 392049 114277 -171138
47205 -171138 -239908 -149837 -104969 -167840 -228566 -195740 -97501 -15295 -8907 -92421 -207248
47194 -207248 -232640 -97374 124816 297103 387673 480164 610713 679361 570968 314775
47184 314775 66344 -54977 -62140 -26720 42301 189295 382520 471798 350155 127697
47174 127697 46677 205819 454554 591988 576823 482617 346788 174294 29020 -7986
47164 -7986 42920 89467 105339 132469 152712 85507 -55301 -123920 -29151 132118 206683
47153 206683 182688 165182 192294 177315 53124 -94032 -95810 89102 282655 264361 43865
47142 43865 -123638 -46719 158432 233540 124164 15921 48909 166007 272814 376248
47132 376248 486175 526797 451936 335038 245741 151763 48545 53429 222229 390733 383751
47121 383751 287445 294193 340187 168235 -227909 -494605 -366051 -8013 236072 276192
47111 276192 271999 314323 325898 255690 181392 168834 154760 44235 -137275 -253574 -197647
47100 -197647 19378 307599 579851 770329 808661 651504 370393 143688 89162 134921
47090 134921 126958 30910 -67698 -136246 -231952 -345515 -349163 -172931 74595 242331 299309
47079 299309 276094 147729 -92365 -305099 -303831 -76825 201536 381660 455990 462719 392344
47068 392344 240302 71954 -26434 -27489 34140 100859 113300 32835 -125065 -294859 -409462
47057 -409462 -434869 -369651 -239513 -83578 81322 263983 435238 500695 403785 230487
47047 230487 123264 92984 15798 -156887 -289961 -236960 -47521 90021 78826 -7090
47037 -7090 -68998 -111931 -180923 -233977 -165191 39458 237350 271834 155031 50268 72314
47026 72314 168695 224342 218446 220968 281409 394045 544362 708405 817211 806538 708732
47015 708732 617830 554015 447262 276162 128325 75059 72565 57506 69897 191017 398480
47004 398480 570944 623423 569582 464114 353725 284387 294479 387452 543908 745589
46994 745589 941510 1017951 885137 604329 355059 246554 219178 164040 79368 50655
46984 50655 111409 191241 201574 122776 -5009 -135574 -232953 -259748 -192551 -56638 83423
46973 83423 183999 251480 295126 287002 212927 133730 123999 156951 136205 53925 11942 42479
46961 42479 29992 -95310 -204476 -158176 -54928 -89904 -210998 -161771 103275 311344
46951 311344 296625 280246 510890 818778 819660 474472 138358 50689 72989 15755 -45136
46940 -45136 51818 245175 323883 216255 40193 -76075 -87279 -285 116878 137218 12358
46929 12358 -127006 -129366 -39754 -18431 -74021 -49012 116848 286614 353689 413122 594961
46918 594961 833940 938723 848879 708548 678091 745678 759813 635126 497955 574414
46908 574414 896952 1188484 1144520 800567 481112 380439 363949 245293 80264 45060
46898 45060 149236 241872 237710 178337 108059 39230 17657 77985 148109 142393 139012 299815
46886 299815 596361 789142 737882 576296 497436 510683 519955 513689 533209 538285 458637
46875 458637 339475 298666 358047 441162 524589 655111 799962 818227 647443 420782
46865 420782 317328 356809 419266 422979 397070 392647 403366 391335 339725 263246 206099 233211
46853 233211 362417 481134 404922 88388 -273334 -446780 -433672 -421555 -463042 -372892
46843 -372892 -37023 322167 366815 72920 -242936 -324481 -228770 -142567 -126154 -142387 -199210
46832 -199210 -316680 -428479 -453996 -425444 -423283 -428442 -374423 -318428 -396915 -587880 -675649
46821 -675649 -521955 -241807 -18109 141207 331953 527031 591092 504088 406808 387659
46811 387659 361483 227448 34319 -99886 -141749 -114126 4036 215433 392811 387452
46801 387452 244110 152970 166419 126848 -66122 -282720 -361067 -330448 -299107 -250489 -131042
46790 -131042 -42818 -128328 -300069 -309019 -98183 121962 197808 227336 341698 477776 501884
46779 501884 423320 341898 280921 210226 162416 191921 263094 294100 280399 280312 310351 336098
46767 336098 331361 281274 183268 110257 186354 400128 528637 383753 79864 -82179 38659
46756 38659 324973 604835 794943 856251 781232 661988 634429 711785 780742 780213 758812
46745 758812 733688 641896 490076 406710 448970 477261 347373 151437 132138 376556 702623
46734 702623 862172 786810 611087 495005 458689 397781 244144 63653 -37657 -56471
46724 -56471 -69549 -97537 -87567 -30961 6808 3812 31684 131667 216131 165453 -15697 -194906
46712 -194906 -245362 -153733 -19487 34526 -24815 -111319 -127652 -84681 -65541 -98135 -138641
46701 -138641 -161471 -168230 -113023 64742 308845 458450 435256 326984 249384 221157 210350
46690 210350 197735 150316 45079 -30765 66795 308898 449532 320067 60372 -58987
46680 -58987 50595 275198 485143 598679 547709 349096 163475 130212 185250 194472 216391
46669 216391 435172 831842 1122522 1085746 801509 500695 309557 219552 193389 196215
46659 196215 179206 109048 -11880 -175558 -364631 -512242 -550737 -519932 -525631 -554550 -450048
46648 -450048 -146445 186798 349651 373915 438234 570023 600452 432212 196868 74041
46638 74041 68271 63843 23677 15094 69449 133333 165891 185224 197885 178095 150134 189041
46626 189041 281294 289439 147633 -1017 13177 136887 172482 61517 -70531 -129014 -132037
46615 -132037 -74487 95111 316085 422444 385027 374127 494354 635128 690642 736209
46605 736209 836699 867009 722387 551118 546517 630432 600915 505129 570334 782024 826733
46594 826733 519056 49676 -279197 -376070 -331791 -238098 -141206 -61306 27171 156497 272607
46583 272607 276697 180145 110636 147146 256759 392869 523001 560120 423765 189479 22195
46572 22195 -56845 -166614 -311225 -334420 -190909 -55848 -59932 -99043 -34051 74718 67959
46561 67959 -94280 -321796 -489009 -461210 -170520 239557 497043 533511 573826 780562
46551 780562 991388 968511 739535 501218 331798 207009 173087 267454 349972 245937
46541 245937 14636 -124923 -92723 17692 149899 320759 477410 529285 517877 562291
46531 562291 637931 595539 399424 159761 -70992 -330096 -554097 -572558 -358093 -97857
46521 -97857 65330 202167 416040 630988 670497 470517 142600 -121405 -189242 -109232
46511 -109232 -88652 -252952 -444218 -392814 -80153 232201 348974 336581 328717 327548 293222
46500 293222 271679 314902 388824 459811 564364 700150 760014 680309 558144 515474 532474
46489 532474 516447 450341 366423 254488 116092 47724 147890 375651 595304 717844
46479 717844 712452 547044 244403 -41074 -138972 -54227 70166 178767 359995 641293
46469 641293 862257 858661 702524 626773 709495 761105 600501 350309 315805 585139 904424
46458 904424 997446 858922 637506 390279 132249 10029 176279 512808 715347 682757
46448 682757 605545 621722 618231 477562 307068 267138 329256 362264 334317 284469 215542
46437 215542 167400 276763 583584 865307 851651 554762 221600 12069 -96038 -118776
46427 -118776 7119 266529 489557 508416 323933 94378 10094 157617 436172 632192
46417 632192 641963 575111 565460 558764 413623 156172 -22131 -15116 83183 126418 71933 -22207
46405 -22207 -69590 -22941 66322 87553 37951 80909 329149 640213 771117 686123 555960
46394 555960 492322 456291 409912 377058 348637 294580 271045 343530 410990 310696 111686
46383 111686 73173 252879 386152 254253 -32252 -231009 -255750 -143904 68957 288541
46373 288541 350055 239712 180345 325697 516271 525076 397165 319584 279989 123835 -114995
46362 -114995 -219907 -128236 -14756 -3563 -13032 55103 158932 219731 232463 211193 152982
46351 152982 102500 128963 204744 234413 224659 271907 352195 309039 122413 123 79474
46340 79474 202860 148904 -39219 -136044 -64750 36443 48105 8353 14723 114050 299151
46329 299151 506775 605161 484678 200942 -29620 -10861 263612 596280 720963 512964
46319 512964 121279 -158067 -190365 -111532 -74174 -13582 193718 452923 551418 495846 510223
46308 510223 671603 780697 677102 471047 336240 255092 127300 -17140 -91909 -128216
46298 -128216 -187931 -186697 1504 313006 554550 661080 707710 692966 526100 248491
46288 248491 49724 -4597 -66286 -229565 -341845 -227784 34780 224567 276738 311767
46278 311767 408099 503281 530980 531084 575028 652403 686229 638436 558839 516221 505689 474353
46266 474353 441979 504676 652883 687102 456561 116957 -37765 19829 34586 -113579
46256 -113579 -224712 -117341 85066 179100 193911 261693 330371 257031 95052 34388 96237
46245 96237 120928 48464 -4286 42894 130794 184156 174545 71571 -95684 -155954 21099
46234 21099 279707 353598 287189 401903 783648 1099364 1062212 818228 680151 691384
46224 691384 681175 599487 555884 602903 683625 754419 806220 805449 736839 649896 560505 394360
46212 394360 142287 -39910 -34437 45428 41974 29996 186900 450409 558231 435586 308174
46201 308174 371272 543273 632141 587125 486980 396865 331924 281458 199173 39156 -150482
46190 -150482 -246803 -208218 -129011 -92051 -58117 32198 129789 140788 69296 6362 -3955
46179 -3955 -9497 -56627 -112351 -108935 -41859 11944 -10484 -62853 -35347 89599 180528 104873
46167 104873 -101964 -272644 -285794 -149001 60819 253413 335656 265765 119782 30558
46157 30558 40399 79063 94254 114616 155193 159975 106050 86002 190348 348442 392402 283938
46145 283938 183349 249221 437712 575216 597472 613024 699974 743111 579837 265159
46135 265159 56745 111818 315431 465327 518096 556390 595005 554230 413817 287340
46125 287340 314578 519139 771649 883286 785978 642755 693524 939677 1093000 935121
46115 935121 610975 415018 386509 323112 144069 -3993 -25979 -27304 -99434 -158832 -127049
46104 -127049 -112574 -257944 -503542 -645685 -570856 -324853 -18597 215186 229027 -29228
46094 -29228 -405033 -636789 -595720 -379794 -169864 -37185 105532 388745 813446 1184495
46084 1184495 1254003 959034 488311 97237 -103236 -163976 -172471 -157275 -81102 102840
46074 102840 363595 566985 597658 502524 423357 379030 238671 -39233 -276699 -293296
46064 -293296 -155379 -78869 -145295 -248484 -286635 -263470 -195510 -54615 150668 334042
46054 334042 433422 494135 591862 708262 743186 649200 510156 458584 524545 598603 563253
46043 563253 435481 339841 352561 423977 461362 437136 393662 379368 403091 427584 399449
46032 399449 308848 214210 177484 191069 208871 221569 242627 250979 224025 198101 206711 192112
46020 192112 90091 -27842 -33352 58906 129366 177612 309973 483425 492526 294069 126020
46009 126020 182025 366159 505946 603255 701524 706386 562281 440715 500933 593605 470077
45998 470077 184699 158 -44614 -164663 -432752 -648541 -650263 -500165 -297824 -47763
45988 -47763 206157 334325 311837 273631 289437 260895 137587 56068 135616 277503 302076
45977 302076 185830 49132 -12331 8244 66894 102815 88114 69870 93401 98375 12084
45966 12084 -74955 -6882 153204 159379 -28738 -130414 46991 297575 309290 103026 -45076
45955 -45076 -15810 52414 37801 -1936 33488 134880 212299 200142 124393 107836 269645
45944 269645 566858 795588 818175 723651 684069 721563 715559 587371 378273 179127 63690
45933 63690 57341 105284 110076 48109 -8688 -21120 -38574 -78939 -73424 -7120 14642 -60122
45921 -60122 -122577 -87222 -41399 -62821 -35556 155141 367406 375290 217852 137377 219125
45910 219125 333379 403215 471039 496627 356738 95275 -73948 -85572 -105775 -206658
45900 -206658 -204159 29583 302777 346341 177892 37954 64292 204280 377045 547133
45890 547133 661239 651556 508632 276620 5175 -230907 -322895 -226380 -29030 148493
45880 148493 268335 332115 307849 203709 143623 236032 398536 441735 320727 183288
45870 183288 156636 199814 203972 143501 68718 11948 -31192 -50762 -9253 108397 251764
45859 251764 331546 302475 215568 165004 181513 213409 222601 245767 320231 395470 385089 291493
45847 291493 214573 229928 307659 362797 343342 254785 142718 80547 136461 302799 469245
45836 469245 515351 436858 335047 267394 173339 1706 -149102 -125300 59704 219298
45826 219298 244749 241774 339471 470413 462417 285991 82278 -23451 -17695 65133 174276
45815 174276 217728 132889 -9034 -84912 -107393 -200049 -375018 -486012 -442493 -320931 -203235
45804 -203235 -57272 132819 262317 252672 185598 161487 128219 -131 -136432 -106114 89539
45793 89539 252015 231594 71612 -97082 -189070 -176535 -80836 4044 -40838 -232506 -438675
45782 -438675 -489364 -331793 -81004 75062 45785 -76769 -141212 -142949 -222100 -429230 -607213
45771 -607213 -587713 -410509 -246045 -183032 -207098 -305033 -437651 -462610 -256801 86325
45761 86325 325028 342866 236652 146878 136399 221981 362211 402167 202848 -133376 -333458
45750 -333458 -306873 -257288 -357713 -490937 -451734 -265330 -127307 -106614 -85089 32125
45740 32125 192963 289967 267352 133518 -40615 -129765 -43727 172335 378469 479280
45730 479280 473703 384125 212860 -13191 -208460 -271079 -150236 120033 431749 660148
45720 660148 738925 680915 528706 321120 116233 -12855 -47418 -43929 -43348 -7833 100574
45709 100574 232115 315379 370869 467326 582522 606078 494636 340808 256236 248518 250677
45698 250677 227062 209168 243633 324111 368013 276225 52118 -152136 -166688 7806 195166
45687 195166 243295 176501 126100 169598 286446 425550 548156 620937 630934 610518 597777
45676 597777 571379 482697 363754 329604 424174 524120 477416 308323 188061 199232 234922
45665 234922 173002 49610 -22513 -30053 -42231 -63191 -27596 64783 133552 151974 176360
45654 176360 209176 161153 16784 -82355 -22469 104269 123699 18026 -81612 -93495 -44611
45643 -44611 38959 153020 221060 129965 -90788 -251957 -236094 -139788 -101942 -89345 28193
45632 28193 250521 431482 479576 449437 410725 340135 203895 59495 -14374 -40524 -97086
45621 -97086 -163849 -120127 76316 299529 403829 393918 370773 361088 301798 172738 33097
45610 33097 -86151 -219043 -358456 -415091 -341870 -211539 -99250 27370 206779 345200
45600 345200 304718 100991 -102181 -187683 -171677 -101855 14812 154862 245217 237198 163946
45589 163946 104713 133718 287453 508539 639192 571542 402504 323200 344602 276698 30240
45578 30240 -211399 -223517 -24024 197835 343855 454550 553955 603952 607814 631632 707099
45567 707099 805231 906198 999696 1016623 870614 596955 357984 268603 285852 306406 305029
45556 305029 328302 398036 469258 469768 370096 233643 178872 242178 300453 208989 7814
45545 7814 -110598 -56022 49070 61523 11134 22848 134268 286041 422510 496284 435564
45534 435564 238804 71236 124281 367934 568058 575805 480017 432004 446439 456726 460330
45523 460330 493068 521219 478171 382858 319388 312697 320675 340041 411695 507018 519268 411964
45511 411964 280832 209219 151640 47482 -21826 88658 367341 613840 648269 477488
45501 477488 237132 51466 -8089 95262 332540 574448 665717 567159 396795 304550
45491 304550 316696 328959 255015 147712 136566 259137 411949 485275 484106 468430 432059
45480 432059 325778 175824 83436 97388 167968 241988 319558 392387 420558 422534 499099
45469 499099 687526 858368 852317 682758 512525 450540 454256 419377 284552 54420 -196984
45458 -196984 -339616 -284298 -86625 107156 226211 317536 413562 448599 355860 181080
45448 181080 38641 -8187 22800 86036 141669 159929 139427 114124 117311 154821 228566
45437 228566 347007 477093 528157 448078 320317 293111 395198 482924 413409 231031
45427 231031 119337 172697 282737 285122 165291 50106 18829 13441 -42933 -128594 -185626
45416 -185626 -230493 -312891 -401174 -409674 -338608 -293176 -337189 -401064 -376067 -251529 -115254
45405 -115254 -39103 3234 97556 266031 400118 372279 227923 175176 316123 480541
45395 480541 443498 234687 78402 74802 124529 152463 195010 237594 187712 81183 93219
45384 93219 236337 275600 104008 -21531 153786 462649 537913 335060 137014 101427
45374 101427 108318 53627 -2689 -29026 -90172 -142038 -9903 312716 563345 545614 380693
45363 380693 289428 303955 354441 471215 689717 862345 788552 502465 252809 196218
45353 196218 246345 233493 102694 -63531 -142884 -82997 42737 104685 73456 60991 163194
45342 163194 320273 391587 317498 153563 2231 -36094 87513 304581 470518 521804
45332 521804 522190 519146 472113 389036 391767 528508 651731 633732 590474 709064 935971
45321 935971 1039627 942319 792222 715629 679508 608643 481209 303820 136410 121840
45311 121840 320802 536131 503985 269487 152308 292201 457430 405249 225222 172319
45301 172319 306407 461817 496656 445912 467011 692686 1075981 1361100 1316879 1020368
45291 1020368 769475 696750 664175 589062 615977 814569 948440 782885 455496 281953
45281 281953 310142 337929 297801 329442 470525 546303 428809 202387 13004 -75802 -35479
45270 -35479 142723 359506 463053 446967 442406 474193 407984 212600 81608 167243 351282
45259 351282 427488 382696 338377 325925 309408 359554 589449 914254 1067663 920641 648764
45248 648764 507667 542637 605101 581630 497922 417541 344336 263960 214739 244700 312505
45237 312505 305177 183210 49896 19872 58293 32072 -86163 -156394 -49421 178135 339650
45226 339650 317624 168055 47867 66119 188798 274577 224701 97401 34986 82768 151734
45215 151734 179048 231705 381892 553367 595904 483963 342225 279223 289595 329598 387874
45204 387874 439015 415029 294536 163435 109665 96624 27806 -82964 -108142 8816 160115
45193 160115 213962 172165 122499 99176 77858 63007 74690 70014 -7660 -102263 -93964 1451
45181 1451 21277 -93718 -178224 -80639 99687 163523 110523 103697 179575 201362 123679 104605
45169 104605 263821 480003 553440 478777 429868 514216 650016 686006 573952 407699
45159 407699 319464 346812 410814 438275 463982 545747 611868 510118 229068 -38985 -103896
45148 -103896 41292 282608 519040 667302 642767 448458 229430 147295 231859 402091
45138 402091 560405 611662 499039 325796 339061 644459 1000637 1057114 768230 422488
45128 422488 281177 345068 477418 587003 645723 668059 729502 886694 1034515 971415
45118 971415 667239 339126 186047 172711 167510 161352 212456 279278 279044 254506 305009 372978
45106 372978 287538 53027 -85359 44147 295430 397020 298286 180511 164918 166696
45096 166696 67719 -93806 -184158 -151541 -59131 20926 63022 50224 -32099 -138744 -165386
45085 -165386 -54472 131769 286874 389963 517041 724757 961083 1109238 1102929 977015
45075 977015 805704 617145 398383 174715 26202 -11515 -17621 -92403 -216216 -280599
45065 -280599 -257027 -242668 -307668 -380324 -340926 -173916 26028 152084 142081 -8376 -224887
45054 -224887 -380877 -404922 -343600 -286900 -272203 -291988 -331217 -345437 -271193 -127767 -42083
45043 -42083 -89046 -168466 -135183 4756 132656 199172 246691 286745 283969 245102 203416
45032 203416 128770 -28042 -216916 -334505 -365756 -350920 -252657 -29795 178012 152414
45022 152414 -86040 -270605 -255610 -180095 -181350 -169782 -29233 160373 282941 404011
45012 404011 619899 809697 760283 475265 166038 -16353 -64305 16166 220973 449829
45002 449829 570180 581409 572798 546598 448120 344197 374141 511616 569985 483463 397773
44991 397773 421621 464396 403613 256246 90581 -82982 -220480 -180309 103504 468842
44981 468842 680483 682958 592417 503247 429352 392609 426425 482993 449938 296699 136850
44970 136850 107746 216401 319114 244526 -47271 -407399 -616355 -576413 -371138 -145248
44960 -145248 14757 75510 28035 -75193 -122719 -56362 64522 167081 266816 387912
44950 387912 458021 408281 338422 433474 700052 910320 847925 517677 93678 -224385
44940 -224385 -272772 4667 441445 719352 687495 536053 523470 615143 575310 367272
44930 367272 219456 248478 258361 56802 -213878 -258542 -30924 248376 408433 456282
44920 456282 424177 313102 210390 253625 414324 495926 414294 303685 269090 233599 152900
44909 152900 176756 405857 643081 611977 331972 66489 -32973 -24461 22572 98166 145805
44898 145805 98567 22028 31642 82976 50948 -811 119389 379892 507528 401721 308173
44887 308173 453412 735859 931816 1003601 1031247 1017245 947610 903303 927761 905006 736118
44876 736118 513116 355328 213803 22253 -105121 -47734 79363 103718 103833 262670
44866 262670 496181 540146 383234 296135 396104 483033 388414 217627 136310 148384 199802
44855 199802 289654 363389 304760 161205 171377 420051 660962 651518 479450 365911 322186
44844 322186 238384 169604 253336 412779 422187 260270 144884 185631 237526 172096 84860
44833 84860 116008 220774 254567 187584 105146 52106 -3939 -72082 -96537 -31020 98642
44822 98642 223199 295511 319397 329836 354162 386149 384201 289588 71147 -211932 -405278
44811 -405278 -378613 -167492 56460 172733 204067 205221 165697 93512 94989 250273 465478
44800 465478 573255 548702 506043 509386 519526 511628 494318 405467 158513 -157936 -290318
44789 -290318 -120344 177638 379072 482863 617655 786586 870939 832948 756360 703444
44779 703444 666972 652060 672518 666684 550908 371576 272494 284961 287856 223995 209584
44768 209584 333614 470208 425979 213440 53047 123097 395502 696013 847167 775240
44758 775240 556365 349484 234812 155412 64526 43491 164955 315475 313044 167941
44748 167941 52891 18538 -63329 -230667 -315759 -208380 -53455 -32445 -90131 -60442 41976
44737 41976 65154 2700 19660 188410 384675 488676 537399 619637 742095 860857 950811
44726 950811 992554 969812 914655 875368 817186 652282 403591 238824 284792 480336 655488
44715 655488 689793 569444 371668 221527 183642 180975 109553 21748 54903 176191 190747
44704 190747 55490 -30738 41191 91109 -42806 -197628 -126658 103033 233518 246566
44694 246566 369453 668342 925487 961272 825790 617737 365172 167918 197834 407961
44684 407961 459060 128095 -362090 -609608 -514498 -307302 -188882 -145111 -85634 19716
44674 19716 159322 299239 362802 292559 149498 72769 134872 296624 483523 629845
44664 629845 671773 594761 488706 466650 515649 507707 378346 220426 166386 231640 312039
44653 312039 300551 171057 -32501 -250731 -438080 -551880 -552013 -448985 -331254 -280850
44643 -280850 -258713 -147934 69032 262286 327785 322496 361855 464699 579818 682564
44633 682564 742463 677153 475842 309777 358169 547577 632167 538135 455232 547184 741279
44622 741279 881288 934965 939431 866230 681446 469147 363186 384662 439963 448044 390545
44611 390545 279024 160696 118282 168824 191102 55849 -181629 -317603 -238075 -40607
44601 -40607 90673 57669 -109375 -296784 -366419 -243315 7410 226768 309605 274595
44591 274595 183688 51369 -133751 -339316 -482584 -485310 -329110 -77136 161178 315922
44581 315922 403903 466336 491864 459859 426150 464299 520851 443967 191610 -97771 -291577
44570 -291577 -397527 -430926 -287847 87226 491931 625592 453290 231222 141997 83497
44560 83497 -104612 -366388 -509289 -452847 -263791 -12308 268905 516781 663281 731909
44550 731909 805132 890013 912977 860054 823232 870755 948432 952404 844667 666984 497326
44539 497326 421154 482264 617181 687494 622852 495827 425340 457303 577626 774972 1015842
44528 1015842 1202439 1249238 1197504 1177007 1240929 1296939 1220030 991417 713885 528665
44518 528665 524083 676485 853007 905153 793300 611457 478938 423532 378403 269283
44508 269283 86306 -113071 -251226 -289492 -260444 -239731 -270049 -310815 -277446 -139120 33912
44497 33912 137453 142279 108989 90720 67150 12906 -12436 76084 242467 334239 271837
44486 271837 158489 141277 224476 302187 335985 399628 544624 705398 765515 667719 443757
44475 443757 183319 -12277 -93861 -108311 -153506 -279852 -456020 -615939 -695787 -641948
44465 -641948 -453914 -229990 -104159 -113300 -178619 -229380 -272419 -310541 -276303 -117129 103091
44454 103091 258857 294319 245570 165318 95935 100845 237459 467116 639752 613879 393724
44443 393724 136502 20312 99232 281040 436784 509072 505136 435004 322776 255333 320428
44432 320428 466357 507483 328801 32307 -173373 -184316 -57965 81124 124733 20881
44422 20881 -180876 -337442 -332887 -186863 -4497 147021 260360 333259 368127 395415 422114
44411 422114 390494 273703 177238 234323 409755 520951 466091 328710 236656 214824 203172
44400 203172 131039 -46995 -294079 -449014 -350498 -45177 227342 300278 234315 172240
44390 172240 157506 152420 114765 -14140 -273844 -557868 -661049 -556692 -473764 -555450 -602058
44379 -602058 -363220 42282 263853 213343 138750 206880 302627 307504 302325 365566 402021
44368 402021 332512 264963 303355 347523 268829 145373 119526 140319 76698 704 99418
44357 99418 334733 455769 380643 314537 402200 488911 370914 116172 -34830 14415 160888
44346 160888 298304 406494 459348 390595 196441 -8803 -86810 5042 201843 407996
44336 407996 565883 658762 672126 593756 473540 427070 500063 561521 450898 236603 180247
44325 180247 380877 602975 581732 380606 276357 363667 478535 504076 535765 670027
44315 670027 805775 785884 628891 485989 428634 407580 392812 420210 478416 461719 303384
44304 303384 97911 14747 100884 230566 267660 226387 222782 297165 366173 368541 371068 456752
44292 456752 564045 541534 353481 134033 23629 40874 139613 293764 467557 579375
44282 579375 569241 458738 297276 110829 -43949 -60966 84190 252186 308150 321842
44272 321842 453178 658020 686913 426245 79451 -88899 -57994 28397 132229 320988
44262 320988 533188 558256 323967 53479 19308 225379 447514 530375 509685 455866
44252 455866 346228 150402 -63332 -196749 -240841 -242654 -191007 -30143 215956 419913
44242 419913 478163 405860 286572 187017 152744 229249 423152 654414 792096 749462 540632
44231 540632 260029 18181 -118666 -146451 -94250 -949 69608 42382 -75690 -146191 -34692
44220 -34692 201581 355739 320146 193777 108474 65876 16215 -18640 -11421 -24698 -106078
44209 -106078 -157260 -58726 115580 169854 64584 -34262 2211 129910 272522 438187
44199 438187 622521 734408 721477 671625 690770 755128 773578 728095 667441 628944 654742
44188 654742 815336 1103558 1343818 1318833 986241 507717 96032 -102044 -32893 234331
44178 234331 514503 642301 613869 539601 490544 473839 516225 643229 776577 781071 643554
44167 643554 492796 401803 284598 59806 -176113 -234226 -48839 261395 517319 617467
44157 617467 594043 577726 663612 771810 704959 404703 76181 -43230 18406 36872 -63533
44146 -63533 -103536 63378 316152 440572 431528 460535 586370 674351 628870 548323 571655
44135 571655 692656 825121 946341 1043062 997443 709128 318628 124783 226824 396273
44125 396273 378404 188899 16211 -45036 -28351 42643 163588 265919 285807 304072 457444
44114 457444 693928 780584 618909 410804 407499 593094 736097 692209 526314 353335
44104 353335 190233 8449 -158525 -240195 -235180 -224845 -267964 -324903 -318430 -248187 -202215
44093 -202215 -252899 -378398 -496228 -537246 -473881 -322568 -146934 -13712 91105 257217
44083 257217 517235 766985 875679 831761 715514 576243 422755 296814 249422 252664
44073 252664 230142 173383 141422 152671 170729 190270 234152 267777 228810 148961 129329
44062 129329 180553 206364 158872 79586 -23225 -173643 -273135 -141610 202836 492571
44052 492571 553642 517844 550543 561318 395256 154066 64983 121888 128256 53114 61947
44041 61947 180363 208064 51740 -97059 -47268 112591 168974 85174 -2248 -7355 22535
44030 22535 15487 -28872 -39073 74218 325463 588426 685084 577021 408622 330614 349628
44019 349628 379552 355740 254372 84405 -81172 -137535 -64652 55254 173011 328474
44009 328474 514649 602403 509621 359725 338900 440214 480368 354790 149130 -16750
43999 -16750 -135308 -243443 -291179 -173235 112623 408555 546456 538182 555389 696453
43989 696453 841492 810752 615433 440585 396356 415315 413635 416683 465201 513850 501386
43978 501386 431285 317590 150735 -10028 -21331 168546 423179 591638 671487 692108
43968 692108 572017 266263 -45411 -130097 -19138 47846 -22196 -82061 -15402 105900
43958 105900 185797 239108 289252 295007 263559 287042 373992 392274 297907 282606 530179
43947 530179 911487 1098210 954225 656250 415970 235491 14439 -207282 -253462 -63343
43937 -63343 180048 266259 240111 317854 511370 532799 201121 -228310 -365319 -213013
43927 -213013 -114832 -207692 -260272 -129501 -33117 -164636 -319757 -197140 116721 287748
43917 287748 253606 260366 397086 433505 210640 -82770 -172472 -43744 130358 262552
43907 262552 387181 504717 546854 483205 369512 295440 327829 467817 619755 650223
43897 650223 530967 383989 336945 373731 377196 280867 123006 -20903 -100603 -95911 -8375
43886 -8375 139552 308519 443476 481577 394700 230921 79085 -14588 -61383 -72222 -47665
43875 -47665 -28796 -75917 -163756 -176248 -59092 90763 155798 161049 222306 364567 482269
43864 482269 480144 384251 300238 304680 381626 435909 380615 243039 158879 217828 346460
43853 346460 405860 375509 352781 377588 361527 223999 11494 -168844 -261905 -253556 -122412
43842 -122412 104985 294776 310024 175759 54373 47374 101660 124357 96017 33149 -62137
43831 -62137 -143706 -100418 103601 330014 427450 447502 555653 745911 824908 722259 627665
43820 627665 700214 793513 646130 262500 -80553 -177670 -73868 96662 272254 415363
43810 415363 456280 381472 292912 301420 411040 546390 630124 607300 479887 359500 394937
43799 394937 585543 743996 709803 531036 372746 319882 344232 393937 424199 390092 298476
43788 298476 233815 260159 333611 373843 371072 352072 299617 194592 91335 60959 98420
43777 98420 166199 277851 445720 599149 657097 632286 565072 428898 231087 124007
43767 124007 235627 441231 504946 420909 393783 488908 560036 564559 663641 890807 997577
43756 997577 824104 593425 591869 733126 720970 529584 416242 494864 594929 575475
43746 575475 513914 502165 480077 389309 321328 382695 530795 650743 694199 647146 465488
43735 465488 160087 -129764 -266470 -274691 -277853 -319072 -341755 -313905 -269822 -236051 -198040
43724 -198040 -139298 -51096 81789 236168 308852 205980 -20911 -206372 -250810 -193105
43714 -193105 -93840 49211 214041 284754 184200 31871 38121 224777 364702 256216
43704 256216 -28006 -245317 -272930 -189469 -100195 -14164 74014 102601 34171 -39072 14301
43693 14301 189421 348778 400785 393803 415727 474268 516042 512826 483688 461318 471168 516849
43681 516849 553541 507627 370812 253626 279616 416089 475002 330596 97517 17174
43671 17174 158403 305457 202942 -124655 -377431 -311635 1859 283535 353737 279783
43661 279783 245814 342948 498832 575933 517675 401932 351804 401755 476008 494242 448905
43650 448905 363042 238276 96478 19179 70908 210015 342574 437321 512502 538706 457729
43639 457729 297986 166553 103091 39881 -55257 -95607 -2105 162649 266333 265479 223054
43628 223054 208455 247750 336914 431608 451585 372267 293104 331216 452843 503779 425868
43617 425868 345202 386909 482887 462912 304432 177911 218933 353042 416429 381431 353444
43606 353444 363239 292898 64885 -189385 -249194 -61485 205702 362499 384494 393975 502841
43595 502841 688753 810987 761961 611016 546302 641475 752858 715763 563477 441443
43585 441443 371803 257487 92724 -4908 8017 36386 25756 49893 153583 257251 302338
43574 302338 349716 433895 459974 372321 299949 382591 548478 620108 561092 457852 327866
43563 327866 132072 -52838 -60913 143805 409955 577167 609021 563515 543130 649211
43553 649211 863388 1004665 938858 789241 769462 837283 729195 366262 10012 -66285
43543 -66285 116782 354414 499803 488922 292736 2163 -154288 -43372 180631 247711
43533 247711 92374 -105836 -156911 -32248 160047 273458 223234 74704 13266 158658
43523 158658 431075 652357 737039 723957 669877 593085 499218 399489 316020 295543 370599
43512 370599 480322 506956 438343 401770 464810 507264 406674 263237 283585 477976 633609
43501 633609 599617 459889 382145 405007 436024 392210 281854 173910 120686 106108 72416
43490 72416 5833 -33551 5377 85507 123825 85738 4940 -56444 -40426 63417 175437
43479 175437 191232 125948 110693 199403 289336 305774 328617 413520 435924 306488 217606
43468 217606 408134 734839 784714 455440 123769 110392 246132 177315 -97876 -261980
43458 -261980 -149620 74751 202199 218575 204519 170367 92339 12363 -7046 8688 -31176
43447 -31176 -151168 -264801 -286714 -239401 -188993 -100739 137042 501068 748733 662622 333887
43436 333887 72869 48975 150463 203598 171375 85834 -52222 -197747 -214367 -39422
43426 -39422 188131 296017 303455 337770 389295 323116 120821 -65407 -133496 -153944 -214647
43415 -214647 -279358 -280843 -235457 -161921 8355 298262 528718 469958 157147 -99954 -77410
43404 -77410 119517 253518 279033 335879 486364 622875 644331 581475 500561 403987 299816
43393 299816 268770 362806 503032 577777 593835 629813 679136 656223 548424 447482 412451
43382 412451 397599 347588 287489 281524 354708 478174 587998 611257 524599 396272 328368
43371 328368 362406 482209 677024 926725 1146166 1234332 1178788 1040181 855249 644076
43361 644076 481664 437789 451958 397035 272562 202025 229766 270248 280149 311892 349423
43350 349423 273808 80273 -41789 36747 196921 262039 234846 204717 155071 38164 -58697
43339 -58697 -6222 168515 340167 484424 652292 789869 764723 574510 384135 340452
43329 340452 451558 631544 757908 715769 510814 326597 359223 606748 907908 1136402
43319 1136402 1245729 1196293 1005541 834108 843445 971441 1016603 944965 930091 1059787
43309 1059787 1191307 1170111 1031506 890945 768926 640174 562146 630161 839668 1077875
43299 1077875 1236541 1285164 1257243 1211109 1201723 1268567 1436799 1703813 2010566 2262043
43289 2262043 2408340 2483993 2562383 2720717 3036129 3502420 3925073 4037211 3782290 3347937
43279 3347937 2874523 2337080 1811124 1573450 1701442 1810154 1513628 987164 717933
43270 717933 815406 963423 991720 1054910 1215942 1291857 1235302 1279841 1533843 1762730 1763326
43259 1763326 1662719 1652707 1692453 1673377 1643271 1672348 1706249 1721518 1812773 1965020 1967576
43248 1967576 1725191 1429550 1257136 1142528 1030944 1084990 1405539 1781061 1957710 1960001
43238 1960001 1938099 1925494 1957169 2164131 2501656 2651223 2474836 2305527 2478221 2828368
43228 2828368 2994069 2971125 3002263 3140555 3307930 3581602 4024113 4413656 4542848 4615789
43218 4615789 4967293 5578595 6249659 7012134 7953786 8912464 9828083 11100855 13039705
43209 13039705 15248239 17184500 19040955 21392352 24315888 27689255 32048156 38216941
43201 38216941 46423074 56877719 70882294 90040212 114811422 145535321 183904216
43194 183904216 229457147 273036201 297610448 290396343 254539055 206597647 162665473
43187 162665473 128713898 102987018 83011767 67942232 56829499 48128960 41012932
43180 41012932 35536968 31493996 28188809 25248246 22729137 20476880 18144036 15804626
43172 15804626 13884572 12488681 11334262 10292320 9468328 8792013 8043520 7292813 6845205
43163 6845205 6714008 6564289 6227332 5882353 5656457 5405490 5007807 4578539 4258097
43154 4258097 4010911 3753515 3517536 3390924 3401663 3487365 3488449 3214494 2657608 2092903
43144 2092903 1806582 1770177 1750924 1675380 1662695 1735967 1759865 1700109 1711433 1884150 2083020
43133 2083020 2128869 2005226 1810829 1625941 1496585 1454127 1484936 1544012 1624471 1742827
43123 1742827 1849340 1843168 1695644 1484479 1301499 1198091 1206022 1320397 1469245 1586816
43113 1586816 1701382 1863291 2021947 2087654 2082142 2092010 2094704 1988178 1799183 1701388 1796737
43102 1796737 2031875 2366763 2848459 3424260 3831515 3816453 3401566 2842072 2369403 2048104
43092 2048104 1823465 1620638 1415741 1260586 1221456 1277381 1320657 1274122 1163112 1067850
43082 1067850 1061289 1185389 1407043 1598523 1652877 1612601 1572856 1477682 1191409 803169
43072 803169 638169 836499 1106679 1085852 809937 606920 613651 653455 575299 452705
43062 452705 381827 308587 179131 89823 136666 237466 264690 266851 374854 529277 505526
43051 505526 250077 14154 48289 281405 430197 357396 182883 64761 17245 -19395
43041 -19395 -47549 -25817 54632 173438 310492 416805 413450 290670 160508 133477 188961
43030 188961 258000 380728 643341 971867 1149928 1088575 939703 870187 855263 798138
43020 798138 728489 725096 718143 554203 251291 24875 26727 187645 354430 455114 480858
43009 480858 439522 408268 506400 703476 764109 530208 178575 23303 102944 162514 56819
42998 56819 -44589 51549 249404 305512 179398 66262 112360 253766 353161 372328 358286
42987 358286 333541 263662 126641 -7926 -1394 198122 433431 481124 355178 328004 548017
42976 548017 788574 761330 557150 516075 711721 867384 813770 709878 689006 598271
42966 598271 316094 77843 178536 492543 606655 382183 96801 24178 136673 273565
42956 273565 365539 394295 316686 154896 45862 97396 269074 455720 608011 718326
42946 718326 767881 745357 665554 546522 425979 389508 481455 586051 523252 293949 104380
42935 104380 95897 171236 159910 49947 -29539 23360 207925 445314 614998 632067 540969
42924 540969 465647 433166 344833 168802 36313 55445 139504 138784 59800 27221 87692
42913 87692 176855 237894 251162 183497 42973 -27812 146284 542959 916270 1045177 941085
42902 941085 778858 691410 680682 684469 667137 641389 636124 666503 728211 790939 786112 644224
42890 644224 389267 161015 78649 109907 151331 197455 308418 430242 413030 244506
42880 244506 103792 113433 193639 253035 356465 562137 739552 735249 621676 587743 643422
42869 643422 625319 466415 281155 191272 224325 369782 572829 682320 579686 372048
42859 372048 288800 366566 411857 311768 193935 203972 301130 386086 482814 653338 834788
42848 834788 908154 877795 863377 943946 1105141 1315952 1573565 1887503 2286666 2818272
42838 2818272 3457515 4014509 4210229 3901232 3222823 2485061 1919414 1537558 1240420
42829 1240420 1015590 945843 1022440 1066926 920193 636728 398344 292882 279363 313750
42819 313750 375669 397183 304215 135119 6149 -39161 -41753 -12417 64228 128723 97517
42808 97517 12596 -8312 35527 53387 76206 238703 521502 734250 816392 919479 1093737
42797 1093737 1144915 963620 764057 776747 888716 836382 618202 451625 408595 362281
42787 362281 259673 194610 205131 222682 249852 384383 612012 745777 644292 373558
42777 373558 102749 -65778 -137125 -184477 -282287 -403940 -406703 -207040 72318 245031
42767 245031 299331 349175 399880 356138 254216 272109 455847 619080 594548 441736 333612
42756 333612 365407 532108 756810 876209 740317 411165 140242 75390 119212 146143
42746 146143 192424 307854 373927 246183 -11941 -201908 -238944 -185894 -95664 28483
42736 28483 147338 204865 224278 266979 311094 285481 205409 150636 119512 37967 -79313
42725 -79313 -113821 -23338 84962 108282 64715 2950 -91262 -216488 -277733 -193198 -23179
42714 -23179 106866 170874 228075 274970 235220 111412 32848 99773 260489 398501 469535
42703 469535 486630 442689 344972 273959 287793 296568 175822 8979 41515 321977 559448
42692 559448 482833 215228 99557 224036 346331 292475 201384 280328 492336 625008
42682 625008 565728 373605 140743 -86249 -264297 -340191 -295841 -156753 38376 240278
42672 240278 390220 468391 517745 569548 566282 416604 129560 -142339 -205603 21117 421342
42661 421342 741317 789989 610857 416662 337495 297820 175423 -1908 -97660 -53875
42651 -53875 48424 96928 53304 -29829 -46989 74399 274085 382720 304654 136608 39924
42640 39924 44582 64754 60894 73442 115514 149077 170409 208633 226257 134406 -58948 -217896
42628 -217896 -240252 -160656 -50142 85528 238195 322691 274732 171461 148768 215698 243529
42617 243529 147339 5716 -29041 95458 270062 330500 231255 113229 163564 391207
42607 391207 589543 563579 350615 154798 99005 129712 162935 219338 356348 528160
42597 528160 597546 489223 279192 109241 39574 17964 -10192 -6331 106482 313582 501335
42586 501335 599938 663137 749406 789714 677315 461007 320124 326269 358492 313940 271838
42575 271838 332998 400822 293015 37814 -116382 -15836 215216 353378 315322 161868
42565 161868 -14712 -123996 -102308 -5518 2490 -145872 -299796 -273590 -81082 124231
42555 124231 264478 349325 341229 198528 38417 58771 256571 396490 323156 147998
42545 147998 45441 16827 -25102 -61618 -5251 138240 278813 374003 439188 454669 369016
42534 369016 191013 1611 -122659 -151266 -95972 -18347 1206 -34513 -10946 153495 374833
42523 374833 497227 488541 455424 478901 520597 497961 389165 255454 198346 282937 467194
42512 467194 629860 699618 714063 714671 654678 488627 298149 231432 337737 530839 682294
42501 682294 687603 503930 222605 53035 116512 286635 347341 271065 205144 213573 203703
42490 203703 126672 81418 156137 299611 422005 511098 572313 552712 414376 217533 57502
42479 57502 -28319 -39188 35383 177188 310604 374599 380191 353437 285225 197159 188629 323392
42467 323392 499823 531988 370457 169105 101638 164075 212630 176143 151546 246121 393336
42456 393336 432608 351857 304545 345811 320016 128754 -41755 50858 350569 594774 694990
42445 694990 774396 849858 774219 559995 467793 623083 789017 714961 511542 448529 528909
42434 528909 525258 362628 206937 181367 219472 234235 247889 290918 310743 255340 161324
42423 161324 102716 106585 149397 195856 232857 295051 431540 602249 654846 486916 203103
42412 203103 20912 30935 134643 211347 250989 302726 376640 445247 502078 574266 674574
42401 674574 752489 717603 547228 357136 300780 393726 514614 585326 638742 679219 624061
42390 624061 472232 388572 478846 590334 506057 266566 117520 170419 293364 338643
42380 338643 315256 310311 374418 512337 671333 722596 571966 307626 122421 70911 22257
42369 22257 -122346 -292950 -376641 -363973 -306777 -220460 -94607 57529 202606 294270 271808
42358 271808 126911 -22343 -21470 125076 235202 166177 -20213 -143928 -93949 100362
42348 100362 325293 479414 553157 617767 703047 724587 603158 409843 283848 236708
42338 236708 168347 67405 51488 186365 392717 560591 644628 635899 566083 546698 658077
42327 658077 784846 724610 484260 283406 221391 154909 -9060 -128572 -81935 -393
42317 -393 -50526 -150819 -127764 -25410 -10364 -48078 58875 319311 490272 418750 247042
42306 247042 193783 278984 359722 336210 233592 139649 127529 205191 304144 346209 333207
42295 333207 333295 376454 413258 387484 302591 201151 120942 94711 161438 339140 579282
42284 579282 765967 790483 645904 432183 251484 131651 80825 150231 353731 569380
42274 569380 643488 585779 539942 557749 535909 395756 185214 -27686 -213737 -298979 -194573
42263 -194573 25453 152845 132554 134091 239401 281474 150410 37686 149968 359812
42253 359812 403878 295315 259124 348363 411414 390859 374713 370622 299209 212616 257576
42242 257576 401956 449572 357303 292978 340732 391882 373103 339489 294690 176292 74381
42231 74381 178995 423443 485227 274730 109287 212892 357306 267653 104700 191708
42221 191708 451146 506096 266332 39771 46139 145461 130015 22942 -41005 -54974 -126267
42210 -126267 -306713 -515373 -592373 -428137 -100497 144481 136408 -22967 -97619 -3192
42200 -3192 161140 311147 445412 529549 483692 318746 152006 57301 17593 37462 159274
42189 159274 334346 428105 418420 453439 624853 798706 780743 575413 378320 355316 505801
42178 505801 701713 790465 697102 494475 349615 349474 408210 391843 294448 230337 280132
42167 280132 410864 538854 611083 616445 564340 481028 416843 435158 566383 751486 855260
42156 855260 787058 605737 448461 354295 236089 49754 -104964 -121690 -49160 -19241
42146 -19241 -57891 -71562 -3059 101677 183162 229572 241364 233289 285571 476289 720009
42135 720009 799143 641907 458205 477613 641474 713365 641131 611154 722607 801536 637775
42124 637775 276390 -42600 -154754 -79937 73793 209691 281492 315939 365880 388899
42114 388899 250195 -61500 -302829 -205529 193909 596281 799980 866719 907623 872123
42104 872123 651261 296095 18639 -11924 177496 406396 518746 524788 547808 620143
42094 620143 610478 430203 223931 201175 319373 326803 141489 -12324 71125 291385 405485
42083 405485 352163 271172 281928 379449 505201 606422 645633 630112 610997 608323 583541
42072 583541 520442 459674 415070 351699 294000 332279 444200 443855 225384 -58887 -195131
42061 -195131 -176010 -128261 -78297 34002 182312 276984 313579 331671 280643 110415 -50085
42050 -50085 -11663 191247 337129 340661 337544 427364 537567 589165 602942 578914 455510
42039 455510 265956 166303 226579 348280 453800 580174 706933 695627 528030 411261
42029 411261 481167 573752 488346 328815 345491 536548 666044 640483 605690 641513 603969
42018 603969 372023 72582 -73621 -27170 67477 93763 71409 73443 116425 147133 103922
42007 103922 -18310 -156163 -232509 -219549 -139100 -21211 102888 178281 150213 31459
41997 31459 -88328 -129135 -98782 -59036 -28260 41598 178527 317087 351993 257868 119181
41986 119181 40680 61728 150726 230002 210141 78793 -32153 31219 221880 318161 242190
41975 242190 197794 357401 569480 593981 512558 620011 946017 1194404 1194894 1105409 1065232
41964 1065232 954561 678257 423781 403870 544652 665983 786236 981035 1103990 970593
41954 970593 725292 689162 870498 951385 775606 528236 370860 224402 44559 10736
41944 10736 233441 504158 574757 518634 560956 668106 593999 310472 112729 218027
41934 218027 467871 561554 454582 367927 453274 605938 641319 540896 436698 409811
41924 409811 415682 411098 443012 551032 661571 668583 580299 498353 468360 431563 321561
41913 321561 142630 -43417 -150732 -108247 65846 243906 313662 303965 312512 343843 323765
41902 323765 250827 206307 213777 222174 242957 355559 532415 612455 532604 447848 505399
41891 505399 611561 568180 375001 242369 309789 474506 530524 406553 230896 183161
41881 183161 296017 417611 396638 274594 214392 252840 253927 143243 40959 67489 147605
41870 147605 144483 89981 119481 237899 320346 319725 308686 318597 300593 265680 299292 386624
41858 386624 376743 201127 1501 -53661 24105 117711 189423 270958 338341 334096 289019
41847 289019 295612 356628 370087 286922 185381 145781 132190 63297 -48514 -101519 -36045
41836 -36045 95762 199695 235059 213542 128665 -60774 -348501 -609881 -673021 -484463
41826 -484463 -167136 115187 309507 443826 500358 426922 278745 229110 370243 582543
41816 582543 681918 634381 533298 426615 300261 206247 244136 379279 429694 314449
41806 314449 192151 244240 414160 489458 389112 249609 256133 484612 865491 1197248
41796 1197248 1250406 996659 700908 637285 741832 721247 490059 273791 230430 215498
41786 215498 61514 -114874 -85489 141736 355919 444789 464120 453556 381057 264442
41776 264442 175472 112487 17756 -75427 -68560 15787 36620 -38030 -62542 66011 257452
41765 257452 369897 377798 324223 225075 109058 48700 59659 59016 3708 -33451 -17324 -60733
41753 -60733 -248419 -446972 -447411 -236463 27994 260457 494934 712207 803976 736925 604152
41742 604152 482104 368178 277651 249386 223273 86953 -86865 -35138 335996 741511
41732 741511 833695 617848 374697 255069 164509 24580 -72936 -26554 124999 285783
41722 285783 412506 476504 434794 327493 311155 488576 752043 886463 810107 651042
41712 651042 598883 724978 933888 1059390 1020758 896988 824423 830657 827124 762268 691166
41701 691166 663834 640250 574662 499713 454129 401355 300296 188492 111115 40261 -36053
41690 -36053 -20404 171465 452405 667360 805279 945664 1030764 897264 559860 257929
41680 257929 139944 80314 -78473 -262006 -296494 -191920 -116791 -142709 -178292 -150675 -112568
41669 -112568 -137016 -201138 -220158 -155146 -64069 -55963 -177334 -332909 -363297 -223639 -25602
41658 -25602 125916 248411 374954 437853 374581 274718 278633 364995 381835 277093 154226
41647 154226 89110 40141 -18229 -14486 88170 189285 180525 110113 122424 266228 437239
41636 437239 496202 396591 213127 76533 57018 91855 63533 -36975 -84200 13872 188587
41625 188587 305361 328905 328174 363726 447049 577069 726297 798219 687787 411496 126991
41614 126991 7033 123509 432050 795396 1019956 965845 681171 381745 249740 283850
41604 283850 376043 472845 587484 690711 692781 560405 389216 321009 410931 583465 686410
41593 686410 591073 301011 -10406 -124809 13496 249609 411698 496825 598746 703440
41583 703440 672637 443816 146443 -34011 -45365 34980 146319 308846 539521 765703
41573 765703 867953 803597 652957 518633 404425 252418 98458 93452 302645 560866
41563 560866 637397 505891 333509 232572 175439 162004 287962 560803 794585 814137
41553 814137 673090 552061 512612 471501 369212 249970 198856 278513 482964 678674
41543 678674 663196 389734 74306 -34099 69524 222303 371093 593941 871965 1040149
41533 1040149 1007823 873541 768708 715678 687043 678139 660950 577771 444640 367680 402025
41522 402025 482265 538531 588066 661825 731563 761987 751302 678684 506693 280539 121849
41511 121849 70507 38489 -22322 -28211 76416 183677 161753 49577 2631 100601 292845
41500 292845 469207 507828 337595 50701 -126486 -82499 30805 7205 -135309 -215115
41490 -215115 -155717 -38665 69759 176725 252270 223798 119193 87440 221439 446127
41480 446127 622923 693810 689068 655568 617716 581814 564108 614591 764957 920316 886160
41469 886160 602358 296183 272362 554885 846800 854306 560343 180955 -44327 -7915
41459 -7915 208466 388233 366794 200918 102369 196017 401215 545625 521953 336651 90012
41448 90012 -79272 -100624 -28946 57185 174316 356859 512511 510841 411006 425909 615888
41437 615888 785143 758499 603011 469473 366003 242400 181099 303098 522807 591594
41427 591594 418763 201906 172372 312907 408036 312289 79576 -152103 -308694 -374474
41417 -374474 -309722 -74403 257198 499953 542404 473857 453463 496675 484271 354187 170558
41406 170558 147 -163892 -322944 -417449 -399228 -289594 -135308 23412 125526 118589
41396 118589 37988 -35353 -108276 -243287 -372446 -316259 -76317 61721 -126643 -477990
41386 -477990 -640464 -523099 -353470 -322474 -374529 -377074 -318718 -258878 -201532 -111779 4644
41375 4644 106488 167605 185758 172769 157658 168335 197110 212092 203344 187731 178944 191021
41363 191021 252946 366047 460828 461860 398039 387340 500567 689586 856139 940344 935862
41352 935862 875629 819722 805324 786422 671398 451940 255883 227641 365975 513857
41342 513857 519221 391597 279684 290731 366446 375956 299243 236249 235226 223099 154936 119945
41330 119945 199205 304686 293397 194148 173938 286670 400058 400868 343809 337982 384780
41319 384780 402301 350680 270797 231023 268721 352455 389489 313343 166536 42812 -43797
41308 -43797 -149817 -259280 -257274 -90629 136567 290852 363409 433207 533227 618214 627695
41297 627695 532093 351186 159958 32040 -45399 -137530 -221596 -176444 31018 243240
41287 243240 281786 148277 -26324 -153145 -204007 -141034 28524 169351 140188 -7515
41277 -7515 -85684 -23813 64941 76569 30604 -33108 -119216 -183431 -122224 60158 206281
41266 206281 226608 241699 383777 574980 654771 626735 592829 515306 269418 -83504 -316444
41255 -316444 -375534 -463472 -681692 -813460 -640342 -300892 -105847 -100296 -59833 112963
41245 112963 246069 198595 84650 94294 245877 422207 532092 535622 420407 265423
41235 265423 234744 385172 551047 539161 372716 214962 116393 1854 -116590 -95807
41225 -95807 127828 421830 609567 636431 538956 357336 150848 16768 10067 86147 172250
41214 172250 243167 285022 259725 178623 150985 265655 451696 544477 484764 376744 343731
41203 343731 398419 479620 554724 633066 701758 704549 607016 462013 376928 403844 481482
41192 481482 504873 435993 319432 206913 111052 33304 -9818 -8038 23483 61860 97466
41181 97466 137469 205142 316103 421030 404205 210861 -33531 -118961 12958 207672
41171 207672 304519 322599 383440 518551 637563 659702 604498 550342 543576 554634 514734
41160 514734 402016 274565 186347 107685 5754 -34649 90177 278043 273577 23573
41150 23573 -195077 -141633 47028 75871 -59339 -88277 107259 342666 444590 474157
41140 474157 534138 556886 441028 262506 177897 191896 176570 83390 -6567 -35893 -47836
41129 -47836 -89597 -140144 -173774 -219549 -301513 -361221 -301317 -108730 103698 203938 180148
41118 180148 145802 200433 321897 422705 468530 480249 449404 343938 205672 146614 201769
41107 201769 255910 175835 -30175 -237382 -350307 -369703 -342010 -297647 -235805 -140472 -13634
41096 -13634 106390 184947 238816 288641 270587 87998 -220166 -462901 -511616 -443938 -401446
41085 -401446 -398708 -374213 -337108 -319465 -246963 -29651 240173 361907 315856 295721 392424
41074 392424 423418 194628 -200109 -483531 -517222 -387509 -233404 -130665 -114165 -171054
41064 -171054 -202119 -103969 92668 259476 348125 420625 484977 434489 224820 5187 -36662
41053 -36662 96048 240507 301375 329988 371853 353911 192508 -48597 -190946 -127074 78966
41042 78966 283883 414398 499175 583707 665555 723473 765533 809169 836494 818375 774565
41031 774565 750752 726487 615855 401005 205597 170897 295705 463384 588239 648705
41021 648705 606153 416201 144697 -42758 -66280 -17713 2289 40086 184302 377390
41011 377390 460818 387665 275372 245167 309970 428623 564427 658067 637560 506364 354620
41000 354620 244317 150588 50911 -10667 -4227 19342 15829 36371 145115 303625 433052
40989 433052 548196 715762 893791 933605 769320 513661 329081 277974 337352 486181
40979 486181 711550 962748 1155206 1218168 1130820 944928 782848 759481 866474 968456
40969 968456 951074 840865 742195 697733 674255 660889 693790 761600 762124 618744 411498
40958 411498 320469 425251 615491 731956 743233 716735 653536 472349 191295 4149
40948 4149 64857 263395 355850 299784 304276 508114 763360 842720 742076 624888 535032
40937 535032 355084 62588 -158972 -162835 -61395 -64251 -165101 -158267 34496 227646 240245
40926 240245 159110 188821 321303 348497 209603 123602 272860 510007 548714 365525
40916 365525 220898 288401 443453 471570 340769 184729 122718 185494 334898 460018
40906 460018 418934 192990 -29923 -23208 228808 515320 629740 564066 478481 520934 678034
40895 678034 788190 717191 514833 345001 266863 185454 46061 -54559 -36666 6204
40885 6204 -47944 -141727 -133328 -37009 4531 -41218 -63321 -14289 22765 2694 -4768 47110
40873 47110 107215 137704 168837 197120 164124 89815 87789 182291 249909 223175 213188 329335
40861 329335 502932 603911 626670 647054 689698 746221 833748 933258 968783 950662 1021909
40850 1021909 1233306 1389071 1274130 943511 630600 460982 423376 517301 707976 797568
40840 797568 586654 167963 -147866 -214050 -165456 -142837 -104441 30828 221911 358076
40830 358076 358912 200119 -42361 -188687 -147863 -87917 -216899 -409210 -303092 179271
40820 179271 664587 786818 587324 333065 154387 28341 -61102 -133573 -252881 -398413
40810 -398413 -417820 -249244 -56579 1290 -11601 16729 14511 -122832 -286632 -295196 -177545
40799 -177545 -75144 50301 334902 681907 808296 652286 473511 480259 585443 621026
40789 621026 587646 572526 587422 621951 729688 919263 1042785 932710 625413 349541
40779 349541 288058 403358 502342 452195 324339 311345 497972 761404 928010 960108
40769 960108 919776 820039 627726 384606 211388 186564 290418 439692 503584 345846
40759 345846 -28860 -403352 -541889 -435929 -258834 -130950 -58410 -41436 -68171 -32309
40749 -32309 155450 381453 446514 377085 413268 644810 860656 836504 598869 324098
40739 324098 135559 82277 161464 264910 234605 59056 -101675 -143138 -129275 -127274 -103582
40728 -103582 -66221 -127939 -307485 -429762 -360131 -201627 -129488 -162668 -230397 -326775 -444331
40717 -444331 -469528 -305826 -21173 250933 464534 609204 633102 551789 509373 586734
40707 586734 669521 650882 627157 721518 849654 856718 764735 675737 548019 304918 72008
40696 72008 55424 242224 447483 584929 651666 540820 178956 -195205 -230964 28233
40686 28233 162336 -34801 -296983 -328396 -202432 -144804 -168807 -142470 -48892 30219 86741
40675 86741 168629 257038 291274 265418 212059 146907 90676 78626 104642 127847 149239 184448
40663 184448 166102 15611 -180583 -236774 -136221 -46512 -29053 45571 212370 279989 124838
40652 124838 -92433 -172754 -152282 -142277 -77269 138931 367464 376852 189018 46963 69034
40641 69034 154106 217237 296650 390551 384628 228770 59167 55766 238470 453069 524499
40630 524499 413923 257755 239602 387982 524543 446664 131079 -259223 -506991 -464361
40620 -464361 -154314 190546 295077 129148 -59222 -60785 66713 168508 232882 315501
40610 315501 363826 308561 233055 248026 264319 102606 -201087 -400300 -340753 -81175 268926
40599 268926 637066 910068 967292 834263 651307 474706 267908 87102 70269 198467
40589 198467 269333 188122 108289 186005 349706 424349 363930 259205 211962 276796 422884
40578 422884 487884 293411 -108549 -421193 -430542 -246340 -125616 -160037 -239816 -231287 -74534
40567 -74534 223490 580751 865843 1003616 1007853 885817 632180 373663 347604 592823
40557 592823 800331 661703 278533 24190 50499 148499 99004 -52419 -132641 -85442
40547 -85442 14280 84611 93558 58684 41427 86167 140452 103512 -28184 -142770 -160451
40536 -160451 -113005 -54245 5065 31704 -42781 -186685 -221163 -25590 271100 425229 371554
40525 371554 264406 244238 292095 331166 345942 349188 336704 345122 462658 688227 847383
40514 847383 761731 475221 213037 132379 209407 353786 510309 626483 640477 559481
40504 559481 465558 395418 296104 144659 17548 -19617 1793 44273 135144 257299 282662
40493 282662 142799 -28311 -67612 -14360 -2563 -5392 98687 249942 247601 83056 -17341
40482 -17341 50422 111144 27680 -49703 78604 351802 570283 691199 798259 879511 857952
40471 857952 790929 818853 918948 907705 717018 494587 377316 317580 218472 125661 169938
40460 169938 360602 530523 507859 309101 124469 93886 140559 104829 13527 60546 275774
40449 275774 406017 268178 46195 8674 62098 -99910 -435695 -509543 -119695 347701
40439 347701 412820 120840 -101412 -57904 52693 37670 -31081 -24816 19019 19109 41395 206852
40427 206852 470554 626687 535721 275453 61107 49106 206570 345003 296724 77484
40417 77484 -143521 -236285 -220609 -166860 -70966 90352 235895 236043 102143 9277 81059
40406 81059 236212 316199 299457 302265 403675 562029 697677 773083 777774 709910 607496
40395 607496 546012 565386 623450 642080 579554 453638 324591 260853 289011 371169 455975
40384 455975 539702 638840 724229 745569 711704 675154 641202 575649 506241 514596 598052 640748
40372 640748 572173 463713 408717 392186 347338 262783 160653 42577 -66016 -90570 -9165
40361 -9165 87801 119606 121053 139346 116522 -4766 -135695 -143855 -50718 13304 8327 -3971
40349 -3971 -8469 -36404 -43008 43506 158144 163634 89566 116495 280821 389303 305866 145556
40337 145556 78103 97445 113758 136773 214679 287029 253049 129828 13025 -67793 -128668
40326 -128668 -115040 50559 314494 512257 556591 505594 428845 304967 96669 -140364
40316 -140364 -284041 -264512 -122416 51080 208908 356544 468961 463375 320430 187454
40306 187454 243321 450288 562479 431960 196323 86735 147954 247319 280201 243536
40296 243536 151326 7540 -134100 -179941 -86635 109213 344385 564402 726538 822772
40286 822772 884549 921466 883314 728500 495215 258543 62464 -56070 -42589 94213
40276 94213 234836 279647 281781 342192 411941 332736 73730 -196469 -297942 -200738 16541
40265 16541 261851 452827 550049 618443 768191 978817 1065167 895062 581431 370196
40255 370196 363221 434312 420295 319700 263994 336431 481696 595126 634899 600507 457871
40244 457871 185466 -115471 -276664 -268020 -235855 -271704 -262059 -80654 171515 279199 219633
40233 219633 190465 327956 537938 633776 535790 316838 142581 163285 362276 523826
40223 523826 468956 303726 286612 461669 609147 583585 489443 443220 375573 213646 81668
40212 81668 128992 272549 303181 182754 63856 62145 172513 373858 643624 868955
40202 868955 901446 732188 500688 318036 190719 124033 169950 326112 483546 527587
40192 527587 436334 263113 83148 -37418 -87070 -123376 -176950 -169112 -29391 125307 75171
40181 75171 -208385 -493084 -572185 -491937 -407372 -334595 -181044 49131 225888 257284 174524
40170 174524 56035 -40196 -65894 4044 122126 201659 227515 276936 400799 536171 577840
40159 577840 500440 364394 223710 82556 -51311 -118718 -54263 128843 330716 452457
40149 452457 475697 447539 410407 369539 311957 224630 102369 -25285 -79298 6325 188451
40138 188451 324831 316158 216065 169277 255343 417760 530902 509283 362730 174314
40128 174314 27823 -52888 -89898 -87521 -23052 85978 159993 152702 132543 203228 354599
40117 354599 456600 404627 213479 -35669 -270364 -424960 -438213 -314189 -150096 -49642
40107 -49642 -26337 -26863 -17091 4016 45902 114043 160512 109381 -52430 -246233 -365992 -339941
40095 -339941 -151427 129846 336442 313689 89658 -125386 -162243 -71105 -29313 -120765
40085 -120765 -271258 -362637 -331783 -178063 39544 206656 231272 140982 52593 37690 72460
40074 72460 118281 172298 217981 210503 157500 142023 206353 273103 246585 139382 27326
40063 27326 -69245 -171487 -251979 -266947 -260433 -316487 -393123 -322405 -26797 357417 633779
40052 633779 746432 763768 738798 678162 603713 547499 499801 436962 383721 376832 392745
40041 392745 397353 440757 586862 752352 755698 567471 374620 320323 315023 224319 120020
40030 120020 165456 323241 390689 322859 305134 445528 594125 583048 479916 445789 463960
40019 463960 397201 246780 159839 193289 248080 255861 268926 323608 363731 364244 398052 494659
40007 494659 543065 436093 233726 92397 97403 242163 490899 759498 907037 872496
39997 872496 777354 769632 800487 692014 412567 134558 -1961 -35374 -40321 17219 183671
39986 183671 383063 504007 563121 655049 761525 739880 533490 295167 230793 360513
39976 360513 499100 471138 300267 162995 177763 280199 321359 254025 171687 164739 196642
39965 196642 161452 32254 -100672 -141794 -100907 -70008 -103661 -144741 -80901 125185 374283
39954 374283 515092 490987 389907 348147 419583 539170 593268 521593 377439 300469 398671
39943 398671 626063 795062 747678 515973 288791 221341 302734 407645 437025 385380
39933 385380 301599 229453 188001 172402 151662 87019 -16607 -82746 -21638 166664 367336
39922 367336 450271 386386 251614 134625 72155 66031 116024 212471 323422 415117 470785
39911 470785 474396 406249 290057 216875 258536 353037 343099 164074 -60214 -161536 -121962
39900 -121962 -49844 6745 108515 263054 330029 176747 -134791 -413038 -555145 -600974
39890 -600974 -587172 -470160 -233498 23006 171714 190997 162237 165543 212734 253750 227761
39879 227761 141739 100059 189138 321839 297659 69434 -155001 -166643 -14984 108901
39869 108901 164738 262895 402813 418628 245050 67125 91244 276977 422603 452347
39859 452347 486119 633679 829297 904942 770495 490253 213078 60151 74860 241151
39849 241151 496975 719102 767851 627609 473419 500161 681090 791283 689159 469785
39839 469785 297180 199124 114458 51081 74541 178526 277252 319480 328630 337595 355273
39828 355273 389951 442555 488358 520641 579932 665038 656909 450760 161389 62049 264574
39817 264574 562504 669020 539973 374202 335907 374532 327862 132133 -110460 -248360
39807 -248360 -227683 -116985 -12964 42219 53634 42396 58615 170839 370080 515391
39797 515391 465294 257284 62157 -43461 -138070 -249598 -231754 32691 395971 571358
39787 571358 472797 281849 167465 96459 -11403 -85731 -4659 177917 264119 180257 84124
39776 84124 153654 361995 533770 563006 496684 439225 454843 546935 652435 655966 489678
39765 489678 236365 59324 4594 -47298 -188299 -326597 -308451 -141352 10866 43671
39755 43671 21546 51035 129732 175893 163549 168017 274900 471901 647620 700194 631834
39744 631834 511662 366081 178596 11880 21167 256796 532816 621040 532133 454763
39734 454763 436262 317684 38567 -188548 -141316 111840 332720 436725 514787 591498
39724 591498 571536 442829 341213 339455 320441 161337 -62609 -170418 -104316 41651
39714 41651 181846 321718 486650 653592 768371 779939 657134 422551 173370 20213
39704 20213 -8720 26572 68936 129278 257458 472182 718218 879345 859623 685046 496183
39693 496183 394702 332147 218565 103589 134972 328853 503506 495953 346625 203421
39683 203421 138824 153607 273165 505570 739841 815126 693390 472259 244840 50344
39673 50344 -58866 -39056 38883 34168 -77733 -179773 -203483 -207155 -214856 -138639 36799
39662 36799 144793 68324 -31177 93332 407480 614595 541533 334299 233265 293983
39652 293983 389246 386562 263123 105969 31237 58606 72297 -29700 -175249 -205861 -104399
39641 -104399 -6164 22550 71981 213383 373463 452612 449858 392577 255492 50270 -95037
39630 -95037 -61323 105131 247946 268602 175921 33625 -65174 -35762 101630 218326 244498
39619 244498 269200 386320 522764 539957 441964 345443 288731 226594 201289 352971 715279
39608 715279 1117935 1343276 1305604 1064654 758301 542341 491101 507504 406999 134602
39598 134602 -160502 -294580 -234028 -90966 86 -21627 -106805 -130176 -11214 187883
39588 187883 330245 352353 276760 118442 -98040 -243537 -168653 74724 243922 203318
39578 203318 76227 28302 51727 72914 122881 243944 347638 349045 353728 507895 720004
39567 720004 757001 606014 503068 556694 573464 365770 39331 -177926 -250045 -301640
39557 -301640 -365638 -350982 -236014 -130733 -126518 -197161 -266915 -285144 -225609 -107021 -30479
39546 -30479 -99652 -269384 -358913 -259287 -53902 110597 192569 230947 231120 174370 98707
39535 98707 61607 28903 -97012 -317560 -496917 -525075 -451592 -396594 -377292 -296690 -90143
39524 -90143 181918 396811 480251 441116 335572 227559 169185 187253 274769 398610 518558
39513 518558 598033 601626 502280 314788 121068 30017 86688 231234 361971 420490 397422
39502 397422 289469 100012 -130575 -345468 -520227 -648147 -688631 -593316 -391466 -190872
39492 -190872 -77936 -61133 -106962 -163951 -157258 -55932 38973 -17848 -204178 -323183 -264089
39481 -264089 -143070 -102494 -109369 -80094 -70737 -160856 -242592 -139414 106659 278093 298727
39470 298727 294209 326768 300245 186536 122344 175947 211804 116342 -7498 -12415 70220
39459 70220 126558 148993 170836 132130 -9658 -127368 -70313 102904 220216 262876 332790
39448 332790 393529 280458 -4015 -224116 -216696 -88144 -13188 11151 91397 226749 304566
39437 304566 258024 129119 -775 -74083 -69157 804 107095 233548 354167 389563 259126
39426 259126 3813 -210717 -256903 -163467 -42172 41560 81427 76109 32416 -5626 8247
39415 8247 64524 109919 105672 48616 -42726 -126040 -131789 -5220 230068 463531 575166
39404 575166 542519 471249 491155 609485 705909 699952 668553 730058 849806 860914 688436
39393 688436 466535 393466 521733 723709 825567 747984 545413 336086 193113 109852
39383 109852 68032 85315 156126 205403 175525 114944 96811 96256 53244 10671 50059 113828
39371 113828 56835 -115386 -237150 -255439 -327455 -553202 -776886 -786288 -582283 -309586
39361 -309586 -26054 301102 640801 900988 1057092 1146437 1154777 1024890 770088 488707
39351 488707 278128 195298 249594 356867 370038 255037 160886 194801 215248 18602 -328986
39340 -328986 -551518 -541800 -465988 -458777 -432833 -283469 -91768 18265 87569 224215 379547
39329 379547 388373 215837 32562 20919 184395 369927 431478 357102 261155 261512 367208
39318 367208 502540 623043 745543 853986 858302 706316 483921 330989 281718 259578
39308 259578 225731 255328 426923 679748 842780 811785 651298 493814 381400 266844
39298 266844 142553 70099 66676 67987 55229 114734 289925 476059 577066 671752 866506
39287 866506 1051656 1002176 709203 417354 310605 345625 428441 548575 660902 642231
39277 642231 493174 404832 474899 522130 364128 132574 87677 221428 296910 233176 184243
39266 184243 219835 191796 11699 -156958 -130199 22546 98417 68530 106584 334327 663793
39255 663793 907467 965789 884089 774416 709869 682274 646283 585623 514900 431928 316878
39244 316878 188823 116579 144877 236430 310040 318163 276688 245079 291896 450639 679890
39233 679890 873401 929079 819427 607527 401752 277030 220054 161765 73798 4365
39223 4365 -781 32138 59662 102316 202953 333244 423926 474344 541065 617911 630268 571641
39211 571641 538204 576302 597988 528962 453731 503615 654050 756536 754061 739552 782689
39200 782689 817978 764161 664496 622620 650036 668517 644340 625740 629082 571182 374432
39189 374432 102770 -64602 7506 300957 668749 929661 967414 808602 617169 557989
39179 557989 639080 717944 665548 474128 204216 -85344 -311025 -360452 -210350 -1841
39169 -1841 100335 100861 130918 227884 272389 170088 -3569 -92868 -32236 114687 230749
39158 230749 225839 102487 -19086 -2271 135247 220335 155530 77244 179777 423466 548633
39147 548633 398893 120169 -19104 70122 247502 345351 329570 263285 200175 165733 198665
39136 198665 335624 539039 685195 663452 483508 267328 142342 158494 294421 499630
39126 499630 703552 807065 721010 452553 141624 -38122 -43410 849 -39295 -141933
39116 -141933 -182615 -130653 -98047 -167650 -261327 -237683 -56015 218627 507763 733809 797584
39105 797584 652519 392620 179859 84948 64416 71365 105405 167885 251351 359885 464493
39094 464493 480396 395937 374247 570943 874079 1013961 944967 905315 1037809 1184806
39084 1184806 1191321 1188317 1359701 1586546 1583479 1317286 1039649 917859 862838 751282 607505
39073 607505 489362 357747 159021 -63568 -215803 -241328 -132885 60775 216387 225523
39063 225523 135091 96175 140413 130681 -5722 -126787 -68049 112787 220553 202833 205085
39052 205085 343498 542562 644512 604294 511592 446811 376278 212266 -47660 -279960
39042 -279960 -348302 -238254 -65858 25137 -37792 -214222 -365833 -351967 -169439 27010
39032 27010 98511 81729 104562 182810 206243 116722 -9875 -72036 -34886 95069 277561
39021 277561 398543 340701 142357 -12932 -10039 90083 186019 252583 271683 195604 74192
39010 74192 77613 258292 402618 273670 -76567 -384179 -490185 -427240 -262965 -47329
39000 -47329 113905 128992 77501 131003 299465 419146 410939 368900 346939 254368 62189
38989 62189 -63334 23303 226506 358983 412683 509601 639071 628043 388628 58399
38979 58399 -147973 -143036 293 142845 178403 101644 12951 22274 130682 232217 231220
38968 231220 121265 -47874 -226063 -359184 -367772 -181894 178065 561838 767956 710824
38958 710824 513689 388957 411181 460670 413909 313756 284106 335435 354566 269643 130344
38947 130344 18754 -33682 -21619 60307 180809 271181 303845 327261 389892 475432 547112
38936 547112 606287 663060 695985 698175 726995 838725 987705 1055706 986072 839601 712223
38925 712223 639719 588562 501552 348609 168870 57193 58810 81102 -17816 -231976 -378206
38914 -378206 -316273 -129960 -11154 -16523 -44079 -26738 -18027 -54725 -58640 40417 170082
38903 170082 214496 201208 263560 417107 497188 369626 115700 -59707 -45049 118601
38893 118601 339059 540392 649927 618821 482192 336494 236271 168060 136060 189438
38883 189438 317848 401565 353445 260725 280530 414782 507425 480016 443965 514703 621923
38872 621923 609809 459192 293264 200655 176759 222058 352489 487053 474785 309780
38862 309780 194412 281847 455683 494959 379036 269934 238045 193572 100276 61886 119844
38851 119844 133469 -11946 -197701 -218979 -62728 112847 229296 354164 518950 632983
38841 632983 629633 572756 544281 518325 431884 320238 291494 383241 508184 544036 446736
38830 446736 281419 161097 147749 209730 284609 354378 412591 395385 246604 54302 4038
38819 4038 151944 352820 470682 535777 598565 565115 345298 75434 -14170 68746 84247
38808 84247 -78511 -246420 -240276 -125183 -64347 -61949 3963 176304 377996 522439 558234
38797 558234 459486 280131 169136 217015 318043 290979 111830 -72886 -136720 -73543
38787 -73543 63360 203823 255661 179795 76279 83961 190436 258740 247705 265163 366124
38776 366124 442923 394568 289561 262316 327299 389974 387157 332833 261138 189693 115088
38765 115088 11579 -123352 -206583 -131315 75659 253948 321301 383035 551548 760934
38755 760934 873405 885429 893703 912100 865267 741062 618506 549221 522655 538530 599916
38744 599916 643950 604256 546220 609397 791616 919538 878863 754613 680819 658793 608300
38733 608300 519313 460821 478690 549216 602638 554141 361473 95956 -95417 -146262 -139492
38722 -139492 -174082 -223930 -196888 -85817 22175 67571 76135 98326 149127 209471 240501
38711 240501 195847 65751 -80494 -133311 -47772 100603 180149 131725 37789 51047 234726
38700 234726 482663 623886 592707 455656 290714 118632 -30772 -74326 32784 204829
38690 204829 296245 256278 168748 146074 220090 332236 399640 384108 306522 200405 75307
38679 75307 -45140 -81095 27764 194777 225489 40925 -200126 -270660 -130271 54278
38669 54278 118841 68726 42519 157526 391566 591578 610809 455949 274237 182549 159324
38658 159324 135144 122595 186466 329191 486125 610202 682397 657434 496115 267210
38648 267210 129432 162986 267837 275273 132360 -65135 -205297 -272591 -306828 -289186 -140744
38637 -140744 136457 380883 420935 289143 192000 247908 349359 326520 153945 -70409
38627 -70409 -264987 -393768 -421669 -342049 -213531 -91260 35373 167832 236727 217231
38617 217231 224108 342584 423079 235194 -177671 -496205 -527089 -423589 -414052 -478552 -445650
38606 -445650 -301178 -216309 -283492 -372514 -294641 -30230 259253 413152 416383 354730 270474
38595 270474 134263 -26557 -69723 100217 372509 554581 625051 718301 856896 870548
38585 870548 648051 327497 135018 132429 217198 283355 283478 209504 121221 136938 290806
38574 290806 443500 434377 285854 160877 150322 200712 227743 198935 110872 -19739 -131410
38563 -131410 -157381 -101070 -21738 45461 100810 129492 105639 40751 -27021 -82997 -129125
38552 -129125 -149367 -133559 -110836 -109911 -120938 -144214 -214693 -305652 -287092 -100265 87065
38541 87065 54500 -166560 -328653 -309807 -233335 -202394 -117638 116027 360654 402613 257577
38530 257577 140718 159250 200828 148162 56187 43692 110171 160721 168100 204580 299491
38519 299491 352038 252398 52583 -69560 -30302 57533 52584 -19003 -31141 22187 8564
38508 8564 -120646 -217818 -127659 95801 260871 285002 265584 303659 351552 285881 88851
38497 88851 -100490 -123023 37777 244437 341885 279207 105293 -96322 -230734 -208400
38487 -208400 -27720 169749 217850 120042 46817 110790 226988 245258 140171 -4277
38477 -4277 -128640 -216154 -221310 -101286 79151 183260 176164 175695 280446 419132 441909
38466 441909 319305 169975 95466 57028 -55839 -272447 -491441 -578963 -503262 -374735
38456 -374735 -351600 -490516 -684844 -765390 -666756 -474208 -304190 -183027 -75659 13388
38446 13388 41340 14998 -6312 -8792 -41105 -100221 -90814 32872 159573 149720 25908 -61189
38434 -61189 -24676 99850 257768 416303 505622 451366 302392 216240 270293 382323 461432
38423 461432 529574 623033 673429 590103 407296 261737 254211 385684 577859 701954 652782
38412 652782 465611 304505 274766 320779 374242 491593 721728 938056 978482 902204
38402 902204 915779 1048020 1088659 887821 544062 233333 13037 -115313 -98838 78631
38392 78631 294556 399761 378910 310038 233951 162457 145620 208280 263006 206392 71773
38381 71773 -34608 -123106 -300844 -551414 -684602 -570013 -308422 -92685 10582 48868
38371 48868 31843 -76451 -227298 -272102 -122802 139385 357176 451806 447076 390177 315254
38360 315254 264304 266174 277490 208441 46670 -91069 -81894 58207 204651 274572 284784
38349 284784 278969 279831 320718 438530 602699 728323 802492 916550 1107610 1248253 1195709
38338 1195709 998569 835223 770859 711876 616184 601520 763900 993566 1085283 984002
38328 984002 818081 712504 674229 668171 697971 752782 745273 590956 335335 127192 48218
38317 48218 28038 -36241 -129567 -156753 -105299 -77611 -138332 -214102 -199829 -97033 22786
38306 22786 126546 193571 140708 -79426 -315568 -321322 -73250 166298 191770 117821 172120
38295 172120 352407 477157 506659 592513 797830 972507 974423 848373 692464 491972
38285 491972 214379 -35298 -105161 1967 141361 212191 217501 162639 24005 -161161
38275 -161161 -281755 -274713 -190119 -100737 -11690 99424 208278 262616 247458 191833 129688
38264 129688 84848 76453 104120 129102 94787 -22583 -184462 -312948 -349828 -297942 -196865
38253 -196865 -59163 138974 382796 569528 589723 461625 338451 354636 480537 551226
38243 551226 443060 213279 45027 40232 98611 56287 -74722 -102957 76855 320574
38233 320574 417939 354883 282559 283885 302033 274326 203203 97156 -29201 -88860 8470
38222 8470 196018 293043 245539 187648 215255 249193 203180 138286 135159 141654 84817 29471
38210 29471 75583 178771 225530 221899 250293 290462 249545 141105 70331 54666 19147
38199 19147 -35011 -21725 62165 128441 179809 324813 558743 700167 629471 445680 293658
38188 293658 169070 4463 -166225 -258169 -274952 -277691 -262167 -168146 12985 205801 301731
38177 301731 219583 -15461 -224602 -205546 34991 272938 342327 306149 293724 314298 333937
38166 333937 386858 467666 452099 297721 193594 302566 469799 438844 273188 264859 450228
38155 450228 543822 403425 235741 219258 230537 135932 83916 247387 474216 486168 301020
38144 301020 163433 128737 17624 -224356 -416744 -448378 -428540 -432711 -331298 -29019
38134 -29019 299052 397418 256382 78570 -17546 -93992 -213911 -322131 -336730 -252524 -113880
38123 -113880 35937 137505 117678 -25396 -172163 -184568 -66189 31073 -7963 -103628
38113 -103628 -67977 148569 369470 398774 258050 136107 135908 178556 163385 107354 76499
38102 76499 77072 89534 136865 235295 333710 387560 440945 536925 591491 480993 242438 57895
38090 57895 21404 44126 31576 31299 122417 254434 306190 254723 178501 117479 42484 -22190
38078 -22190 46123 315009 640818 750150 507801 77174 -217357 -190969 49366 240253
38068 240253 212934 6217 -210230 -272271 -116477 185500 476781 638081 661637 591081
38058 591081 447733 278624 202134 276614 364114 288630 123026 119895 314761 427794 281718
38047 281718 90116 119389 248491 156350 -148384 -313004 -163940 67294 130962 97705
38037 97705 155233 284155 337430 301389 272899 260512 203765 151207 233988 450369 626089
38026 626089 631095 526379 440275 376008 219900 -71280 -351732 -408213 -211176 15249
38016 15249 44595 -71423 -89747 65748 192506 114837 -58162 -105283 -5247 80848 66998
38005 66998 17379 -4291 -1590 42643 181614 397465 573948 601992 451539 156614 -186694
37994 -186694 -431652 -495201 -451968 -420294 -386301 -264980 -102448 -45142 -96557 -91312 28080
37983 28080 86008 -71988 -348454 -542501 -604077 -595205 -501273 -262335 48266 250047 274488
37972 274488 231937 242722 310122 378801 408391 350681 159399 -105203 -256512 -159730 94026
37961 94026 266091 217394 16881 -188010 -317717 -338295 -191377 129955 459695 558299
37951 558299 386230 165630 94941 117031 87391 55858 183258 428665 556370 488846
37941 488846 427017 522087 630378 547964 331405 197865 210776 258011 276213 300975 324990
37930 324990 297619 264809 327366 438238 418132 222229 28593 -8466 56984 111543 171474
37919 171474 297697 432202 468013 421649 393730 387203 303778 130163 6487 61519 252378
37908 252378 414149 427995 309863 165119 87125 91980 138720 204886 315597 479491 632478
37897 632478 698684 695998 721329 820115 923881 941892 868151 760280 652044 544355 465951
37886 465951 471195 552971 612193 566477 467762 453924 573922 707880 691895 498629 261295
37875 261295 125893 108753 109413 51163 -10790 55420 284609 532282 622456 564865 536967
37864 536967 620972 664035 496533 215915 106706 281885 544285 644507 550470 389124
37854 389124 238315 100779 18469 66806 231223 397270 486252 520233 533068 500009 397279
37843 397279 266472 165466 95645 29190 -16238 19593 163060 359934 505825 519846
37833 519846 410159 278938 237431 296723 358652 322213 175645 -11966 -140545 -119445
37823 -119445 58009 243817 239109 56618 -11164 272205 735412 963222 814193 573999
37813 573999 526325 583034 502853 310223 250735 391080 518180 468406 340054 294826 327579
37802 327579 352696 377528 441258 475097 383793 222921 145549 181965 209868 163274 145773
37791 145773 278596 524342 736393 837157 875406 919874 962879 960654 935799 977447 1113693
37780 1113693 1235693 1219921 1102546 1031455 1034521 962191 724895 460541 344496 333876
37770 333876 266855 154292 165968 320428 402480 272229 79092 36546 109696 83768 -123229
37759 -123229 -368444 -486308 -456258 -359170 -263758 -180694 -68439 125282 377508 551179
37749 551179 507452 270800 32612 -27765 102081 286179 371510 300479 139466 16513
37739 16513 10600 92528 178007 218496 220426 204530 185753 176045 169792 144430 110711 131378
37727 131378 236476 348270 362759 295900 273073 368520 527362 656202 711872 676791 531186
37716 531186 304130 92533 -28149 -70291 -65846 12728 190531 383943 448727 350410 223820
37705 223820 224933 348204 428630 336457 147169 68085 174150 286709 207057 23072 20070
37694 20070 259335 442748 328855 111235 154208 448071 616662 476028 281827 300719
37684 300719 409490 344174 152228 106097 254149 356789 277341 167497 192714 302498
37674 302498 384111 450676 535945 559739 458894 331705 288643 264990 162556 83671 199354
37663 199354 427760 492444 326733 182558 255247 415004 442128 349415 301323 345288 411982
37652 411982 494241 628042 741204 717142 600736 554878 597355 566519 392860 221803
37642 221803 189379 249945 331509 483105 704785 786209 544810 145409 -62741 -9830
37632 -9830 39946 -71077 -160335 -33148 178305 200646 7059 -187564 -244889 -220117 -195636
37621 -195636 -185035 -205039 -277279 -337066 -284513 -146984 -47982 5233 140335 381615 565609
37610 565609 579029 521019 515264 505553 381992 196084 91988 103829 167798 257287 349303
37599 349303 331045 124222 -138879 -247469 -197332 -160500 -187632 -149447 4745 143518
37589 143518 172933 172534 232292 322645 407764 515546 599785 515183 261507 82933 159238
37578 159238 339294 360945 212418 77603 30054 13094 56897 258644 547636 709915
37568 709915 692324 674005 771123 867742 836462 745829 705391 638372 384589 -24266 -346199
37557 -346199 -389328 -191969 63997 237832 303644 301374 273384 256842 303900 454305 661790
37546 661790 789473 731895 522768 274804 45774 -162363 -299530 -276815 -110513 31129
37536 31129 -15727 -242363 -480652 -552274 -404499 -150061 21631 23991 -37260 -7935 105156
37525 105156 161098 109529 60313 97928 160271 177594 213353 350012 511338 533677 394227
37514 394227 255414 269702 419872 572804 630745 595235 512126 398388 250545 119097
37504 119097 114226 275543 471024 521175 421869 338294 361316 396260 345164 262160 224657
$$ [...]
##END NTUPLES=NMR SPECTRUM
##END=
