##TITLE=31P_DE-80H_X3
 64 sc D2O
 26.2.2025
##JCAMPDX= 6.0         $$ Bruker NMR JCAMP-DX V2.0
##DATA TYPE= NMR SPECTRUM
##DATA CLASS= NTUPLES
##ORIGIN= UXNMR, Bruker Analytische Messtechnik GmbH
##OWNER= root
$$ XWIN-NMR		Version 3.5
$$ Thu May 15 14:22:37 2025 Russian Standard Time (UT+4h)  Yarkov@DPX200
##.OBSERVE FREQUENCY= 81.013821
##.OBSERVE NUCLEUS= ^31P
##.ACQUISITION MODE= SIMULTANEOUS
##.ACQUISITION SCHEME= undefined
##.AVERAGES= 64
##.DIGITISER RES= 17
##SPECTROMETER/DATA SYSTEM= spect
##.PULSE SEQUENCE= zgpg30
##.SOLVENT NAME= CDCl3
##.SHIFT REFERENCE= (INTERNAL, CDCl3, 0, 198.062)
##AUDIT TRAIL= $$ (NUMBER, WHEN, WHO, WHERE, WHAT)
$$ ##TITLE= Audit trail, XWIN-NMR		Version 3.5
$$ ##JCAMPDX= 5.01
$$ ##ORIGIN= Bruker BioSpin GmbH
$$ ##OWNER= Yarkov
$$ C:/Bruker/XWIN-NMR/data/yarkov2/nmr/P31/2/pdata/1/auditp.txt
$$ ##AUDIT TRAIL=  $$ (NUMBER, WHEN, WHO, WHERE, WHAT)
(   1,<2025-05-15 14:21:24.50 +0400>,<Yarkov>,<DPX200>,
      <created by zg, POWCHK disabled, PULCHK disabled
       configuration hash MD5:
       00 E9 B6 7A A2 85 ED C7 34 08 36 98 17 FE 4E 26
       data hash MD5: 32K
       1F 89 88 F5 87 DD 45 42 D3 21 6D 18 31 0E 89 30>)
(   2,<2025-05-15 14:21:48.23 +0400>,<Yarkov>,<DPX200>,
      <Start of raw data processing
       efp BC_mod = 2 LB = 1.5 FT_mod = 6 PKNL = 1 PHC0 = 1789.214 PHC1 = 1.159449 SI = 64K 
       data hash MD5: 64K
       A8 8B 59 D9 7A 61 4C D8 FC 22 CF ED 6D 8A F8 E2>)
(   3,<2025-05-15 14:22:09.54 +0400>,<Yarkov>,<DPX200>,
      <pk PHC0 = -51.73014 PHC1 = 158.2001 
       data hash MD5: 64K
       E9 01 CB 29 F3 AC 5B 5A C1 4B B5 1B 4B 83 AE CA>)
(   4,<2025-05-15 14:22:13.75 +0400>,<Yarkov>,<DPX200>,
      <abs ABSG = 5 
       data hash MD5: 64K
       AE 67 F6 97 46 5A 89 94 93 62 26 1F 49 88 57 4B>)
$$ ##END=
$$ 
$$ hash MD5
$$ 01 63 79 27 50 35 68 EF B3 F7 0E 55 F7 EC C6 2E
##$RELAX= 
##$RELAX= 
##$RELAX= 
##$RELAX= 
##$RELAX= 
##$RELAX= 
##$RELAX= 
##$RELAX= 
$$ Bruker specific parameters
$$ --------------------------
##$DU= <C:/Bruker/XWIN-NMR>
##$EXPNO= 2
##$NAME= <P31>
##$PROCNO= 1
##$TYPE= <nmr>
##$USER= <yarkov2>
##$AMP= (0..31)
100 100 100 100 100 100 100 100 100 100 100 100 100 100 100 100 100 100 
100 100 100 100 100 100 100 100 100 100 100 100 100 100 
##$AQSEQ= 0
##$AQ_mod= 1
##$AUNM= <au_zg>
##$AUTOPOS= <>
##$BF1= 81.014009
##$BF2= 200.13
##$BF3= 200.13
##$BF4= 200.13
##$BF5= 200.13
##$BF6= 200.13
##$BF7= 200.13
##$BF8= 200.13
##$BYTORDA= 1
##$CFDGTYP= 0
##$CFRGTYP= 5
##$CHEMSTR= <none>
##$CNST= (0..31)
1 1 145 1 1 1 1 1 1 1 1 1 1 1 1 1 1 1 1 1 1 1 1 1 1 1 1 1 1 1 1 1 
##$CPDPRG= <waltz16>
##$CPDPRG1= <>
##$CPDPRG2= <waltz16>
##$CPDPRG3= <>
##$CPDPRG4= <mlev>
##$CPDPRG5= <mlev>
##$CPDPRG6= <mlev>
##$CPDPRG7= <mlev>
##$CPDPRG8= <mlev>
##$CPDPRGB= <>
##$CPDPRGT= <>
##$D= (0..31)
0 1 0 0 0 0 0 0 0 0.06 0 0.03 2e-05 3e-06 0 0 0.0002 0 0 0 0 0 0 0 0 0 
0 0 0 0 0 0 
##$DATE= 1747304483
##$DBL= (0..7)
120 120 120 11 120 120 24 19 
##$DBP= (0..7)
150 150 150 150 150 150 150 150 
$$ [...]
##$SUBNAM3= <"">
##$SUBNAM4= <"">
##$SUBNAM5= <"">
##$SUBNAM6= <"">
##$SUBNAM7= <"">
##$SUBNAM8= <"">
##$SUBNAM9= <"">
##$SW= 400.765351723535
##$SWIBOX= (0..15)
0 1 3 0 0 0 0 0 0 0 0 0 0 0 0 0 
##$SW_h= 32467.5324675325
##$TD= 32768
##$TD0= 1
##$TE= 0
##$TE2= 300
##$TE3= 300
##$TEG= 300
##$TL= (0..7)
0 120 53 12 22 120 120 120 
##$TP= (0..7)
150 150 150 150 150 150 150 150 
##$TP07= 0
##$TPNAME0= <>
##$TPNAME1= <>
##$TPNAME2= <>
##$TPNAME3= <>
##$TPNAME4= <>
##$TPNAME5= <>
##$TPNAME6= <>
##$TPNAME7= <>
##$TPOAL= (0..7)
0.5 0.5 0.5 0.5 0.5 0.5 0.5 0.5 
##$TPOFFS= (0..7)
0 0 0 0 0 0 0 0 
##$TUNHIN= 0
##$TUNHOUT= 0
##$TUNXOUT= 0
##$USERA1= <user>
##$USERA2= <user>
##$USERA3= <user>
##$USERA4= <user>
##$USERA5= <user>
##$V9= 5
##$VALIST= <valist>
##$VCLIST= <CCCCCCCCCCCCCCC>
##$VD= 0
##$VDLIST= <DDDDDDDDDDDDDDD>
##$VPLIST= <PPPPPPPPPPPPPPP>
##$VTLIST= <TTTTTTTTTTTTTTT>
##$WBST= 1024
##$WBSW= 4
##$XGAIN= (0..3)
0 0 0 0 
##$XL= 0
##$YL= 0
##$YMAX_a= 12603
##$YMIN_a= -30839
##$ZGOPTNS= <>
##$ZL1= 120
##$ZL2= 120
##$ZL3= 120
##$ZL4= 120
##$ABSF1= 198.0616
##$ABSF2= -202.7028
##$ABSG= 5
##$ABSL= 3
##$ALPHA= 0
##$AQORDER= 0
##$ASSFAC= 0
##$ASSFACI= 0
##$ASSFACX= 0
##$ASSWID= 0
##$AUNMP= <proc_1d>
##$AZFE= 0.1
##$AZFW= 0.5
##$BCFW= 0
##$BC_mod= 2
##$BYTORDP= 0
##$COROFFS= 0
##$CY= -3
##$DATMOD= 1
##$DC= 0
##$DFILT= <>
##$DTYPP= 0
##$F1P= 0
##$F2P= 0
##$FCOR= 1
##$FTSIZE= 65536
##$FT_mod= 6
##$GAMMA= 0
##$GB= 0
##$INTBC= 1
##$INTSCL= 9.790993e-09
##$ISEN= 30
##$LB= 1.5
##$LEV0= 0
##$LPBIN= 0
##$MAXI= 10000
##$MC2= 0
##$MEAN= 0
##$ME_mod= 0
##$MI= 50
##$NCOEF= 0
##$NC_proc= -5
##$NLEV= 6
##$NOISF1= 182.463
##$NOISF2= 159.3651
##$NSP= 0
##$NTH_PI= 0
##$NZP= 0
##$OFFSET= 198.0616
##$PC= 4
##$PHC0= 1737.484
##$PHC1= 159.3596
##$PH_mod= 1
##$PKNL= yes
##$PPARMOD= 0
##$PSCAL= 0
##$PSIGN= 0
##$REVERSE= no
##$SF= 81.0140089999434
##$SI= 65536
##$SIGF1= 159.3651
##$SIGF2= -187.1042
##$SINO= 113.3802
##$SIOLD= 16384
##$SREGLST= <1H.CDCl3>
##$SSB= 0
##$STSI= 65536
##$STSR= 0
##$SW_p= 32467.5324675325
##$SYMM= 0
##$S_DEV= 0
##$TDeff= 32768
##$TDoff= 0
##$TI= <>
##$TILT= no
##$TM1= 0
##$TM2= 0
##$TOPLEV= 0
##$USERP1= <user>
##$USERP2= <user>
##$USERP3= <user>
##$USERP4= <user>
##$USERP5= <user>
##$WDW= 1
##$XDIM= 65536
##$YMAX_p= 448098734
##$YMIN_p= -40947061
$$ End of Bruker specific parameters
$$ ---------------------------------
##NTUPLES= NMR SPECTRUM
##VAR_NAME=  FREQUENCY,     SPECTRUM/REAL,   SPECTRUM/IMAG
##SYMBOL=    X,             R,               I
##VAR_TYPE=  INDEPENDENT,   DEPENDENT,       DEPENDENT
##VAR_FORM=  AFFN,          ASDF,            ASDF
##VAR_DIM=   65536,         65536,           65536
##UNITS=     HZ,            ARBITRARY UNITS, ARBITRARY UNITS
##FACTOR=    0.49542278885378, 1,            1
##FIRST=     16045.7642231865, 0,            0
##LAST=      -16421.768244346, 0,            0
##MIN=       -16421.768244346, -40947061,    0
##MAX=       16045.7642231865, 448098734,    0
$$ Real data points
##PAGE= N=1
##DATA TABLE= (X++(R..R)), XYDATA
$$ [...]
43055 461943 719299 857481 809254 731755 706345 598218 370382 267745 461936 721639
43045 721639 688604 340534 -52901 -308441 -409135 -294805 131041 750953 1210060 1226755
43035 1226755 815638 184721 -453029 -929356 -1125410 -1037120 -795660 -559338 -400598 -327319
43025 -327319 -377542 -618018 -1010468 -1324491 -1290857 -897345 -452907 -258980 -276286 -250486
43015 -250486 -114187 -53030 -146245 -181280 37301 375671 548332 484458 326923 159870
43005 159870 -43794 -242557 -323967 -315183 -405155 -691794 -1062833 -1397791 -1721288 -2025734
42995 -2025734 -2084435 -1663567 -907342 -303784 -175055 -338691 -398782 -256705 -131731 -129950
42985 -129950 -87204 59444 41245 -330778 -717365 -587284 41006 569907 591343 320853
42975 320853 135634 58465 -44892 -83259 76913 252183 156693 -136335 -325401 -399533
42965 -399533 -613606 -938122 -969426 -529473 4330 168554 -65290 -433554 -767991 -981301
42955 -981301 -896186 -431158 136189 404483 339684 280844 445289 669571 701851 535052
42945 535052 336350 207795 152936 162287 170580 -5107 -498627 -1142953 -1537403 -1452278 -1078494
42934 -1078494 -785721 -704663 -668171 -520624 -320650 -205714 -204477 -256333 -286390 -170769
42924 -170769 219961 776896 1073709 772702 87658 -390515 -366719 -131543 -117571 -387784
42914 -387784 -698321 -877172 -930930 -875159 -679883 -382620 -100610 89989 185198 171391
42904 171391 29325 -164627 -251221 -149928 59299 247829 365842 413875 341744 53870
42894 53870 -461383 -1026972 -1341332 -1205919 -722463 -227470 19039 58927 111048 275231
42884 275231 460367 581425 675935 770540 780185 671048 617496 806641 1121184 1230070
42874 1230070 1031197 787888 726483 722532 577266 404998 440988 564671 382361 -176687
42864 -176687 -688171 -778987 -543595 -249503 63000 418571 603713 395648 -29200 -269819
42854 -269819 -229593 -143306 -118324 -22149 135872 99256 -209494 -481287 -446431 -255587 -210751
42843 -210751 -328535 -431047 -513868 -720738 -1001578 -1077737 -801329 -353414 5410 257046
42833 257046 578765 1001372 1232751 937997 210489 -377139 -336689 194076 652906 740710
42823 740710 656477 639429 597667 344151 -60563 -423276 -695511 -919490 -1048030 -1042169
42813 -1042169 -1026025 -1122538 -1240256 -1233814 -1150253 -1075465 -880712 -446693 -43014 -82282 -474176
42802 -474176 -625949 -217926 371675 615430 508687 421589 501667 559190 462766 331303
42792 331303 298264 322876 322761 329028 396892 461550 403226 215916 1175 -202668 -462174
42781 -462174 -757385 -867179 -609929 -167029 40021 -132595 -342040 -204744 211172 536685
42771 536685 612880 580381 516316 308490 -35997 -251850 -165125 11242 -69175 -449842
42761 -449842 -861528 -1062395 -1015264 -788396 -476213 -228783 -192399 -351529 -522841 -563424
42751 -563424 -519337 -517953 -576629 -598903 -535540 -450882 -396166 -306558 -118204 63895 57368
42740 57368 -124128 -241520 -144904 30283 99218 113305 222764 360629 312146 79949
42730 79949 -63395 70268 387322 727131 1064145 1392607 1588086 1519737 1193507 706101
42720 706101 187139 -152885 -112689 219691 436542 236483 -224067 -556536 -600747 -479766
42710 -479766 -297459 -20373 334986 590134 559208 249237 -126092 -334976 -377106 -516128
42700 -516128 -914583 -1246479 -953428 -13512 858378 1051055 822553 829460 1101828 1036685
42690 1036685 397452 -266196 -402964 -191856 -175053 -506202 -916032 -1174809 -1221164 -1004102
42680 -1004102 -572988 -230102 -230421 -358458 -142457 485564 1048018 1101804 698729 198759
42670 198759 -118932 -153033 75257 413620 657349 751883 807224 875367 897004 915333 1087534
42659 1087534 1359457 1401054 1080076 756157 808429 1052570 983614 505891 38962 -109698
42649 -109698 -104359 -207901 -369389 -374695 -200406 -25544 -4017 -152790 -373655 -508786
42639 -508786 -476884 -395253 -436812 -552449 -522963 -310245 -112431 -9561 149786 385334
42629 385334 446222 261798 202024 550674 982321 974266 561003 236315 212340 248309 189389
42618 189389 182385 271118 233960 -4305 -179167 -105181 28999 -18407 -210626 -412550 -628058
42607 -628058 -855636 -963754 -911941 -849412 -812091 -614127 -255666 -98309 -328657 -582001
42597 -582001 -498684 -347620 -576817 -954132 -781942 48768 821642 948731 645411 428308
42587 428308 382837 257711 -12217 -232975 -261643 -121880 111723 355924 513723 562831
42577 562831 575536 561011 407579 86572 -218623 -315844 -223487 -68004 107857 286291
42567 286291 346385 187136 -82211 -248245 -253596 -196978 -117252 32360 186444 143938 -160537
42556 -160537 -492637 -554160 -323320 -35181 157786 352203 642793 833326 599044 -48021
42546 -48021 -655227 -815087 -617231 -452934 -482237 -522521 -413981 -217056 3482 320531
42536 320531 725425 976350 867121 523754 236979 77255 -122060 -420212 -605883 -445983
42526 -445983 8105 437369 555519 375429 186706 257116 555054 805022 806557 609728
42516 609728 360497 108557 -133776 -249103 -94483 282164 625666 715265 576712 436621
42506 436621 483446 668391 745706 543307 176679 -80151 -122016 -86968 -90350 -65526 32469
42495 32469 50827 -132896 -322043 -195372 223434 534474 462226 178112 7278 -10147
42485 -10147 -81185 -283720 -451371 -443371 -330597 -225048 -89062 118221 208098 -75271
42475 -75271 -629023 -964832 -745343 -176207 306172 575984 801083 1002341 974421 678115
42465 678115 391899 333671 362652 209858 -174075 -634068 -996000 -1104771 -873256 -468183
42455 -468183 -272645 -463504 -766319 -817159 -613934 -398315 -253932 -91928 83140 187822
42445 187822 276626 469623 710153 857459 963126 1158769 1302799 1073660 453443 -184413
42435 -184413 -532938 -624133 -594441 -474950 -304868 -176710 -67439 117991 265086 123347
42425 123347 -239029 -415929 -277501 -231043 -594515 -1051782 -1102110 -790017 -557178 -533018
42415 -533018 -438263 -149723 94478 133013 136552 251088 273572 -73042 -672734 -1046840
42405 -1046840 -865268 -320245 72191 35148 -183851 -177793 54354 138438 -66309 -216578
42395 -216578 -26779 244427 178667 -136089 -227349 53965 349072 328531 46220 -314543
42385 -314543 -709242 -1110659 -1386683 -1452731 -1362646 -1160460 -839736 -518949 -424614 -590732
42375 -590732 -774226 -760609 -560134 -254587 82576 236560 -42100 -604283 -899646 -660785
42365 -660785 -304497 -348542 -694122 -869966 -777897 -717781 -752641 -571029 -83340 300896
42355 300896 240451 -3709 88126 572000 962302 858275 407863 63606 35235 153009
42345 153009 239313 398079 783587 1218858 1322280 1031084 712388 629565 570876 228538
42335 228538 -287015 -620575 -707601 -780818 -900896 -852285 -560884 -296670 -335197 -642570
42325 -642570 -1008887 -1306304 -1505058 -1586210 -1545355 -1395056 -1135057 -818386 -606765 -590742
42315 -590742 -596681 -391413 -44508 181005 275475 472994 746080 708828 202944 -368474
42305 -368474 -540406 -346017 -136779 -107544 -266499 -616192 -1036086 -1191918 -915892 -526798
42295 -526798 -427192 -523190 -425449 -119298 5788 -205644 -434041 -381530 -157311 -24302
42285 -24302 -43921 -135739 -275236 -462111 -616176 -619469 -398678 33661 506812 712719
42275 712719 494075 93118 -93859 2962 114456 82238 51244 181778 430532 669384
42265 669384 776463 577558 -17700 -758539 -1222660 -1321173 -1342127 -1434928 -1426657 -1270231
42255 -1270231 -1234255 -1389234 -1313308 -685579 130960 511108 359209 74955 -105005 -297877
42245 -297877 -579328 -803411 -837957 -684405 -371628 12409 232583 125575 -134054 -243804
42235 -243804 -174717 -85588 45086 321369 528666 288998 -308678 -650626 -332829 366290
42225 366290 892026 992449 748057 336987 -17845 -112129 12295 79975 -23152 -71050
42215 -71050 124586 375405 358466 21590 -446348 -881272 -1178115 -1218920 -997439 -714790
42205 -714790 -557941 -476059 -337433 -179883 -116672 -115922 -82264 -58119 -136828 -267508 -352752
42194 -352752 -440346 -586964 -633233 -404715 -90920 -100654 -491620 -833657 -750221 -359734
42184 -359734 -35580 80158 139150 279202 452365 552931 582297 632306 744375 835202
42174 835202 796528 659632 590504 684816 845632 933894 956466 993296 1003676 855051 540151
42163 540151 244972 181182 411818 809167 1116668 1128199 917705 813228 1007861 1286595
42153 1286595 1310278 1062997 773387 484154 46887 -446984 -623114 -354231 15013 186230
42143 186230 326342 666947 964528 786233 211933 -185888 -81246 259618 452946 480403
42133 480403 538437 670107 756524 717695 548827 275429 10481 -69183 52565 151653
42123 151653 61448 -77520 -54673 40109 -68350 -405716 -694986 -755798 -702766 -679367 -641883
42112 -641883 -535596 -465296 -500363 -468732 -166388 310842 647830 675944 473038 139548
42102 139548 -303282 -758273 -998625 -887308 -558525 -294575 -258108 -369813 -406797 -225717
42092 -225717 61579 173692 3217 -186046 -48893 383078 706332 627354 280097 30726
42082 30726 119592 521913 978769 1112810 719639 53458 -354915 -284244 -56311 -58403
42072 -58403 -229277 -211666 141870 636090 994772 1044367 735855 207370 -243466 -456369
42062 -456369 -601164 -864306 -1057527 -842089 -296459 83098 1560 -321004 -547405 -642938
42052 -642938 -744827 -863434 -922301 -935999 -960753 -983733 -1014770 -1165538 -1466342 -1705028
42042 -1705028 -1640591 -1327094 -1043306 -914117 -780495 -489272 -161254 -55952 -231733 -473636
42032 -473636 -589383 -657464 -851717 -1082850 -1043048 -682313 -404721 -581142 -1028757 -1245668
42022 -1245668 -1064122 -759612 -552724 -360356 -96737 127000 237107 332518 437591 408622
42012 408622 253780 237557 439513 513014 183008 -282866 -455121 -370187 -369964 -489479 -489043
42001 -489043 -433180 -715849 -1411819 -2048896 -2207802 -1995064 -1722346 -1442990 -1077147 -756151
41991 -756151 -722228 -973993 -1249129 -1322532 -1161804 -837466 -435093 -53678 205126 265677
41981 265677 110476 -143993 -237370 -577 376582 518414 373861 313611 572741 851948
41971 851948 731668 286333 -54165 -152982 -288911 -614038 -879986 -859992 -721400 -727446
41961 -727446 -795494 -663029 -377851 -284363 -503217 -721658 -616860 -260094 67688 285613
41951 285613 505284 701360 665161 341431 1766 -44455 201894 479167 573485 468710
41941 468710 264798 83692 36162 167362 417721 687173 911312 1031812 973390 748068
41931 748068 504073 337001 124319 -271995 -685284 -762976 -435935 -35635 141585 158896
41921 158896 189195 164231 -93066 -519311 -851544 -972688 -992486 -999200 -952299 -854266 -826258
41910 -826258 -931643 -1070344 -1123400 -1079262 -956550 -741609 -491387 -363926 -422712 -514708
41900 -514708 -480402 -401403 -478412 -710326 -870046 -806514 -620695 -513952 -593420 -856735
41890 -856735 -1225454 -1534348 -1627711 -1555005 -1545305 -1685232 -1757694 -1548560 -1187154 -969329
41880 -969329 -915979 -764930 -407866 -68963 46160 53383 191862 490599 798079 1015125
41870 1015125 1123699 1087250 917427 781393 846295 1026293 1050615 795504 418433 159763
41860 159763 126750 262674 412437 435323 363560 403220 643294 835905 661457 162199
41850 162199 -323853 -628487 -854143 -988388 -791915 -245013 222057 225160 -69667 -230250
41840 -230250 -169384 -144619 -266752 -380853 -428020 -572358 -877449 -1130651 -1111867 -837487
41830 -837487 -443261 -23464 307649 394726 234661 43033 -18678 -52573 -220471 -474458
41820 -474458 -675381 -852319 -1094454 -1239550 -957497 -214021 570173 945159 870651 624440
41810 624440 425390 306969 252990 243814 183654 -19356 -248380 -209952 234968 865760
41800 865760 1304786 1347022 1032022 511409 -23796 -361314 -381735 -169506 80231 249427
41790 249427 314775 249615 62686 -97139 -60580 116744 205588 138422 100404 207773 300032
41779 300032 194822 -26054 -172477 -252777 -406627 -617698 -730532 -727520 -757375 -862597
41769 -862597 -892895 -761951 -605138 -565172 -556977 -393851 -84948 133197 68823 -211730
41759 -211730 -474810 -568954 -529549 -451916 -343845 -162763 61722 254693 425962 636248
41749 636248 823291 832639 680789 595760 675920 702738 479129 179211 106602 223435 210904
41738 210904 -58584 -408577 -701959 -980355 -1210475 -1198290 -880231 -464860 -167805 -12981
41728 -12981 10869 -161413 -484564 -719682 -700403 -511519 -279521 6386 316438 452409
41718 452409 304603 53948 -81977 -123332 -152608 -88301 102012 173350 -79499 -431214
41708 -431214 -506484 -324884 -173166 -34452 369642 943545 1138323 700413 81319 -171772
41698 -171772 -109521 -155303 -438637 -716309 -831269 -892358 -996785 -1059031 -992839 -869833
41688 -869833 -787624 -685251 -409556 38289 402267 396947 43054 -318314 -420797 -375918
41678 -375918 -436309 -561056 -470916 -122690 164768 146375 -52528 -212613 -339758 -508942
41668 -508942 -611860 -527048 -403279 -500465 -813810 -1088216 -1153761 -1028130 -738923 -292694
41658 -292694 172928 429121 398367 208514 -57 -166134 -221024 -106830 78498 118626
41648 118626 -78459 -382430 -601809 -640160 -511698 -327782 -239237 -263033 -235331 -103480
41638 -103480 -142455 -588732 -1130445 -1158954 -590231 -33456 23964 -187563 -202824 -46860
41628 -46860 -80282 -339539 -481450 -333990 -112192 -42318 -77773 -70418 8060 104688 177835
41617 177835 183873 92608 -54236 -194630 -329274 -447974 -456297 -336358 -276520 -406681 -488055
41606 -488055 -170954 456551 907643 924661 727048 544438 283877 -127976 -408628 -239849
41596 -239849 285359 826215 1233754 1536367 1640931 1392235 875100 357440 -40886 -357681
41586 -357681 -520410 -388974 -76224 98819 48001 434 51567 -48835 -456792 -859516
41576 -859516 -839620 -467569 -231721 -419824 -820889 -1046061 -919416 -498706 80244 638259
41566 638259 950135 883765 558163 274386 253248 467185 720813 833630 728554 435420
41556 435420 103582 -37512 133185 461680 658640 629744 527739 442450 254248 -62079
41546 -62079 -202985 125506 745677 1175732 1218137 1091696 992705 862249 661004 535137
41536 535137 543721 507246 333729 250799 472889 831483 983005 825406 475328 8994
41526 8994 -489368 -770659 -646141 -295618 -46299 77979 254956 390950 177521 -346055
41516 -346055 -729065 -754634 -744049 -983920 -1209833 -998813 -437119 -28545 -49300 -314412
41506 -314412 -529911 -584132 -491713 -308841 -160707 -168678 -289418 -345249 -235695 -18164
41496 -18164 205288 361830 389531 280307 132501 28213 -127272 -487715 -980945 -1315820
41486 -1315820 -1332191 -1196998 -1168603 -1282784 -1370543 -1305809 -1134875 -999823 -1007329 -1146917
41476 -1146917 -1282935 -1244167 -967152 -563237 -249591 -212227 -476551 -846378 -1015028 -838584
41466 -838584 -490825 -261973 -234075 -267272 -256063 -209798 -86197 200950 514469 489487
41456 489487 -6309 -604150 -878169 -913517 -1118978 -1538828 -1723736 -1376938 -808649 -542344
41446 -542344 -669243 -817642 -651138 -187461 321525 629029 613085 329546 8619 -92775
41436 -92775 101712 444064 723389 851505 917157 1085369 1404788 1692156 1675077 1287249
41426 1287249 743091 290539 26381 15772 363182 941447 1237545 840222 69625 -244956
41416 -244956 266570 1055693 1314521 841902 72848 -506242 -708711 -591299 -356998 -259063
41406 -259063 -363358 -452340 -368929 -359230 -781989 -1500516 -1885773 -1519590 -657335 110723
41396 110723 447610 407566 204274 35780 17021 87035 13014 -373144 -938228 -1335675
41386 -1335675 -1349184 -1108653 -939884 -990844 -1036232 -746001 -171169 203779 33971 -419883
41376 -419883 -643506 -572521 -599403 -891305 -1111348 -972288 -709780 -736279 -1064206 -1353024
41366 -1353024 -1362486 -1095023 -630327 -102546 246853 273911 157800 185939 344612 359534
41356 359534 137817 -68536 4935 312878 574060 565528 324979 134200 267301 675158
41346 675158 986466 905448 498598 -7886 -522040 -976557 -1122064 -762066 -130657 273606
41336 273606 231923 -54765 -319737 -446125 -365564 -51010 372362 765363 1179532 1626077
41326 1626077 1743807 1157095 175892 -375047 -163285 299858 496686 560979 781668 958824
41316 958824 739618 243845 -158833 -447056 -804111 -1052747 -791127 -64723 584863 797297
41306 797297 740140 737273 894345 1138918 1323015 1246028 857480 449234 361509 511389
41296 511389 532305 362994 313943 508749 667245 557526 281784 -24121 -376129 -630699
41286 -630699 -400955 393987 1204801 1432391 1124152 778667 665537 689730 758915 873500
41276 873500 907558 680220 266864 -68561 -270433 -522002 -847515 -1002921 -863074 -627508
41266 -627508 -496203 -404065 -265347 -235082 -454042 -696905 -597923 -183031 122022 42624
41256 42624 -255109 -492931 -617971 -662480 -541453 -263254 -147038 -460529 -903871 -857097
41246 -857097 -215232 404564 467223 178236 49301 101644 -77209 -616703 -1143162 -1289470
41236 -1289470 -1059468 -628438 -126425 263874 308255 6465 -343881 -526994 -646745 -829542
41226 -829542 -910921 -644430 -81753 468951 773653 797588 615359 386196 329236 517192
41216 517192 723875 637100 209043 -306127 -598668 -484760 35423 709695 1091559 893340
41206 893340 320608 -90332 -15811 351527 544658 297133 -209858 -509914 -276926 370066
41196 370066 1012177 1365069 1461381 1420169 1261795 1044621 937699 955187 818967 343721
41186 343721 -194154 -367565 -177881 -9910 -63566 -161739 -127454 -21380 58538 110350
41176 110350 67449 -208875 -648948 -947988 -969815 -932915 -1018289 -1034428 -722910 -224871
41166 -224871 49414 -43925 -227765 -190406 63579 283087 257178 -9403 -324890 -483057
41156 -483057 -440461 -312403 -181374 12613 322382 611874 654463 413743 117209 -4304
41146 -4304 7665 -89216 -370911 -539407 -218764 521094 1099045 1017631 421493 -110666
41136 -110666 -258652 -227306 -352347 -709693 -1175393 -1604461 -1804423 -1562298 -919434 -277859
41126 -277859 -2831 7599 144144 514901 778604 607014 149701 -92209 175554 702058
41116 702058 968329 780306 467204 401814 455660 171336 -545050 -1209977 -1365346 -1129511
41106 -1129511 -936321 -940240 -964060 -901579 -843504 -827499 -763928 -658092 -655904 -790699 -899855
41095 -899855 -888174 -874610 -948049 -954014 -707658 -315818 -94227 -189756 -438299 -599967 -598367
41084 -598367 -492264 -333196 -140651 38238 133303 112223 -5599 -172726 -303754 -286619
41074 -286619 -103984 67890 11338 -242229 -402104 -271771 11353 183280 162476 26393
41064 26393 -150513 -229384 54082 766432 1476396 1642268 1298042 978938 923010 783949
41054 783949 290272 -265034 -486708 -438475 -363257 -172436 307817 792699 772193 238539
41044 238539 -280562 -422498 -306257 -127181 117156 368272 370851 17334 -431073 -655965
41034 -655965 -621318 -473511 -305385 -153749 -53272 32311 186974 373150 447166 391634
41024 391634 331123 266398 35486 -380851 -779084 -1066384 -1380842 -1715596 -1739813 -1266832
41014 -1266832 -649643 -379202 -453627 -486511 -336951 -267566 -475728 -786001 -882524 -619239
41004 -619239 -42036 676684 1230546 1295677 813615 101146 -400311 -456483 -137183 290433
40994 290433 514509 364472 927 -113228 394845 1349935 2059132 1955378 1210854 560338
40984 560338 478741 720827 783476 590866 454006 505603 554368 500057 519481 724647 942671
40973 942671 987089 890341 727169 484837 281519 412014 915857 1347702 1271917 793990
40963 793990 325845 39951 -115055 -74307 232263 545211 512863 245524 195460 451910
40953 451910 599633 384847 81171 -12787 -49163 -307546 -687353 -865765 -791899 -698009
40943 -698009 -701952 -690067 -577836 -436410 -320432 -162050 86990 326063 395979 247201
40933 247201 -19640 -244240 -319078 -254931 -176011 -239887 -513072 -885600 -1126939 -1087831
40923 -1087831 -859532 -676818 -653491 -689643 -649093 -508681 -294241 -28126 164260 67023
40913 67023 -343755 -766492 -907777 -827189 -750084 -679331 -465844 -161849 21306 74340
40903 74340 183751 357643 383513 201530 2008 -104102 -182746 -186699 42995 360815
40893 360815 328837 -120138 -434090 -186275 275416 321790 -88919 -487336 -643855 -742264
40883 -742264 -877305 -878745 -693356 -524971 -484982 -446162 -352531 -346169 -444755 -403901 -97555
40872 -97555 219538 253439 74735 -54924 -95223 -187309 -286312 -137881 329691 819692
40862 819692 989726 820447 536595 261115 -71540 -461526 -703190 -634064 -410447 -334293
40852 -334293 -426559 -400081 -128650 87886 -87453 -534455 -816566 -745845 -548792 -463523
40842 -463523 -431323 -290007 -71953 59096 75207 135060 374821 726576 952976 848483
40832 848483 433383 -49272 -370451 -533876 -686429 -828121 -744572 -293683 341053 795672
40822 795672 895386 789411 723618 778302 884944 1024149 1265971 1575252 1709121 1452575
40812 1452575 908670 395807 71824 -148746 -292781 -219303 51074 170767 -100630 -482149
40802 -482149 -518408 -230635 -53609 -159795 -261841 -166186 -95574 -234799 -314763 3280
40792 3280 546648 810015 624187 295073 76872 -166770 -669475 -1361585 -1916040 -2085493
40782 -2085493 -1890652 -1538633 -1219361 -947776 -602305 -168878 111679 -10596 -408052
40773 -408052 -630721 -430434 -56901 103749 34081 29338 229845 457509 519024 426840
40763 426840 239016 -96637 -576931 -977639 -1052188 -822709 -507652 -230657 17766 193759
40753 193759 207478 118983 106083 203373 285850 349303 548288 849939 920541 565812 92955
40742 92955 -4385 382354 906374 1163800 1001377 560653 202002 251059 620785 825792
40732 825792 579733 192526 101121 219911 155606 -88850 -130923 98590 213055 24290
40722 24290 -160501 -88167 54634 74174 177445 596749 1113201 1322262 1170210 916030
40712 916030 747479 717548 858072 1051632 984527 556656 168261 250659 653486 862944
40702 862944 719792 539163 577886 760975 927634 1004712 922758 662907 387791 247637
40692 247637 103802 -239771 -601523 -614260 -328115 -179091 -310306 -386660 -203262 -7890
40682 -7890 -8217 937 219943 418084 271517 -133704 -455760 -536733 -400365 -41632 450143
40671 450143 740703 572026 127452 -210706 -343738 -414990 -443186 -350578 -255070 -349495
40661 -349495 -513198 -412114 -22364 276496 204325 -99654 -319084 -256110 157983 828720
40651 828720 1359793 1267265 552028 -159651 -274587 117627 451484 389315 63636 -296195
40641 -296195 -665418 -1067621 -1344893 -1285902 -932065 -579525 -422335 -329518 -109934 104001
40631 104001 -11256 -433371 -696393 -512127 -214567 -273180 -574531 -622495 -354759 -222714
40621 -222714 -373923 -320962 262961 879322 813228 140299 -388768 -361546 -104955 -62824
40611 -62824 -245260 -437456 -561847 -603047 -461504 -146954 71729 -32913 -318233 -478704
40601 -478704 -487821 -578408 -816028 -960459 -821084 -542355 -405783 -466141 -512908 -338058
40591 -338058 58155 496649 768483 770814 576821 382025 324357 346797 287309 104762
40581 104762 -63959 -106811 -106045 -208473 -382437 -451611 -387735 -406676 -658005 -928016 -830355
40570 -830355 -282563 367531 731774 757681 640204 498841 301107 49291 -138076 -176018
40560 -176018 -131250 -128974 -210044 -331337 -447242 -527945 -537462 -466896 -388448 -424241 -634424
40549 -634424 -936289 -1140581 -1099601 -858272 -629784 -547067 -460324 -112214 455465 838670
40539 838670 741253 373402 187166 293501 383337 222932 -43875 -189109 -255948 -424667
40529 -424667 -671737 -790460 -702860 -553242 -478437 -432328 -284210 -12761 230072 234079
40519 234079 -47793 -373155 -412770 -151852 39678 -140729 -543827 -809825 -850424 -837183
40509 -837183 -821257 -703433 -555352 -583659 -696843 -505150 60613 503980 431375 153709
40499 153709 229725 622858 777561 469444 115210 158403 535964 909895 1106397 1104121
40489 1104121 828361 247591 -404873 -745745 -623308 -291423 -172068 -449389 -874961
40480 -874961 -997776 -646413 -136995 95498 -1415 -134543 -131914 -100243 -99373 17222 290986
40469 290986 469348 356053 143447 145283 357434 546444 642221 748911 853707 844717
40459 844717 790088 875540 1040235 1000566 718697 529931 659367 907372 1018104 1083653
40449 1083653 1290541 1479228 1342057 984250 876489 1159615 1341796 901558 -26439
40440 -26439 -817017 -1083909 -978188 -797090 -598529 -324564 -68554 31283 74782 303371
40430 303371 682505 824246 466864 -144289 -546229 -608966 -563125 -538383 -367639 75230
40420 75230 594845 899330 950272 917410 899405 878075 878466 962130 1054338 958865 605826
40409 605826 170596 -106919 -143450 -34158 49766 -41556 -332836 -658430 -786968 -673374
40399 -673374 -512256 -484157 -541602 -534202 -449455 -385176 -338808 -213833 -58163 -97708 -408221
40388 -408221 -692825 -576431 -78545 398306 570081 562790 607271 637286 415456 -21447
40378 -21447 -315542 -247153 -24059 14741 -184826 -440312 -659061 -880575 -1052512 -1037508
40368 -1037508 -890718 -876314 -1069103 -1140948 -753574 -55563 430675 382372 -54218 -549214
40358 -549214 -924060 -1144604 -1186102 -1056388 -852347 -655373 -417900 -57480 377064 728713
40348 728713 885481 819712 526131 64384 -333359 -361843 39491 533319 661369 290674
40338 290674 -264046 -572818 -502453 -264465 -85312 73485 392072 848340 1150984 1070567
40328 1070567 715636 375874 181837 55862 -63860 -130443 -126679 -130345 -178560 -180463 -31502
40317 -31502 259879 600296 897051 1093460 1190199 1237742 1236304 1082105 735127 382086
40307 382086 229123 160375 -114914 -526056 -590129 -80032 558768 738740 454370 164708
40297 164708 128573 208832 226158 131179 -133811 -571177 -911359 -820493 -388087 -73487
40287 -73487 -79856 -112581 114964 461545 627246 568364 442379 365099 409182 626084 875827
40276 875827 842752 425627 -75221 -350597 -454417 -570994 -642037 -521317 -336220 -370460
40266 -370460 -657336 -952366 -1052643 -929379 -636410 -308120 -144032 -169565 -132583 128444
40256 128444 377212 336380 177787 267214 537922 574357 296651 93293 211796 468523
40246 468523 678674 920157 1174353 1138959 697282 230820 122140 194674 -8107 -558927
40236 -558927 -1094084 -1317808 -1256926 -1063292 -825973 -586546 -362805 -150660 7167 23538
40226 23538 -82032 -171424 -243966 -523934 -1092627 -1587513 -1540158 -961021 -348683 -127032
40216 -127032 -270637 -479256 -522259 -370821 -144273 7276 35045 21588 48781 98621
40206 98621 146032 249872 440171 603715 615851 518390 436931 385472 277264 60632 -269795
40195 -269795 -694899 -1069406 -1135042 -836840 -511743 -513152 -723110 -719844 -402634 -135568
40185 -135568 -210911 -464781 -563471 -434836 -229337 -16841 257909 567240 724168 557478
40175 557478 110638 -348077 -515588 -291989 145514 503746 588687 375756 -28591 -428069
40165 -428069 -631137 -607342 -498204 -416021 -337711 -263266 -296480 -416081 -361415 12624 422555
40154 422555 487433 254741 79138 84975 126577 201909 434242 624580 350461 -324716
40144 -324716 -735237 -470182 92120 426174 602582 944511 1297072 1216658 728773 327259
40134 327259 225764 114517 -249414 -647778 -769255 -638821 -475653 -353713 -199079 24183
40124 24183 289983 587187 908450 1203913 1389269 1373259 1122151 774987 610831 763087
40114 763087 1044972 1212358 1278037 1343116 1271070 895701 482400 518113 960440 1157264
40104 1157264 718415 50414 -265350 -248954 -295548 -484029 -588416 -600032 -734416 -960918
40094 -960918 -985960 -743149 -495867 -382100 -236563 32954 257517 331830 380642 442332
40084 442332 339428 65251 -70047 40779 591 -487942 -1028635 -1036843 -635695 -482869
40074 -482869 -765302 -955770 -666410 -199412 -24721 -163785 -381200 -610812 -853720 -951977
40064 -951977 -823199 -687122 -702914 -604574 -117121 433565 432703 -121671 -522227 -270805
40054 -270805 322528 637124 479935 84106 -336432 -708953 -935150 -926464 -797470 -802908
40044 -802908 -1037089 -1308793 -1336524 -1012731 -495286 -84156 27456 -80540 -164050 -79588
40034 -79588 136827 424686 766580 1062928 1129328 936530 702216 601010 514439 242631
40024 242631 -140964 -358681 -307647 -154902 -40379 115459 429693 822791 1069066 1019529
40014 1019529 720619 372013 205894 329833 615146 783359 674162 404944 201264
40005 201264 100176 -63271 -340263 -471030 -156292 501402 997167 927925 377709 -263993
39995 -263993 -719582 -933980 -919970 -718576 -459989 -244104 29564 504928 1050058 1345071
39985 1345071 1338941 1353330 1598810 1814387 1581570 855142 5742 -563462 -696364 -486243
39975 -486243 -162973 67566 166606 187804 47559 -432244 -1146984 -1604499 -1418312 -761446
39965 -761446 -116036 289057 546042 705013 668933 443280 207527 78624 4302 -63381
39955 -63381 -62639 63675 282849 521753 689575 678137 477274 254414 169351 158866 75078
39944 75078 -31717 5337 149707 191819 108120 107344 250400 297916 71797 -248454 -350042
39933 -350042 -155672 165957 426672 528002 449318 246196 3904 -254301 -528487 -709630
39923 -709630 -644257 -374992 -149098 -120897 -208458 -303833 -416325 -499033 -365045 19800
39913 19800 327801 201386 -276331 -658940 -659613 -414535 -227327 -216813 -259902 -174292 90882
39902 90882 399507 561151 558268 602596 885424 1288777 1442944 1112386 476594 -23558
39892 -23558 -118536 45428 120602 -14208 -119093 92338 595189 1082805 1289210 1201704
39882 1201704 1010904 940150 1080835 1321717 1487096 1571010 1702794 1836281 1714220 1305963
39872 1305963 1013378 1148290 1433991 1408231 1124650 959851 852950 372023 -406710 -761848
39862 -761848 -346047 229132 228312 -232373 -497467 -321683 -22554 103088 61390 -22370
39852 -22370 369 288116 781538 1113283 1031234 751742 600342 514253 271637 15056
39842 15056 88411 450264 693368 610388 344018 25928 -318429 -539558 -478988 -327944
39832 -327944 -440618 -751644 -814631 -490077 -149624 -75279 -94175 10665 136580 140787
39822 140787 132548 231285 320636 286330 246952 317247 371991 272767 131916 147103 350890
39811 350890 678732 1065484 1315053 1141409 574214 104083 173737 688480 1229500 1552544
39801 1552544 1661495 1613888 1534119 1650808 2041878 2468600 2696673 2831405 3111801 3581109
39791 3581109 4247516 5351988 7114834 9409326 12095269 15432468 19489600 23127652
39783 23127652 24348790 22146564 17677737 13210333 10121348 8227192 6772714 5487123
39775 5487123 4593912 4247047 4282242 4395386 4348975 4043520 3548274 3064972 2730893 2432321
39765 2432321 1938084 1265761 759845 673743 805072 750690 434479 105604 -156119 -555572
39755 -555572 -1076181 -1250451 -766868 -51314 178155 -160987 -452831 -254981 186541 421421
39745 421421 403737 349335 267151 1445 -360729 -480910 -219810 158913 338924 321888
39735 321888 323877 445577 608051 729676 781512 693073 395137 -11984 -312570 -461991
39725 -461991 -632751 -868970 -907109 -543935 -10819 288566 293140 222573 95530 -264388
39715 -264388 -700373 -671938 23483 827915 1036817 604958 38664 -318139 -546758 -818273
39705 -818273 -1142055 -1437078 -1595408 -1487437 -1117097 -728449 -543196 -455890 -231002 68546
39695 68546 151502 -19836 -146776 -61691 21224 -140449 -442704 -575393 -387818 15743
39685 15743 429049 679540 693354 518919 266744 28266 -110912 -74349 53777 -17709
39675 -17709 -461433 -1010730 -1215298 -1002307 -708586 -540475 -325004 97318 538722 708824
39665 708824 570494 273544 -77932 -419605 -655237 -758534 -810692 -816648 -659109 -358344
39655 -358344 -159427 -193222 -281437 -291170 -433078 -898150 -1397239 -1449100 -1038955 -611346
39645 -611346 -431731 -336116 -161736 -42505 -111441 -206896 -98547 177707 408391 488512
39635 488512 428457 179515 -324919 -950821 -1355059 -1280184 -819245 -347866 -184551 -309147
39625 -309147 -420647 -277024 64384 376843 554322 654963 687679 516428 39013 -640088
39615 -640088 -1286230 -1722540 -1898802 -1853515 -1683701 -1506352 -1370217 -1206656 -906570 -449436
39605 -449436 47431 395396 473842 353933 262364 338790 434705 270153 -174866 -561580
39595 -561580 -586657 -366236 -272622 -446058 -657420 -667885 -524176 -394812 -279787 -67102
39585 -67102 204191 354330 346198 353621 461384 469780 151579 -396255 -820197 -879798 -610626
39574 -610626 -183671 208163 353028 151302 -187488 -284662 -41733 218825 180208 -79080
39564 -79080 -280842 -351143 -396509 -417598 -347192 -312735 -524245 -864155 -924224 -582297 -236859
39553 -236859 -249284 -407859 -255418 203283 479499 264802 -211923 -562574 -690731 -726735
39543 -726735 -746838 -756488 -796268 -844515 -712178 -272969 233656 377632 75648 -247167
39533 -247167 -145070 337645 770929 861339 733961 727880 1021154 1465809 1747948 1725365
39523 1725365 1611155 1740566 2123656 2353210 2048138 1272756 400140 -300514 -752226
39514 -752226 -882728 -657532 -298658 -168225 -338968 -516601 -481394 -351430 -271127 -123556
39504 -123556 194001 429790 250211 -243520 -595094 -571613 -375154 -264002 -249676 -244216
39494 -244216 -254051 -306530 -375468 -486122 -714234 -979936 -1042638 -839221 -627083 -603360 -573320
39483 -573320 -267154 138954 161435 -310968 -786610 -757419 -303208 70391 69377 -119199
39473 -119199 -168750 -31076 82647 53381 43922 276675 693739 970008 894649 615244
39463 615244 409830 325637 198220 -40186 -269736 -384879 -373877 -177023 280050 813223
39453 813223 1004460 698396 267222 145458 289929 392127 441057 653565 919537 823354
39443 823354 326808 -41948 80988 382510 413262 285974 401219 724238 845522 665363
39433 665363 506607 514456 421632 53496 -339041 -465142 -395784 -347678 -328467 -260240 -259626
39422 -259626 -502610 -893756 -1104139 -920821 -433490 61150 245111 -7067 -460628 -671704
39412 -671704 -443461 -32471 213488 267863 303403 323314 186930 -56767 -135070 107628
39402 107628 517955 823510 883673 736732 519491 359796 266739 141146 -42729 -140931
39392 -140931 -29722 193933 343256 401217 490636 639029 733624 670989 413909 -26911
39382 -26911 -509581 -762438 -685292 -562855 -716466 -1001014 -957521 -472876 34392 163621
39372 163621 -24027 -222097 -272045 -197039 -72386 -12641 -91520 -152465 72629 507843
39362 507843 655575 209612 -461548 -727866 -464072 -120805 -105546 -369484 -595924 -551045
39352 -551045 -211171 263299 619891 704826 594430 455066 310537 76034 -218805 -415588
39342 -415588 -445636 -398044 -328142 -147930 211694 627668 857810 755350 403497 100991
39332 100991 188012 737103 1367537 1524293 1076901 542327 537731 1046919 1428741 1193269
39322 1193269 561221 115421 78194 185133 188855 155119 182246 130724 -162521 -598170
39312 -598170 -962058 -1204804 -1342941 -1225536 -694311 85679 729868 1032417 1018149 694126
39302 694126 93616 -475070 -628785 -413204 -231524 -213231 -80712 249213 429695 285829
39292 285829 164033 328721 449408 130818 -420467 -761997 -921888 -1158745 -1276502 -867531
39282 -867531 -132237 259523 167668 154331 505110 753796 491717 60912 -552 227116
39272 227116 262809 -37639 -425362 -748300 -1048324 -1252868 -1164317 -769245 -287886 77291
39262 77291 235823 127882 -188638 -402447 -181380 400021 867412 853549 458801 55586
39252 55586 -139747 -226288 -421225 -773674 -1085888 -1127756 -905066 -632726 -440518 -245384
39242 -245384 20663 215364 166241 -54824 -200441 -142878 34875 195190 251897 153699
39232 153699 -85988 -329774 -406559 -298414 -173608 -214970 -439968 -666365 -642107 -283986
39222 -283986 172680 358764 169753 -128508 -268405 -303535 -416909 -554315 -485803 -174438
39212 -174438 156346 325847 351192 282425 118328 -35403 44408 382865 634986 439180
39202 439180 -108481 -519089 -466434 -131937 64391 -36914 -219304 -224038 -47070 149255
39192 149255 292044 429355 565279 629753 613335 558541 377259 -121326 -894656 -1525533
39182 -1525533 -1603515 -1161726 -579340 -145749 98710 186170 136098 37332 -9984 -59979
39172 -59979 -232153 -443740 -468057 -325491 -359447 -758543 -1199078 -1184683 -642384 26528
39162 26528 438762 564287 560354 480554 284841 54928 32304 363099 855862 1107016
39152 1107016 923306 550565 394273 558572 777908 779314 558696 276741 56182 -22763
39142 -22763 124520 476388 815606 911178 787110 688916 761854 862625 752157 435425
39132 435425 237011 483323 1096872 1575071 1468635 862852 267168 28922 24349 -16493
39122 -16493 -99627 -69554 38070 22551 -141767 -260936 -252101 -266120 -388761 -461099 -356855
39111 -356855 -227591 -241352 -227990 124436 769507 1291237 1426824 1336568 1272965 1245308
39101 1245308 1169682 1115573 1159313 1140633 835690 309308 -148096 -393928 -499278 -475112
39091 -475112 -231619 142522 357738 297082 150571 43675 -179507 -586343 -846589 -624655
39081 -624655 -113680 177541 87378 -102638 -205126 -378687 -755596 -1140946 -1245321 -1005667
39071 -1005667 -553133 -61416 257438 216598 -121754 -433979 -484391 -354102 -216476 -70121
39061 -70121 135205 271017 159178 -141913 -378895 -412527 -347583 -373159 -566861 -818367
39051 -818367 -889327 -638237 -244525 -71020 -220067 -408384 -411592 -403100 -619992 -907738
39041 -907738 -936147 -735789 -625639 -646009 -484920 -41198 340418 370802 221623 203626
39031 203626 305706 311111 170632 -7861 -191270 -370433 -387180 -99076 326610 550073
39021 550073 491672 390781 412240 431814 289576 59287 -45740 93903 440665 839738
39011 839738 1049714 884051 440323 69136 -18880 -13935 -215823 -554991 -611158 -138644
39001 -138644 585784 1022974 907643 473864 188296 280919 514766 447651 -32550 -515985
38991 -515985 -547903 -228567 -103863 -436375 -865641 -936296 -698168 -522342 -519208 -486574
38981 -486574 -344463 -237140 -183327 -4912 277347 324085 -42064 -512055 -686298 -574562
38971 -574562 -449774 -405483 -361048 -361540 -533874 -802197 -960642 -1017146 -1175995 -1465994 -1663678
38960 -1663678 -1627741 -1453954 -1248062 -1001878 -769600 -711239 -839877 -935336 -829285 -595943
38950 -595943 -365427 -149651 34844 82606 -11872 -62202 59125 243140 366115 512635
38940 512635 796873 1112918 1255262 1165590 883823 387941 -311058 -1011698 -1456342 -1560695
38930 -1560695 -1381217 -989202 -537801 -279657 -283249 -274302 -13692 309872 363637 213899
38920 213899 212124 403634 467025 273150 88564 102522 132838 -6472 -171341 -157049 -31739
38909 -31739 68075 267010 775197 1489939 2035221 2158445 1904970 1464286 1032040 778012
38899 778012 756115 829243 802629 630618 414021 241859 132598 83314 78611 93956 168117
38888 168117 397732 762352 1041337 1033052 783884 460042 74279 -458408 -1014822 -1242176
38878 -1242176 -932764 -283897 303405 588259 582276 398552 161528 35518 168479 513028
38868 513028 792429 779756 597443 596902 899915 1212815 1199973 889129 529999 189420
38858 189420 -236960 -667366 -823920 -645647 -408637 -310387 -215874 18402 251178 320083
38848 320083 340084 437739 401160 -29740 -642762 -925911 -749647 -506486 -512254 -605596 -467450
38837 -467450 -62489 399169 736290 871450 780489 522786 249485 97115 128215 369777
38827 369777 768035 1092883 1076570 726203 352278 220469 316249 499469 705643 900840
38817 900840 1007781 990535 872206 589874 29026 -666047 -1031123 -761361 -129487 297709
38807 297709 282226 53168 -90775 -65723 86744 305117 453259 376278 134416 27330
38797 27330 234302 523637 491206 69056 -373578 -496980 -406633 -439313 -611773 -547116
38787 -547116 -44649 529272 680231 479603 474738 899316 1337495 1334330 1034577 932016
38777 932016 1159478 1349680 1174259 764470 542598 782285 1367033 1885150 1965698 1608029
38767 1608029 1165368 950727 941670 955071 962757 1031520 1047774 783483 267162 -149831 -192342
38756 -192342 45040 297860 468562 633622 823894 953679 949027 843796 730323 649903
38746 649903 537642 287667 -91739 -411842 -473594 -311008 -174171 -236484 -405538 -480862
38736 -480862 -422672 -379033 -486867 -734788 -1012269 -1200222 -1178398 -833522 -183205 493354
38726 493354 770489 449560 -190540 -616040 -537764 -128025 244884 377026 297827 130246
38716 130246 -9820 -66201 -102703 -247854 -497576 -660943 -604622 -455302 -425961 -528880
38706 -528880 -622786 -668739 -731831 -753206 -552437 -125252 232182 204259 -212075 -702190
38696 -702190 -901507 -678388 -256443 -65320 -362975 -979817 -1510364 -1737362 -1758139 -1719490
38686 -1719490 -1591827 -1256049 -708575 -132043 198360 127593 -171407 -288229 -23834 341468
38676 341468 432647 327622 404477 677411 697637 242524 -287092 -414075 -223900 -131114
38666 -131114 -226923 -245637 -91506 -8668 -163848 -351423 -260096 113371 446099 450746 199437
38655 199437 57427 250874 544525 507808 114343 -169080 -17414 295445 323964 108190
38645 108190 41185 207197 281910 101208 -99836 -148357 -248399 -589866 -934202 -906702
38635 -906702 -541141 -224489 -174142 -263765 -364502 -565971 -938392 -1272340 -1239032 -755650
38625 -755650 -69267 501394 807533 859366 702337 402021 105503 -11679 85554 245576
38615 245576 321563 362800 527631 826763 1064522 1073933 922863 806629 774153 656827
38605 656827 300825 -186711 -492394 -407248 -38365 317439 473090 476826 476264 549960 686316
38594 686316 835795 924691 872431 658962 354266 50984 -198879 -364288 -418742 -390677
38584 -390677 -375050 -435554 -526237 -546126 -433676 -192766 99726 284256 220918 -31912
38574 -31912 -237852 -259852 -213373 -247828 -305651 -260879 -193179 -301294 -572192 -763257 -747896
38563 -747896 -668749 -661277 -612267 -346591 57039 314285 281856 117146 55897 127875 170190
38552 170190 75577 -82382 -190606 -239251 -226071 -39651 351611 637678 388340 -356488
38542 -356488 -978738 -963837 -493901 -131792 -95436 -148057 -86601 30214 137714 298701
38532 298701 490113 529635 328958 14495 -280346 -534863 -691618 -627020 -370314 -130372
38522 -130372 -7925 83983 117281 -133331 -679288 -1106027 -1048882 -686252 -481318 -592841
38512 -592841 -825208 -1008584 -1087064 -926631 -431482 119994 213605 -299527 -989740 -1349530
38502 -1349530 -1291088 -1043070 -798422 -657364 -736185 -1067745 -1435203 -1523349 -1277876 -973307
38492 -973307 -864850 -881091 -757256 -407763 -26856 194352 298349 406747 471730 383398
38482 383398 255161 323291 527143 503644 158783 -55679 279641 919620 1260170 1139367
38472 1139367 922982 840605 709330 423204 260178 433853 679612 628750 376100 314102
38462 314102 517565 652838 488802 187238 25400 74325 238540 415843 504317 395578
38452 395578 91549 -235978 -385865 -301020 -89517 66100 27488 -170927 -297834 -136051
38442 -136051 255405 590026 673619 541690 267128 -157685 -635480 -866765 -657483 -220179
38432 -220179 51789 53770 -5761 -8814 -77377 -254837 -299664 21431 569158 932538 849865
38421 849865 438738 61032 9653 236092 337878 -51903 -782824 -1249816 -1062720 -493721
38411 -493721 -87610 2695 36503 174675 295948 312712 320776 342238 224591 -52602 -235410
38400 -235410 -160921 -51289 -205619 -551777 -760077 -711337 -596859 -584658 -620424 -578798
38390 -578798 -422723 -177843 98636 295047 330067 285111 319247 434698 476797 401016
38380 401016 371702 513688 715752 799355 766978 743077 744168 654661 400101 21702 -391871
38369 -391871 -717024 -767571 -435152 92954 420817 358935 135309 67105 133070 56377
38359 56377 -253578 -582367 -755715 -853114 -962791 -954833 -710035 -414100 -350735 -464210
38349 -464210 -405089 -24370 438318 722537 851327 944326 951606 763838 436342 105963
38339 105963 -205994 -506184 -633845 -399279 86484 449065 480127 350477 312967 360447
38329 360447 315052 131816 -77308 -276934 -553601 -876811 -1011893 -825102 -545241 -500360
38319 -500360 -642794 -603099 -260976 41972 43598 39859 484899 1247258 1653212 1291577
38309 1291577 450692 -306065 -685286 -679503 -372029 38579 233926 55077 -297402 -499771
38299 -499771 -453086 -289942 -162149 -135000 -169101 -120844 89054 250815 41119 -477491
38289 -477491 -821256 -723936 -500365 -514718 -606219 -425734 -88602 -5375 -177218 -159035
38279 -159035 256259 750003 958481 882654 716992 580339 530063 582000 609318 436307
38269 436307 98532 -197650 -397686 -636940 -931257 -1100359 -1052981 -887061 -659135 -334474
38259 -334474 -21017 63721 -30736 57465 527937 1151227 1595418 1760085 1676415 1370047
38249 1370047 972489 684984 475131 102555 -394658 -591338 -299381 44348 -38996 -362955
38239 -362955 -342091 198768 854575 1181381 1072706 662931 173930 -153044 -220799 -165332
38229 -165332 -122272 -13833 232377 416211 316290 94797 106184 345895 440443 205252
38219 205252 -124149 -286284 -297196 -231315 3007 438371 780319 639653 29660 -546738
38209 -546738 -593145 -156373 218312 107972 -290987 -419811 -73391 366929 481502 333393
38199 333393 253245 322190 348418 235597 81528 -40709 -131308 -109221 137414 522673
38189 522673 792637 807946 631839 363535 77575 -113838 -183154 -357265 -877526 -1536580
38179 -1536580 -1750396 -1246756 -465153 -79679 -250833 -528669 -434687 23572 436240 487823
38169 487823 281130 139615 172791 204985 153274 236259 632898 1117681 1286519 1046178
38159 1046178 641678 291010 53139 -28306 41322 70749 -106615 -308308 -222835 60709
38149 60709 133963 -83643 -223148 -116077 -88898 -348789 -521558 -205061 342514 540931
38139 540931 325863 164982 301701 452003 328645 82640 51609 311636 648128 833068
38129 833068 808916 680737 598067 595050 545322 342638 77455 -90762 -185026 -349758 -552283
38118 -552283 -576568 -379899 -221768 -282442 -344648 -91265 381904 632847 475464 251955
38108 251955 359936 685896 731200 259536 -380127 -624988 -263597 432604 1036870 1320843
38098 1320843 1322106 1179866 978919 750180 543937 393850 208989 -141767 -549484 -644733
38088 -644733 -253175 272379 458805 350677 360879 511088 329843 -319677 -826920 -631609
38078 -631609 -40162 241539 113764 61591 274460 392563 164784 -180079 -359111 -392821
38068 -392821 -376778 -284505 -172327 -216858 -347486 -187624 385739 920879 923097 492640
38058 492640 142377 132266 270244 300088 233882 273255 524735 827122 880078 613595
38048 613595 359715 472550 829594 980716 787073 577172 599671 686916 618685 471700
38038 471700 384815 283154 92260 -35787 27822 144382 155724 130485 115721 -65485
38028 -65485 -440843 -591320 -148952 586722 963158 805298 523596 458026 527954 537987
38018 537987 447688 271088 20168 -174189 -133162 119834 374276 495695 477046 283300
38008 283300 -94781 -458932 -551083 -391064 -223517 -147868 -68112 19065 12101 2983 239583
37997 239583 689430 957686 797535 450404 311105 455005 652923 683924 485384 136542
37987 136542 -169002 -247652 -132445 -54824 -144639 -270128 -256775 -135281 -62667 -89802 -116884
37976 -116884 -40097 120733 228508 174431 52021 104632 386760 573865 312598 -283970
37966 -283970 -735187 -797345 -700643 -703046 -689453 -412676 64060 427075 548301 626782 861806
37955 861806 1155225 1241950 1040597 747756 563896 444530 241803 23779 48072 377596
37945 377596 730524 833419 748455 699847 748629 833255 965036 1127292 1105236 714217
37935 714217 141804 -221716 -265081 -189175 -81645 217218 759584 1290360 1531684 1478570
37925 1478570 1324365 1254988 1368864 1627268 1826033 1767254 1498895 1251783 1138433 1053660
37915 1053660 838086 383564 -335679 -1107660 -1451274 -1059079 -258626 283763 338532 282852
37905 282852 478283 836526 1094548 1179630 1152242 1060612 983018 970801 864973 446057
37895 446057 -151183 -477598 -324337 66402 414920 648184 630767 136354 -651404 -1057053
37885 -1057053 -712550 -106626 51467 -265173 -537688 -489206 -276759 -59801 142138 209415
37875 209415 -20896 -414384 -603837 -466081 -262825 -238855 -307727 -215798 144217 643348
37865 643348 1035993 1164154 1131302 1236057 1640284 2165622 2519879 2646575 2741602 3012732
37855 3012732 3538226 4264248 5004749 5517505 5696684 5623963 5365690 4860018 4110782 3339750
37845 3339750 2797584 2535146 2472680 2542706 2623297 2491386 2038722 1448179 1008444 827798
37835 827798 816409 820380 681027 324894 -87946 -264420 -138431 34939 35466 -76719 -166847
37824 -166847 -226351 -236200 -98729 126978 196827 80460 100293 444574 833738 942264
37814 942264 872547 904031 1039522 1151766 1347713 1789185 2294470 2484840 2247767 1779169
37804 1779169 1283686 886700 693645 671948 612860 436965 363851 572270 923670 1244027
37794 1244027 1595964 2009146 2256162 2211980 2129598 2234167 2371547 2393918 2506385 2828251
37784 2828251 3019498 2819180 2556969 2611459 2770355 2710726 2702430 3169936 3923464 4517669
37774 4517669 5009205 5631400 6124014 6232279 6489092 7533519 8951586 9835500 10284920
37765 10284920 11286905 13283009 15991202 19514780 24370097 30374076 36690022 43015614
37757 43015614 49598286 56318345 63349335 72678141 87122083 107790965 134969649 172084879
37749 172084879 225238417 295162309 369856157 427496879 448098734 424256777 364453387
37742 364453387 288657580 218502763 166735536 133285766 111054534 94602324 82575721
37735 82575721 74126970 66885313 59128191 51355223 44525496 38419202 32689212 27962903
37727 27962903 24734597 22300012 19831105 17560846 15961641 14652928 13124974 11779729
37719 11779729 11205557 10993041 10287203 9099257 8110598 7472779 6733259 5808533 5166279
37710 5166279 5007291 4959393 4696888 4344395 4144492 4110193 4118786 4091663 4014530 3933895 3919836
37699 3919836 3931810 3814316 3513981 3162374 2874919 2654186 2540928 2603681 2711390 2626547
37689 2626547 2426976 2492319 2923842 3325159 3336897 3049309 2710324 2405153 2243077 2452166
37679 2452166 2977078 3330954 3183652 2812344 2666706 2778085 2901328 2933215 2849914 2524408
37669 2524408 1987323 1624343 1729215 2052526 2133512 1874080 1458053 955145 408094 102599
37659 102599 299320 801338 1170054 1276674 1306677 1362329 1441227 1687536 2248734 2929203
37649 2929203 3357928 3476738 3538151 3668725 3769600 3813031 3903356 4058469 4240940 4582483
37639 4582483 5251932 6082348 6618894 6574608 6025108 5195126 4308772 3606816 3223682 3032286
37629 3032286 2815773 2534506 2217436 1745335 1071226 531956 529274 935327 1222478 1187593
37619 1187593 1124219 1225216 1267354 1045888 720421 504042 332088 88080 -95112 -16562
37609 -16562 283161 609777 879448 1119201 1326114 1489798 1660206 1853731 1964247 1876625
37599 1876625 1616665 1325849 1142297 1125929 1222647 1300398 1298546 1292746 1303300 1152323 722548
37588 722548 256024 88975 127901 -44041 -489172 -734194 -423554 192281 632572 739817
37578 739817 610350 277923 -187847 -485953 -385259 -125507 -150592 -475971 -674309 -515400
37568 -515400 -269947 -258252 -401441 -435372 -367379 -449492 -755981 -1030251 -1013179 -772922
37558 -772922 -602614 -660281 -824853 -900982 -854924 -798249 -823616 -938661 -1098262 -1191740 -1043773
37547 -1043773 -589336 -75168 76265 -280362 -782718 -911536 -543298 -31525 272089
37538 272089 432462 745686 1216136 1445038 1149117 606839 334112 379152 270264 -250054
37528 -250054 -783275 -813255 -419086 -98526 -43237 -3297 177790 342226 417107 612287
37518 612287 1010146 1298613 1199838 922681 865873 1018409 993600 618512 172954 -23251
37508 -23251 -14935 -60629 -209337 -195225 234938 968827 1559549 1621017 1175595 604408 295976
37497 295976 365313 630960 768418 542731 20253 -463474 -638992 -544716 -326574 48725
37487 48725 614250 1042570 868654 139675 -534936 -727793 -631157 -569763 -488602 -256254
37477 -256254 -108988 -316336 -632783 -597499 -257647 -61649 -76704 106734 601648 943833
37467 943833 835786 655433 841583 1174950 1143161 762564 533112 693228 998077 1213961
37457 1213961 1366767 1422723 1166183 604159 155197 160123 417366 472187 227062 -1518
37447 -1518 35230 229706 318631 190713 -36670 -135072 38137 370162 565980 496080 386412
37436 386412 502417 741634 790501 643866 648368 961049 1288073 1334701 1233382 1270243
37426 1270243 1402862 1365964 1131381 924744 812478 590441 139151 -368762 -711224 -875974
37416 -875974 -985982 -1113005 -1238817 -1282426 -1125241 -733073 -272347 38402 204084 413224
37406 413224 715302 950521 1041897 1110373 1200242 1147026 890455 687603 774243 980708
37396 980708 958820 698546 539250 681375 936453 1010944 850292 629502 528863 582379
37386 582379 669324 624506 418291 225715 244530 455625 649772 688475 642516 642429 661246
37375 661246 504429 30588 -611798 -1009963 -851592 -293420 143876 117956 -199234 -408902
37365 -408902 -377165 -277381 -225080 -96263 237433 639034 785001 506066 12742 -260243
37355 -260243 -86439 303508 511244 483546 537505 826948 1048931 866649 397504 7841
37345 7841 -209105 -415441 -589301 -493551 -103128 298370 537914 743397 993986 1107764
37335 1107764 977874 838602 935005 1135734 1161441 1058602 1145320 1541270 2017743 2304589
37325 2304589 2314265 2053355 1546495 926558 431878 214518 235817 383756 580860 734710
37315 734710 713496 478655 186028 60380 167146 348131 391116 261046 158012 303883
37305 303883 643535 830736 607966 155600 -79831 84941 371585 442945 344177 373596
37295 373596 598180 728692 536835 221430 206505 629600 1167329 1381255 1138701 660199
37285 660199 246083 38342 -4274 -20594 -160297 -472361 -790923 -797802 -340686 289782
37275 289782 542718 180273 -407426 -603934 -256382 202280 339601 223058 206611 405251
37265 405251 626388 749546 889758 1124462 1289943 1187565 855799 507569 283188 164655
37255 164655 59986 -108930 -330876 -463001 -362974 -110706 44516 27551 39486 190760
37245 190760 255184 23480 -280971 -263694 46636 210488 -4074 -332046 -411761 -201953
37235 -201953 92438 267375 201843 -59502 -198921 139632 863385 1432450 1520488 1404191
37225 1404191 1462499 1571915 1361063 873625 530998 472981 372452 5816 -359346 -350435
37215 -350435 -26895 187954 -6958 -531264 -1063781 -1312206 -1199613 -884429 -577216 -323120
37205 -323120 -48109 180200 119148 -301123 -725518 -655682 20779 891032 1408969 1359548
37195 1359548 957357 576629 412187 370606 269424 108968 75331 255356 449800 375130
37185 375130 24317 -275021 -194861 244562 689510 808282 616420 423969 449887 550920
37175 550920 418573 6827 -385051 -491294 -387115 -319916 -368215 -425368 -441527 -494243
37165 -494243 -620122 -728305 -718546 -595491 -456077 -431769 -606295 -895974 -1072517 -1040090
37155 -1040090 -1014134 -1218780 -1459729 -1294577 -680393 -135882 -90823 -340853 -389340 -126374
37145 -126374 123655 107139 -109466 -351604 -525932 -593353 -573893 -581269 -662725 -644380 -366115
37134 -366115 -25487 12747 -230952 -317472 -8527 396098 513806 388854 296724 240886
37124 240886 -57929 -732983 -1552585 -2120720 -2181410 -1785701 -1265502 -975161 -973699 -1038032
37114 -1038032 -1015252 -982393 -985770 -867463 -527149 -141926 93417 250072 438510 496048
37104 496048 236264 -114131 -104686 328699 771735 872807 687572 451436 286250 197398
37094 197398 126359 -57802 -421605 -789386 -890173 -679259 -321836 75951 447577 559580
37084 559580 217701 -303005 -457257 -159773 107234 74820 114961 592844 1200302 1358188
37074 1358188 1022584 652698 523613 489422 376650 235595 158220 114439 29515 -129311
37064 -129311 -330566 -424919 -211153 283652 707612 761851 556399 379666 262530 61383
37054 61383 -132746 -20908 464181 1041692 1428344 1533323 1304898 707598 -49452 -544838
37044 -544838 -568200 -331934 -147322 -66020 43883 239896 467366 657113 735844 635868
37034 635868 393795 144858 -64743 -345077 -733730 -1010224 -897350 -411370 124965 423378
37024 423378 478373 455265 439570 389218 289165 216512 192620 80678 -231752 -596795 -723584
37013 -723584 -539044 -257450 -59565 95603 272214 408616 502290 700622 999180 1076504
37003 1076504 717413 234856 135571 447708 704842 566757 153674 -233053 -440994 -501101
36993 -501101 -572684 -842578 -1251415 -1391936 -970449 -287473 106324 170844 337608 698563
36983 698563 774558 281664 -352243 -529020 -171266 407073 971497 1394403 1524783 1379865
36973 1379865 1225584 1157297 866931 169370 -521788 -678577 -405689 -225847 -260698 -150529
36963 -150529 231361 504011 338819 -110935 -499559 -695235 -740254 -659015 -468890 -218166
36953 -218166 82591 423886 665593 633203 383011 179569 179397 332436 592689 954146
36943 954146 1227697 1096078 552333 39439 -39224 232297 497741 608341 664773 708550
36933 708550 633083 394742 123081 -17808 27074 212320 455488 660404 725167 575880
36923 575880 234393 -126507 -262186 -87830 202985 375572 486032 798462 1336751 1721145
36913 1721145 1579243 977377 292999 -226967 -584071 -761956 -600252 -59132 528506
36904 528506 674533 251628 -333696 -599062 -545135 -572342 -836927 -959498 -561608 119982
36894 119982 480065 336600 120699 222573 491651 558195 370097 153988 21244 -110891
36884 -110891 -289575 -464839 -626562 -792459 -868485 -714414 -367206 -38642 122507 105713
36874 105713 -130550 -685352 -1461694 -2055478 -2085001 -1587876 -957026 -508173 -242444 -32637
36864 -32637 130474 190513 216300 357071 593441 693631 510149 209095 70387 120057
36854 120057 118931 -83854 -337735 -379151 -116694 328058 755047 981894 902193 567460
36844 567460 183718 -59036 -148307 -195432 -252552 -249247 -113033 91397 174867 5240 -306658
36833 -306658 -462259 -305814 -68081 -144753 -608542 -1080548 -1154115 -824916 -409394 -148942
36823 -148942 -26891 82855 220385 297857 195119 -81706 -321563 -279168 25376 290908
36813 290908 301533 182317 169420 261788 288397 223384 199916 237971 190598 -6097 -219918
36802 -219918 -300639 -207323 56706 435242 711184 649789 352326 226436 440432 638681
36792 638681 445486 62257 19442 402779 705946 536884 141814 22452 254594 456627
36782 456627 345844 60560 -102928 -72643 -13264 -62902 -182259 -251072 -221438 -129096 9479
36771 9479 231768 523855 745665 764218 649219 603919 658604 582314 216404 -234905 -434711
36760 -434711 -360289 -296505 -398785 -510999 -474499 -372001 -337073 -329542 -257441 -136549 41715
36749 41715 395596 870874 1074961 734047 205876 149891 688157 1259507 1357629 1045337
36739 1045337 625901 188935 -283034 -651009 -742916 -562575 -176990 392225 959661 1125152
36729 1125152 746844 264810 200924 482650 634453 516455 426247 493124 457001 176609
36719 176609 -61396 29706 294843 360174 94422 -348607 -768165 -1009147 -972247 -719896
36709 -719896 -466608 -334729 -250714 -189663 -321652 -729425 -1159035 -1292820 -1160674 -1048800
36699 -1048800 -1080713 -1114802 -997662 -698799 -249651 211951 373912 5289 -675046 -1119651
36689 -1119651 -1012890 -522599 31671 498413 784705 722898 300767 -134453 -172025 204772
36679 204772 643885 842650 739443 364615 -198325 -656296 -620864 -71861 494521 613968
36669 613968 423158 423980 751657 992110 782303 295414 -44882 -118741 -140786 -248642
36659 -248642 -315742 -183750 95765 303255 259423 1470 -198920 -80985 248589 337945
36649 337945 -55992 -562354 -600992 -119872 367408 454560 219166 -98038 -403301 -604657
36639 -604657 -528442 -209514 36220 63433 119502 354026 454655 157977 -189805 -94772
36629 -94772 271635 313604 -15927 -123056 268808 694710 712114 534508 558278 713060
36619 713060 699385 520811 328834 12505 -560003 -1063584 -1008328 -471386 -47980 -24768
36609 -24768 -64912 149096 402467 348696 87372 -22527 53966 20936 -192139 -227334 200774
36598 200774 832147 1120346 888377 505247 384413 511601 593433 510878 406543 391566
36588 391566 425882 519835 796495 1232671 1553325 1558659 1394276 1305814 1264674 1064800 699208
36577 699208 394765 303725 379925 543932 749081 876777 797478 592005 507299 608513
36567 608513 655484 436971 86748 -64230 124120 455536 591987 341648 -190232 -692928
36557 -692928 -931293 -942659 -904958 -843294 -581672 -1754 745104 1315152 1426031 1080396
36547 1080396 606068 393694 491288 568194 416528 305255 561631 959467 946013 453525
36537 453525 13496 -41893 -10905 -221564 -453746 -336659 23827 264237 375152 611722
36527 611722 917356 929161 564374 174203 38560 61269 58382 26062 -5508 -110127 -308507
36516 -308507 -484249 -584782 -723383 -971879 -1226844 -1383767 -1467265 -1479035 -1299336 -888031
36506 -888031 -438985 -172871 -73930 21728 151547 184352 15818 -317030 -710800 -1084438
36496 -1084438 -1358114 -1402427 -1098712 -510135 56166 298523 263627 280771 484188 617204
36486 617204 468495 247736 231615 254514 -26337 -479579 -614101 -342179 -97919 -90962
36476 -90962 -4373 319650 449185 38696 -504288 -553628 -175029 43686 -107451 -284738
36466 -284738 -240479 -101016 42613 315097 680254 794009 440792 -162227 -658037 -911612
36456 -911612 -955733 -818694 -558864 -282259 960 370003 755119 906022 715616 388381
36446 388381 152446 -30015 -318693 -694976 -958584 -958676 -743281 -535684 -571017 -845932
36436 -845932 -1053950 -940885 -682091 -642842 -783437 -687027 -280542 -84480 -467361 -1039621
36426 -1039621 -1191310 -932549 -707664 -578848 -190645 474711 911230 825842 553414 470127
36416 470127 427007 134880 -224466 -241334 35395 135185 -118148 -354427 -232200 79900
36406 79900 191958 24922 -169248 -177730 -4691 246211 474514 584124 525071 336919
36396 336919 66927 -298201 -698187 -872856 -580695 31894 466351 357613 -194368 -815717
36386 -815717 -1226674 -1362113 -1316124 -1299385 -1497345 -1811511 -1874288 -1502337 -1013387 -867493
36376 -867493 -1075676 -1217925 -1013794 -605862 -257562 -42722 79532 119975 113276 129051
36366 129051 117430 -73597 -417266 -653208 -664172 -688463 -935475 -1183788 -1067670 -656868
36356 -656868 -406836 -528030 -729231 -677477 -424550 -207473 -54564 167657 441106 593577
36346 593577 588491 575239 591828 437581 2004 -421587 -383474 170255 796435 1064073
36336 1064073 985012 831538 711718 541699 336912 252729 306291 295670 101251 -100193
36326 -100193 -45523 301228 746491 1079292 1188974 1069675 831728 661378 673236 822675
36316 822675 994746 1102741 1055297 737360 129763 -596059 -1162149 -1332228 -1008329 -332167
36306 -332167 283460 423634 88019 -305600 -428017 -370108 -352328 -340071 -182052 48242
36296 48242 144659 109451 114745 167149 92843 -136369 -320563 -324694 -248292 -246734 -338238 -419476
36284 -419476 -355472 -84800 235657 284991 -26574 -324334 -196399 239240 526478 560624
36274 560624 656991 900022 915288 490165 -10532 -154791 -29376 35881 52498 255052
36264 255052 545409 500828 -34265 -685846 -957985 -701058 -136928 395298 650571 559180
36254 559180 192449 -320699 -792697 -947426 -610799 -16033 307019 114935 -267977 -428836
36244 -428836 -395246 -421375 -470265 -293061 93092 423341 658480 1022801 1508343 1748827
36234 1748827 1550756 1212678 1102115 1182754 1197101 1099015 1028264 985389 808196 444214
36224 444214 43659 -222166 -294586 -192030 21003 212642 247586 131181 37838 137907
36214 137907 395611 580888 523112 329258 270339 455765 747454 1018184 1289464 1502605
36204 1502605 1410036 948565 496804 391719 356881 -99563 -786952 -947122 -402015 49107
36194 49107 -261450 -907647 -1039772 -609803 -280948 -335061 -379177 -150265 45300 -94286
36184 -94286 -349909 -331083 -11182 364553 676817 981296 1295348 1537784 1624699 1542148
36174 1542148 1400467 1405604 1600339 1645993 1132562 178512 -554589 -580535 -84517 430059
36164 430059 734819 943347 1228848 1680674 2226630 2502626 2062228 995977 104995
36155 104995 96542 750931 1243092 1172920 878310 779924 859458 880427 762622 568157 355387
36144 355387 193239 158595 231538 323455 422641 557078 651836 638659 652553 835147 986277
36133 986277 776771 320301 103543 247769 310905 36404 -186948 21883 340825 197950
36123 197950 -352214 -742207 -739177 -639459 -637871 -522412 -121212 345629 537336 360307
36113 360307 -36926 -405824 -483952 -203098 119380 60333 -354264 -626702 -400463 168291
36103 168291 734751 1148001 1357045 1254983 880419 555547 547954 728808 789673 657535
36093 657535 461055 220688 -144389 -561071 -827094 -901823 -960844 -1134788 -1359856 -1503451
36083 -1503451 -1487516 -1274500 -882378 -453786 -191914 -174920 -291800 -363382 -271696 -13405
36073 -13405 277084 392465 258849 64824 67852 275227 442545 410975 322451 435080
36063 435080 803065 1212716 1408402 1336564 1172093 1125359 1233597 1349580 1318655 1127520
36053 1127520 886210 722777 696457 736579 653106 298838 -247597 -745033 -1050886 -1207957
36043 -1207957 -1263815 -1177813 -970976 -782100 -669993 -549342 -450847 -608809 -1059494 -1361333
36033 -1361333 -1049408 -277581 318658 369367 71277 -246927 -510992 -762954 -948364 -1019039
36023 -1019039 -1052818 -1117525 -1151268 -1081384 -931491 -735830 -495711 -298795 -326496 -641329
36013 -641329 -1077035 -1395521 -1435705 -1110877 -473828 161359 408285 246216 62474 130655
36003 130655 276145 234295 95663 114123 231620 127141 -283412 -674170 -698830 -383113
35993 -383113 -67341 -54191 -344791 -668579 -763222 -623435 -427116 -262468 -86441 58062
35983 58062 32405 -110228 -97913 140029 291262 119078 -155355 -212745 -129198 -142759 -133468
35972 -133468 200212 737029 988301 775089 409957 151096 -79058 -322786 -389220 -227437
35962 -227437 -98070 -132156 -82942 206469 435863 297569 15433 41311 393959 676204
35952 676204 626103 299156 -193929 -763236 -1198480 -1299353 -1157340 -1029602 -954526 -780437
35942 -780437 -546454 -501544 -711246 -952009 -1047888 -1026468 -905995 -653881 -427020 -498573
35932 -498573 -807095 -917538 -613582 -202911 -15960 55438 211823 259072 -100345 -676112
35922 -676112 -949041 -760075 -424793 -174179 90753 406345 517064 241081 -221975 -565279
35912 -565279 -750047 -902653 -1008501 -941837 -718468 -514625 -445277 -458141 -453426 -422742 -445260
35901 -445260 -562406 -670251 -607027 -406262 -337761 -519953 -609579 -193021 526431 821849
35891 821849 356166 -366385 -684948 -558426 -333588 -87796 296929 606719 437645 -122851
35881 -122851 -485431 -345675 -15991 183778 385826 750706 1027695 955341 794414 982592
35871 982592 1415885 1545897 1151706 581540 194173 -20505 -135074 12441 537345 1157019
35861 1157019 1415028 1191206 792731 567647 567524 575279 366173 -45669 -366257 -285460
35851 -285460 149744 504794 403397 -64203 -499742 -688123 -741492 -772768 -674655 -347978
35841 -347978 29866 164691 2015 -260712 -486716 -723419 -981100 -1092215 -920977 -591373
35831 -591373 -362665 -339527 -426410 -515267 -582905 -624771 -628487 -627701 -671743 -717509 -647346 -431516
35819 -431516 -203902 -140901 -298345 -563405 -732284 -675283 -484003 -396052 -492080 -554816
35809 -554816 -363256 -35486 120997 40551 -68403 -107792 -211749 -418982 -519536 -369512
35799 -369512 -106353 105024 288825 442320 386853 104597 -29369 293171 796141 952674
35789 952674 730706 585440 739140 921656 914826 918164 1150496 1418958 1373869 997974
35779 997974 580135 322415 201651 145989 140048 171417 223762 323612 493053 661647 696853
35768 696853 515717 140136 -309806 -652272 -759105 -697528 -683868 -822717 -959081 -887968
35758 -887968 -674888 -644405 -995632 -1489113 -1622321 -1174164 -513210 -240698 -526371 -948968
35748 -948968 -1035640 -759571 -387982 -79311 118505 71169 -265923 -551524 -344713 270220
35738 270220 714427 665350 423243 382935 487217 430109 118196 -324603 -781178 -1116643
35728 -1116643 -1139594 -864926 -651058 -795566 -1112852 -1168413 -826443 -324518 84779 309507
35718 309507 320297 129804 -170561 -531300 -998590 -1468129 -1568859 -1082432 -347614 73868
35708 73868 50753 -100005 -134919 -53935 172899 612600 1074596 1216243 1023745 821721
35698 821721 729298 508099 84867 -187657 -26745 351126 543784 436402 142811 -242763
35688 -242763 -583035 -651989 -439005 -279389 -402494 -571655 -485009 -317917 -482816 -989681
35678 -989681 -1449577 -1646693 -1701847 -1667938 -1372033 -770988 -137784 265225 469910 625449
35668 625449 736453 724461 610931 504217 478546 534906 613786 629661 584817 634130 899809
35657 899809 1230795 1317628 1067432 691716 392307 151521 -108719 -356350 -530257 -620942
35647 -620942 -585641 -368083 -100823 -75370 -356179 -616078 -537456 -197406 145217 437759
35637 437759 721611 814802 510434 44887 -54719 324771 695485 629901 280857 47619
35627 47619 31936 101098 247000 543882 887991 1104023 1225955 1367663 1395511 1078749
35617 1078749 538687 171735 83232 -19067 -267374 -380649 -176283 54161 3187 -127896
35607 -127896 44313 451878 701225 701671 710795 790436 688907 344199 74237 95055 201099
35596 201099 131453 -39324 -107040 -99483 -197663 -474239 -907553 -1466734 -1975772 -2095807
35586 -2095807 -1706091 -1148715 -828416 -712680 -524132 -292177 -330692 -695617 -1054145 -1169855
35576 -1169855 -1173292 -1210949 -1141092 -814465 -436649 -354242 -552485 -625407 -282595 289656
35566 289656 654952 608462 315542 1646 -334111 -778814 -1180521 -1205320 -787963 -313376
35556 -313376 -188047 -384932 -596696 -681953 -704171 -656686 -490003 -373318 -552625 -889516
35546 -889516 -911992 -464901 38983 218635 229789 368774 479870 201592 -344373 -597671
35536 -597671 -332974 15436 -57048 -519684 -969344 -1155017 -1111089 -921784 -611933 -253557
35526 -253557 2673 40857 -159338 -558957 -1047903 -1394150 -1341157 -851191 -199052 267426
35516 267426 446985 488633 499291 396404 129575 -91411 18905 434850 798953 818128
35506 818128 526684 130952 -207015 -352102 -195619 144778 307949 107777 -167612 -146764
35496 -146764 45506 -44441 -460790 -671606 -296922 327206 565641 241441 -294113 -677229
35486 -677229 -798877 -644980 -232955 227071 400978 215805 -6112 50430 296015 411393
35476 411393 324205 301459 558430 952279 1153614 1026633 731824 481769 301893 75705
35466 75705 -234008 -496706 -566584 -461562 -326839 -246003 -177927 -99222 -98402 -228768 -335792
35455 -335792 -186099 216611 588890 703705 637734 583741 552776 442780 321673 404966
35445 404966 730801 1067017 1208714 1186050 1099115 946999 748733 636290 640061 550577
35435 550577 224907 -108473 -129119 85752 171306 38192 -32581 98052 200105 116099
35425 116099 81892 341611 692751 726860 389175 25437 -44068 226020 678452 1039973
35415 1039973 1040601 714114 499793 754725 1223418 1320849 925401 519772 491256 692548
35405 692548 846344 973491 1128680 1061534 571513 11011 -34918 454921 886074 865025
35395 865025 673505 743513 995686 1015585 701395 373026 259987 214584 43949 -140169
35385 -140169 -125716 -1985 -69773 -356018 -500174 -257432 96577 90270 -317982 -692443
35375 -692443 -692907 -452508 -316155 -424075 -694631 -1043484 -1412681 -1661508 -1632292 -1333043
35365 -1333043 -928282 -556244 -270597 -139579 -241227 -509614 -707594 -641011 -353734 -64588
35355 -64588 43674 -60909 -292177 -517904 -613394 -516952 -277392 -31950 105142 149331
35345 149331 212135 336515 407383 284318 -7501 -300177 -477690 -546216 -521208 -385076
35335 -385076 -189010 -44379 61088 291846 706619 1113855 1315859 1360477 1387798 1361549
35325 1361549 1169264 890941 711620 607336 382017 20679 -264660 -394018 -552121
35316 -552121 -841884 -1045332 -917810 -566813 -348393 -465505 -809495 -1134633 -1271314 -1216624
35306 -1216624 -1105677 -1054020 -989885 -733289 -284035 104548 228864 182379 183258 275337 348062
35295 348062 361387 382067 438984 490676 518383 532143 504646 406286 283924 202908 131152
35284 131152 -22598 -270383 -526576 -704032 -754953 -656688 -445351 -231565 -99012 -21141
35274 -21141 44066 30327 -159390 -481497 -762845 -879009 -852461 -791596 -782566 -800701 -694626
35263 -694626 -346686 99363 306843 151126 -85940 -84547 91301 160550 96366 129179
35253 129179 297236 313825 -13224 -472171 -707682 -632106 -433296 -277657 -142763 91108
35243 91108 466789 868065 1109055 1125642 1024456 887997 645177 273265 -1246 49077
35233 49077 267853 278320 39564 -85750 99439 328062 311281 163801 125938 118507 -83204
35222 -83204 -383117 -449796 -253289 -180303 -510254 -1000995 -1148235 -771175 -230592 -52312
35212 -52312 -348882 -666498 -503013 55666 427541 319402 128323 333418 750991 795570
35202 795570 374709 56107 260935 709704 894286 782510 736671 911001 1073023 992966
35192 992966 726264 451002 232666 57482 -27100 64784 313958 543235 530516 193164
35182 193164 -312632 -694763 -774056 -627577 -459284 -376124 -359081 -385482 -422684 -315888
35172 -315888 89820 608358 709608 84700 -907748 -1613790 -1818029 -1803072 -1736538 -1444256
35162 -1444256 -925321 -635004 -911058 -1437725 -1692022 -1689411 -1807512 -2017968 -1864367 -1230508
35152 -1230508 -579988 -269266 -103353 192327 496306 602591 645178 836041 1032356 935079
35142 935079 553728 164570 -40065 252 302374 665625 633124 11538 -733149 -990345
35132 -990345 -772344 -563537 -561824 -563972 -504890 -531894 -518221 -100732 636671 1061624 823336
35121 823336 315422 35472 -61499 -219380 -312874 -94529 262143 349875 121666 -116573
35111 -116573 -213608 -289794 -408439 -505017 -630960 -909133 -1204898 -1172749 -734795 -244749
35101 -244749 -39464 -29256 116410 512629 941963 1141402 1094693 1020977 1099452 1239310
35091 1239310 1182671 837183 395674 75290 -126394 -312850 -468010 -515100 -487981 -460398
35081 -460398 -387754 -215929 -73262 -119705 -239500 -146528 170106 357669 163219 -202905
35071 -202905 -301663 42612 577806 870898 664824 79675 -488385 -735810 -730135 -738815
35061 -738815 -822711 -779204 -505107 -195797 -75234 -108019 -127294 -105702 -121864 -154506 -105141
35050 -105141 8060 51393 -24302 -118083 -122096 -17686 168896 383566 512249 473039 374652
35039 374652 433572 661095 783932 601398 288096 156407 206294 148775 -137850 -438486
35029 -438486 -552425 -546308 -509705 -322546 78875 418814 421275 313693 565026 1110452
35019 1110452 1290363 727482 -130604 -605182 -590431 -433309 -292762 -65286 182997 188769
35009 188769 -57650 -211587 -36707 311710 564659 637813 533942 206333 -285685 -657673
34999 -657673 -651003 -340202 -45427 29810 -18078 51151 332772 636673 660742 355598 43263
34988 43263 44846 259961 307752 39005 -345902 -689184 -1062150 -1438763 -1494534 -990747
34978 -990747 -193668 334953 297070 -139764 -587301 -725405 -463483 -3109 317676 368213
34968 368213 325924 346318 324327 162987 66417 269059 614562 753574 695277 784155 1114786
34957 1114786 1367443 1344982 1299345 1496931 1756706 1723273 1413013 1165762 1130968 1098630
34947 1098630 845068 400646 -74068 -472085 -713541 -698215 -412195 -3923 347703 603542
34937 603542 837308 1079393 1257471 1275850 1101080 781029 422654 138519 -24833 -94181
34927 -94181 -80727 63493 327135 529591 468369 186040 -59856 -140737 -192714 -296388
34917 -296388 -225880 237512 866992 1186004 1084873 907131 860921 715128 276145 -171048
34907 -171048 -225709 44281 247712 269578 333914 513550 592135 487622 435042 582095
34897 582095 710383 572827 266462 29446 -143055 -407424 -713819 -828181 -693149 -523968
34887 -523968 -502483 -558369 -526738 -398317 -319780 -383800 -476239 -365748 11403 375897 345187
34876 345187 -82845 -422811 -228003 358251 749537 575542 16369 -511050 -796704 -902890
34866 -902890 -958821 -1019945 -1053644 -963218 -666230 -218653 169007 292810 120573 -214758
34856 -214758 -543975 -767895 -887702 -963648 -1023886 -1023756 -939829 -870751 -943167 -1116999 -1203685
34845 -1203685 -1108251 -925218 -739048 -482780 -121436 151572 97109 -229404 -511846 -574359
34835 -574359 -585158 -782699 -1114271 -1259318 -980475 -380565 185459 423812 334784 151884
34825 151884 66322 55987 5310 -94428 -165251 -199559 -240447 -217247 7695 365973 544830
34814 544830 358633 18639 -139219 -97326 -128669 -373068 -649510 -704723 -471690 -56391
34804 -56391 355564 538750 371139 32261 -113086 55218 260927 240050 107574 96725
34794 96725 101349 -184039 -702845 -979736 -740453 -292080 -83632 -103272 28610 481792
34784 481792 1002996 1265464 1205532 977288 764232 705982 850011 1063971 1096174 832504
34774 832504 436810 155364 42763 -26949 -131662 -210164 -204323 -181342 -252808 -414583 -519802
34763 -519802 -415788 -99143 265248 485454 506233 424758 361365 361005 415087 493610 520899
34752 520899 424804 299164 414337 904470 1487362 1683555 1337984 760728 321273 96104
34742 96104 -15174 -60415 -92877 -259845 -592975 -850805 -845861 -816170 -1114484 -1553223 -1484501
34731 -1484501 -671602 299639 725884 590508 355348 232786 102563 -7547 114334
34722 114334 385880 407698 92881 -99699 171576 584145 616416 291604 31369 -67123
34712 -67123 -303637 -719768 -877542 -495038 75260 292381 100933 -143237 -242530 -307740
34702 -307740 -407853 -419467 -287954 -167658 -175836 -191099 -39421 229177 382382 284643
34692 284643 59022 -16146 228260 636191 806930 509655 2089 -226578 -45439 183121
34682 183121 112750 -179929 -427260 -555238 -598156 -439300 20379 522505 639438 330711
34672 330711 15734 36086 312554 593577 752192 732729 508697 272260 385293 897863
34662 897863 1343194 1291827 925950 748471 866121 936823 774636 597760 596027 614531
34652 614531 451103 201364 78353 61507 -35632 -238243 -380920 -392975 -411533 -546841
34642 -546841 -679500 -617433 -402896 -314996 -505230 -733145 -604435 -52727 566133 882171
34632 882171 841386 571939 158861 -260336 -384680 -46988 459181 665647 532558 459594
34622 459594 672384 936712 991747 935231 972566 1050410 1001129 870550 833017 881827 835231
34611 835231 589255 188996 -272932 -667116 -836118 -766537 -652227 -613326 -480226 -65740
34601 -65740 489411 911537 1209957 1565049 1876161 1819833 1390788 988482 840844 701533
34591 701533 305484 -201245 -534644 -701377 -855835 -934755 -771882 -468711 -327228 -440686
34581 -440686 -615604 -685142 -654006 -536128 -300004 -15340 165924 227384 291516 369042
34571 369042 332079 212545 283586 691006 1197439 1474049 1489171 1406507 1240776 888048
34561 888048 452544 258083 456696 816136 992990 891611 678178 557590 624268 833329
34551 833329 1010422 949685 609694 196115 -27199 -10869 37455 -120275 -497474 -832696
34541 -832696 -798626 -319957 306021 677768 698441 632505 732794 937926 1012062 851517
34531 851517 528470 145706 -185475 -306229 -150186 102363 192263 91001 -33039 -124647
34521 -124647 -281304 -468962 -475035 -243010 4610 124243 279484 600713 849456 723768
34511 723768 354348 162242 276920 424824 408753 372771 495914 704491 840518 891197
34501 891197 871147 661366 192802 -311199 -508517 -345027 -110139 -59797 -124973 -57857
34491 -57857 223352 526094 610099 464414 313166 338215 444415 364778 -9179 -475214
34481 -475214 -720228 -617395 -305846 -35280 38293 -44466 -109550 -45680 59617 34848
34471 34848 -130789 -253447 -189204 8827 225341 452614 709700 885472 836741 641287
34461 641287 597614 901493 1405022 1769461 1815942 1657230 1493663 1352250 1083516 606293
34451 606293 88575 -174919 -57424 274282 527996 534361 337246 118083 63113 231037
34441 231037 484362 590072 454532 242787 212525 442231 772694 1003069 1075044 1041003
34431 1041003 915136 639665 218383 -177043 -318299 -163145 64053 82507 -170194 -495862
34421 -495862 -632871 -468679 -115089 165706 154940 -129070 -454816 -634106 -682099 -669583
34411 -669583 -560655 -349733 -221379 -323581 -458255 -306335 41003 125542 -211040 -558616
34401 -558616 -528980 -289362 -228245 -365497 -459193 -510772 -734107 -1066904 -1120234 -702010
34391 -702010 -105296 225092 120390 -260161 -617034 -725224 -639984 -684258 -1045478 -1438992
34381 -1438992 -1437267 -1096796 -909340 -1078325 -1214766 -905834 -258408 325096 623086 619396
34371 619396 331639 -88777 -294290 -94579 263245 438713 464586 562662 652310 447770
34361 447770 1321 -262886 -121333 197478 438338 659116 968656 1209398 1153226 855051
34351 855051 590661 533484 654377 842323 957767 852199 521314 201897 146883 311189
34341 311189 410978 299935 128964 83022 107753 15123 -218325 -396662 -341697 -70145
34331 -70145 292473 655912 936264 984204 711730 281737 -5996 -81295 -199300 -562082
34321 -562082 -990151 -1140144 -949363 -656580 -427752 -193811 113994 389148 500613 449039
34311 449039 273441 -38444 -408942 -567546 -276593 365867 979384 1255657 1180977 939623
34301 939623 704553 533160 385469 204577 2785 -124327 -85470 107279 332874 446076
34291 446076 381660 209857 83554 94507 191795 269769 285911 233518 85749 -99606 -95494
34280 -95494 264135 777518 1028443 889767 641323 521302 440372 282393 184506 256774
34270 256774 270413 -32353 -471284 -632151 -455438 -262209 -228985 -206676 -79535 68169
34260 68169 211821 439854 629183 451360 -87882 -463246 -277264 170000 280641 -63610
34250 -63610 -454298 -551796 -388650 -146814 40001 66771 -72143 -167800 -1810 306395
34240 306395 400508 176968 -72757 -85250 50158 115664 103820 151613 268999 321858 236437
34229 236437 81732 -32765 -43681 70393 299837 588423 825651 874225 665511 332423
34219 332423 192257 466178 1010676 1448262 1574014 1492900 1337327 1051798 581922 115584
34209 115584 -66880 59215 222553 162760 -133905 -498117 -758910 -833901 -734808 -551998
34199 -551998 -409574 -391293 -485813 -580986 -513532 -182484 331761 786404 980283 949356
34189 949356 908422 976451 1017844 830054 461041 198101 158111 33449 -525533 -1310560
34179 -1310560 -1646645 -1211632 -486103 -149012 -264336 -404012 -380278 -369419 -349043 22676
34169 22676 774708 1342517 1241807 691621 238933 50149 -57438 -127314 -46088 127996
34159 127996 251673 430706 838067 1243058 1189648 690926 283638 262178 303837 74422
34149 74422 -203726 -116884 305536 694357 902503 1099250 1369184 1529612 1371735 888548
34139 888548 258994 -256069 -443141 -309376 -99026 -25605 -47111 -12236 77132 107461
34129 107461 65372 22066 -33993 -163868 -319523 -393899 -385526 -336319 -170923 171847 485107
34118 485107 451594 97359 -179913 -134223 19284 -41584 -299905 -502499 -552936 -578190
34108 -578190 -673779 -779202 -794715 -683610 -465916 -212113 -24193 59566 107445 173335
34098 173335 200177 134743 58111 77787 161240 221977 302285 482776 647671 566386 243795
34087 243795 -15325 34518 320986 614669 770864 744065 572503 462250 665328 1105460
34077 1105460 1339256 1107336 713560 574375 593093 367831 -109456 -432280 -444047 -424316
34067 -424316 -512892 -460455 -182936 -77068 -414954 -819139 -790328 -458517 -312229 -403614
34057 -403614 -381161 -202839 -229560 -582672 -948787 -1122891 -1239179 -1312023 -1055712 -415863
34047 -415863 160384 299753 190882 179076 201451 -14457 -454596 -888156 -1215672 -1394518
34037 -1394518 -1236210 -679236 -97718 78468 -64907 -138792 -109976 -270625 -596819 -662149
34027 -662149 -284531 200279 461402 556843 608125 485689 93353 -333656 -510865 -472746
34017 -472746 -399029 -277430 -35211 147253 -3254 -409822 -658888 -514587 -209978 -132814
34007 -132814 -357048 -604875 -629054 -513599 -520547 -682424 -709848 -406323 -25200 20966
33997 20966 -245417 -360129 -79847 228702 55769 -574545 -1120279 -1140335 -712061 -253763
33987 -253763 -76992 -143225 -195711 -90449 44616 19800 -124485 -171101 -30561 175543
33977 175543 307391 284054 5034 -519906 -940062 -808532 -184053 341289 389608 226087
33967 226087 197331 122998 -335971 -970455 -1195218 -838653 -307489 7992 61237 -125058
33957 -125058 -592067 -1163439 -1426155 -1212877 -827310 -592279 -421056 -59727 444399 773827
33947 773827 742804 456695 118470 -147579 -282955 -244949 -33798 250890 416821 309516
33937 309516 -11432 -292724 -373624 -378638 -501502 -690718 -744133 -649382 -579218 -561440 -436788
33926 -436788 -199479 -90132 -217327 -334613 -172605 196177 504129 641380 677468 664235
33916 664235 615752 597859 652296 683088 577950 411613 393980 626423 995586 1279389
33906 1279389 1296207 1010958 574753 218036 49466 -36 -31656 -76733 -142079 -202125
33896 -202125 -109818 296443 906867 1340876 1355135 1096648 842983 679639 575614 565718
33886 565718 643733 646736 485245 347038 421122 552699 468411 254649 279507 645187 1026266
33875 1026266 1103458 899169 617095 383120 233185 160311 74079 -138322 -436476 -639351
33865 -639351 -656760 -572213 -459164 -266171 49439 390526 588527 545217 314809 115349
33855 115349 189361 525649 799098 749709 521702 411493 402938 277440 114042 255987
33845 255987 714592 1026164 877128 511211 298742 236720 145304 54111 56277 13386 -230097
33834 -230097 -507029 -569589 -541228 -729514 -1048118 -1044922 -558291 22667 275280 225782
33824 225782 167214 238193 364385 457300 498471 512632 567171 716274 871996 838951 564626
33813 564626 248667 102294 104324 130360 235435 603213 1189699 1606502 1506007 1018343
33803 1018343 651323 737096 1110377 1393108 1441484 1351093 1145393 747149 285300 135921
33793 135921 482029 1007902 1213338 921175 337116 -240005 -573940 -498609 -40945 488098
33783 488098 732816 617004 292992 -127268 -562941 -788526 -611467 -257844 -245394 -727830
33773 -727830 -1225319 -1200439 -717659 -312150 -301136 -440575 -280220 266523 775722 745254
33763 745254 163075 -436466 -552423 -250988 19248 27229 -77872 -150653 -259016 -422502
33753 -422502 -448147 -213183 103466 261804 265661 253585 245668 185586 92826 -20579 -252967
33742 -252967 -620983 -881587 -792679 -490566 -362166 -548439 -789726 -781902 -492048 -81153
33732 -81153 303040 564121 615712 433717 140028 -40354 29401 219184 212453 -111364
33722 -111364 -408679 -195470 502426 1060857 981448 498568 233198 405686 689906 762633
33712 762633 655005 520950 364412 144206 -44128 -66212 43346 92332 -50749 -291925
33702 -291925 -385180 -199353 102387 236293 151290 63859 113456 194236 216370 270910 361817
33691 361817 265549 -63974 -233741 59063 478086 515882 335023 543294 1174610 1560001
33681 1560001 1346764 1005659 1050269 1329346 1470274 1508759 1595199 1497027 973103 378615
33671 378615 297627 678648 874817 538464 17226 -182245 61615 532561 930725 1013689
33661 1013689 765724 473441 390991 350460 6812 -540865 -747331 -338262 302629 621832
33651 621832 510617 269819 183706 308079 522768 634649 532250 332197 258786 328181
33641 328181 317270 116402 -75798 -28669 205627 383110 351454 127361 -191471 -460881
33631 -460881 -511894 -255650 238932 776396 1089443 936408 334532 -308638 -521961 -283599
33621 -283599 -111 65541 68188 181613 255161 110486 -81924 -45795 140746 162529 -31890
33610 -31890 -165342 -54021 192337 417384 605093 758850 820936 804842 827629 911064
33600 911064 892906 635401 216574 -167952 -402880 -477199 -388323 -114109 324853 791037
33590 791037 1016951 752657 53430 -615491 -740831 -284145 281792 504190 383325 223019
33580 223019 228563 396678 663510 940868 1043129 804931 342365 41158 172230 600071
33570 600071 968402 1101901 1094182 1038564 867117 551563 321099 479424 997164 1450018
33560 1450018 1449727 1041326 575943 271410 54081 -172586 -290514 -129182 216853 407420
33550 407420 242681 -79272 -182514 67371 474348 810706 1040631 1182578 1106173 644527
33540 644527 -122675 -848691 -1207340 -1118867 -717918 -234449 83574 88525 -138742 -362414
33530 -362414 -445602 -452031 -475177 -499490 -498615 -537154 -660511 -777337 -768885 -649349 -518103
33519 -518103 -423938 -380762 -442115 -627126 -809743 -801988 -542949 -144645 202019 315497
33509 315497 121237 -237324 -481400 -502523 -473307 -521920 -457428 -58967 472518 667949
33499 667949 399381 44761 -15071 201238 461341 636128 681026 540555 280644 144833
33489 144833 256847 388505 251052 -62742 -171342 69058 353560 309030 -64602 -416975
33479 -416975 -429565 -112876 235632 335610 205948 142467 392250 878513 1289475 1398572
33469 1398572 1228688 939947 667432 484711 420443 437965 442008 366618 237841 103492
33459 103492 -75055 -383908 -789897 -1093180 -1124473 -948120 -765527 -630698 -406797 -59182
33449 -59182 161132 -32225 -607678 -1248417 -1670087 -1763388 -1511445 -997750 -490312 -278604
33439 -278604 -358136 -461690 -452638 -470829 -606949 -681657 -516647 -221354 -11426 84803 126979
33428 126979 50794 -168104 -281979 -42026 365892 517140 367593 271667 307573 56757
33418 56757 -661400 -1233795 -916008 109114 834259 622380 -133132 -682767 -843102 -925135
33408 -925135 -1025832 -871238 -364816 122542 194630 -93616 -410123 -599517 -695686 -606597
33398 -606597 -145575 558336 978742 718222 -20698 -652553 -809494 -594089 -331908 -254638
33388 -254638 -396506 -615491 -662849 -358125 213750 719980 853246 597450 228428 63819
33378 63819 190317 404002 417541 128046 -328032 -739302 -956033 -896384 -577840 -197861
33368 -197861 -28167 -116425 -216560 -137414 -21588 -102009 -311396 -385801 -296611 -294856 -502276
33357 -502276 -732287 -806553 -801910 -839792 -841587 -689993 -493381 -479977 -692945 -955523 -1084091
33346 -1084091 -984689 -603846 17197 636859 951009 908818 770456 777270 856445 738747
33336 738747 315367 -209658 -513783 -446855 -132067 169105 269234 165822 -14964 -171412
33326 -171412 -328084 -571344 -867219 -992272 -749312 -271455 20835 -121579 -454067 -542676
33316 -542676 -346353 -270090 -582898 -1011496 -1087379 -756352 -420016 -413033 -655597 -865711
33306 -865711 -932050 -952264 -992950 -961386 -745748 -412921 -197720 -268923 -525263 -673025
33296 -673025 -529591 -216819 -23475 -104573 -347502 -502800 -408541 -118496 146604 206280
33286 206280 121195 134172 343510 508761 322621 -146960 -468359 -362815 -44046 91652
33276 91652 -10455 -50094 156869 422681 479570 351036 284675 405082 584305 622896
33266 622896 426766 20788 -472577 -849701 -953010 -830495 -670374 -557399 -429501 -306133
33256 -306133 -355802 -606728 -779142 -621276 -287660 -134558 -222684 -314689 -331802 -452140
33246 -452140 -666547 -604417 -45176 656084 959456 814093 647788 761773 1020724 1121053
33236 1121053 899232 364104 -306760 -740251 -593870 61823 764424 1158858 1283938
33227 1283938 1267928 1018003 472104 -36127 -39606 434924 815743 658171 136028 -254971
33217 -254971 -278798 -80984 101716 131807 -37773 -319731 -444526 -179504 343637 695315
33207 695315 615706 258279 -104417 -407785 -662813 -699608 -346197 199340 496621 416332
33197 416332 278641 319960 310592 -49730 -564009 -720870 -410562 -117305 -284626 -740675
33187 -740675 -948380 -681337 -225567 54388 132235 223617 412777 528392 390757 73440
33177 73440 -158740 -154000 -47371 -94659 -362971 -643296 -690590 -513558 -373841 -490503
33167 -490503 -794885 -1020853 -1001634 -797566 -534930 -240035 84245 306493 240360 -120196
33157 -120196 -542669 -761174 -676098 -361033 19073 273272 290842 163357 130555 328242
33147 328242 628217 777411 656883 371152 135071 109408 294140 541610 705339 775049
33137 775049 808283 762774 529169 143577 -179117 -269430 -124978 215417 716087 1181800
33127 1181800 1287342 950127 495369 257987 190389 81536 -26119 50312 232366 256320
33117 256320 119222 92156 257531 379756 326913 291220 430579 569576 466602 183582
33107 183582 -11955 23787 249488 588254 969472 1282862 1410142 1282272 904379 428263
33097 428263 166684 322796 676101 773484 490718 144663 -16913 -89706 -119964 160587
33087 160587 868472 1538790 1587715 1041863 412591 -23063 -386953 -718504 -803965 -562956
33077 -562956 -225890 -11199 80431 79394 -35020 -144397 -37625 228104 314714 97695
33067 97695 -123403 -87453 44685 -1888 -177409 -244302 -159649 -56404 -730 -17851 -195654
33056 -195654 -485814 -559789 -192343 328103 545745 532007 802803 1488601 2033717 1937728
33046 1937728 1439129 1136591 1148497 1020151 416103 -417182 -956345 -968108 -666927 -412923
33036 -412923 -351268 -332176 -147368 175487 357533 168473 -320852 -833260 -1155147 -1229837
33026 -1229837 -1073759 -761256 -469195 -359702 -375144 -294104 -49106 156160 135596 -13563
33016 -13563 -66384 20830 122782 188589 277482 374351 370761 264699 201236 239028 217769
33005 217769 -42111 -491976 -881659 -981861 -765032 -446483 -332283 -497837 -643523 -469529
32995 -469529 -184203 -330424 -995569 -1534726 -1337600 -593991 38232 295202 407158 484202
32985 484202 331904 -77083 -433916 -561082 -655431 -872797 -1035916 -993822 -925451 -977006
32975 -977006 -901532 -451391 82509 167724 -214180 -524942 -390533 4114 298724 392455
32965 392455 374803 321357 339537 591574 1056464 1405570 1319711 867162 408587 172187
32955 172187 77230 -27343 -105454 -3729 278812 498536 401572 19746 -348032 -469335
32945 -469335 -405947 -351106 -339184 -248687 -48609 118080 123359 -4539 -193341 -483564 -965242
32934 -965242 -1561556 -1950830 -1788390 -1064852 -212443 257292 253845 136295 201724 316248
32924 316248 186889 -167607 -448460 -491140 -395120 -268125 -98526 91668 209195 266713
32914 266713 379728 516149 468509 173372 -149493 -291488 -291725 -263347 -206927 -163360 -326854
32903 -326854 -755277 -1118013 -1004418 -416428 267341 743244 961408 918351 570784 17353
32893 17353 -462055 -665659 -653583 -609863 -611830 -573863 -354063 76646 502497 557553 82858
32882 82858 -644343 -1176659 -1361078 -1391738 -1455239 -1546067 -1639336 -1788916 -1948042 -1900235 -1528376
32871 -1528376 -1027098 -704604 -652747 -715056 -695092 -503532 -194656 41913 21805 -194967
32861 -194967 -311608 -169080 10054 -53781 -221840 -62022 523449 1059452 1023410 430282
32851 430282 -263552 -692554 -812714 -698349 -380986 71600 533672 962473 1381738 1647371
32841 1647371 1471200 868340 354325 379550 701022 706403 322373 131175 469587 907171
32831 907171 929160 715718 773213 1074809 1137578 843384 584397 534157 349593 -179147
32821 -179147 -666584 -657561 -271296 39366 118786 123653 88262 -112720 -413477 -531867 -345381
32810 -345381 -34424 203034 374725 583088 862570 1173528 1417874 1435929 1132296 642070
32800 642070 246164 85738 67524 60267 40186 -1405 -136805 -369064 -514542 -375082
32790 -375082 -37840 121205 -166707 -696547 -949354 -683075 -247471 -162495 -466273 -721912
32780 -721912 -679322 -631881 -957314 -1545677 -1934607 -1877902 -1529706 -1144791 -844161 -644297
32770 -644297 -481267 -192866 322610 900548 1225852 1173011 887085 537508 170383 -175530
32760 -175530 -391653 -416234 -316080 -200148 -128459 -115218 -140082 -158135 -156255 -153386 -98564
32749 -98564 104394 373774 434220 205397 10083 126698 321291 189430 -175833 -310852
32739 -310852 -122569 8888 -75491 -58033 226567 422815 238686 -25653 62331 384338
32729 384338 469519 172477 -247413 -588231 -866059 -1077320 -1128898 -996568 -730041 -357006
32719 -357006 30667 217081 109637 -85974 -176155 -313705 -738707 -1324028 -1707201 -1781000
32709 -1781000 -1712938 -1542520 -1128144 -500880 70017 418104 611100 719399 733028 729237
32699 729237 824041 905347 705658 220270 -211342 -322653 -168205 111618 483332 842459
32689 842459 903137 476301 -259379 -887215 -1075889 -770349 -226953 131397 97504 -55503
32679 -55503 101666 559162 857886 713304 355773 155184 196111 358500 535315 585220
32669 585220 318564 -239794 -736430 -831845 -547911 -169020 48171 -12696 -290231 -506082
32659 -506082 -379428 2468 253546 225872 187986 334719 471138 412269 342804 458103
32649 458103 563379 423097 250478 398574 742226 843845 638461 474882 492506 424875
32639 424875 97878 -280180 -451809 -420184 -321375 -260584 -350850 -637213 -904023 -834512
32629 -834512 -450725 -127751 -88973 -175432 -212707 -273324 -395639 -366710 -68629 191126
32619 191126 23101 -486748 -862504 -834807 -581839 -365092 -182149 101372 434430 572715
32609 572715 382183 29938 -202745 -241079 -225359 -198482 18555 495215 896604 785196
32599 785196 190571 -375096 -515132 -343907 -218046 -289303 -445567 -522635 -427164 -162975
32589 -162975 140279 311788 343087 408974 606909 797154 800811 630390 400615 136942
32579 136942 -157558 -334704 -212038 146741 436983 458777 346851 380077 619355 816930
32569 816930 694849 267700 -152515 -261233 -16795 408876 829942 1121512 1193268 1040327
32559 1040327 801998 637312 536441 363735 75964 -227765 -467755 -658940 -820013
32550 -820013 -946155 -1077014 -1239908 -1317397 -1149689 -805786 -566023 -561673 -601926 -452962
32540 -452962 -144431 98024 105820 -123108 -447834 -648646 -579898 -310031 -13242 256978
32530 256978 523789 671141 547811 291034 209101 270777 95272 -400732 -773759 -735187
32520 -735187 -629048 -824123 -1014088 -681706 -17194 266621 -28164 -355649 -302871 -109270
32510 -109270 -123880 -267051 -326414 -370520 -516799 -597078 -423192 -175680 -170272 -365256 -426116
32499 -426116 -206114 128992 409043 608050 685536 553178 270621 59014 14162 -34258
32489 -34258 -253900 -512231 -498158 -110832 405455 747228 868527 919074 927147 717072
32479 717072 214940 -311037 -497469 -334198 -183220 -327435 -668726 -933222 -1010864 -978490
32469 -978490 -914472 -839136 -775579 -739069 -693184 -607195 -519557 -466225 -404741 -305882 -257381
32458 -257381 -350662 -509234 -575400 -548680 -576364 -691136 -731928 -599102 -438227 -450649 -619954
32447 -619954 -753146 -734392 -623882 -548413 -596967 -777920 -970888 -975237 -739629 -492376
32437 -492376 -481410 -632677 -680739 -612177 -684329 -937619 -1023758 -717479 -312254 -228150 -453678
32426 -453678 -696724 -885605 -1123088 -1288401 -1158790 -886156 -856615 -1029805 -930690 -433813
32416 -433813 -28410 -52291 -165916 43603 375833 398010 167343 46928 32950 -185132
32406 -185132 -607700 -884479 -853138 -663596 -398645 -29529 258111 180890 -122536 -131504
$$ [...]
##END NTUPLES=NMR SPECTRUM
##END=
