##TITLE=31P_DE-80H_X3
 64 sc D2O
 26.2.2025
##JCAMPDX= 6.0         $$ Bruker NMR JCAMP-DX V2.0
##DATA TYPE= NMR SPECTRUM
##DATA CLASS= NTUPLES
##ORIGIN= UXNMR, Bruker Analytische Messtechnik GmbH
##OWNER= root
$$ XWIN-NMR		Version 3.5
$$ Mon May 12 16:59:24 2025 Russian Standard Time (UT+4h)  Yarkov@DPX200
##.OBSERVE FREQUENCY= 81.013821
##.OBSERVE NUCLEUS= ^31P
##.ACQUISITION MODE= SIMULTANEOUS
##.ACQUISITION SCHEME= undefined
##.AVERAGES= 64
##.DIGITISER RES= 17
##SPECTROMETER/DATA SYSTEM= spect
##.PULSE SEQUENCE= zgpg30
##.SOLVENT NAME= DMSO
##.SHIFT REFERENCE= (INTERNAL, DMSO, 0, 198.062)
##AUDIT TRAIL= $$ (NUMBER, WHEN, WHO, WHERE, WHAT)
$$ ##TITLE= Audit trail, XWIN-NMR		Version 3.5
$$ ##JCAMPDX= 5.01
$$ ##ORIGIN= Bruker BioSpin GmbH
$$ ##OWNER= Yarkov
$$ C:/Bruker/XWIN-NMR/data/yarkov2/nmr/P31/2/pdata/1/auditp.txt
$$ ##AUDIT TRAIL=  $$ (NUMBER, WHEN, WHO, WHERE, WHAT)
(   1,<2025-05-12 16:58:38.09 +0400>,<Yarkov>,<DPX200>,
      <created by zg, POWCHK disabled, PULCHK disabled
       configuration hash MD5:
       00 E9 B6 7A A2 85 ED C7 34 08 36 98 17 FE 4E 26
       data hash MD5: 32K
       47 A4 07 37 D4 0F 64 47 19 E3 45 9C 7F 49 99 0D>)
(   2,<2025-05-12 16:58:42.29 +0400>,<Yarkov>,<DPX200>,
      <Start of raw data processing
       efp BC_mod = 2 LB = 1.5 FT_mod = 6 PKNL = 1 PHC0 = 1806.83 PHC1 = 9.095428 SI = 64K 
       data hash MD5: 64K
       62 96 C4 8E 2F E9 14 C1 10 7B 98 57 14 7E 1E 3C>)
(   3,<2025-05-12 16:58:59.12 +0400>,<Yarkov>,<DPX200>,
      <pk PHC0 = -12.03378 PHC1 = -0.4 
       data hash MD5: 64K
       6A C9 CA 37 3B 80 CD 1C E0 00 29 C0 05 D5 C9 E3>)
$$ ##END=
$$ 
$$ hash MD5
$$ 58 C3 01 88 5C 59 33 B3 9E 5A 48 46 00 10 27 E8
##$RELAX= 
##$RELAX= 
##$RELAX= 
##$RELAX= 
##$RELAX= 
##$RELAX= 
##$RELAX= 
##$RELAX= 
$$ Bruker specific parameters
$$ --------------------------
##$DU= <C:/Bruker/XWIN-NMR>
##$EXPNO= 2
##$NAME= <P31>
##$PROCNO= 1
##$TYPE= <nmr>
##$USER= <yarkov2>
##$AMP= (0..31)
100 100 100 100 100 100 100 100 100 100 100 100 100 100 100 100 100 100 
100 100 100 100 100 100 100 100 100 100 100 100 100 100 
##$AQSEQ= 0
##$AQ_mod= 1
##$AUNM= <au_zg>
##$AUTOPOS= <>
##$BF1= 81.014009
##$BF2= 200.13
##$BF3= 200.13
##$BF4= 200.13
##$BF5= 200.13
##$BF6= 200.13
##$BF7= 200.13
##$BF8= 200.13
##$BYTORDA= 1
##$CFDGTYP= 0
##$CFRGTYP= 5
##$CHEMSTR= <none>
##$CNST= (0..31)
1 1 145 1 1 1 1 1 1 1 1 1 1 1 1 1 1 1 1 1 1 1 1 1 1 1 1 1 1 1 1 1 
##$CPDPRG= <waltz16>
##$CPDPRG1= <>
##$CPDPRG2= <waltz16>
##$CPDPRG3= <>
##$CPDPRG4= <mlev>
##$CPDPRG5= <mlev>
##$CPDPRG6= <mlev>
##$CPDPRG7= <mlev>
##$CPDPRG8= <mlev>
##$CPDPRGB= <>
##$CPDPRGT= <>
##$D= (0..31)
0 1 0 0 0 0 0 0 0 0.06 0 0.03 2e-05 3e-06 0 0 0.0002 0 0 0 0 0 0 0 0 0 
0 0 0 0 0 0 
##$DATE= 1747054717
##$DBL= (0..7)
120 120 120 11 120 120 24 19 
##$DBP= (0..7)
150 150 150 150 150 150 150 150 
##$DBP07= 0
##$DBPNAM0= <>
##$DBPNAM1= <>
##$DBPNAM2= <>
##$DBPNAM3= <>
##$DBPNAM4= <>
##$DBPNAM5= <>
##$DBPNAM6= <>
##$DBPNAM7= <>
##$DBPOAL= (0..7)
$$ [...]
##$SUBNAM2= <"">
##$SUBNAM3= <"">
##$SUBNAM4= <"">
##$SUBNAM5= <"">
##$SUBNAM6= <"">
##$SUBNAM7= <"">
##$SUBNAM8= <"">
##$SUBNAM9= <"">
##$SW= 400.765351723535
##$SWIBOX= (0..15)
0 1 3 0 0 0 0 0 0 0 0 0 0 0 0 0 
##$SW_h= 32467.5324675325
##$TD= 32768
##$TD0= 1
##$TE= 0
##$TE2= 300
##$TE3= 300
##$TEG= 300
##$TL= (0..7)
0 120 53 12 22 120 120 120 
##$TP= (0..7)
150 150 150 150 150 150 150 150 
##$TP07= 0
##$TPNAME0= <>
##$TPNAME1= <>
##$TPNAME2= <>
##$TPNAME3= <>
##$TPNAME4= <>
##$TPNAME5= <>
##$TPNAME6= <>
##$TPNAME7= <>
##$TPOAL= (0..7)
0.5 0.5 0.5 0.5 0.5 0.5 0.5 0.5 
##$TPOFFS= (0..7)
0 0 0 0 0 0 0 0 
##$TUNHIN= 0
##$TUNHOUT= 0
##$TUNXOUT= 0
##$USERA1= <user>
##$USERA2= <user>
##$USERA3= <user>
##$USERA4= <user>
##$USERA5= <user>
##$V9= 5
##$VALIST= <valist>
##$VCLIST= <CCCCCCCCCCCCCCC>
##$VD= 0
##$VDLIST= <DDDDDDDDDDDDDDD>
##$VPLIST= <PPPPPPPPPPPPPPP>
##$VTLIST= <TTTTTTTTTTTTTTT>
##$WBST= 1024
##$WBSW= 4
##$XGAIN= (0..3)
0 0 0 0 
##$XL= 0
##$YL= 0
##$YMAX_a= 76496
##$YMIN_a= -86738
##$ZGOPTNS= <>
##$ZL1= 120
##$ZL2= 120
##$ZL3= 120
##$ZL4= 120
##$ABSF1= 0
##$ABSF2= 0
##$ABSG= 0
##$ABSL= 0
##$ALPHA= 0
##$AQORDER= 0
##$ASSFAC= 0
##$ASSFACI= 0
##$ASSFACX= 0
##$ASSWID= 0
##$AUNMP= <proc_1d>
##$AZFE= 0.1
##$AZFW= 0.5
##$BCFW= 0
##$BC_mod= 2
##$BYTORDP= 0
##$COROFFS= 0
##$CY= -3
##$DATMOD= 1
##$DC= 0
##$DFILT= <>
##$DTYPP= 0
##$F1P= 0
##$F2P= 0
##$FCOR= 1
##$FTSIZE= 65536
##$FT_mod= 6
##$GAMMA= 0
##$GB= 0
##$INTBC= 1
##$INTSCL= 9.790993e-09
##$ISEN= 30
##$LB= 1.5
##$LEV0= 0
##$LPBIN= 0
##$MAXI= 10000
##$MC2= 0
##$MEAN= 0
##$ME_mod= 0
##$MI= 50
##$NCOEF= 0
##$NC_proc= -2
##$NLEV= 6
##$NOISF1= 182.463
##$NOISF2= 159.3651
##$NSP= 0
##$NTH_PI= 0
##$NZP= 0
##$OFFSET= 198.0616
##$PC= 4
##$PHC0= 1794.796
##$PHC1= 8.695429
##$PH_mod= 1
##$PKNL= yes
##$PPARMOD= 0
##$PSCAL= 0
##$PSIGN= 0
##$REVERSE= no
##$SF= 81.0140089999434
##$SI= 65536
##$SIGF1= 159.3651
##$SIGF2= -187.1042
##$SINO= 113.3802
##$SIOLD= 16384
##$SREGLST= <1H.CDCl3>
##$SSB= 0
##$STSI= 65536
##$STSR= 0
##$SW_p= 32467.5324675325
##$SYMM= 0
##$S_DEV= 0
##$TDeff= 32768
##$TDoff= 0
##$TI= <>
##$TILT= no
##$TM1= 0
##$TM2= 0
##$TOPLEV= 0
##$USERP1= <user>
##$USERP2= <user>
##$USERP3= <user>
##$USERP4= <user>
##$USERP5= <user>
##$WDW= 1
##$XDIM= 65536
##$YMAX_p= 325785247
##$YMIN_p= -2120438
$$ End of Bruker specific parameters
$$ ---------------------------------
##NTUPLES= NMR SPECTRUM
##VAR_NAME=  FREQUENCY,     SPECTRUM/REAL,   SPECTRUM/IMAG
##SYMBOL=    X,             R,               I
##VAR_TYPE=  INDEPENDENT,   DEPENDENT,       DEPENDENT
##VAR_FORM=  AFFN,          ASDF,            ASDF
##VAR_DIM=   65536,         65536,           65536
##UNITS=     HZ,            ARBITRARY UNITS, ARBITRARY UNITS
##FACTOR=    0.49542278885378, 1,            1
##FIRST=     16045.7642231865, 0,            0
##LAST=      -16421.768244346, 0,            0
##MIN=       -16421.768244346, -2120438,     0
##MAX=       16045.7642231865, 325785247,    0
$$ Real data points
##PAGE= N=1
##DATA TABLE= (X++(R..R)), XYDATA
$$ [...]
46345 -159014 -160213 -105653 -33330 -1705 -25480 -70989 -101075 -102284 -78992 -46767 -30672 -49008
46333 -49008 -92942 -132980 -147924 -140065 -123783 -110573 -108060 -123876 -160675 -205468 -229445 -209129
46321 -209129 -154915 -111057 -112455 -142256 -149471 -112895 -67147 -51872 -54815 -32057 22577 59893
46309 59893 36144 -32475 -93126 -117911 -120315 -119343 -115545 -108284 -111838 -136049 -164000 -168721 -147302
46296 -147302 -121877 -110735 -116668 -140692 -182228 -219570 -216674 -168201 -120670 -125837 -180056 -229448
46284 -229448 -231718 -195101 -157402 -144463 -153961 -167707 -172485 -171664 -176598 -186412 -185095 -164361 -137037
46271 -137037 -115459 -89478 -46616 -7025 -12517 -75967 -160298 -215331 -224715 -214071 -223206 -269040
46259 -269040 -323769 -334011 -277935 -197810 -153789 -150581 -140654 -100326 -62071 -55698 -58527 -37555
46247 -37555 -11338 -25613 -80410 -126500 -135219 -130869 -142544 -160212 -161637 -157594 -179554 -229428
46235 -229428 -266001 -245339 -163449 -58703 18696 40464 14693 -27632 -62417 -88311 -111929
46224 -111929 -126222 -116934 -89258 -70419 -75726 -84524 -65699 -20656 18368 32392 34809 36581
46212 36581 15752 -52931 -148270 -213419 -221889 -206720 -208697 -216061 -182493 -100117 -26723 -27593 -104087
46199 -104087 -193885 -234257 -209905 -144167 -68756 -13967 -6761 -49743 -104350 -119946 -86736 -42733
46187 -42733 -23799 -27071 -31307 -29120 -23253 -13006 -5330 -19286 -54293 -73504 -50971 -18999 -28042
46174 -28042 -68510 -79809 -40025 2213 469 -29487 -46193 -40489 -27765 -15683 -13429 -44081
46162 -44081 -107162 -149233 -116546 -29398 35649 35531 -2809 -34880 -50285 -63635 -85273 -115217
46150 -115217 -145491 -158121 -138151 -96640 -65442 -63605 -82587 -105167 -120328 -118560 -96732 -75755
46138 -75755 -90475 -147593 -209493 -233503 -215455 -184160 -166484 -171491 -198007 -239610 -281289 -301112
46126 -301112 -281427 -223088 -151372 -99598 -77302 -63976 -49004 -63498 -141320 -251491 -308245
46115 -308245 -263699 -162302 -86427 -73913 -107997 -159325 -205641 -226677 -213385 -179536 -144595
46104 -144595 -113986 -92732 -98759 -133568 -156354 -126268 -65319 -40593 -81776 -152516 -208225 -242649
46092 -242649 -263508 -261381 -230215 -192321 -173408 -167398 -149440 -112499 -72425 -49127 -59417 -111987
46080 -111987 -187210 -236038 -225253 -175975 -133961 -111415 -86694 -55127 -43895 -68593 -105484
46069 -105484 -123298 -121805 -120494 -122441 -110179 -76778 -46902 -57232 -113059 -170105 -174548 -126594
46057 -126594 -85342 -95056 -127426 -125352 -86510 -61168 -72853 -91950 -97263 -109212 -134229 -127558
46045 -127558 -59860 13507 8445 -75093 -150035 -151691 -102447 -59856 -44720 -39212 -24205 2248
46033 2248 24256 14754 -37821 -103727 -136257 -126689 -107074 -93710 -66257 -18923 9741 -9438
46021 -9438 -46105 -54891 -45705 -61221 -96688 -96566 -37912 30972 55091 38154 16743 -474 -31181
46008 -31181 -73043 -99304 -101412 -99652 -98689 -66163 14543 90982 85039 -5957 -91156 -90480 -26767
45995 -26767 17207 9820 -5881 7936 31324 28396 1196 -23535 -33902 -33765 -24994 -13259 -14742
45982 -14742 -34455 -53272 -57177 -60985 -79244 -93721 -80760 -54668 -48382 -61788 -67097 -60161 -66631
45969 -66631 -94859 -120133 -123578 -114647 -107074 -102652 -105760 -121980 -134027 -114216 -73946 -63601 -101833
45956 -101833 -139099 -120080 -55057 1718 21877 17135 923 -26372 -59161 -84770 -98952 -100725
45944 -100725 -78978 -31534 7521 -7857 -78248 -151545 -181477 -172088 -156072 -150945 -151069 -146988
45932 -146988 -134346 -109957 -74883 -43075 -37056 -67736 -118413 -154839 -158420 -146594 -147650 -155535
45920 -155535 -132063 -67050 -12998 -31146 -114478 -197447 -239316 -261068 -292414 -322135 -325704 -311722
45908 -311722 -305236 -300588 -268626 -208491 -157513 -141064 -139770 -120397 -79404 -40519 -24482 -37754
45896 -37754 -79002 -136182 -181342 -187445 -154485 -109756 -82179 -82721 -103211 -120948 -109616 -64530
45884 -64530 -18745 -16977 -68825 -141620 -200510 -236379 -250884 -240108 -207716 -172780 -145674 -113278
45872 -113278 -66283 -21672 5329 31777 77871 122303 124705 85720 44546 17387 -18169 -69238
45860 -69238 -102931 -96694 -76311 -76178 -90621 -94470 -88944 -94342 -111716 -122916 -121391 -117567 -118981
45847 -118981 -125084 -133779 -134355 -105825 -45913 7952 13136 -26817 -68910 -84512 -81538 -75510 -67053
45834 -67053 -55354 -52047 -69725 -105738 -140782 -148020 -111701 -50489 -12609 -26684 -63093 -67391
45822 -67391 -28376 13192 22580 7299 -11422 -32946 -65818 -103066 -128308 -135746 -130898 -120567
45810 -120567 -111847 -112030 -121103 -131635 -140005 -147429 -147293 -126425 -86220 -49822 -40067 -59359 -94962
45797 -94962 -131528 -153885 -152235 -132588 -111400 -96138 -84036 -80341 -96903 -127827 -151529 -168175
45785 -168175 -207856 -280902 -343488 -341071 -272097 -181853 -106016 -52016 -27986 -49195 -104372 -146857
45773 -146857 -141643 -107865 -96949 -133290 -187819 -209819 -180522 -134530 -124672 -161866 -197715 -177654
45761 -177654 -103922 -28834 8689 14737 7186 -16200 -56867 -88892 -86839 -70393 -85548 -136760
45749 -136760 -170290 -142205 -79130 -46187 -67002 -103226 -111502 -93452 -80063 -88186 -109216 -128062
45737 -128062 -134307 -120049 -86791 -57683 -65662 -117335 -176037 -193502 -159158 -109263 -83934 -84040
45725 -84040 -80444 -60484 -46661 -61443 -90336 -98772 -77591 -49460 -31872 -18682 -4317 -1433
45713 -1433 -20193 -48641 -68722 -75657 -67635 -36660 9770 36846 19633 -20218 -42126 -40315
45701 -40315 -40570 -53161 -64716 -74126 -97361 -129346 -137515 -108826 -74331 -69546 -93167 -120745 -137642
45688 -137642 -141288 -129841 -108017 -92403 -96229 -116697 -142818 -162546 -160982 -134204 -109924 -125736
45676 -125736 -173965 -196957 -156879 -85269 -41010 -41700 -61040 -73686 -75141 -72290 -79170 -107727
45664 -107727 -140438 -131645 -64602 10985 31743 -2729 -40173 -49671 -45536 -44905 -46516 -55413 -85731
45651 -85731 -125354 -133878 -94925 -43341 -21674 -32504 -53711 -81310 -130896 -202241 -263885 -280269
45639 -280269 -249620 -210306 -204352 -233370 -260031 -257127 -237717 -223428 -204569 -160004 -102941 -71275
45627 -71275 -75097 -87884 -91386 -94393 -100717 -95471 -78493 -78439 -110962 -147268 -148421 -115260 -84590
45614 -84590 -87953 -127776 -179080 -201264 -166200 -92197 -34668 -24792 -31955 -7061 50485 94153
45602 94153 92498 64539 48964 56139 60691 35401 -16197 -65920 -99096 -134469 -191935 -248876
45590 -248876 -254142 -190474 -100407 -39964 -25298 -34850 -43926 -42075 -31424 -21783 -17512 -5759 22932
45577 22932 40596 1627 -88925 -161561 -161300 -108945 -55557 -12850 27403 37718 -17714 -110351
45565 -110351 -165983 -161920 -146820 -149889 -132281 -62589 11773 20266 -33079 -79587 -80338 -61874
45553 -61874 -58500 -64870 -60552 -47384 -38908 -32681 -17865 -1854 -5605 -29347 -40417 -6551 65641
45540 65641 136397 175328 187975 198412 218658 246558 286618 354662 454052 554914 606838
45529 606838 576618 475844 351918 248413 172428 105249 43813 15123 36600 76560 80893
45518 80893 39892 2559 13131 54446 72653 43878 -5412 -36612 -33926 -3324 36624 54380
45506 54380 20848 -53944 -113239 -107179 -51995 -15930 -45666 -125373 -208804 -265630 -285736 -266335
45494 -266335 -221402 -187226 -187629 -199500 -181456 -134324 -102886 -114811 -149701 -178243 -199961 -223549
45482 -223549 -237062 -223221 -187362 -147986 -114387 -93411 -99489 -131028 -151857 -128432 -79108 -56295
45470 -56295 -82148 -130055 -167836 -187588 -188146 -160393 -106201 -50979 -20485 -15854 -20722 -22201 -18003
45457 -18003 -14009 -22082 -51879 -98942 -145178 -171783 -170038 -148958 -139749 -175739 -248183 -296322
45445 -296322 -268734 -185312 -108609 -63392 -23863 22640 48263 34770 7465 -4858 -10303 -29969
45433 -29969 -63035 -99649 -140819 -180575 -195602 -179422 -160284 -156859 -144561 -99510 -47613 -28322
45421 -28322 -32768 -24678 -5208 -5097 -22059 -21067 2615 14919 6066 9938 43241 73300 71209
45408 71209 55075 49784 38922 -6690 -76297 -131283 -156712 -170433 -188955 -209154 -218314 -203345
45396 -203345 -157610 -96134 -54929 -56017 -79216 -85569 -62712 -30916 -10412 -523 10524 28819
45384 28819 47189 46846 13734 -37207 -64305 -41019 10347 41833 33160 7861 -1899 7621 13423
45371 13423 -3054 -31037 -39563 -15737 12411 7339 -24911 -36409 34 54920 84794 87418
45359 87418 90707 105056 115722 113619 106894 104327 105658 103458 82153 30096 -31414 -54548 -27254
45346 -27254 -4786 -41088 -110044 -143483 -132264 -129546 -155995 -169496 -145605 -121965 -128053 -127089
45334 -127089 -76016 -2996 26743 -3847 -60933 -121848 -189043 -251393 -280767 -272043 -251742 -242348
45322 -242348 -244097 -250695 -255711 -243952 -203295 -147694 -107254 -95282 -102593 -118065 -133398 -135184
45310 -135184 -117958 -101104 -108718 -137062 -164131 -182064 -193628 -189364 -163883 -146126 -171070 -222170
45298 -222170 -245315 -224735 -201036 -204861 -219304 -224923 -234357 -254458 -256459 -220987 -180970 -179920
45286 -179920 -209059 -223226 -203701 -170811 -146293 -135465 -137329 -141962 -125754 -78823 -31323 -23868
45274 -23868 -55995 -91801 -112479 -130951 -151299 -147372 -99648 -34586 -6842 -43943 -116695 -165957
45262 -165957 -158885 -117291 -86101 -78986 -70879 -43377 -12504 -1295 -10454 -33647 -75753 -129056
45250 -129056 -153856 -119156 -51797 -9175 -6907 -7688 16914 47313 48463 16532 -19964 -32063
45238 -32063 -16209 4121 3416 -14517 -22434 -14998 -23436 -62816 -93441 -74281 -32988 -31088 -70507
45225 -70507 -93978 -79500 -69179 -86024 -86805 -35256 30812 54397 42960 44037 62833 59971
45213 59971 21212 -21747 -41628 -44643 -42926 -32824 -10713 16177 43337 71028 86556 67854
45201 67854 15355 -38138 -60965 -52894 -33843 -17145 -6575 -9173 -33612 -74193 -106993 -109225
45189 -109225 -81311 -44714 -16859 3555 18761 10088 -44378 -128893 -191501 -199709 -175296 -156881
45177 -156881 -147890 -127920 -100528 -92074 -102171 -92314 -39747 24749 55641 51416 48661 66162
45165 66162 82651 72678 40096 4302 -28609 -63197 -92868 -100945 -83488 -55434 -31635 -15247
45153 -15247 -6861 -8617 -12612 -1433 29094 61226 79713 89478 96471 90135 65408 44439 48042
45140 48042 56866 32690 -26607 -84493 -115321 -123116 -110866 -70273 -14029 16476 -3589 -51433
45128 -51433 -85933 -89522 -72138 -55311 -60172 -87561 -104482 -78802 -32003 -20489 -55824 -89578
45116 -89578 -96018 -115877 -179693 -237047 -220033 -146771 -98884 -108620 -127892 -109680 -66518 -36725
45104 -36725 -34994 -52982 -78983 -101750 -113804 -118914 -122637 -117293 -92745 -56356 -23553 3509
45092 3509 27974 40406 32485 16498 5583 -10901 -41993 -60811 -33486 27287 75166 87123
45080 87123 68526 15031 -78403 -173802 -212981 -195744 -185698 -222526 -273695 -290748 -269495 -232063
45068 -232063 -188603 -142011 -99032 -56016 -3755 38166 28345 -35431 -98377 -114529 -96365 -77623
45056 -77623 -65647 -58529 -70442 -102348 -117839 -87348 -34666 -5150 -8232 -23745 -43526 -70803
45044 -70803 -94858 -101248 -95663 -88495 -68590 -20342 44870 98512 123236 113377 69799 17151
45032 17151 -536 29018 64443 68792 58524 58440 44040 -17455 -93635 -115854 -71915 -14313
45020 -14313 16953 23385 4390 -52023 -125170 -165983 -163519 -159159 -177588 -191603 -177502 -160279
45008 -160279 -174361 -213479 -246002 -251802 -223921 -165229 -105004 -86895 -116308 -148913 -152902 -147800
44996 -147800 -154176 -144585 -88919 -20759 -5988 -55069 -113686 -139558 -145103 -156388 -169128 -164997
44984 -164997 -147118 -138467 -155162 -192610 -230127 -243347 -222089 -182995 -156489 -154601 -158118 -141917
44972 -141917 -106950 -78213 -73013 -81420 -82547 -72336 -65187 -70883 -83484 -96840 -116795 -147794
44960 -147794 -179038 -197463 -205068 -208925 -205336 -193534 -193075 -218118 -239448 -208176 -124452 -48975
44948 -48975 -31782 -59939 -93437 -119735 -143027 -148124 -119199 -83687 -91778 -145626 -186871 -171945
44936 -171945 -132212 -135190 -201141 -282796 -323028 -309791 -269598 -226863 -186783 -151510 -132701 -138453
44924 -138453 -156452 -160980 -136488 -91078 -51136 -45356 -83383 -139849 -168364 -146573 -102870 -83364
44912 -83364 -97355 -114780 -114748 -111413 -125410 -152738 -174367 -179585 -167928 -143570 -120085 -115716 -130363
44899 -130363 -141495 -137385 -139205 -170525 -216214 -234737 -207372 -154840 -105781 -68070 -35513 -6830
44887 -6830 12082 18912 20772 27551 38120 35066 1181 -56367 -107715 -131033 -131838 -125900 -115383
44874 -115383 -92606 -57572 -19781 9908 20164 3543 -27501 -42496 -29751 -20643 -52581 -111547
44862 -111547 -138666 -100829 -34010 -5521 -46935 -133578 -216930 -262942 -264605 -233656 -188131 -144050
44850 -144050 -109779 -81447 -46721 -2722 29329 19305 -38018 -116724 -191167 -254728 -297293
44839 -297293 -289935 -220349 -129491 -79212 -84607 -106626 -110738 -100484 -86789 -59238 -8209 47769
44827 47769 78577 72398 34539 -25311 -86036 -113393 -91688 -49161 -28786 -38595 -51213 -46519
44815 -46519 -30653 -14587 445 11444 9845 -4327 -25046 -62571 -136063 -227876 -271619 -217180
44803 -217180 -98122 -4440 12520 -15669 -26500 3879 53490 93508 113596 117843 112916 99283
44791 99283 68031 13852 -43828 -68474 -49474 -23348 -31071 -64615 -81987 -69742 -58185 -70006
44779 -70006 -87494 -86771 -75504 -71785 -66883 -39139 6508 42645 58542 67912 78674 82021 74682
44766 74682 65237 50536 12374 -47431 -90963 -84171 -39797 -1055 8200 -988 -8481 -5258 9418
44753 9418 30928 46693 45889 34084 24696 15602 -8505 -46861 -74880 -75314 -60558 -50947 -45460
44740 -45460 -30879 -9281 2807 -3103 -23134 -52855 -83609 -92781 -63720 -16530 8167 3181
44728 3181 4739 35540 65981 55090 8154 -34448 -50311 -46324 -27904 7207 44337 55053
44716 55053 34491 9973 2580 2805 -5350 -18997 -29250 -38730 -48145 -42488 -13505 12656 -6562
44703 -6562 -82043 -176013 -236936 -246854 -235504 -250063 -306125 -366411 -375873 -321586 -248928 -213477
44691 -213477 -226876 -256857 -269357 -257811 -235598 -212420 -182938 -137689 -83298 -44056 -35308 -43161
44679 -43161 -46640 -54816 -97177 -171864 -229059 -223230 -167896 -122727 -133807 -195326 -259492 -275340
44667 -275340 -229546 -159858 -120484 -128158 -151262 -152131 -122517 -75129 -24718 11773 18539 -1952
44655 -1952 -32072 -65163 -104040 -129338 -108440 -53393 -27658 -64427 -116602 -126550 -108757 -113489
44643 -113489 -139145 -141866 -115382 -97505 -102031 -105577 -103630 -117487 -136698 -119480 -71822 -63353
44631 -63353 -127756 -199532 -196953 -131209 -82924 -92235 -121712 -122416 -95322 -79222 -101389 -150068
44619 -150068 -188575 -193920 -177962 -162699 -145262 -111327 -75590 -70509 -89981 -87241 -44626 -1516
44607 -1516 11955 22726 57235 78549 37475 -39448 -76650 -57052 -41728 -74952 -126610 -151170
44595 -151170 -156300 -176975 -210219 -214694 -166499 -86508 -12635 34839 56972 60438 48701 27253
44583 27253 9845 9253 16213 -3764 -76264 -177535 -242811 -227835 -158034 -104522 -109180 -144147
44571 -144147 -153706 -126875 -108629 -135491 -182915 -196827 -164370 -126169 -121061 -147293 -184124 -222039
44559 -222039 -253625 -256884 -214545 -144808 -94081 -96674 -146353 -202613 -222729 -198305 -163864 -157147
44547 -157147 -170084 -159160 -108957 -58242 -48559 -73942 -103953 -130560 -159427 -173668 -148205 -96902
44535 -96902 -67067 -80620 -111479 -129114 -133724 -133694 -116850 -70033 -12369 17552 5114 -29083
44523 -29083 -61594 -91347 -125672 -156132 -163953 -147060 -129033 -137254 -178062 -233523 -273863 -273605
44511 -273605 -231171 -178852 -155865 -159209 -139791 -66411 25329 76110 79179 76540 87818 88703
44499 88703 64702 39301 30502 19307 -14697 -60532 -104623 -160052 -234263 -291989 -286019 -213290
44487 -213290 -115688 -38657 -7809 -24163 -55924 -53803 -2476 57270 78727 60872 28320 -10335
44475 -10335 -50419 -65849 -41246 -12591 -29914 -87680 -133727 -141078 -130388 -125403 -126890 -132023
44463 -132023 -144252 -161201 -179252 -203490 -225112 -204956 -119893 -14024 41992 36368 15226
44452 15226 3658 -17979 -57907 -90682 -103738 -114610 -126014 -112723 -72410 -43007 -46784 -59968
44440 -59968 -61901 -73244 -117270 -178294 -226016 -251635 -257976 -244965 -225043 -219819 -222090 -197546
44428 -197546 -144151 -108160 -115963 -134182 -128218 -113147 -106119 -76674 -578 74880 85437 47006
44416 47006 30928 52850 55045 4276 -57087 -77605 -62814 -47954 -44110 -41635 -39830 -43439 -46038
44403 -46038 -41672 -41577 -56780 -71337 -56382 -13080 17897 1304 -47849 -79055 -64923 -29879
44391 -29879 -14078 -24764 -39773 -47383 -56941 -70558 -70368 -43754 -3209 29118 43669 43083 32104
44378 32104 14970 -5200 -25392 -33385 -8909 47732 98284 104926 79676 64117 66276 59302
44366 59302 43177 56113 107553 148905 140989 110700 104734 118512 111370 73185 38194 39693
44354 39693 75335 109946 99590 30126 -54297 -83394 -37908 27668 53800 39127 17454 4524
44342 4524 -5692 -19153 -43803 -89601 -142088 -162191 -137945 -109704 -117099 -147067 -160275 -140848
44330 -140848 -94285 -29379 26618 29074 -29524 -93275 -106620 -78802 -54554 -54221 -78494 -134708
44318 -134708 -211585 -258037 -236622 -177350 -136961 -127470 -123101 -110627 -92816 -69065 -49588 -57678
44306 -57678 -83764 -78432 -29989 -834 -40270 -111963 -158602 -181693 -198882 -185565 -130509 -86571
44294 -86571 -84256 -56212 62028 215633 310624 349851 388108 419259 422765 453081 556836
44283 556836 676132 772400 956592 1333245 1822691 2345158 3066085 4203959 5739204
44274 5739204 7674513 10407951 14185481 18033012 19931901 18627100 14979248 11079331
44266 11079331 8266123 6455108 5104793 4073242 3410526 2948652 2483270 2065998 1826449
44257 1826449 1695056 1525780 1336522 1223563 1154759 1029753 860509 735577 668615 612015
44247 612015 564151 549268 539814 496413 439455 400866 359239 298433 267136 297688 328433 296459
44235 296459 250551 275432 349121 373904 317450 231042 153436 87359 53203 74724 113801
44224 113801 98826 23048 -50143 -81142 -91930 -107127 -115528 -100860 -66411 -22588 14759 18022
44212 18022 -21162 -60387 -47737 7466 43661 24494 -29465 -82535 -117169 -123470 -94637 -45058
44200 -45058 -7234 381 -10615 -15426 815 28833 34609 -11759 -94998 -162776 -187468 -191809
44188 -191809 -195957 -176508 -109982 -22868 41765 79072 102297 98814 59407 27558 56993 128461
44176 128461 168411 150508 121836 121487 127784 103309 48386 -8726 -40594 -27852 26655 79157
44164 79157 77029 25224 -12806 3310 41735 50889 29497 17072 36601 74538 105280 112105
44152 112105 90856 52206 18987 9531 22897 43003 52813 44052 21204 -1657 -13594 -16315
44140 -16315 -17515 -21014 -30256 -52277 -87170 -121253 -140380 -140427 -118683 -75166 -34485 -37501 -86029
44127 -86029 -124519 -112548 -88323 -111565 -164375 -171666 -115325 -59777 -50173 -50511 -13700 41723
44115 41723 66733 53918 31948 17776 15421 37154 81128 103267 56602 -43523 -128475 -151170
44103 -151170 -124719 -88506 -65044 -55691 -55556 -61267 -72685 -89229 -100542 -90125 -59199 -35881
44091 -35881 -44523 -74768 -98208 -107020 -115962 -132672 -148664 -157721 -161871 -159518 -148692 -142763 -159867
44078 -159867 -191482 -203459 -177805 -134888 -103444 -86394 -70494 -53846 -44405 -40236 -30774 -14179
44066 -14179 3390 23120 49814 71760 63637 17349 -44246 -92261 -117277 -122978 -112735 -97830
44054 -97830 -101721 -132161 -159953 -153558 -128763 -130385 -163520 -182540 -162235 -139290 -153330 -179940
44042 -179940 -165087 -107797 -61622 -57427 -69051 -63257 -45019 -37530 -48033 -72084 -106714 -138811
44030 -138811 -141048 -103598 -58075 -47877 -80541 -126900 -161813 -186593 -210855 -230719 -235356 -227365
44018 -227365 -224541 -238939 -262267 -279784 -292191 -308094 -316353 -290836 -233449 -185631 -173611 -166326
44006 -166326 -122465 -61196 -40359 -70922 -104919 -115203 -133190 -184650 -236750 -244834 -214580 -176802
43994 -176802 -129645 -53066 35337 86205 77636 32336 -20992 -67832 -91692 -78840 -50254 -55133
43982 -55133 -113377 -185164 -213895 -184454 -126245 -73379 -38399 -17403 -4146 3022 -759 -25861
43970 -25861 -80409 -155905 -218792 -226807 -167623 -79604 -19850 -10541 -30719 -56741 -83233 -99034
43958 -99034 -78625 -21481 27623 28768 -1204 -17582 -11103 -7011 -15001 -21857 -27819 -45881 -62794
43945 -62794 -46446 -4489 6666 -47342 -133523 -200721 -242886 -283464 -321711 -331658 -304839 -262261
43933 -262261 -225572 -200673 -189117 -191711 -194798 -172021 -113207 -45636 -17013 -54663 -141418 -230430
43921 -230430 -282188 -287030 -257978 -214791 -179290 -170242 -186614 -203735 -201456 -187811 -177873 -161982
43909 -161982 -122509 -73555 -47709 -43077 -24596 11337 17560 -33031 -95625 -110707 -87315 -84939
43897 -84939 -124245 -160978 -152488 -111788 -79221 -65597 -46549 -7297 24813 3198 -81441 -178717
43885 -178717 -227983 -225019 -215810 -224129 -220579 -178282 -121329 -86101 -64611 -27976 14173 25025
43873 25025 1764 -21408 -28650 -34797 -42209 -36193 -31918 -71235 -150372 -201587 -180600 -129301 -110744
43860 -110744 -119377 -107119 -71788 -57820 -74601 -73780 -22809 44396 74584 62897 47378 52395
43848 52395 61192 41240 -15773 -79643 -105848 -78236 -25021 13892 26406 21817 -886 -48474
43836 -48474 -99932 -113969 -83127 -49839 -49003 -61894 -54087 -35784 -46574 -90026 -123849 -120031
43824 -120031 -99445 -90946 -83493 -44408 25935 81546 76628 13871 -57448 -90554 -87052 -89170
43812 -89170 -124420 -171287 -194108 -197636 -216265 -251958 -263343 -231793 -199060 -207434 -233256 -223028
43800 -223028 -175744 -138019 -124476 -100683 -55686 -34114 -66436 -114283 -127040 -118402 -137135 -182537
43788 -182537 -202529 -171281 -119624 -82987 -64003 -60285 -87549 -148778 -207917 -222438 -188032 -131816
43776 -131816 -76206 -29531 1081 11858 13522 20846 30578 23573 -9213 -52193 -79193 -78792 -65572
43763 -65572 -65070 -83413 -96109 -77835 -39744 -19973 -36530 -69898 -96187 -112836 -121094 -109711
43751 -109711 -76296 -44030 -33759 -35295 -29084 -20402 -26225 -42308 -52742 -61924 -85698 -116444
43739 -116444 -127863 -112086 -84088 -53904 -24564 -10916 -22834 -32441 -2347 48017 52347 -9422
43727 -9422 -73570 -74449 -24366 19111 29348 17051 -8277 -39298 -54192 -43145 -37345 -68914
43715 -68914 -113429 -118781 -86469 -73995 -108597 -145529 -132327 -78581 -36419 -35638 -62709 -89000
43703 -89000 -97967 -91394 -84182 -90943 -111310 -131914 -143259 -146964 -147579 -147743 -150655 -157093 -162091 -162418
43689 -162418 -158242 -137415 -78543 5221 46291 -10417 -126018 -198077 -176267 -104062 -40656
43678 -40656 3663 34282 32285 -10497 -58023 -76787 -83522 -101890 -106110 -64414 -12387 -14799
43666 -14799 -63685 -85097 -54264 -35307 -82658 -162734 -209514 -210305 -194269 -173290 -143276 -121374
43654 -121374 -131887 -162149 -174049 -159005 -146072 -152732 -161154 -152997 -140094 -145238 -169868 -194353
43642 -194353 -199790 -182241 -156905 -152779 -186709 -233297 -237989 -177352 -95278 -59839 -89942 -144127
43630 -144127 -177341 -182919 -174054 -153132 -120119 -93110 -93989 -119389 -147700 -170708 -194775 -211864
43618 -211864 -197882 -149589 -99877 -81936 -95290 -119493 -142152 -157043 -153953 -134339 -124674 -148998
43606 -148998 -194227 -224996 -227974 -219224 -211330 -197324 -169012 -130703 -91340 -59059 -43849 -49037
43594 -49037 -60401 -59833 -47721 -35661 -23825 -7992 -2610 -27902 -74965 -112937 -130411 -136872
43582 -136872 -123452 -66718 15708 59611 32601 -18012 -29136 -5337 -3089 -53585 -137000 -216570
43570 -216570 -262861 -258089 -212866 -170004 -157994 -149239 -98891 -16678 39496 39359 9577 -15546
43558 -15546 -31391 -39930 -28498 6232 39543 45875 28442 7385 -5998 -12659 -20474 -44626
43546 -44626 -94202 -148020 -164189 -127872 -72462 -40075 -37944 -47133 -54479 -55542 -40886 -4228
43534 -4228 39830 65061 61413 43599 33737 41193 54561 49934 15846 -27185 -44929 -31174 -14224
43521 -14224 -15026 -20774 -15367 -15418 -51799 -125587 -203166 -247803 -239602 -176855 -82413 -3357 20896
43508 20896 -6328 -49187 -79284 -89016 -75188 -37386 6589 29965 28729 24121 28771 32172 26705
43495 26705 24201 33078 39465 28945 11495 4946 4538 -9193 -36487 -53436 -44356 -23784 -18964
43482 -18964 -38283 -63464 -70973 -57934 -44715 -49048 -60524 -51162 -13997 22770 30483 15734
43470 15734 2968 -10014 -51591 -125504 -186178 -184631 -127018 -67486 -46694 -54344 -52178 -18215
43458 -18215 35494 76625 79545 48331 15597 8256 14476 720 -36360 -59611 -46843 -31621
43446 -31621 -59929 -119833 -148564 -108585 -25555 52903 104461 127965 123721 97670 62501 16365
43434 16365 -55910 -139811 -177989 -135370 -57980 -24432 -47957 -72796 -67943 -70744 -116347 -171581
43422 -171581 -179625 -141965 -109331 -101820 -84484 -29565 35416 62553 43286 9723 -11963 -25728
43410 -25728 -43904 -61170 -60304 -37022 -11095 -11995 -52750 -114384 -157673 -158337 -132950 -120762 -133682
43397 -133682 -135067 -82383 14046 92634 103448 54964 -5269 -39795 -43443 -34091 -35677 -58153
43385 -58153 -80363 -65170 -7813 43445 36076 -25627 -89076 -113670 -97933 -57155 -10287 11028
43373 11028 -18761 -77169 -104834 -78328 -42582 -49695 -95641 -144898 -186699 -226560 -244933 -215626
43361 -215626 -159583 -129766 -135565 -129017 -82669 -36937 -40251 -76326 -89623 -62693 -26789 -3952
43349 -3952 18464 48343 61643 37097 -4234 -21358 -8076 -696 -27111 -68112 -84015 -70126
43337 -70126 -64997 -98369 -148069 -165391 -135875 -93354 -71209 -62885 -45402 -23553 -24971 -56127
43325 -56127 -88777 -95607 -79527 -58872 -41117 -24363 -11115 -3723 6638 30828 65207 96946
43313 96946 121285 139827 146556 132972 105909 82076 64256 43055 25001 32710 63550 72384
43301 72384 20439 -71374 -143079 -163471 -153302 -143893 -141103 -139167 -145887 -172852 -207885 -215372 -170347
43288 -170347 -89260 -23683 -19519 -78766 -162036 -227494 -259189 -256835 -217879 -148734 -82370 -57499
43276 -57499 -76365 -102257 -103882 -85784 -69905 -64576 -61523 -50709 -28028 3373 32393 47319
43264 47319 47223 38757 22438 -5853 -39650 -62646 -67112 -59595 -50361 -52730 -86943 -159028 -236130
43251 -236130 -272207 -262845 -244518 -235309 -214839 -173920 -138359 -120097 -92117 -47952 -39075 -99800
43239 -99800 -172582 -174946 -119325 -93678 -129297 -163980 -148243 -114660 -111684 -131302 -144907 -161701
43227 -161701 -200453 -235353 -222224 -164554 -111254 -95150 -106448 -121726 -129697 -128890 -121839 -113296
43215 -113296 -104620 -97328 -106372 -147091 -196243 -197704 -136397 -79166 -99668 -177758 -220520 -180140
43203 -180140 -103939 -60537 -62881 -84350 -110295 -139624 -159617 -156277 -142489 -146733 -173561 -196475
43191 -196475 -192139 -165267 -137532 -126643 -138780 -165854 -184502 -174044 -146553 -144018 -187253 -238152
43179 -238152 -238085 -182046 -125614 -110717 -116481 -104509 -81972 -81532 -96938 -88293 -53266 -44641 -97554
43166 -97554 -176646 -221667 -217264 -188936 -153622 -109253 -60988 -24204 -4226 1687 -13411 -56193
43154 -56193 -107043 -129831 -111741 -74165 -42852 -27799 -34433 -69473 -123385 -164957 -170287 -150485
43142 -150485 -138755 -153091 -180451 -196954 -195217 -185903 -175203 -152545 -109875 -65003 -47985 -63873
43130 -63873 -87338 -98188 -101472 -103736 -92963 -60333 -24570 -13972 -34860 -72388 -107885 -120584
43118 -120584 -93278 -39629 -7106 -25168 -66505 -88389 -93353 -110515 -132198 -118936 -67387 -24638
43106 -24638 -23280 -43526 -55780 -63268 -80400 -99286 -103737 -97091 -94560 -101466 -114148 -129457 -142345
43093 -142345 -147714 -152555 -170505 -197227 -207518 -183202 -129242 -62947 -7982 5725 -30633 -75822
43081 -75822 -77153 -48424 -64801 -156991 -253379 -263714 -188007 -101443 -55881 -42468 -38440 -41775
43069 -41775 -54300 -67189 -76115 -89921 -115679 -147762 -173826 -181507 -161848 -117321 -64563 -22411
43057 -22411 -2181 -11436 -51832 -105642 -142203 -150184 -148129 -152384 -153078 -133801 -94313 -41374 17270
43044 17270 53969 28262 -60336 -154944 -207465 -234417 -270783 -298344 -272448 -205261 -165883 -194162
43032 -194162 -258757 -306450 -314388 -287974 -244847 -210998 -201416 -196447 -165452 -117610 -96991 -120461
43020 -120461 -152737 -153370 -119648 -72957 -31512 -9517 -17837 -50373 -86820 -115664 -136224 -138192
43008 -138192 -107603 -59276 -34337 -53416 -94635 -126275 -138484 -135508 -120945 -100470 -79952 -57014
42996 -57014 -33848 -33092 -70303 -114804 -118002 -83349 -64308 -85269 -113582 -125374 -144661 -186394
42984 -186394 -210143 -174052 -99800 -40142 -8589 16940 43233 56700 53046 35077 -3180 -55339
42972 -55339 -84555 -66809 -38100 -56506 -124798 -189149 -208759 -190557 -161258 -142755 -150753 -178570
42960 -178570 -182960 -125637 -33484 19481 -1462 -55556 -84940 -77652 -60893 -59816 -78307 -100895
42948 -100895 -102367 -71497 -31196 -18527 -42175 -77912 -105568 -126826 -144564 -151304 -145416 -135423
42936 -135423 -121440 -95667 -67548 -61985 -81554 -95420 -80029 -49357 -31140 -35184 -61051 -113159
42924 -113159 -182329 -226712 -200768 -105563 5461 73251 78807 46680 14320 1211 4462 16915
42912 16915 35780 47778 25839 -35219 -91142 -89758 -40085 -5264 -18943 -45371 -39453 -9093
42900 -9093 12066 23456 48478 83312 97694 83738 66316 61230 57149 47596 47785 62073 61959
42887 61959 22293 -36415 -69088 -63403 -50635 -58370 -77545 -87638 -94294 -119887 -162972 -189235
42875 -189235 -169011 -111287 -53799 -28024 -38830 -68315 -90377 -87483 -62388 -32559 -12389 -8286
42863 -8286 -29793 -85991 -160557 -209772 -205591 -168893 -139561 -125017 -103545 -70095 -47137 -48409
42851 -48409 -60947 -70809 -83391 -109953 -152049 -201727 -237252 -223165 -148125 -65078 -51350 -112128
42839 -112128 -164275 -141906 -78930 -50670 -69656 -89537 -87927 -84823 -84591 -61322 -15849 4096
42827 4096 -34181 -103815 -160578 -195677 -217310 -211494 -163402 -101923 -78643 -101525 -125488 -116761
42815 -116761 -95358 -98723 -128819 -157899 -171238 -178540 -187798 -191729 -184219 -171600 -159109 -139946
42803 -139946 -108735 -76475 -60178 -62352 -69892 -68607 -51559 -21583 3079 -4248 -47814 -92008
42791 -92008 -97476 -72199 -59297 -71387 -72018 -39300 -12925 -42394 -108813 -140876 -104623 -37349
42779 -37349 13071 42833 67939 78834 51262 -12155 -79423 -123174 -136064 -117939 -71711 -13889
42767 -13889 31195 53658 60294 53178 26113 -10213 -22057 9056 55022 70510 48593 25050
42755 25050 25845 31806 6192 -55257 -114184 -126995 -89042 -44703 -49640 -111993 -174572 -174074 -119381
42742 -119381 -86044 -121309 -181068 -186313 -123266 -52741 -26365 -31623 -29122 -10963 665 -6671
42730 -6671 -23584 -40294 -57485 -73535 -78540 -69999 -63855 -77111 -101645 -108152 -81089 -39289 -12670
42717 -12670 -8006 -12198 -20140 -35221 -44828 -27273 7130 13912 -26702 -76815 -92401 -81394 -77621
42704 -77621 -80897 -65609 -33132 -7763 12399 49501 89719 87351 39441 5648 27753 70055
42692 70055 70329 19432 -38726 -61648 -36759 21624 78725 101061 91218 82351 86881 80613 52173
42679 52173 28280 23997 9953 -32698 -62860 -33487 34508 84729 106855 126559 132659 86520
42667 86520 7151 -23653 33418 116822 140929 92512 22816 -21400 -24534 15078 88290 164000
42655 164000 202648 188786 142192 96611 71840 64333 60896 57944 60204 60377 36671 -17194 -72501
42642 -72501 -91340 -62259 632 75822 134290 143352 98369 34891 -16656 -67439 -130139 -171002
42630 -171002 -152533 -105155 -93946 -118406 -112113 -51515 4157 8173 -2615 25038 73180 85438
42618 85438 54055 18836 -4710 -44783 -119894 -202789 -246615 -230353 -177243 -135323 -129754 -128771
42606 -128771 -76993 26659 109954 105906 27978 -55069 -96726 -98817 -82916 -72573 -93697 -155846
42594 -155846 -230655 -274005 -271790 -245138 -213533 -175924 -131184 -95902 -89642 -109566 -127683 -115514
42582 -115514 -72889 -29412 -12404 -20302 -38626 -69415 -118638 -161418 -157919 -111628 -75200 -82858
42570 -82858 -111100 -124681 -124264 -121060 -100661 -51857 -6372 -6521 -44927 -72648 -60305 -22873 6681
42557 6681 3373 -36659 -83780 -92406 -57461 -32104 -57567 -99898 -97933 -52735 -19281 -23324 -42111
42544 -42111 -63249 -104593 -166982 -218043 -236764 -231833 -207015 -155163 -98437 -82531 -107737 -113514
42532 -113514 -61804 6745 34417 25933 25641 47128 72162 97444 131844 156921 139335 84241
42520 84241 33425 3156 -34950 -95399 -139813 -126480 -74030 -39390 -42311 -49017 -33299 -15058
42508 -15058 -17598 -18294 20224 82910 109321 72461 12205 -23520 -34393 -42489 -47323 -41548 -44169
42495 -44169 -73018 -98175 -70740 2035 52846 33338 -36758 -105184 -137315 -122461 -67220 -1800
42483 -1800 33609 27675 4551 -17822 -49630 -93893 -116629 -79250 11063 103551 150566 142462
42471 142462 107964 91397 119198 177707 228609 246779 231474 184815 105471 12405 -49103
42460 -49103 -43920 18484 92666 131462 115226 68117 46072 83169 144737 160026 107888 39806
42448 39806 7141 307 -18116 -50461 -64905 -41742 7923 58332 84654 76066 51003 44718
42436 44718 65049 77647 52579 5113 -32359 -58590 -93636 -133979 -150816 -132290 -101586 -87657
42424 -87657 -92545 -91336 -59209 -1547 42836 40805 7453 -10521 3183 15922 -2477 -41109
42412 -41109 -75092 -98178 -109166 -101381 -90308 -112603 -163735 -177609 -115584 -39395 -34935 -88925
42400 -88925 -111712 -72418 -35176 -50101 -79587 -64834 -13317 18218 -4777 -71437 -149171 -204902
42388 -204902 -221611 -213368 -209123 -213261 -205149 -184073 -180733 -207232 -229169 -213282 -175255 -150113
42376 -150113 -137434 -111349 -72416 -53034 -71056 -106444 -129225 -129832 -116162 -99011 -90708 -106347
42364 -106347 -152806 -216745 -269776 -288125 -267484 -221057 -167468 -121621 -90800 -72036 -55916
42353 -55916 -40617 -37464 -51177 -63060 -56544 -54524 -96729 -173466 -222211 -209706 -176620 -170300
42341 -170300 -175076 -153948 -120898 -111280 -108340 -71479 -23529 -29106 -82247 -98742 -43025 15179
42329 15179 7712 -39344 -68253 -81946 -112685 -147514 -153198 -142790 -149878 -158346 -125080 -62431
42317 -62431 -34007 -67594 -127660 -177654 -215742 -239373 -227073 -177805 -129516 -113814 -117430 -106914
42305 -106914 -71471 -28224 -2453 -11326 -49976 -87593 -93618 -70647 -45315 -29861 -15378 16
42293 16 5272 677 -1419 -4682 -27039 -63736 -84447 -78500 -69727 -70341 -55326 -8143 39658 49053
42279 49053 31666 29152 46953 48227 12660 -34881 -63442 -76329 -98086 -137060 -172924 -174679
42267 -174679 -129639 -65182 -39367 -90575 -190597 -263895 -260329 -193563 -104150 -13105 68072
42256 68072 110322 93350 52396 51449 96454 117131 61626 -28562 -79584 -91233 -122360 -180814
42244 -180814 -200177 -147671 -90489 -108064 -182759 -233050 -225195 -190021 -146468 -81091 -9848 10151
42232 10151 -39106 -97483 -105611 -82519 -84285 -120225 -158902 -192155 -235179 -270687 -252884 -180191
42220 -180191 -115207 -108382 -138673 -157315 -158069 -166656 -181704 -172502 -134720 -106611 -114799 -134193 -123948
42207 -123948 -83223 -45539 -29245 -22667 -17609 -28332 -65299 -111170 -140087 -147539 -144006 -130901
42195 -130901 -105709 -85781 -99897 -148832 -194512 -199953 -166396 -121176 -82915 -51510 -20811 13624
42183 13624 50718 74082 57192 -2585 -64486 -84507 -72389 -79910 -128526 -180468 -194879 -179090
42171 -179090 -157368 -118972 -41318 49347 92980 78340 61854 82343 100878 63480 -9127
42160 -9127 -46424 -30151 -16103 -45979 -87867 -90947 -62371 -51809 -78625 -114309 -134270 -150474
42148 -150474 -180359 -209940 -211678 -189729 -181998 -209176 -239854 -227529 -176979 -144064 -156192 -162834
42136 -162834 -100272 9840 74251 45169 -24937 -67170 -87866 -134470 -203946 -243272 -231648
42125 -231648 -205873 -196410 -187644 -159768 -127051 -106589 -83744 -44705 -20170 -55188 -142895 -224846
42113 -224846 -258686 -253837 -234190 -198608 -138932 -75027 -42981 -52077 -74517 -79676 -62808 -38080
42101 -38080 -20973 -24371 -52996 -86318 -83212 -28415 32436 31689 -44437 -143310 -210581 -236013
42089 -236013 -228122 -186488 -128215 -104064 -140409 -184983 -162490 -77540 -9027 1071 -4016 22347
42077 22347 55361 43599 -12035 -70483 -115145 -156367 -182621 -162141 -99944 -51123 -59116 -106410
42065 -106410 -143151 -146794 -137305 -143979 -172221 -202075 -212323 -202157 -185249 -164383 -126758 -73375
42053 -73375 -36125 -44680 -85924 -120611 -135091 -147830 -163938 -157675 -115025 -63736 -34647 -12736
42041 -12736 40039 118561 165113 137427 63368 8845 2016 10138 -8090 -47637 -68380 -51284
42029 -51284 -22745 -18174 -37756 -53082 -50655 -50754 -77598 -120653 -135064 -83445 20911 113336
42017 113336 129548 67058 -10314 -39054 -21066 -7507 -23686 -37726 -15242 20628 13624 -47652
42005 -47652 -107124 -107520 -58314 -19404 -29200 -71372 -109031 -124415 -115157 -78645 -27065 -2857
41993 -2857 -41832 -116991 -153104 -113227 -42927 -6259 -3993 9740 45673 59667 19382 -48279
41981 -48279 -93573 -100256 -85617 -65451 -43377 -24664 -18785 -29309 -52369 -80617 -101045 -99035
41969 -99035 -76683 -58106 -62286 -77155 -75244 -50329 -23699 -16839 -32747 -63426 -100218 -132400
41957 -132400 -147231 -139182 -116124 -94191 -87181 -97185 -111808 -114738 -101863 -80068 -49014 -466
41945 -466 54715 79246 51838 3476 -18572 -17540 -43124 -114874 -185787 -203998 -184371 -186482
41933 -186482 -230024 -263231 -224622 -120342 -26478 -14140 -78316 -148116 -167731 -152997 -155133
41922 -155133 -184121 -198741 -171605 -127633 -102076 -91741 -74982 -57769 -65512 -97984 -123978 -120562
41910 -120562 -93234 -57762 -25895 -10528 -20628 -43496 -50128 -26001 15120 49111 59523 40299
41898 40299 408 -32901 -36181 -18972 -11465 -21332 -27821 -24212 -35290 -75438 -115916 -119442 -91606
41885 -91606 -73727 -94016 -144514 -195418 -213258 -177784 -105725 -50893 -55889 -105287 -146613 -152760
41873 -152760 -139303 -122570 -91589 -33511 34672 76593 71194 30883 -6609 -4040 42671 93156
41861 93156 98725 56136 11686 5919 30698 51127 52744 49070 53141 62910 73688 87101 102472
41848 102472 110559 102994 84474 72865 88108 137298 204518 257659 274637 265587 261840 278609
41836 278609 295380 281405 237195 199006 197721 222153 232870 209005 169938 148314 152412 163692
41824 163692 166541 169910 195960 250848 311683 346694 349179 345106 360840 389703 402360 386095
41812 386095 356355 328851 302482 278771 274829 297522 321952 320391 302242 298237 309368 301145
41800 301145 253847 192294 152546 137256 119679 81560 31892 -9297 -34904 -54785 -77918
41789 -77918 -95510 -90670 -66555 -50782 -60990 -79252 -78041 -60548 -51914 -56683 -52564 -28396 -3173
41776 -3173 -1691 -31976 -88846 -154335 -190201 -161463 -82796 -16051 -3992 -28369 -50070 -63815
41764 -63815 -85768 -108448 -105036 -73695 -46298 -48815 -74429 -100879 -118566 -136029 -167323 -216418
41752 -216418 -267755 -293444 -276101 -223485 -159212 -106106 -79497 -82052 -96619 -96983 -75723 -50116
41740 -50116 -33550 -19000 -2765 -3125 -33814 -75482 -99389 -108495 -127723 -159477 -176427 -157990
41728 -157990 -110146 -49226 9311 42945 28686 -29854 -96847 -136472 -143760 -140502 -149065 -171503
41716 -171503 -186392 -167153 -111579 -50768 -21585 -35391 -78850 -130682 -164722 -155720 -108270 -68279
41704 -68279 -75772 -112418 -127251 -110312 -102178 -124423 -141670 -114386 -58885 -26664 -41247 -80501
41692 -80501 -110615 -114843 -93645 -55983 -13091 26649 55137 57052 19227 -44295 -92009 -96291
41680 -96291 -76980 -76862 -106907 -132242 -114870 -57267 2651 30940 22687 -7643 -46198 -82109
41668 -82109 -100287 -89861 -61962 -43695 -47589 -59758 -64184 -62068 -57460 -43713 -20706 -6112
41656 -6112 -7813 -4112 20742 38705 11066 -51867 -103128 -124290 -135121 -139846 -113924 -56064
41644 -56064 -5422 15170 31339 65048 87876 61746 55 -46613 -47464 -4890 68735 152910
41632 152910 210192 210484 163402 105641 63148 44224 55792 98541 151292 184715 189727 176684
41620 176684 154307 127652 108570 107432 118317 127395 128923 120402 95276 57219 27322 17813
41608 17813 13339 -1542 -14556 -10670 -5754 -23060 -51834 -65598 -68764 -84115 -103371 -97735 -75989
41595 -75989 -79532 -109016 -108703 -49133 19203 29833 -14564 -59261 -76762 -86903 -107013 -122857
41583 -122857 -116017 -91360 -63477 -32057 13847 71138 114385 118921 89756 58320 46722 46141
41571 46141 39861 33370 41001 52186 40141 4892 -22078 -24401 -23757 -41976 -66071 -71440 -60330
41558 -60330 -55292 -68658 -98182 -138294 -173934 -177479 -139066 -92491 -83808 -115993 -148395 -149076 -122558
41545 -122558 -85493 -43695 -2489 24669 31850 27405 14143 -18048 -65610 -96738 -84308 -40643
41533 -40643 1215 29421 52574 66189 50747 5266 -45260 -83842 -118193 -152676 -167497 -142295
41521 -142295 -82254 -6072 71923 130510 137639 88014 27842 6901 14526 -553 -50459 -88892
41509 -88892 -78498 -39421 -14469 -16670 -30846 -42454 -43329 -26073 8605 49739 89374 122260
41497 122260 130236 94920 34654 -3562 -4408 -3666 -29311 -61754 -80305 -107330 -162042 -203709
41485 -203709 -176939 -97652 -39777 -40967 -68656 -77180 -52717 -1166 62123 103516 94143 52268
41473 52268 27191 33845 39465 21405 -1654 -7205 1659 19730 56091 108253 151650 173836
41461 173836 190649 210730 212342 175702 115076 60635 27425 13621 8361 -5712 -32221 -39895
41449 -39895 4304 74838 102005 60653 1222 -27029 -36893 -58387 -79352 -73182 -52120 -49089
41437 -49089 -69277 -96406 -124000 -146120 -142499 -108892 -76399 -63981 -41934 13523 60330 41019
41425 41019 -28443 -80611 -95051 -112322 -151591 -177374 -161228 -124786 -103690 -108285 -132621 -164906
41413 -164906 -178010 -146404 -84603 -36363 -18340 -9342 -260 -11085 -44178 -63310 -42369 -1280
41401 -1280 29317 49601 73897 97992 105890 90335 50428 -11810 -79821 -128107 -149060 -151709
41389 -151709 -129782 -65290 24239 80134 67323 15834 -22462 -29806 -17389 1273 8237 -13136
41377 -13136 -43360 -33272 23501 62741 34462 -21141 -32394 1229 25581 28536 50321 101727
41365 101727 140600 140482 122027 98506 47321 -36009 -103514 -109649 -66734 -15381 28877 68095
41353 68095 90213 82042 56340 34230 15034 -8941 -24048 -12245 16308 37478 49169 63961
41341 63961 77312 75256 63575 53282 26132 -40616 -115253 -128282 -63316 15452 51340 66294
41329 66294 106358 154290 151519 91078 32263 19387 33732 39577 36484 42708 57740 69456
41317 69456 78513 88236 83638 48718 229 -20155 10141 73880 136681 175366 183968 167979
41305 167979 138336 102734 61651 19934 -2812 11554 53048 88332 95585 81998 65489 56712
41293 56712 64578 98688 151419 193087 203056 194277 187899 175149 131272 62711 8980 -8056
41281 -8056 -6212 -2081 18894 65673 102970 89973 45742 32542 72426 122052 141154 144824
41269 144824 165172 196961 213654 210883 197967 167008 111314 61233 56651 86502 98543 72804
41257 72804 44457 47093 75590 117146 173775 230901 245195 197051 125360 78875 60506 51139
41245 51139 58450 100800 164754 220909 263009 287780 259401 156219 44949 35411 141015
41234 141015 244664 236886 139924 54997 28011 22021 1148 -18187 -5441 38567 90165 128463
41222 128463 137277 104776 42236 -8948 -9663 39149 103118 153999 186898 201475 191349 164363
41210 164363 151242 169355 189758 169873 115687 79607 92460 130906 162149 183860 199512
41199 199512 191972 155679 125846 135370 163660 170282 161724 177121 218283 245527 241934 231589
41187 231589 229528 223492 214751 226027 251917 250977 211406 179314 192389 226782 242897 245159 257713
41174 257713 274887 280068 286844 313822 337663 320746 275563 252677 266065 277493 263241 252968
41162 252968 281049 328903 342941 299322 230943 189315 189524 199578 184430 149809 128168 127862
41150 127862 121784 90051 45808 8785 -15783 -16032 32865 124915 203341 219663 188834 151043
41138 151043 108333 47950 4239 31390 115756 177991 177226 159848 181837 228543 244058 209712
41126 209712 161293 144078 171139 212830 216864 157521 73498 33842 57380 92937 89705 53724
41114 53724 16373 -16073 -48566 -61149 -28502 36126 92766 125238 148169 166834 163254 129383
41102 129383 89099 75682 99946 144167 175487 166191 116953 62724 42109 59298 88757 114650
41090 114650 144675 180480 197798 172759 115342 59780 28153 18092 20980 33165 46116 42352
41078 42352 11940 -35032 -80675 -115761 -134689 -125238 -83634 -37154 -26423 -55540 -82214 -75050
41066 -75050 -60537 -85077 -142823 -178475 -163615 -131539 -121001 -122668 -112600 -109743 -151988 -222066
41054 -222066 -247660 -190523 -96248 -30549 1515 37130 80625 97248 80706 75539 110179 146641
41042 146641 131689 73967 30134 25088 28039 10256 -13341 -15262 3335 23450 37057 42846
41030 42846 32267 5557 -11303 7000 48030 76668 83681 91161 106591 101986 55667 -6250
41018 -6250 -34830 -18588 3303 -8292 -45790 -69452 -56177 -15632 37386 99773 157715 174075
41006 174075 129910 68846 62994 127772 200916 217602 177815 123832 82002 54054 42022 46437
40994 46437 50095 34773 10021 545 10202 22541 31611 47201 73277 105658 147399 200939
40982 200939 247426 260192 238733 205530 173170 143016 131569 159293 206809 221010 181869
40971 181869 131981 120352 143782 165216 166194 155876 144683 133172 117337 88019 37132 -19796
40959 -19796 -42368 -7077 59838 109732 121943 109519 88429 68320 69241 116503 206093 290959
40947 290959 316026 265884 176891 107189 93200 124392 153364 134496 61160 -29960 -91558
40936 -91558 -105966 -94192 -84283 -76625 -52116 -12396 10185 -5225 -35189 -41108 -16120 19834
40924 19834 55787 89374 103866 87463 72654 108908 185988 231269 204175 149183 125027 123521
40912 123521 102775 69016 68946 111412 149651 146105 112664 77050 46109 18036 1995 6054
40900 6054 23580 45717 71206 91454 84112 41117 -6736 -14023 29559 86886 114695 109229
40888 109229 104740 128720 165709 172474 128938 64601 26612 27537 36791 23555 -4889 -14491 14409
40875 14409 67603 116529 146443 160094 160631 142571 103168 55605 23845 24783 56389 97740
40863 97740 117848 95010 39885 -5432 -6055 27642 54098 53650 49843 69006 95889 90104 42133
40850 42133 -8635 -19701 5154 25740 16624 -10211 -33929 -52889 -70531 -73127 -47647 -12325
40838 -12325 1206 -4310 6310 45448 83154 95157 94350 93232 71987 18842 -25923 -8516
40826 -8516 70209 160743 224129 249189 228356 163465 90560 54912 59255 71600 79151 94265
40814 94265 111817 108402 88446 85625 108580 126365 118936 103594 98959 96874 80628 42285 -18473
40801 -18473 -79619 -89805 -23753 61710 84994 52045 44221 88844 122240 104896 88721 124737
40789 124737 179958 204626 216096 247233 266583 228336 163793 143376 168961 178368 147165 118407
40777 118407 130247 169866 205282 220551 215492 202089 198671 203579 188932 146984 120415 151093
40765 151093 217348 259156 251492 220472 202005 212480 241650 250870 205488 131993 104615 145793
40753 145793 187366 170725 132227 133656 160625 163086 155156 190900 265745 324198 350275 371610
40741 371610 385808 363323 319293 304549 324737 342642 359978 415984 496308 525720 474220
40730 474220 398386 350418 312285 254356 203605 211815 287711 388230 456285 458560 410263 362781
40718 362781 344516 329767 295947 279302 321593 390637 419400 401850 379866 358456 317113
40707 317113 287775 325451 403674 436418 411225 403390 444480 476931 462276 435203 420180 394161
40695 394161 369199 409319 514238 584564 565130 532609 570162 638722 653198 613986 574742
40684 574742 538106 476648 417984 418996 475104 529041 554751 569085 574687 553415 513307 491951
40672 491951 509325 549134 586823 616259 652332 713153 787614 828776 809704 773754 781425 816732
40660 816732 810638 756742 726722 756925 800208 817341 836546 883615 925873 931298 921697 925759
40648 925759 937313 956453 1012290 1109651 1211760 1305128 1419392 1560343 1697132 1839781
40638 1839781 2045759 2321886 2612388 2916630 3310202 3792722 4214534 4421792 4392633 4182183
40628 4182183 3838451 3439857 3109839 2904127 2758157 2610076 2488898 2423775 2373707 2319811
40618 2319811 2318100 2381974 2426635 2417125 2451835 2598296 2763943 2841844 2873153 2948994 3061198
40607 3061198 3173302 3334655 3596055 3903725 4189612 4468945 4749435 4967805 5126315
40598 5126315 5357190 5735476 6174318 6621050 7180809 7910249 8687581 9450621 10353454
40589 10353454 11504193 12781135 14127209 15778114 17939219 20483955 23251912 26380700
40581 26380700 30050014 34234239 39100987 45327853 53609072 64260696 77839179 95662608
40573 95662608 119033947 148471139 184334902 226701996 271973525 309624023 325785247
40566 325785247 313157441 277341263 232271862 189873121 154681980 126355068 103884199
40559 103884199 86547843 73146178 62377242 53686075 46923912 41568122 36927105
40552 36927105 32770756 29189037 26078233 23228586 20688002 18605376 16873364 15276804
40544 15276804 13838102 12694750 11774560 10891753 10050006 9377302 8854962 8356751 7875065
40535 7875065 7484772 7150266 6767488 6340434 5946840 5591227 5245056 4964183 4817100
40526 4817100 4754790 4680114 4582778 4492051 4373726 4190650 3988649 3811918 3614777 3364801
40516 3364801 3144090 3034298 2987214 2920648 2853192 2832483 2827382 2814510 2877295 3088282 3381046
40505 3381046 3668175 3987638 4378727 4700269 4749807 4516591 4158585 3772924 3349703 2918792
40495 2918792 2569136 2316175 2091843 1877794 1728468 1654891 1596263 1515452 1428124 1340404
40485 1340404 1249768 1196308 1215826 1252287 1215600 1118583 1057001 1057919 1049881 990581 928621 919697
40473 919697 956114 991806 978208 882611 734052 633753 650142 724726 755482 742154 758500
40462 758500 809509 824710 782635 732657 692128 630197 564860 568514 650939 730796 750839 735248
40450 735248 708647 648528 552248 468440 422778 384172 337785 318747 338892 354388 346857 363782
40438 363782 428899 479775 454414 386860 353878 365209 368225 337747 305458 308469 348759 400378
40426 400378 431493 424198 388234 349742 323365 308631 308501 325165 340266 331574 309979 306847
40414 306847 325488 342006 352073 372608 396315 396197 383820 407794 474747 523779 506989 450393
40402 450393 405981 386218 379431 390485 425554 464086 482368 482274 466648 415767 327682 256203
40390 256203 258127 312039 339021 307362 269782 279068 307855 289071 215284 152057 147467 169319
40378 169319 158204 113610 85572 92920 100135 83348 70451 91095 127237 146488 152468 165113
40366 165113 177372 171360 156864 153135 149227 123995 92553 90754 121304 153593 169452 172525
40354 172525 161595 133691 107595 107081 125185 136547 135121 129232 118221 111176 144236 229910
40342 229910 310903 322940 288356 283756 324793 352818 333973 296797 261794 209311 141088 105209
40330 105209 126376 167120 189969 206230 230614 238540 209279 172085 169121 200112 234449 252422
40318 252422 249817 227892 200104 184353 175464 154712 133418 145486 184966 199922 168794 133084
40306 133084 126944 125382 100118 80372 109235 171476 213380 215378 204048 205012 217051 223639 207956
40293 207956 169128 136864 147056 189381 209709 181879 141604 126946 125849 116039 117839 160619
40281 160619 222062 249704 232236 208626 211653 237188 268847 303393 343339 377589 376510 312881
40269 312881 199844 99312 65354 81603 87188 61920 41865 48295 58641 66866 112942 214899
40257 214899 318979 359237 330079 265165 187290 120238 105433 151982 201080 192040 137899
40246 137899 88881 53827 15736 -2824 40512 132142 209572 243364 256517 262476 242166 194089
40234 194089 155560 152679 165822 164093 145339 123970 101396 68179 26890 999 18476 81302
40222 81302 151352 182393 172038 162003 179300 204457 210988 203359 194365 179040 159629 163245
40210 163245 200121 234341 232483 211405 198898 180293 132174 78715 58406 58418 42574 26829
40198 26829 60535 138596 197723 204592 188747 179588 167551 143442 125848 128252 137636 143023 151916
40185 151916 165786 171744 169734 176748 193712 197949 178524 152304 136798 131340 130593 134859 145966
40172 145966 172368 229917 311663 369202 358413 295459 233114 193182 162222 140665 144388 160570
40160 160570 154974 128879 121504 149779 191690 234444 289368 348940 378616 366975 339888 311006
40148 311006 262602 190443 122764 77055 40265 8335 1483 22297 44245 63301 114226 207399
40136 207399 292941 322354 311599 309107 329082 348267 346469 322051 284018 249372 232973 227404
40124 227404 210059 175066 136152 99855 66650 52458 66620 74274 36227 -13808 -185 73624
40112 73624 110887 58846 -15109 -30870 -9722 -19566 -62366 -87009 -76464 -54198 -29897 44
40100 44 19181 14495 14412 50584 99613 114012 94412 80201 83000 79394 58017 27167 -13114
40087 -13114 -63092 -100825 -109278 -108491 -118041 -111260 -59555 -1050 -3040 -65610 -121318 -124913 -87492
40074 -87492 -29838 35662 78282 68674 32597 26983 56462 72828 62908 69138 106736 130782
40062 130782 115806 103200 127617 151314 122778 60800 27260 40315 61209 54087 21910 -8535
40050 -8535 -10479 24179 69010 77656 31780 -38331 -92106 -116484 -113162 -78563 -22437 17609
40038 17609 12974 -15249 -18177 24817 89263 134485 133955 90610 39814 25105 54142 89404
40026 89404 95284 78848 69872 80065 101808 129015 155414 166722 159143 153497 166601 180494
40014 180494 166837 132441 111781 120053 142429 165676 188027 195966 165884 102027 45672 28832
40002 28832 38290 43339 42703 61129 106523 152960 169652 152086 118489 86038 60072 41725
39990 41725 33797 35422 40422 49335 75979 128090 183251 201824 170786 120028 84821 65765
39978 65765 40788 5041 -22380 -27348 -14663 8533 42419 80004 100966 93220 70118 54042
39966 54042 50448 49739 48472 54616 72222 92126 100888 93211 74966 58605 54031 57590 50593 15586
39952 15586 -43914 -102487 -130460 -112218 -56702 905 17201 -21939 -82928 -119558 -125100 -129178
39940 -129178 -142806 -137408 -93841 -43954 -34470 -64957 -91643 -84980 -54368 -19427 12800 38364
39928 38364 51369 57262 71397 98413 131625 175549 245321 335272 409118 431862 396029 313541
39916 313541 205366 106537 54318 54932 79955 105735 134649 168316 189426 188857 184023 187341
39904 187341 180468 145555 101073 79033 83803 99160 117646 135185 135116 108897 77264 60295
39892 60295 43383 6370 -32430 -42477 -35956 -48636 -73905 -68432 -26226 5149 -4565 -27790
39880 -27790 -29077 -16215 -18155 -43076 -80599 -119871 -145824 -140511 -106158 -67663 -41004 -21897
39868 -21897 -13140 -30236 -63704 -69860 -25944 29787 39566 -8848 -77910 -122685 -121039 -84116
39856 -84116 -55721 -78187 -139135 -176866 -158470 -121577 -112201 -117965 -104768 -87214 -104275 -139909
39844 -139909 -131538 -63173 5476 20163 -2738 -14264 1897 29412 55413 75465 78586 53969
39832 53969 5678 -54499 -117478 -167001 -176431 -137070 -79446 -44377 -37845 -33838 -16781 1596
39820 1596 7824 4895 -3800 -28136 -72316 -114776 -127494 -113480 -107011 -130899 -166908 -179387 -161129
39807 -161129 -142203 -151334 -177535 -176262 -112427 3550 119015 176837 155708 81477 2947
39796 2947 -45207 -61050 -63539 -65768 -60319 -31136 20734 68523 83575 65682 39839 22858
39784 22858 8262 -9275 -13778 7730 32923 25339 -11253 -29988 -6465 18550 -11924 -93627
39772 -93627 -164838 -187301 -189597 -213299 -243508 -227252 -153635 -77792 -52204 -64270 -67255 -51437
39760 -51437 -47385 -64750 -69394 -34597 17010 44058 37274 18222 4841 1458 9782 25418 31219
39747 31219 15744 -7671 -18379 -16001 -11712 -4406 9962 16964 2130 -16634 -9656 13376 11081
39734 11081 -23709 -43646 -10592 49959 80978 60213 13073 -25299 -39080 -31706 -17024 -10584
39722 -10584 -18203 -30342 -30147 -8275 24548 36097 -3837 -85330 -155629 -173299 -153741 -137994
39710 -137994 -130978 -106143 -63351 -36919 -39433 -40138 -14264 24025 55864 87248 119905 126597
39698 126597 86900 23419 -26346 -52574 -60542 -40761 10908 58243 50228 -17568 -95071 -132732
39686 -132732 -123493 -90985 -57884 -31761 -9346 11876 25588 24454 16224 20420 44641 76186
39674 76186 100705 114331 113829 93989 62905 42352 44378 62175 86762 112557 125136 110897
39662 110897 85216 82124 106000 120480 93913 28985 -54603 -129745 -152240 -93083 3917 49717
39650 49717 19971 -13754 10270 64879 98116 114040 134385 135531 93731 51756 65129 109285
39638 109285 113106 64954 15422 -7361 -12457 9618 79114 165904 211393 217032 240745 296656
39626 296656 329352 306751 275046 294846 370939 466583 548299 605467 662617 773512 966124
39615 966124 1209106 1483679 1861614 2435213 3193611 4067607 5071372 6237448 7361900
39606 7361900 7979553 7739929 6755024 5479361 4302185 3349942 2610203 2073050 1713818
39597 1713818 1454980 1223360 1009514 836595 702788 582537 463224 358019 289951 270042
39587 270042 283057 294142 277142 234077 183838 142453 118495 111318 105630 83559 48187 18240
39575 18240 -803 -15134 -13848 20938 69621 84279 56943 34739 47583 67078 63042 52208
39563 52208 55175 50043 11670 -40389 -74992 -94125 -103517 -80596 -23307 8409 -37281 -119208
39551 -119208 -150144 -107819 -38794 26392 90786 133510 111242 30541 -40648 -52512 -21514
39540 -21514 11477 30165 39524 49297 69536 94485 92575 43867 -19384 -46361 -33978 -18539
39528 -18539 -10683 10958 43355 50978 23404 -7090 -17554 -20250 -25370 -22303 -13219 -22557 -53007
39515 -53007 -69147 -47271 -11636 -51 -16442 -34559 -31236 -5183 24321 36936 40899 68086
39503 68086 119143 142360 108388 76225 120757 210723 236466 162444 72499 44721 60024 68688
39491 68688 72470 88594 91256 48493 -22023 -84501 -136624 -182725 -193530 -148646 -91946 -86767
39479 -86767 -129756 -159539 -142310 -103319 -76962 -66319 -56348 -38899 -19837 -15640 -38723 -78270
39467 -78270 -109646 -128164 -149200 -168503 -157964 -114987 -75877 -60172 -45319 -20204 -11380 -22284
39455 -22284 -6695 45135 54118 -39459 -161455 -185535 -102077 -15356 11377 10465 10286 -14181
39443 -14181 -63400 -77950 -27917 32275 45578 29633 25656 26138 8355 -6400 11865 39530
39431 39530 32433 106 -10224 9027 19832 6349 -3128 10769 26803 19400 -3953 -16830
39419 -16830 -5830 20951 41926 33566 -11397 -73553 -125505 -158729 -179158 -183851 -163810 -127215
39407 -127215 -95322 -73425 -50839 -33574 -45632 -82446 -94578 -49494 9136 4051 -75141 -153111
39395 -153111 -162771 -122685 -94567 -92330 -76653 -30892 7568 7494 -5128 12075 50229 59056 14286
39382 14286 -58793 -125703 -172338 -190213 -167254 -110646 -55156 -29082 -25470 -20007 -2300 23880
39370 23880 55227 86547 105715 106663 96800 78960 42600 -8877 -41209 -28550 2798 4079
39358 4079 -27157 -44683 -22999 9816 22276 25616 45160 75198 94149 104237 120770 133550
39346 133550 115906 70506 32666 23849 31841 43610 66366 101465 125928 123478 115806 138380
39334 138380 195131 258541 307425 342397 365230 364447 330429 275337 228824 211481 212348 199064
39322 199064 159541 126415 139496 185441 205086 171428 127958 127931 167042 207934 241356 277225
39310 277225 295619 263712 198591 158094 161176 168373 153936 144351 163089 188563 198862 210648
39298 210648 233462 229936 174401 117515 130421 200492 242730 210963 142797 91673 67816 58752
39286 58752 60578 67669 65977 54949 49039 48114 38892 34185 69439 141560 192223 180395 136315
39273 136315 111495 108959 102860 96576 108308 114870 68064 -29369 -113696 -138227 -120045 -94956
39261 -94956 -68360 -36035 -16795 -27565 -47834 -46275 -30722 -34997 -60088 -65801 -28968 20817
39249 20817 39376 20369 -7618 -20384 -14701 4734 32402 54194 49905 14072 -30710 -49830
39237 -49830 -29334 8940 28728 17133 -4186 -9238 -90 2038 -10012 -24353 -36403 -56448
39225 -56448 -84481 -101433 -98824 -95505 -106367 -113084 -88486 -35369 21983 70471 105967 113066
39213 113066 81473 35961 13558 10174 -15521 -80453 -151930 -190346 -185177 -142371 -72711 -6096
39201 -6096 18506 -2215 -29421 -35829 -33572 -32384 -12225 31220 52957 15844 -43856 -55697
39189 -55697 -5897 54986 85444 88968 79470 56531 25427 7274 15249 41788 74590 105313
39177 105313 122518 119571 110514 114307 122166 104831 55032 -126 -31812 -33646 -13414 16452
39165 16452 39869 51356 68764 109967 163516 211269 271113 376795 519770 663997 825914
39154 825914 1072299 1397391 1655055 1679634 1459995 1143092 874318 685479 537993 411987
39144 411987 316695 249381 190599 134857 94091 68505 39966 2500 -23963 -26736 -28713 -57683
39132 -57683 -95891 -92577 -33337 31473 43388 -254 -56593 -92036 -104196 -103314 -97335 -89853 -73654
39119 -73654 -32645 33355 95661 126180 128452 121572 109483 89307 71896 63883 45661 2478
39107 2478 -36965 -34087 -2663 6700 -21911 -60779 -95986 -138020 -171645 -158517 -110069 -98590
39095 -98590 -162322 -247441 -280379 -254937 -208268 -151732 -77504 -8359 13234 -19158 -67792 -94162
39083 -94162 -85004 -46399 137 23558 8976 -28300 -67716 -105931 -139376 -148946 -127276 -101335
39071 -101335 -101397 -124435 -151735 -181172 -213287 -226562 -201655 -156852 -127567 -122479 -128732 -144170
39059 -144170 -169504 -181567 -153039 -93836 -39749 -5894 16030 22428 -766 -41281 -63623 -57625
39047 -57625 -53132 -75592 -111891 -132603 -130629 -125841 -138976 -165933 -177515 -151849 -107981 -89198
39035 -89198 -106815 -126173 -121374 -111993 -122727 -141373 -151251 -172582 -226306 -282173 -294153 -269976
39023 -269976 -252673 -246498 -218386 -166077 -124405 -101929 -71003 -30192 -18584 -50763 -89400 -102735
39011 -102735 -102821 -107558 -111777 -117574 -145555 -188061 -195478 -141581 -64942 -14259 10277 28047 29145
38998 29145 -2646 -47043 -72556 -85099 -108653 -132199 -119986 -70264 -25111 -18272 -41432 -65371
38986 -65371 -71720 -60405 -43290 -33171 -27586 -6571 40673 90326 99528 49894 -30875 -91451
38974 -91451 -100872 -75549 -61942 -85370 -120581 -124808 -91656 -51033 -22184 2146 22211 16843
38962 16843 -21625 -64283 -76670 -56439 -27072 -9567 -9901 -19437 -21902 -14608 -20056 -53798 -87484
38949 -87484 -78864 -36317 -10571 -18875 -27885 -23497 -39602 -90154 -129007 -118812 -93092 -102559 -138918
38936 -138918 -162963 -174971 -201078 -233035 -237592 -212983 -187628 -174100 -167575 -175234 -202065 -221772
38924 -221772 -208137 -181234 -174716 -173178 -137598 -82283 -64793 -99095 -137200 -142227 -123918 -95444
38912 -95444 -54239 -19043 -26208 -66752 -82143 -50496 -25206 -53568 -103909 -116071 -88085 -67227
38900 -67227 -78642 -104447 -118142 -104600 -58972 2259 39813 30593 -100 -11232 -1726 -5497
38888 -5497 -35310 -60026 -43475 12000 67048 81030 45125 -12210 -51309 -55716 -40453 -30030
38876 -30030 -36740 -56525 -70937 -54461 -153 58029 70249 27324 -27547 -54305 -62262 -84279
38864 -84279 -122474 -142573 -117130 -58430 -8607 -2035 -32137 -55121 -38040 -1217 6961 -22321
38852 -22321 -45744 -33992 -17498 -39808 -89776 -115879 -98815 -76325 -92681 -146578 -194982 -195054
38840 -195054 -140468 -66605 -19316 -11851 -18398 -15182 -11814 -26565 -46935 -40975 -1062 49468
38828 49468 89673 112436 102713 40871 -55701 -124829 -122453 -76944 -50728 -57825 -55545 -20430
38816 -20430 7768 -18623 -83276 -122750 -103504 -49498 1844 35671 48465 38885 25001 36804
38804 36804 69476 74625 25656 -36458 -56522 -38286 -23067 -18047 1361 28866 26182 -10802
38792 -10802 -39177 -34741 -20295 -12767 5913 41374 60561 45485 28668 38594 51427 37792
38780 37792 17168 17405 17759 -9359 -30295 7178 78857 103912 58632 1023 -25930 -44266
38768 -44266 -72460 -76814 -32839 20490 38510 40100 62602 79943 33165 -68061 -141024 -136718
38756 -136718 -94729 -71478 -65101 -47207 -29267 -46662 -94646 -132227 -148900 -177051 -223818 -239418
38744 -239418 -188152 -115668 -96715 -131480 -146083 -97910 -29501 342 -5229 -2853 23738 56644
38732 56644 84040 106573 111600 81510 32419 10713 37001 75410 73068 17180 -57061 -104230
38720 -104230 -105096 -73950 -39783 -19169 -5222 15311 37335 37587 1204 -56490 -97585 -92986
38708 -92986 -49883 -5717 12398 17414 36145 58270 42088 -18055 -64076 -43240 18308 48307
38696 48307 22337 -15303 -22715 -11480 -15800 -43454 -74600 -87314 -70081 -27346 15310 29200
38684 29200 17086 12337 32497 53359 44892 14005 -10444 -21821 -38074 -63494 -75109 -56199
38672 -56199 -24591 -11504 -20173 -23434 -4729 16506 15001 2942 16650 58112 79891 46190
38660 46190 -14284 -42429 -20018 22060 54923 76191 87922 88738 94148 128087 179700 200671
38648 200671 165909 110919 85726 92482 93954 68382 28791 -4604 -26278 -39625 -46880 -48408
38636 -48408 -45218 -43583 -56870 -89130 -112509 -82907 3531 84645 86900 2579 -103633 -161338
38624 -161338 -155068 -126317 -131455 -192212 -271389 -301325 -251956 -166972 -116898 -121381 -137734 -123966
38612 -123966 -87717 -63489 -61807 -59501 -35031 392 11150 -24660 -86646 -126794 -117960 -82514
38600 -82514 -64111 -76542 -94702 -93904 -78723 -66275 -59218 -51036 -47134 -60331 -86027 -99936 -87047
38587 -87047 -59585 -37142 -20842 -2024 11814 2792 -22126 -25342 14824 66458 76227 35508
38575 35508 -8094 -8953 27061 60781 69820 62499 49249 21473 -32024 -96063 -130089 -105506
38563 -105506 -39179 19090 34871 17206 -3344 -10313 -4834 11017 32831 41717 16641 -38428
38551 -38428 -96423 -137177 -159656 -166785 -160181 -151370 -153138 -153205 -122555 -62239 -16663 -21001 -55197
38538 -55197 -73127 -63905 -59478 -86409 -131839 -160423 -152965 -124656 -107977 -116731 -130306 -122037 -96932
38525 -96932 -82574 -85777 -85834 -75519 -76123 -95631 -102968 -70396 -19970 -108 -30644 -94093 -164150
38512 -164150 -217129 -232528 -213640 -197137 -213019 -243858 -251154 -231142 -213040 -210706 -210962 -206381
38500 -206381 -204349 -201517 -182021 -146894 -117415 -103692 -94321 -79197 -57407 -23280 25091 62067
38488 62067 53737 8685 -23822 -17539 1748 5374 5691 26642 57726 68046 52759 39528 53528
38475 53528 92397 131205 142082 116334 75680 54137 63291 83084 87462 67055 28269 -12547
38463 -12547 -34417 -31520 -27668 -47862 -76193 -71817 -30294 5330 4372 -16460 -33347 -53237 -86608
38450 -86608 -114855 -115619 -96986 -78527 -60366 -37900 -24317 -29961 -41428 -48614 -65578 -92791
38438 -92791 -92144 -45667 -8514 -41269 -106513 -104588 -14618 71736 76460 28457 -3331 -11266 -33179
38425 -33179 -76182 -113101 -133157 -143182 -129890 -73579 -72 30988 3995 -27122 -13558 20275
38413 20275 13167 -48781 -118377 -151001 -149950 -143280 -142798 -141580 -135096 -124691 -105991 -71450 -26002
38400 -26002 11539 25567 14626 -15362 -59530 -111202 -156034 -175303 -158734 -117287 -79883 -65815
38388 -65815 -59106 -28796 16899 23638 -35630 -103658 -99457 -28883 15105 -28703 -119086 -179945
38376 -179945 -190503 -175103 -146360 -107277 -82857 -96516 -126373 -131914 -116502 -115709 -126659 -103028
38364 -103028 -33297 24861 15517 -43664 -89882 -93295 -76941 -69436 -65647 -39602 15527 69330
38352 69330 81549 47993 6446 -12159 -21194 -48055 -85687 -106525 -110650 -116577 -108950 -49788
38340 -49788 43638 86178 25262 -83953 -145114 -136431 -116520 -130892 -160783 -167192 -145463 -119821
38328 -119821 -106246 -97506 -78200 -47760 -28803 -46605 -95386 -137036 -145000 -136281 -142042 -158649
38316 -158649 -153933 -118074 -80016 -67990 -78245 -93323 -108980 -125096 -125367 -90340 -29180 20797
38304 20797 32708 17159 3892 4028 -836 -35340 -103766 -184004 -239636 -241309 -190838 -128740
38292 -128740 -104558 -130771 -175333 -205358 -221715 -237754 -244140 -221825 -179299 -145100 -124581 -96257
38280 -96257 -55982 -31065 -36217 -46708 -39105 -34683 -71666 -145920 -208431 -219590 -183772 -131395
38268 -131395 -89348 -74088 -93712 -141612 -193592 -222581 -219202 -195178 -165679 -133119 -95282 -66010
38256 -66010 -70042 -106669 -134885 -116644 -66906 -35792 -43733 -61941 -60057 -43236 -30449 -22387
38244 -22387 -8546 12261 34485 54621 65771 59092 41333 34085 44791 55787 51844 38387
38232 38387 21277 -8726 -55858 -103406 -132050 -135802 -111684 -61129 -13386 -13322 -64409 -114778
38220 -114778 -122639 -103524 -89171 -78174 -59058 -41543 -24417 26083 114809 174023 144536 69670
38208 69670 37561 53335 47984 602 -37620 -45133 -64112 -109405 -127873 -87362 -34665 -20462
38196 -20462 -28983 -29599 -39246 -77453 -109752 -99479 -78444 -100064 -147108 -151974 -98199 -42791 -37475
38183 -37475 -74581 -112882 -118344 -79117 -15126 26753 17403 -16688 -27582 -10707 -4684 -33692
38171 -33692 -84768 -138384 -184223 -205051 -182902 -130996 -88295 -71447 -59295 -34445 -10506 -2536
38159 -2536 1899 18723 33808 21050 -14599 -39019 -35005 -22643 -23671 -25882 -5361 24645 17387
38146 17387 -45780 -123269 -162172 -158911 -145718 -135341 -114855 -83680 -56209 -29536 7336 30967
38134 30967 2042 -61717 -86629 -41817 15747 27808 13564 17309 27053 4832 -38206 -62094
38122 -62094 -69349 -90839 -116124 -104197 -57934 -24931 -23283 -24316 -11313 1390 11224 30888
38110 30888 42716 9902 -55283 -95333 -94824 -100493 -132751 -145141 -106926 -60999 -52495 -58079 -43067
38097 -43067 -36480 -78110 -128033 -110692 -35902 3406 -38641 -103210 -121391 -105993 -109550 -132509
38085 -132509 -124808 -66189 655 25690 8573 -19080 -46600 -86532 -127979 -128682 -76399 -27454
38073 -27454 -45747 -118449 -173780 -175069 -150767 -130837 -107499 -75705 -61491 -80637 -109746 -128809
38061 -128809 -153649 -192024 -206968 -167811 -106057 -73442 -71158 -70382 -77190 -116189 -164135 -166571
38049 -166571 -122201 -88266 -90698 -88685 -50515 -9440 -9017 -35405 -45582 -34856 -34535 -57874 -86316
38036 -86316 -103468 -110624 -108445 -90708 -62627 -45222 -51647 -71415 -87698 -102526 -133145 -183270
38024 -183270 -228318 -237958 -210636 -175281 -156184 -147068 -127604 -96091 -72562 -72313 -88224 -100759
38012 -100759 -97122 -77024 -43713 3710 60647 98506 74703 -15973 -109635 -128426 -73473 -26541
38000 -26541 -43792 -87761 -94468 -68775 -63310 -86209 -89777 -48905 4511 36815 54392 70334
37988 70334 69991 38395 -5393 -30341 -33526 -35235 -47010 -65414 -87891 -114454 -136572 -139688 -118927
37975 -118927 -86293 -62225 -60388 -76945 -95560 -106395 -114313 -122360 -118820 -94102 -58658 -26132
37963 -26132 7966 46009 60920 25952 -32842 -56029 -29904 -6429 -29356 -76729 -97951 -77471
37951 -77471 -37896 -5360 3680 -17365 -53741 -74678 -69718 -61425 -65158 -62589 -40793 -30894 -69403
37938 -69403 -134898 -162298 -118672 -34998 36026 66078 55848 22849 -7298 -16879 -10917 -5409
37926 -5409 -3474 1013 105 -25608 -76622 -124679 -141120 -123917 -91896 -62948 -44497 -39000 -51126
37913 -51126 -85577 -134580 -171551 -170743 -137581 -105455 -94763 -91142 -75636 -56719 -50685 -45655 -15555
37900 -15555 33435 60187 39710 -4940 -32823 -32225 -25549 -35571 -59241 -75661 -73573 -64534 -66075
37887 -66075 -77850 -84772 -81109 -75989 -72473 -58619 -26995 12528 47350 72945 81662 62321 23875
37874 23875 -2284 48 12649 16160 15464 11418 -18862 -79033 -121385 -103242 -52868 -27474 -23144
37861 -23144 11036 74129 99344 56059 2359 2440 40144 53114 16785 -43578 -95633 -116745
37849 -116745 -90817 -27759 26118 30563 -2320 -27894 -23451 1267 34024 69688 95270 93648
37837 93648 64917 27120 -2083 -11415 6808 46355 79891 80681 49519 9560 -16607 -14973
37825 -14973 15861 48614 34298 -44454 -137088 -172872 -139946 -88049 -58819 -48066 -36894 -21292
37813 -21292 495 36282 78107 98179 84139 56184 33153 5433 -38298 -80650 -99072 -103578
37801 -103578 -121018 -150354 -162951 -145381 -115720 -95433 -87686 -86137 -83648 -69432 -41448 -27468
37789 -27468 -65835 -149256 -212586 -202022 -140652 -96229 -92188 -84268 -30174 48672 93085 75860
37777 75860 26109 -7966 -4514 20349 33484 16806 -15021 -30697 -19119 -2393 -5908 -26537
37765 -26537 -43731 -52911 -67024 -85316 -83060 -44221 8642 32324 8660 -37376 -66752 -68111
37753 -68111 -66617 -91014 -136470 -168217 -163490 -137992 -121366 -118315 -113952 -112702 -142703 -208026 -259206
37740 -259206 -238544 -149936 -58881 -18476 -17653 -15642 -6495 -20597 -68636 -120196 -151041 -178922
37728 -178922 -223323 -254381 -225824 -150040 -90099 -70524 -49258 -764 28072 -9841 -76909
37717 -76909 -99117 -73723 -61221 -80107 -84062 -55282 -47986 -103749 -178579 -199558 -157715 -101632
37705 -101632 -65973 -48612 -39227 -29752 -8586 19234 16515 -44063 -126455 -155723 -100837 -7579
37693 -7579 53884 51920 3395 -54005 -90222 -99460 -98175 -102063 -106432 -95662 -66624 -33674 -14890
37680 -14890 -19628 -42847 -68520 -89956 -125857 -193037 -260603 -268199 -208599 -153726 -164897 -210321
37668 -210321 -216043 -172184 -132959 -124691 -115796 -83027 -50262 -41711 -40606 -18479 25872 76145
37656 76145 120035 144623 136578 104300 78204 74580 77751 66047 33384 -19389 -84598 -130638
37644 -130638 -119356 -58239 -5531 -3739 -34436 -57239 -63772 -68267 -71047 -61128 -38165 -7648
37632 -7648 29520 62399 65552 33166 -2102 -11069 -11584 -41168 -98448 -140277 -131249 -75937 -11387
37619 -11387 15319 -22385 -100521 -158247 -160581 -130917 -104002 -74635 -23370 33931 64393 67954
37607 67954 63799 39857 -32096 -130991 -187549 -165570 -104617 -67409 -75930 -111407 -145391 -152764
37595 -152764 -118344 -51176 17604 58737 59291 20652 -38804 -87233 -110754 -133503 -178068 -218336
37583 -218336 -211298 -166642 -134755 -126620 -103447 -56616 -35598 -69259 -116033 -129321 -121878 -121489
37571 -121489 -110332 -64787 -20105 -31736 -90056 -132287 -130573 -114995 -113736 -121904 -130767 -139229
37559 -139229 -130362 -82356 -14482 18141 -8632 -58293 -84174 -80761 -71178 -69594 -72506 -71655 -65747
37546 -65747 -67319 -91561 -123721 -116339 -50873 15080 8262 -61433 -117159 -129132 -146949 -201858
37534 -201858 -246072 -228724 -175425 -141632 -130386 -111570 -89610 -92333 -112341 -116459 -103285 -100306
37522 -100306 -111243 -114784 -109574 -111006 -106639 -67599 -8082 19713 1939 -15592 122 23542
37510 23542 22081 9177 11782 18928 1590 -36943 -66103 -71646 -65587 -61340 -63220 -74133 -92858
37497 -92858 -107905 -109524 -103472 -103067 -116136 -146888 -195178 -242297 -254572 -218477 -161437 -124237
37485 -124237 -122691 -144102 -164245 -158611 -120038 -79714 -84870 -135984 -174498 -160094 -130888 -148641
37473 -148641 -208068 -248017 -238872 -207198 -177085 -140964 -98389 -74768 -81962 -98901 -109919 -124806
37461 -124806 -139693 -118457 -47516 21186 23721 -33695 -83471 -81870 -53232 -48806 -89406 -155724
37449 -155724 -215046 -245313 -240405 -201822 -133343 -52697 -3295 -29586 -125934 -225780 -259991 -217837
37437 -217837 -139376 -65624 -18187 -11572 -49621 -106907 -141969 -139027 -118823 -103280 -90109 -70828
37425 -70828 -52598 -46252 -47585 -48158 -53766 -71661 -84853 -62976 -4164 53254 73390 64320 61605
37412 61605 78249 90827 75821 39451 2386 -28069 -54580 -69892 -60737 -29709 3612 24660
37400 24660 33673 33413 21677 -1347 -30259 -59681 -80591 -75989 -40580 -3610 -5116 -42414 -68269
37387 -68269 -55569 -33507 -35821 -42077 -9500 51043 75259 25953 -62118 -129693 -156613 -161032
37375 -161032 -157780 -142603 -110923 -71772 -39240 -19154 -7830 44 6525 14110 28742 48991
37363 48991 51952 6835 -83796 -168126 -191084 -153810 -108393 -93389 -95918 -83916 -54079 -31405
37351 -31405 -33973 -56911 -86818 -114790 -132486 -128758 -99774 -58920 -28689 -19743 -20929 -14028 2884
37338 2884 13623 8404 2075 17151 50167 67977 45272 -1265 -28076 -14722 12821 17506
37326 17506 598 -3404 17089 24511 -17905 -85904 -114829 -79382 -22436 4339 593 1463 24549
37313 24549 54746 66972 42803 -23358 -112584 -184412 -213316 -217230 -231096 -257988 -266352 -231733
37301 -231733 -162459 -87726 -38351 -33808 -66252 -98078 -95213 -64099 -40650 -46049 -70091 -91888
37289 -91888 -95950 -73203 -30548 3048 4936 -7854 1312 36968 68064 75806 72421 67286 48234
37276 48234 8116 -40044 -86794 -135758 -176814 -182876 -153705 -132692 -153718 -194051 -205579 -173852
37264 -173852 -122825 -80717 -66598 -92099 -146141 -188698 -186224 -146217 -97926 -53968 -15165 3635
37252 3635 -12521 -43967 -48209 -11244 34101 43529 487 -74461 -136295 -145891 -109014 -78577
37240 -78577 -97881 -151434 -195382 -220650 -247378 -265461 -234390 -158311 -112570 -157524 -253322 -302796
37228 -302796 -269573 -213567 -205014 -240231 -263938 -250231 -226271 -218226 -209351 -171227 -113763 -73647
37216 -73647 -60784 -48796 -23277 -9608 -39651 -114088 -211005 -307850 -378857 -398617 -376098 -364879
37204 -364879 -406852 -476046 -507245 -471746 -396706 -319539 -258178 -224228 -227410 -253945 -265458 -234612
37192 -234612 -171521 -111022 -83015 -91327 -109366 -104001 -77179 -69899 -105563 -148534 -149290 -113445
37180 -113445 -86560 -83864 -83958 -86871 -120581 -179691 -214650 -205672 -196899 -225186 -259241 -248845 -198711
37167 -198711 -149064 -109220 -58376 905 34844 23579 -17099 -58516 -81099 -79704 -68466 -72454
37155 -72454 -95129 -106499 -84774 -53490 -50042 -73035 -93357 -104436 -123402 -149447 -162627 -164924
37143 -164924 -180877 -208998 -213207 -180191 -150448 -167284 -219914 -262934 -273578 -262284 -238193 -194092
37131 -194092 -128289 -61543 -23257 -26245 -56528 -84801 -90399 -78107 -69978 -79707 -99688 -113783
37119 -113783 -114922 -106371 -92863 -76126 -54961 -27145 2314 12702 -20432 -92723 -156572 -156458
37107 -156458 -85150 4402 51263 45139 24429 22359 33742 39976 44515 60480 73507 48952
37095 48952 -15967 -73079 -74140 -25717 24049 41698 32686 17875 8145 3722 2131 697 -2163
37082 -2163 -6624 -14708 -28166 -40107 -40578 -37515 -55169 -96530 -125039 -108905 -72201 -71134 -121895
37069 -121895 -182052 -206072 -189436 -150734 -101623 -51305 -15187 3177 22599 56909 90227
37058 90227 98396 83443 66213 52688 29154 -11119 -54714 -82973 -87198 -69414 -40607 -18518
37046 -18518 -15255 -24707 -30447 -26419 -22427 -30927 -56868 -97587 -141394 -168226 -165940 -148038 -141246
37033 -141246 -151117 -154647 -135491 -111389 -110058 -126146 -123111 -80505 -22881 6763 -7893 -46280
37021 -46280 -77407 -85793 -75685 -62218 -60777 -77450 -106310 -137937 -167861 -191014 -192209 -155076
37009 -155076 -84506 -10582 37406 56668 65253 73553 67216 21675 -63868 -148823 -179464 -144344
36997 -144344 -90827 -69258 -69746 -41551 26410 80438 71746 18674 -25734 -41976 -48312 -57512
36985 -57512 -67682 -84217 -109472 -114743 -67116 8877 39553 -10056 -91487 -136519 -132921 -110550
36973 -110550 -83025 -42710 1190 20101 3338 -30169 -60650 -85311 -103688 -106577 -88177 -55085
36961 -55085 -16252 23922 56408 64808 44190 16065 9878 26483 30744 -9388 -80039 -131106
36949 -131106 -132800 -108052 -96872 -102976 -98299 -72029 -43328 -20942 16120 79179 137639 152197
36937 152197 123967 85210 54332 28342 11733 20284 52114 80260 82245 60303 27962 -6989
36925 -6989 -42158 -78379 -120150 -162144 -175348 -130120 -41138 32812 47780 16352 -22124 -52067
36913 -52067 -80813 -105522 -115150 -123508 -165203 -243152 -304392 -293376 -221023 -157680 -156279 -201095
36901 -201095 -237583 -233842 -198954 -156143 -121162 -102880 -99774 -89871 -47630 15159 45854 11328
36889 11328 -50405 -67506 -21921 29001 27529 -13872 -37456 -18573 10163 12385 -2402 1660
36877 1660 33140 61148 55723 22710 -6672 -7072 26577 80131 123272 126472 93806 66768 71886
36864 71886 76238 28857 -59031 -119478 -121924 -113155 -138579 -171524 -164265 -131304 -124094 -144750 -148731
36851 -148731 -126726 -117804 -132297 -126464 -78721 -33814 -34117 -53567 -44680 -15662 -10455 -34691 -52568
36838 -52568 -47061 -35587 -27204 -8608 18953 26079 -4502 -47558 -61877 -36016 898 7576
36826 7576 -30394 -82907 -102031 -74448 -36057 -22761 -24923 -13025 9352 11889 -12267 -39697
36814 -39697 -58681 -80463 -104188 -108544 -90232 -76255 -81634 -85714 -68915 -44577 -33874 -35427
36802 -35427 -41181 -55734 -75260 -74663 -47093 -32031 -65584 -119738 -133564 -96630 -57899 -51825
36790 -51825 -59766 -55250 -46744 -53103 -65873 -62484 -40301 -14846 5922 27341 54376 85831 116490
36777 116490 134174 121210 71058 1440 -56885 -83041 -76051 -50507 -28490 -27837 -48618 -73001
36765 -73001 -83137 -76931 -65957 -65580 -88838 -138192 -195362 -228134 -217327 -173034 -119054 -70076
36753 -70076 -32844 -18336 -33174 -59375 -62826 -33448 -4822 -15879 -54539 -60891 -724 78905
36741 78905 95370 32747 -33141 -30255 16324 20092 -52339 -143472 -181855 -156132 -101647 -53024
36729 -53024 -32987 -54765 -102288 -128129 -103323 -57158 -40711 -64205 -97986 -120088 -127593 -111774
36717 -111774 -65075 -14825 -9169 -56932 -113118 -136380 -131195 -119822 -104694 -81279 -62283 -60397
36705 -60397 -61704 -42689 -6397 19584 16927 -7504 -34159 -44800 -29497 5526 38574 50309
36693 50309 37946 7622 -35731 -81252 -107788 -102983 -80477 -64389 -61933 -63354 -62339 -62463 -67881
36680 -67881 -80952 -106012 -143484 -182382 -208064 -214007 -199216 -162748 -111547 -64619 -35414 -16089
36668 -16089 8661 39342 64629 76049 66306 27311 -30281 -69673 -66640 -45497 -46343 -65418
36656 -65418 -67013 -53541 -75259 -151404 -223930 -224321 -161040 -104329 -98041 -121618 -134468 -123879
36644 -123879 -101995 -80692 -63344 -49688 -39004 -33272 -39386 -61702 -91439 -111115 -111590 -98242
36632 -98242 -78505 -50725 -10958 32508 58718 52870 25296 6708 19966 58031 93181 104287
36620 104287 89714 60119 31376 21831 39268 65770 70389 44785 13540 270 -3214 -20522
36608 -20522 -53083 -74875 -62671 -21254 19429 26267 -10363 -62141 -82335 -52922 -8978 -4777
36596 -4777 -58219 -138051 -199430 -217629 -191661 -135916 -75022 -32434 -13472 -5162 2162 -199
36584 -199 -26378 -71560 -107777 -107933 -75244 -45924 -55197 -98264 -133224 -127918 -94289 -67747 -63611
36571 -63611 -69573 -74259 -83123 -104277 -134266 -161184 -169976 -145435 -87011 -24153 580 -27432
36559 -27432 -81617 -124994 -138487 -115417 -53073 31871 96680 105804 67170 20557 -3658 -942
36547 -942 19886 43648 50630 36242 26225 46100 75690 65942 10119 -35318 -22334 23674
36535 23674 40046 8058 -37610 -69147 -93274 -115136 -114660 -77413 -21296 28232 68127 100937
36523 100937 106666 60942 -23438 -97013 -118387 -86383 -31784 9688 21500 17876 27212 52851
36511 52851 60970 24087 -35397 -68569 -58721 -31466 -14136 -15388 -39258 -81637 -110547 -89744
36499 -89744 -30929 16181 35273 58391 92292 86057 11196 -75459 -103696 -87989 -91439 -119545
36487 -119545 -123620 -99126 -100124 -143064 -170044 -138937 -90135 -82629 -108306 -113476 -75013 -15591
36475 -15591 33209 47646 13484 -52666 -98995 -89318 -48497 -30306 -52162 -87842 -111103 -116638
36463 -116638 -106724 -85267 -60520 -33550 5018 46914 53896 3771 -66722 -100957 -95368 -96634
36451 -96634 -130094 -168260 -173652 -141178 -93594 -60924 -63795 -89646 -88964 -27355 60605 103818
36439 103818 79134 25833 -21342 -65149 -105201 -118235 -100870 -85546 -86812 -74173 -28522 16130
36427 16130 23825 11142 8058 -669 -43910 -99677 -118530 -98593 -83283 -88592 -83411 -45451 7724
36414 7724 49296 65967 47125 -7478 -62759 -72746 -41517 -21022 -36074 -52913 -40364 -19395
36402 -19395 -22588 -40771 -47473 -50357 -76388 -119419 -143704 -138512 -133798 -152628 -174702 -164302 -121977
36389 -121977 -89755 -101242 -137206 -145383 -106598 -62197 -59093 -84534 -86733 -54129 -34301 -63823
36377 -63823 -115998 -140590 -128352 -109902 -108411 -118408 -121960 -109391 -92849 -104638 -160227 -216182
36365 -216182 -199858 -101379 -42 31114 10880 -753 -2513 -39730 -109916 -149351 -120562
36354 -120562 -56229 -2192 32990 54295 54521 38472 33823 50087 58735 39105 11803 -697
36342 -697 -13237 -42799 -63199 -38519 14716 42530 25121 -5117 -16581 -12957 -9204 -7291 -10993
36329 -10993 -38919 -99599 -163452 -180125 -129689 -51330 -13439 -46898 -107318 -115144 -40498 62608
36317 62608 116660 103197 68821 58135 65486 57921 25232 -9265 -21842 -16996 -17031 -30335 -42283
36304 -42283 -40222 -34047 -40477 -58312 -77424 -102595 -141135 -169923 -150283 -86138 -33588 -32245
36292 -32245 -55496 -54372 -26275 -9157 -25021 -61240 -96047 -112327 -96676 -56350 -29292 -45218
36280 -45218 -81436 -88390 -55007 -16998 -4055 -13355 -33862 -58480 -67936 -41759 4399 28621
36268 28621 22237 23712 57749 96252 99911 65387 9513 -58466 -120821 -141321 -108586 -65302
36256 -65302 -57308 -74633 -81308 -81595 -106638 -146137 -149020 -98374 -36292 583 24570 52201 57870
36243 57870 11806 -59097 -90836 -58231 450 34851 30936 4237 -27985 -53652 -63115 -57270
36231 -57270 -50511 -52432 -53516 -41767 -25452 -21242 -24421 -14335 8126 15381 -2395 -14416 6246
36218 6246 37508 39962 18968 14362 31006 24926 -28028 -90376 -114703 -104684 -92712 -82031
36206 -82031 -52310 -12617 -5602 -49505 -105604 -120082 -84011 -38653 -27278 -50565 -70198 -54508
36194 -54508 -15984 4042 -14725 -52965 -85844 -112586 -136583 -137934 -95268 -28055 11112 -8560
36182 -8560 -65136 -109991 -112889 -83276 -58506 -66968 -93950 -96281 -64472 -49185 -95863 -169634
36170 -169634 -190486 -142920 -101482 -129567 -196480 -227001 -201257 -164570 -154805 -162241 -160137 -138803
36158 -138803 -100416 -47831 6292 36916 30086 2299 -14199 -1362 35060 77110 103932 94225
36146 94225 37048 -50695 -126625 -155738 -141551 -117391 -108112 -109859 -106923 -94239 -77382 -63285
36134 -63285 -59760 -71423 -84578 -70132 -19431 33810 49518 31775 17476 18426 8070 -25852
36122 -25852 -49169 -25366 29317 62479 47935 6676 -31252 -61495 -95703 -134634 -163396 -168301
36110 -168301 -150689 -124505 -102962 -87332 -68734 -42104 -17313 -12256 -31463 -53855 -49979 -16605
36098 -16605 13767 10670 -11700 -10714 21346 36169 -9367 -91273 -145099 -141708 -105111 -62796
36086 -62796 -17572 25410 42488 23524 -4610 -8844 9754 21733 2624 -50257 -118962 -171800
36074 -171800 -185188 -169706 -158008 -158597 -145148 -104694 -67785 -66720 -88384 -98516 -92774 -88563
36062 -88563 -80679 -45977 10551 52770 62098 57515 58755 57942 39830 7204 -27420 -59010 -88430
36049 -88430 -116963 -148537 -182993 -203344 -188330 -145223 -111335 -111086 -126802 -124945 -98444 -68863
36037 -68863 -56169 -61245 -73010 -78736 -68287 -40328 -9040 1215 -24599 -74222 -111850 -107827
36025 -107827 -68832 -32699 -28791 -50872 -73926 -85259 -87132 -80164 -61496 -33903 -2847 27468
36013 27468 41346 10478 -69351 -151724 -180839 -154791 -117866 -96742 -82786 -74137 -85250 -103554
36001 -103554 -88587 -38884 -11035 -36850 -66759 -43078 8533 20626 -8303 -16768 16048 41299
35989 41299 28203 13979 33955 55746 29356 -32382 -74513 -83382 -98219 -139183 -169377 -146631
35977 -146631 -83041 -26467 3721 33758 85044 132059 132909 92503 64767 82601 114705 116926
35965 116926 102503 119007 163443 172863 116034 47819 36939 70853 75607 14056 -79213 -154796
35953 -154796 -195941 -203925 -178615 -133422 -100125 -96428 -107287 -113838 -118923 -125861 -116653 -79207 -37644
35940 -37644 -22619 -24159 -11292 7957 -9433 -70494 -123649 -128216 -108402 -106511 -112758 -83669
35928 -83669 -14958 46562 60617 26630 -39015 -119490 -185304 -205356 -187200 -174839 -188881 -199303
35916 -199303 -177945 -145394 -135436 -140739 -132231 -114021 -117719 -151590 -194801 -235910 -275453 -292808
35904 -292808 -258530 -189693 -146768 -154395 -164256 -122955 -43088 22759 47779 35446 -13329 -90543
35892 -90543 -152846 -153794 -108137 -82062 -107877 -142996 -130524 -73202 -25729 -30427 -80013 -134675
35880 -134675 -160508 -155133 -144398 -151217 -167168 -164606 -136518 -106501 -92154 -78327 -44518 -6674
35868 -6674 -8598 -70249 -160053 -223969 -234058 -206152 -178692 -179976 -209388 -240495 -242079 -205662
35856 -205662 -158499 -142023 -166498 -191559 -168200 -101640 -53024 -69620 -132550 -188821 -215531
35845 -215531 -227576 -235755 -230440 -206524 -176199 -151110 -131898 -117221 -103455 -77977 -37331 -8969
35833 -8969 -24031 -68554 -97431 -99566 -105596 -120839 -103751 -39935 12220 -4333 -61354 -86465
35821 -86465 -63513 -38664 -42118 -58977 -73906 -92798 -114311 -122930 -118179 -115388 -113888 -99526 -80415
35808 -80415 -82950 -109621 -137712 -159608 -181533 -182320 -127363 -35863 20924 12219 -11340 2005
35796 2005 32007 30613 -2484 -31403 -38728 -27023 4579 41333 37155 -32599 -119456 -150223
35784 -150223 -116482 -73262 -60238 -70923 -94014 -134444 -184749 -216392 -214508 -194661 -175983 -159252
35772 -159252 -136532 -104717 -69301 -48154 -60978 -97394 -114502 -93340 -75473 -104483 -152062
35761 -152062 -155441 -118020 -109796 -159443 -206299 -183510 -100715 -16414 31106 35875 4631 -38652
35749 -38652 -53770 -24484 16256 25654 882 -30758 -54139 -74915 -96868 -111310 -104896 -69272
35737 -69272 -12018 39567 61949 63576 67791 69624 42988 -5827 -34211 -26992 -20377 -39770 -58509
35724 -58509 -50762 -42002 -63635 -95024 -102641 -107118 -151048 -217290 -243465 -215705 -187431 -195414 -211938
35711 -211938 -199619 -167353 -144964 -136985 -130469 -124850 -126946 -131394 -128883 -124528 -129548 -139935 -137756
35698 -137756 -112632 -73885 -41720 -29929 -37125 -54281 -77714 -107311 -133573 -141938 -135220 -134397
35686 -134397 -148197 -161295 -163318 -163200 -157010 -115472 -38535 7446 -41172 -151144 -219745 -195803
35674 -195803 -124805 -71054 -48432 -42474 -48089 -56114 -42619 -4457 23686 17069 140 9276
35662 9276 39076 55619 45143 20451 -6870 -32894 -50650 -57534 -65038 -81703 -97999 -106732
35650 -106732 -122321 -156005 -187077 -187099 -161617 -138029 -120097 -86786 -33841 15580 44879 59754
35638 59754 64856 52776 25181 -1118 -20777 -47848 -82292 -93460 -60352 -10697 8226 -10336
35626 -10336 -28979 -20828 -613 4729 -8854 -30185 -54590 -78134 -84740 -63273 -31090 -16860
35614 -16860 -22102 -23415 -12226 -4249 -4855 2614 20848 24737 6797 3849 43235 88039 80573
35601 80573 26684 -10626 1590 31489 38927 22569 125 -17264 -15597 19385 70677 93060
35589 93060 67247 24609 4495 16241 52623 101088 126286 88427 6164 -44274 -26702 3872
35577 3872 -10888 -42094 -28801 17616 37754 27674 36769 69224 71280 30226 8320 46998
35565 46998 101950 114377 94676 87397 92209 74132 32330 6855 18080 38431 33474 7595
35553 7595 -3624 20658 55672 52617 -2336 -59977 -59038 -2391 43617 30050 -22281 -61851
35541 -61851 -70047 -67704 -79266 -109503 -140313 -136507 -73981 20473 76563 49847 -28942 -92233
35529 -92233 -108007 -92294 -65234 -27207 21279 62897 78059 65598 43137 30666 32562 32040
35517 32040 7550 -41528 -91369 -119135 -124517 -122792 -125019 -128167 -116754 -75087 -10011 41583
35505 41583 46789 18197 -357 9604 25391 26914 22624 20331 7706 -18090 -34419 -31761 -37169
35492 -37169 -70746 -109992 -131708 -157753 -214499 -271919 -275663 -225543 -168489 -121434 -60162 10052
35480 10052 32143 -30102 -138035 -220854 -242858 -212127 -155255 -105872 -92283 -112327 -134591
35469 -134591 -136816 -125961 -113600 -97097 -77887 -73513 -94355 -126716 -152034 -165517 -167471 -157803
35457 -157803 -147351 -150011 -155362 -138471 -107697 -107247 -152007 -194380 -184286 -133618 -90193 -73209
35445 -73209 -69457 -73276 -91499 -117838 -133841 -129369 -101349 -49191 2898 1777 -78064 -186859
35433 -186859 -246200 -233869 -186941 -135870 -83735 -44371 -43671 -69596 -69919 -23221 25566 26364 -9330
35420 -9330 -30614 -14831 14030 22221 -603 -38749 -65427 -63081 -36019 -491 33847 61805
35408 61805 70966 55668 39975 58440 109654 155527 171410 167386 153116 116898 56229 -2779
35396 -2779 -37948 -56219 -66965 -60753 -40337 -41744 -88076 -143445 -151112 -104855 -48045 -13959
35384 -13959 -3945 -16340 -55155 -106353 -141161 -152390 -160454 -176023 -182765 -166333 -136377 -107307
35372 -107307 -76945 -38341 1639 29794 44164 52499 57174 50589 27316 -1736 -13103 2731
35360 2731 20943 5679 -40337 -69702 -47617 4286 40111 45560 36310 19676 -7599 -34788
35348 -34788 -47603 -57739 -84494 -110183 -96608 -50406 -26744 -52436 -86191 -77979 -33187 8895
35336 8895 30908 41424 45609 43642 44896 56224 64573 52302 20870 -17342 -57362 -92860 -103444
35323 -103444 -74161 -20259 25613 42708 25776 -22723 -82043 -111580 -90086 -49249 -39923 -67887
35311 -67887 -88910 -66206 -7787 53581 92316 98021 75557 46436 33655 37831 40523 32670
35299 32670 23583 19212 10675 -7538 -24379 -28991 -29182 -39923 -58800 -65248 -45589 -10879 16077
35286 16077 28825 41409 57823 50763 -6840 -92895 -149181 -152005 -137917 -140717 -137962 -94682
35274 -94682 -31301 1225 -103 9576 45571 71415 66186 61384 85497 115434 113490 75687 12643
35261 12643 -77297 -173499 -210199 -149798 -59525 -47115 -120057 -175549 -145178 -81580 -63950 -77880
35249 -77880 -52628 16825 60771 44948 19461 35018 66320 59012 15974 -12526 -8745 -7802
35237 -7802 -34360 -60709 -47511 -1384 30516 12923 -46118 -109484 -143372 -138092 -107790 -74396
35225 -74396 -51713 -42845 -44479 -46110 -32636 -901 30393 40601 31378 14869 -13159 -61127
35213 -61127 -105555 -102739 -47614 9799 23244 -1071 -31223 -55506 -77163 -89199 -84887 -75599
35201 -75599 -71089 -60679 -41877 -44742 -89559 -137165 -126269 -54320 21405 62105 84247 113387
35189 113387 142775 151578 131927 85697 23638 -22538 -19854 18071 31423 -17972 -100598 -157460
35177 -157460 -163218 -133230 -87281 -31390 28818 73749 75457 22188 -58210 -111800 -112741 -93839
35165 -93839 -100735 -127637 -131034 -99380 -67585 -59849 -61305 -57522 -60194 -74843 -80581 -65879 -54243
35152 -54243 -71214 -111099 -154114 -188343 -198192 -165400 -105052 -67648 -77940 -102176 -104005 -98936
35140 -98936 -116636 -140094 -129124 -86441 -54043 -51515 -59058 -59601 -60833 -71561 -85367 -93913 -96140
35127 -96140 -90763 -75220 -54467 -41440 -49278 -84802 -140218 -190657 -215479 -221793 -226828 -222252 -188262
35114 -188262 -139351 -111488 -101749 -75950 -45607 -68078 -143591 -187391 -150550 -94708 -84554 -79187
35102 -79187 -14580 69629 91848 74881 113013 208666 258496 208712 117357 43986 -21661 -91070
35090 -91070 -129174 -115547 -79079 -38118 22430 86260 98017 57439 40693 82570 116973 89057
35078 89057 47597 56556 84757 65515 12597 -8745 11521 32478 43835 62985 72835 44425
35066 44425 10374 34973 108844 147550 108666 47291 34907 73902 115345 122110 90853 37936
35054 37936 -16205 -60291 -96256 -124914 -138641 -139540 -144393 -153811 -143980 -114853 -111813 -158158 -197769
35041 -197769 -159944 -61690 11781 15780 -22642 -71629 -126450 -172701 -184147 -171741 -176516 -197074
35029 -197074 -181814 -115231 -54483 -48670 -73817 -86497 -95508 -132386 -185046 -212744 -207201 -190268
35017 -190268 -161936 -99175 -9525 55610 58249 21118 -120 17515 40775 23417 -35471 -87350
35005 -87350 -91206 -61205 -44186 -60925 -91201 -111537 -121994 -133645 -152305 -177567 -197047 -183350
34993 -183350 -124947 -60773 -48745 -89876 -118955 -87786 -24854 9917 -764 -29860 -51193
34982 -51193 -53772 -31305 6998 26485 811 -49414 -77901 -66287 -32801 1816 27161 29744
34970 29744 2156 -32690 -39033 -16330 -48 -6050 -5560 27923 74904 97759 92646 84663 81048
34957 81048 59930 9090 -48168 -77956 -74303 -61354 -62461 -77067 -89626 -95610 -110768 -148696
34945 -148696 -192997 -206069 -173597 -128013 -111904 -125630 -132776 -115925 -98479 -99100 -91862 -40112
34933 -40112 41887 92113 69355 -1499 -58201 -61103 -20873 20726 32247 21190 22151 54258
34921 54258 100199 134003 151043 153715 129994 77027 27712 13367 12266 -17653 -63738 -74027
34909 -74027 -46601 -33877 -44241 -19043 55499 92900 25106 -87947 -142625 -133605 -127065 -134268
34897 -134268 -112985 -75716 -89619 -160835 -215650 -219095 -224240 -269877 -309000 -285393 -217660 -158077
34885 -158077 -117668 -77315 -31473 18945 78433 127739 125424 72799 30884 33251 30712 -28625
34873 -28625 -110319 -143404 -122646 -97959 -89620 -80997 -78811 -111233 -166017 -190121 -160041 -107130
34861 -107130 -66205 -38661 -12966 12130 30265 28656 -7218 -63529 -88212 -48467 16377 43358
34849 43358 33229 35222 52338 28816 -54541 -135590 -151345 -114202 -73615 -43246 -7809 26487
34837 26487 33967 11937 -13791 -23696 -20989 -15398 -9849 -4093 1445 8581 25785 71932 170415
34824 170415 323762 492347 617135 672697 683137 677051 643859 551791 401089 241780 133875
34813 133875 93670 81658 46583 -17530 -66567 -64069 -29852 -14236 -34082 -58549 -56570 -34502
34801 -34502 -21861 -37718 -74880 -102752 -88102 -32219 16107 9342 -38555 -69877 -61691 -49193
34789 -49193 -60519 -70925 -49886 -19509 -25268 -65741 -92233 -74723 -33802 -3845 6440 8457
34777 8457 12504 24714 48712 76710 89527 78717 62032 62662 74575 64097 13300 -50055
34765 -50055 -80529 -68426 -47039 -43903 -45885 -26228 11686 39943 45781 41181 36509 29983 25136
34752 25136 33247 50978 58757 52386 54391 78380 101494 94365 66494 56104 75713 91332 66970
$$ [...]
##END NTUPLES=NMR SPECTRUM
##END=
