##TITLE=31P_DE-80H_X3
 64 sc D2O
 26.2.2025
##JCAMPDX= 6.0         $$ Bruker NMR JCAMP-DX V2.0
##DATA TYPE= NMR FID
##DATA CLASS= NTUPLES
##ORIGIN= UXNMR, Bruker Analytische Messtechnik GmbH
##OWNER= root
$$ XWIN-NMR		Version 3.5
$$ Fri Apr 25 11:07:19 2025 Russian Standard Time (UT+4h)  Yarkov@DPX200
##.OBSERVE FREQUENCY= 81.013821
##.OBSERVE NUCLEUS= ^31P
##.DELAY= (6, 6)
##.ACQUISITION MODE= SIMULTANEOUS
##.ACQUISITION SCHEME= undefined
##.AVERAGES= 64
##.DIGITISER RES= 17
##SPECTROMETER/DATA SYSTEM= spect
##.PULSE SEQUENCE= zgpg30
##.SOLVENT NAME= DMSO
##.SHIFT REFERENCE= (INTERNAL, DMSO, 0, 243.863)
##AUDIT TRAIL= $$ (NUMBER, WHEN, WHO, WHERE, WHAT)
$$ ##TITLE= Audit trail, XWIN-NMR		Version 3.5
$$ ##JCAMPDX= 5.01
$$ ##ORIGIN= Bruker BioSpin GmbH
$$ ##OWNER= Yarkov
$$ C:/Bruker/XWIN-NMR/data/yarkov2/nmr/P31/2/audita.txt
$$ ##AUDIT TRAIL=  $$ (NUMBER, WHEN, WHO, WHERE, WHAT)
(   1,<2025-04-25 11:06:21.54 +0400>,<Yarkov>,<DPX200>,
      <created by zg, POWCHK disabled, PULCHK disabled
       configuration hash MD5:
       00 E9 B6 7A A2 85 ED C7 34 08 36 98 17 FE 4E 26
       data hash MD5: 32K
       DB 3C D9 87 5C 15 6D 87 2B AE B1 A7 37 50 E2 25>)
$$ ##END=
$$ 
$$ hash MD5
$$ 11 5C C2 B7 9D FC B7 B5 7A 7D 2D 5C 83 EF 99 2F
##$RELAX= 
##$RELAX= 
##$RELAX= 
##$RELAX= 
##$RELAX= 
##$RELAX= 
##$RELAX= 
##$RELAX= 
$$ Bruker specific parameters
$$ --------------------------
##$DU= <C:/Bruker/XWIN-NMR>
##$EXPNO= 2
##$NAME= <P31>
##$PROCNO= 1
##$TYPE= <nmr>
##$USER= <yarkov2>
##$AMP= (0..31)
100 100 100 100 100 100 100 100 100 100 100 100 100 100 100 100 100 100 
100 100 100 100 100 100 100 100 100 100 100 100 100 100 
##$AQSEQ= 0
##$AQ_mod= 1
##$AUNM= <au_zg>
##$AUTOPOS= <>
##$BF1= 81.014009
##$BF2= 200.13
##$BF3= 200.13
##$BF4= 200.13
##$BF5= 200.13
##$BF6= 200.13
##$BF7= 200.13
##$BF8= 200.13
##$BYTORDA= 1
##$CFDGTYP= 0
##$CFRGTYP= 5
##$CHEMSTR= <none>
##$CNST= (0..31)
1 1 145 1 1 1 1 1 1 1 1 1 1 1 1 1 1 1 1 1 1 1 1 1 1 1 1 1 1 1 1 1 
##$CPDPRG= <waltz16>
##$CPDPRG1= <>
##$CPDPRG2= <waltz16>
##$CPDPRG3= <>
##$CPDPRG4= <mlev>
##$CPDPRG5= <mlev>
##$CPDPRG6= <mlev>
##$CPDPRG7= <mlev>
##$CPDPRG8= <mlev>
##$CPDPRGB= <>
##$CPDPRGT= <>
##$D= (0..31)
0 1 0 0 0 0 0 0 0 0.06 0 0.03 2e-05 3e-06 0 0 0.0002 0 0 0 0 0 0 0 0 0 
0 0 0 0 0 0 
##$DATE= 1745564780
##$DBL= (0..7)
120 120 120 11 120 120 24 19 
##$DBP= (0..7)
150 150 150 150 150 150 150 150 
##$DBP07= 0
##$DBPNAM0= <>
##$DBPNAM1= <>
##$DBPNAM2= <>
##$DBPNAM3= <>
##$DBPNAM4= <>
##$DBPNAM5= <>
##$DBPNAM6= <>
##$DBPNAM7= <>
##$DBPOAL= (0..7)
0.5 0.5 0.5 0.5 0.5 0.5 0.5 0.5 
##$DBPOFFS= (0..7)
0 0 0 0 0 0 0 0 
##$DE= 6
##$DECBNUC= <off>
##$DECIM= 4
##$DECNUC= <off>
##$DECSTAT= 4
##$DIGMOD= 1
##$DIGTYP= 9
##$DL= (0..7)
0 0 52 120 120 21 21 25 
##$DP= (0..7)
150 150 150 150 150 150 150 150 
##$DP07= 0
##$DPNAME0= <>
##$DPNAME1= <>
##$DPNAME2= <>
##$DPNAME3= <>
##$DPNAME4= <>
##$DPNAME5= <>
##$DPNAME6= <>
##$DPNAME7= <>
##$DPOAL= (0..7)
0.5 0.5 0.5 0.5 0.5 0.5 0.5 0.5 
##$DPOFFS= (0..7)
0 0 0 0 0 0 0 0 
$$ [...]
##$SUBNAM1= <"">
##$SUBNAM2= <"">
##$SUBNAM3= <"">
##$SUBNAM4= <"">
##$SUBNAM5= <"">
##$SUBNAM6= <"">
##$SUBNAM7= <"">
##$SUBNAM8= <"">
##$SUBNAM9= <"">
##$SW= 400.765351723535
##$SWIBOX= (0..15)
0 1 3 0 0 0 0 0 0 0 0 0 0 0 0 0 
##$SW_h= 32467.5324675325
##$TD= 32768
##$TD0= 1
##$TE= 0
##$TE2= 300
##$TE3= 300
##$TEG= 300
##$TL= (0..7)
0 120 53 12 22 120 120 120 
##$TP= (0..7)
150 150 150 150 150 150 150 150 
##$TP07= 0
##$TPNAME0= <>
##$TPNAME1= <>
##$TPNAME2= <>
##$TPNAME3= <>
##$TPNAME4= <>
##$TPNAME5= <>
##$TPNAME6= <>
##$TPNAME7= <>
##$TPOAL= (0..7)
0.5 0.5 0.5 0.5 0.5 0.5 0.5 0.5 
##$TPOFFS= (0..7)
0 0 0 0 0 0 0 0 
##$TUNHIN= 0
##$TUNHOUT= 0
##$TUNXOUT= 0
##$USERA1= <user>
##$USERA2= <user>
##$USERA3= <user>
##$USERA4= <user>
##$USERA5= <user>
##$V9= 5
##$VALIST= <valist>
##$VCLIST= <CCCCCCCCCCCCCCC>
##$VD= 0
##$VDLIST= <DDDDDDDDDDDDDDD>
##$VPLIST= <PPPPPPPPPPPPPPP>
##$VTLIST= <TTTTTTTTTTTTTTT>
##$WBST= 1024
##$WBSW= 4
##$XGAIN= (0..3)
0 0 0 0 
##$XL= 0
##$YL= 0
##$YMAX_a= 11481
##$YMIN_a= -11696
##$ZGOPTNS= <>
##$ZL1= 120
##$ZL2= 120
##$ZL3= 120
##$ZL4= 120
##$ABSF1= 60
##$ABSF2= -190
##$ABSG= 5
##$ABSL= 3
##$ALPHA= 0
##$AQORDER= 0
##$ASSFAC= 0
##$ASSFACI= 0
##$ASSFACX= 0
##$ASSWID= 0
##$AUNMP= <proc_1d>
##$AZFE= 0.1
##$AZFW= 0.5
##$BCFW= 1
##$BC_mod= 2
##$BYTORDP= 1
##$COROFFS= 0
##$CY= 9.86611175537109
##$DATMOD= 1
##$DC= 1
##$DFILT= <>
##$DTYPP= 0
##$F1P= 182.462994727601
##$F2P= 168.069089081705
##$FCOR= 0.5
##$FTSIZE= 0
##$FT_mod= 0
##$GAMMA= 1
##$GB= 0
##$INTBC= 1
##$INTSCL= 1
##$ISEN= 30
##$LB= 1.5
##$LEV0= 0
##$LPBIN= 0
##$MAXI= 11.51145
##$MC2= 0
##$MEAN= 0
##$ME_mod= 0
##$MI= 1.244541
##$NCOEF= 0
##$NC_proc= 0
##$NLEV= 6
##$NOISF1= 0
##$NOISF2= 0
##$NSP= 1
##$NTH_PI= 0
##$NZP= 1
##$OFFSET= 243.8632
##$PC= 1.4
##$PHC0= 1788.236
##$PHC1= -6.504568
##$PH_mod= 0
##$PKNL= yes
##$PPARMOD= 0
##$PSCAL= 0
##$PSIGN= 0
##$REVERSE= no
##$SF= 81.0140731611343
##$SI= 65536
##$SIGF1= 0
##$SIGF2= 0
##$SINO= 80
##$SIOLD= 65536
##$SREGLST= <31P.CDCl3>
##$SSB= 0
##$STSI= 0
##$STSR= 0
##$SW_p= 25641.0256410257
##$SYMM= 0
##$S_DEV= 0
##$TDeff= 0
##$TDoff= 0
##$TI= <>
##$TILT= no
##$TM1= 0
##$TM2= 0
##$TOPLEV= 0
##$USERP1= <user>
##$USERP2= <user>
##$USERP3= <user>
##$USERP4= <user>
##$USERP5= <user>
##$WDW= 1
##$XDIM= 64
##$YMAX_p= 0
##$YMIN_p= 0
$$ End of Bruker specific parameters
$$ ---------------------------------
##NTUPLES= NMR FID
##VAR_NAME=  TIME,          FID/REAL,        FID/IMAG
##SYMBOL=    X,             R,               I
##VAR_TYPE=  INDEPENDENT,   DEPENDENT,       DEPENDENT
##VAR_FORM=  AFFN,          ASDF,            ASDF
##VAR_DIM=   16384,         16384,           16384
##UNITS=     SECONDS,       ARBITRARY UNITS, ARBITRARY UNITS
##FACTOR=    3.08e-05,      1,               1
##FIRST=     0,             0,               0
##LAST=      0.5045964,     0,               0
##MIN=       0,             -11696,          0
##MAX=       0.5045964,     11481,           0
$$ Real data points
##PAGE= N=1
##DATA TABLE= (X++(R..R)), XYDATA
$$ [...]
$$ plain form
11376 1553 82 93 876 11 118 902 786 -14 -93 955 -970 341 -834 1345 1229 -99 1121
11393 1121 -701 -201 291 -464 -112 204 1326 -585 -196 -1854 464 236 7 507 -362 1924 -1105
11410 -1105 -37 -435 -683 776 633 213 356 468 -1002 -386 188 1021 -186 54 -512 566 -102 789
11428 789 -99 208 -703 -191 647 -997 80 -91 -911 323 327 1575 601 430 -456 -276 730 -590
11446 -590 2310 382 508 -248 -867 -655 -18 448 -230 -1291 22 219 2158 -733 2585 -441 876
11463 876 -701 -1599 701 -365 1140 -771 -597 357 162 1026 226 78 259 -232 -1199 79 1009 -798
11481 -798 437 -1600 925 -220 -549 1039 -91 -297 1319 -668 -790 -221 -221 -723 -682 1648 214
11498 214 218 -278 1159 187 -356 -1976 1000 1166 24 -463 -801 -137 8 453 -141 -662 -1107 490 1142
$$ packed form
11376A553j471J1P83q65J07P84j16q00p9J048j925J311j175K179j16j328J220
11393A121j822N00M92p55L52L16J122j911L89j658K318k28k29N00q69K286l029
11410a105J068l98k48J459j43m20J43J12j470O16N74Q33j207K40n66J078o68Q91
11428G89q88L07r11N12Q38j644J077j71q20J234MJ248r74j71q86J80J006j320
11446e90K900j928J26p56o19K12O37M66o78j061J313J97J939k891L318l026J317
11463H76j577q98K300j066J505j911J74R54j95Q64q00j48J81m91r67J278R30j807
11481g98J235k037K525j145l29J588j130k06J616j987j22N69%n02M1K330j434
11498B14Mm96J437r72n43j620K976J66j142m87l38O64J45M45n94n21m45J597O52
$$ plain form
11517 1142 -202 -382 -1260 401 -786 65 -175 240 -1256 783 -1334 -1048 -1824 -314 1217 397 -320
11534 -320 -900 1231 -960 -165 197 -1493 749 -388 -302 -767 1021 1411 -610 253 378 -338 -876 487
11552 487 -898 -1607 -276 -373 -66 600 1656 -411 41 619 -524 -1317 264 -179 324 -955 438
11569 438 -2271 91 -342 -114 -435 -264 199 -226 619 190 -322 378 910 241 -413 698 659 -1603 -799
11588 -799 77 -290 -183 -608 559 897 12 -1400 480 -277 109 -322 -1018 1160 1716 592 -207 85
11606 85 870 -164 908 -987 -256 1650 -1261 1008 -162 -595 288 -617 221 -754 1479 -1317 -107
11623 -107 -976 -797 -684 147 379 -1181 -740 174 230 -179 306 -238 -691 763 373 -426 455 448 -391 -585
11643 -585 923 -486 -218 -328 -1443 739 -1452 -26 375 196 -120 1247 1016 -876 808 639 -452
$$ packed form
11517A142j344j80q78J661j187Q51k40M15j496K039k117K86p76J510J531q20p17
11534c20n80K131k191P95L62j690K242j137Q6m65J788L90k021Q63J25p16n38J363
11552D87j385p09J331r7L07O66J056k067M52N78j143p93J581m43N03j279J393
11569D38k709K362m33K28l21J71M63m25Q45m29n12P00N32o69o54J111l9k262Q04
11588g99Q76l67J07m25J167L38q85j412J880p57L86m31o96K178N56j124p99K92
11606H5P85j034J072j895P31J906k911K269j170m33Q83r05Q38r75K233k796J210
11623a07q69J79J13Q31K32j560M41R14N6m09M85n44m53J454l90p99Q81pq39j94
11643e85J508j409K68j10j115K182k191J426M01j79l16J367k31j892J684j69j091
$$ plain form
11660 -452 112 644 1958 -1793 113 -566 1244 -274 42 186 -442 808 138 -1045 386 273 349
11677 349 1115 -532 -386 792 -871 -970 63 687 -1242 -111 -149 -766 -1165 -7 557 1024 286 -199
11695 -199 -736 -459 197 751 -586 366 -1187 857 104 -277 -20 -607 2243 179 223 18 301 578
11713 578 -697 591 1214 -237 -77 -177 -655 -927 1026 -77 230 282 -4 -115 -793 -27 334 570
11731 570 -751 313 -93 -272 -196 -107 -1011 -451 269 755 -1095 -278 -1232 -230 -877 -703 617 -864
11749 -864 992 -262 -47 1800 960 683 -605 1078 -602 1271 -202 1388 1821 -1126 269 -249
11765 -249 565 -615 398 271 -532 199 -302 -35 -537 -1886 -601 248 151 -289 989 784 562 322
11783 322 1295 514 625 176 1000 590 1289 -231 1331 804 -492 316 38 1250 -1649 -27 -525 26
$$ packed form
11660d52N64N32J314l751J906o79J810j518L16J44o28J250o70j183J431j13P6
11677C49P66j647J46J178j663r9J033O24j929J131l8o17l99J158N64M67p38m85
11695a99n37K77O56N54j337R52j553K044p53l81K57n87K850k064M4k05K83K77
11713E78j275J288O23j451J60j00m78k72J953j103L07N2k86j11o78P66L61K36
11731E70j321J064m06j79P6Q9r04N60P20M86j850Q17r54J002o47J74J320j481
11749h64J856j254K15J847q40k77j288J683j680J873j473J590M33k947J395n18
11765b49Q14j180J013j27q03P31n01K67n02j349J285Q49r7m40J278k05k22k40
11783C22R73p81J11m49Q24m10O99j520J562n27j296Q08k78J212k899J622m98N51
$$ plain form
11801 26 -281 577 1331 -814 47 -875 -1261 1085 -521 -353 49 -390 1101 -76 444 -1104 1986 -1077
11819 -1077 999 -1492 -1096 266 -915 291 -575 -900 -217 246 -110 -1628 684 -575 348 -223 -1247
11836 -1247 567 -709 360 117 145 131 -160 76 391 -347 1302 638 56 -195 618 -1612 737 86
11854 86 776 -382 -281 -22 -890 166 857 -285 -778 838 -895 -707 365 519 -603 313 -226 391
11872 391 -612 -466 -478 84 31 -1468 81 -621 572 618 1430 842 429 573 911 -628 -786 326 967
11891 967 4 -500 -159 437 29 -31 -528 618 1325 -742 1043 -177 -191 966 377 540 367 -390 359
11910 359 -630 409 -608 -235 420 -1089 1080 -466 1486 -262 -822 1522 -903 -696 -1114 212
11926 212 -660 -648 -301 -769 893 -147 1241 -290 -622 720 623 997 -1867 337 497 399 -13 -1132
$$ packed form
11801B6l07Q58P54k145Q61r22l86K346j606J68M02m39J491j177N20j548L090l063
11819a077K076k491L96J362j181J206q66l25O83M63l56j518K312j259R23n71j024
11836a247J814j276J069k43K8j4k91K36L15p38J649o64n82k51Q13k230K349o51
11854H6O90j158J01K59q68J056O91j142m93J616j733J88J072J54j122R16n39O17
11872C91j003J46j2N62n3j499J549p02J193M6Q12n88m13J44L38j539j58J112O41
11891I67r63n04L41N96m08o0m97J146P07k067J785j220j4J157n89J63j73p57P49
11910C59r89J039j017L73O55j509K169j546J952j748n60K344k425K07m18J326
11926B12q72J2L47m68J662j040J388j531l32J342r7L74k864K204J60r8m12j119
$$ plain form
11944 -1132 -867 -9 543 -801 440 1320 418 791 -48 929 -1385 -202 -530 -109 294 -574 -1219 265
11962 265 -550 -994 -951 457 -786 -67 -1805 621 864 -325 -555 -1045 -322 -909 -491 548 -358 -22
11980 -22 -86 -636 -321 47 1499 -485 525 -1581 -1182 524 -98 675 -1032 79 -843 -1764 -160 -715
11998 -715 717 -448 728 142 560 310 -274 168 -1147 777 458 1077 1108 809 1245 -1717 -214 693
12016 693 -405 713 -516 -330 -568 216 -1159 483 -714 559 325 -138 -374 -606 -403 -180 518
12033 518 -479 457 449 371 -1169 1172 208 -190 -1298 388 555 -749 1143 -122 -17 638 874 -695
12051 -695 524 509 -197 357 -421 784 -31 -481 74 133 -219 390 212 118 -1076 443 117 -1301 1559
12070 1559 252 -11 -490 237 -877 -665 -69 -450 1916 58 679 -1108 -91 543 -1025 755 -1100
$$ packed form
11944a132K65Q58N52j344J241Q80r02L73q39R77k314J183l28M21M03q68o45J484
11962B65q15m44M3J408j243P19j738K426K43j189k30m90P23n87M18J039r06L36
11980b2o4n50L15L68J452j984J010k106L99J706o22P73j707J111r22r21J604n55
11998g15J432j165J176n86M18k50n84M42j315J924l19O19L1k99M36k962J503R07
12016F93j098J118j229J86k38P84j375J642j197J273k34m63k36k32K03K23O98
12033E18r97R36qp8j540K341r64l98j108J686J67j304J892j265J05O55K36j569
12051f95J219j5p06N54p78J205q15m50N55N9l52O09j78r4j194J519l26j418K860
12070A559j307k63m79P27j114K12N96l81K366j858O21j787J017O34j568J780j855
$$ plain form
12087 -1100 720 476 1584 235 623 -211 -273 332 -579 -92 659 -1300 25 -1169 1157 414 -1605
12104 -1605 88 -165 942 -204 -253 -227 1023 371 -244 449 827 103 -72 -1147 -255 -340 63 -785 15
12123 15 182 -371 -1416 -241 -306 -492 677 307 -327 -1009 866 -1049 1321 -675 -69 -43 405 171
12141 171 398 1356 -6 -336 268 217 312 551 -926 386 267 -1462 537 1079 -8 1403 -261 205
12159 205 97 717 -311 867 -12 290 884 -328 -214 -284 -295 1080 226 -426 638 -477 -1001 -921 -118
12178 -118 -344 410 -528 419 -973 521 942 -566 557 -563 1554 882 -236 -842 1157 808 240
12195 240 1181 67 -684 697 1082 407 -33 1139 -1764 319 -547 494 1267 -1295 -1419 722 -431
12212 -431 -480 1523 1121 -481 701 863 221 -319 650 524 -80 -479 -655 405 234 -75 116 1180
$$ packed form
12087a100J820k44J108j349L88q34o2O05r11M87P51j959J325j194K326p43k019
12104a605J693k53J107j146m9K6J250o52o15O93L78p24j75j075Q92q5M03q48Q00
12123A5J67n53j045J175o5j86J169l70o34o82J875j915K370j996O06K6M48k34
12141A71K27R58j362l30O04n1R5K39j477J312j19j729J999N42j087J411j664M66
12159B05j08O20j028J178q79L02N94j212J14p0j1J375q54o52J064j115n24Q0Q03
12178a18k26P54r38R47j392J494M21j508J123j120K117o72j118o06J999l49n68
12195B40R41j114p51J381L85o75m40J172k903K083q66J041P73k562j24K141j153
12212d31m9K003m02j602J182J62o42n40R69j26o04l99j76J060j71l09J91J064
$$ plain form
12230 1180 471 205 -699 1069 -1717 -209 1080 1387 -943 196 -237 166 -1115 -604 1050 510 307
12247 307 1539 -842 69 1088 -625 581 -404 1422 -352 1547 577 209 -323 -2454 -1224 -1054
12263 -1054 -231 -255 -247 -714 -880 791 -398 409 285 -759 -122 -328 930 -992 686 126 538 -410
12281 -410 -733 726 956 453 466 326 12 -258 677 462 -485 40 313 1208 -323 1474 -1127 62
12299 62 -92 391 -1104 -1304 1603 770 382 -477 -24 592 -402 354 -739 1301 -365 -194 843 -42
12317 -42 -551 -874 611 751 309 -352 -1048 1103 335 -270 -787 8 -506 990 -272 -87 713 609 -261
12336 -261 584 -326 365 -147 -163 623 -1201 522 -854 -719 570 -1218 -89 -1784 800 401 -2344
12353 -2344 -140 623 318 -1033 1297 -400 -251 2002 262 1273 -442 -109 581 -64 844 -385
$$ packed form
12230A180p09k66r04J768k786J508J289L07k330J139m33M03j281N11J654n40k03
12247C07J232k381R11J019j713J206r85J826j774J899r70l68n32k131J230J70
12263a054Q23k4Qm67j66J671j189Q07j24j044O37k06J258j922J678n60M12r48
12281d10l23J459K30n03J3j40l14k70R35k15r47N25K73Q95j531J797k601J189
12299F2j54M83j495k00K907q33l88q59M53O16r94P56j093K040j666J71J037q85
12317d2n09l23J485J40m42o61o96K151p68o05n17P95n14J496j262J85Q00j04q70
12336b61Q45r10O91n12j6P86j824J723j376J35J289j788J129j695K584l99k745
12353b344K204P63l05j351K330j697J49K253j740J011j715L33O90o45R08j229
$$ plain form
12369 -385 365 -475 536 987 -776 727 -925 874 -426 -358 -2104 -5 935 -209 988 -87
12385 -87 538 4 -324 1513 573 399 239 -1050 -809 22 433 -341 36 -1562 -967 563 -530 -459 355
12404 355 355 167 161 471 745 -749 -625 -602 36 -298 771 -1345 1308 -34 -880 305 880 269 -326
12423 -326 614 -178 -1086 -1952 -1590 -448 -977 545 -802 -1542 1715 -1455 268 -432 837 -979 -505
12440 -505 104 -826 220 -322 376 -656 131 -351 -235 214 -1428 1236 -102 -407 -393 -590 12 -452
12458 -452 -404 -807 487 1148 162 856 -1496 -401 630 -38 1244 -490 -420 -1208 164 -473 246 1361
12476 1361 245 1521 35 59 -682 -32 1178 -319 515 -35 995 964 -1188 109 223 675 -66
12493 -66 1252 -308 38 -229 -748 -165 -123 -110 54 -1455 351 879 -1606 -444 331 1104 661 238 290
$$ packed form
12369c85P50q40J011M51j763J503j652J799j300O8j746K099R40j144J197j075
12385h7O25n34l28J837r40j74j60j289K41Q31M11p74L77j598N95J530j093P1Q14
12404C55%j88oL10K74j494J24K3O38l34J069k116K653j342q46J185N75o11n95
12423c26R40p92r08q66L62J142n29J522j347p40L257l170J723p00J269j816M74
12440e05O09r30J046n42O98j032P87m82J16M49j642K664j338l05J4j97O02m64
12458d52M8m03J294O61r86O94k352J095J031o68J282j734P0p88J372o37P19J115
12476A361j116J276j486K4p41O50J210j497Q34n50J030l1k152J297J14M52p41
12493f6J318j560L46k67n19N83M2J3J64j509J806N28k485J162P75P73m43m23N2
$$ plain form
12512 290 -382 -631 -445 1190 1473 872 -590 -310 490 -875 582 342 1921 -2197 469 1263 -682
12529 -682 -150 567 -449 598 -878 450 -215 801 1080 -46 848 685 323 -592 329 -1398 -356
12546 -356 883 50 -108 -1108 1128 -361 334 -150 337 509 51 719 -893 277 -1435 1030 1692
12563 1692 -508 673 -1411 1247 2040 1641 -661 225 365 -365 -643 -750 -313 -182 138 665 229 1031
12581 1031 -270 -560 -51 1040 997 163 624 -261 -5 978 718 -237 -310 194 350 -551 -765 336 -401
12600 -401 1376 1505 389 878 119 -1289 105 -142 -1682 2119 -901 471 -725 1195 339 -716
12616 -716 645 -1189 -392 258 75 -551 -1289 -315 -600 665 410 1135 601 -1519 724 -1148 903
12633 903 380 810 -839 -243 1625 -591 1999 393 -1707 987 85 178 -1859 1290 -428 120 -270
$$ packed form
12512B90o72k49J86J635K83o01j462K80Q00j365J457k40J579m118K666P94j945
12529f82N32P17j016J047j476J328o65J016K79j126Q94j63l62r15R21j727J042
12546c56J239q33j58j000K236j489O95m84M87J72m58O68j612J170j712K465O62
12563A692k200J181k084K658P93l99k302Q86J40p30k78j07M37J31L20N27m36Q02
12581A031j301k90N09J091m3q34M61q85K56R83k60r55p3N04J56r01k14J101p37
12600d01J777J29j116M89p59j408J394k47j540L801l020J372j196J920q56j055
12616g16J361j834P97O50j83o26p38R74k85J265k55P25n34k120K243j872K051
12633I03n23M30j649N96J868k216K590j606k100K694r02R3k037L149j718N48l90
$$ plain form
12650 -270 -784 879 250 -1384 -937 973 701 250 -608 -277 144 1097 714 887 -686 -851 -303 635
12668 635 797 38 277 -1211 -1378 409 -13 -154 671 -152 -148 159 -360 -452 -481 175 -882 982 979 -671
12688 -671 532 142 -471 419 -546 48 1396 -607 531 -841 895 -440 -379 478 -862 -326 -1719
12705 -1719 -310 867 257 1993 -66 604 -1381 376 -399 -342 205 -1193 -332 1132 653 363 1306
12722 1306 -1107 -717 1533 -1815 -1172 847 -581 -245 471 693 -257 60 -1252 1569 1390 -909 376
12739 376 -787 198 -923 -1381 471 -1173 -279 -791 1240 218 867 -1287 -2238 -345 487 1961 -483
12756 -483 840 156 -561 -473 197 -570 -1232 -784 559 -921 -1301 564 -227 216 1048 560 1410 219
12774 219 -73 -494 -370 393 442 126 506 -104 285 393 236 356 -1165 391 1241 95 1321 -664
$$ packed form
12650b70n14J663o29j634M47J910k72m51q58L31M21R53l83J73j573j65N48R38
12668F35J62p59K39j488j67J787m22j41Q25q23ML07n19r2k9O56j057J864lj650
12688f71J203l90o13Q90r65N94J348k003J138j372J736j335O1Q57j340N36j393
12705a719J409J177o10J736k059O70j985J757p75N7N47j398Q61J464m79k90R43
12722A306k413L90K250l348O43K019j428L36P16K22r50L17j312K821j79k299J285
12739C76j163R85j121m58J852j644Q94n12K031j022O49k154r51J893Q32J474k444
12756d83J323o84p17Q8O70p67o62M48J343j480l80J865p91M43Q32m88Q50j191
12774B19k92m21J24P63M9l16L80o10L89J08j57J20j521J556Q50j146J226j985
$$ plain form
12792 -664 341 -53 -1531 -117 -187 1694 -882 1417 -1119 -624 899 -1920 -74 -1107 1248 -848
12808 -848 -33 723 -1241 112 -1554 -685 578 1317 -142 -77 1583 -1325 1131 -410 1216 577 -473
12825 -473 262 1766 1783 -1484 -217 -184 865 106 -1120 665 541 1851 1263 -1353 919 121 -355
12842 -355 -600 -761 -467 -1402 796 240 1319 -808 577 947 -185 -199 333 686 -1786 1324 982 -11
12860 -11 -1502 41 211 -811 548 -1532 -167 -806 -254 -1374 362 -175 1820 -954 -779 -617 569
12877 569 827 -880 283 -1313 210 414 372 96 -1106 1185 -623 -974 -629 -140 1126 -536 1427
12894 1427 -254 -70 -158 135 1294 -253 897 -1422 -608 470 -50 2177 -966 2271 576 372
12910 372 -902 317 1362 -62 1866 -743 858 302 826 1306 -597 442 -692 359 200 834
$$ packed form
12792f64J005l94j478J414p0J881k576K299k536M95J523k819J846j033K355k096
12808h48Q15P56j964J353j666Q69J263P39j459O5J660k908K456j541J626o39j050
12825d73P35J504J7l267J267L3J049p59j226J785j24J310n88k616K272p98m76
12842c55k45j61K94r35K198n56J079k127J385L70j132j4N32L53k472L110l42r93
12860a1j491J543J70j022J359k080J365o39N52j120J736n37J995k774J75J62J186
12877E69K58j707J163j596J523K04m2k76j202K291j808l51L45M89J266j662J963
12894A427j681J84q8K93J159j547J150k319Q14J078n20K227l143L237j695k04
12910C72j274J219J045j424J928k609J601n56N24M80j903J039j134J051j59O34
$$ plain form
12926 834 -58 -1335 265 -225 -1003 -213 220 -1265 -857 1070 -87 55 970 -192 454 218 -536 545
12944 545 -42 48 -1035 -434 1365 -118 -32 659 63 -1199 1300 -222 -332 729 -200 648 -473 -892
12962 -892 160 747 455 281 228 -701 107 809 -794 356 -1406 834 -697 -563 -1325 355 -630 -837
12980 -837 1281 -297 -82 132 452 180 -1302 592 -897 821 -1716 -742 1053 -534 -408 19 396
12997 396 -849 255 -887 -117 -472 546 1148 677 1137 482 355 1194 389 -398 220 -761 -1355 -367
13015 -367 -802 748 -267 159 497 -611 -141 -522 -567 1218 -522 -249 -593 -607 -410 480 1213 328 1006
13034 1006 -472 1359 -902 1195 118 -341 155 398 -225 -1150 -442 -643 2177 -263 -299 1239 75
13051 75 807 -1159 -358 -2309 455 -230 784 591 -811 -15 858 526 447 -1417 406 870 378 -740
$$ packed form
12926H34q92j277J600m90p78P90M33j485M08J927j157J42R15j162O46k36p54J081
12944E45n87R0j083O01J799j483Q6O91n96j262K499j522j10J061r29Q48j121m19
12962h92J052N87k92j74n3r29Q08P02j603J150j762K240j531J34p62J680r85k07
12980h37K118j578K15K14L20k72j482J894j489J718k537R74J795j587J26M27L77
12997C96j245J104j142P70l55J018O02m71M60o55j27Q39q05p87O18r81n94R88
13015c67m35J550j015M26L38j108M70l81m5J785j740K73l44j4J97Q90P33q85O78
13034A006j478J831k261K097j077m59M96K43o23r25P08k01K820k440l6J538j164
13051G5P32j966Q01j951K764o85J014j93j402P96Q73l32p9j864J823M64m92j118
$$ plain form
13069 -740 15 -147 -221 587 -594 638 -1136 823 -22 344 -1027 -1458 -282 -262 597 818 -1594 97
13087 97 169 -338 255 727 15 305 992 -1083 -1190 -1827 893 -442 606 1017 75 569 -1480 213
13105 213 179 124 -491 -100 1230 -11 270 -228 705 134 -2134 302 -1864 137 80 940 -982 -489
13123 -489 1879 1177 185 -141 2 600 1254 19 -273 -1157 172 -258 -5 -1226 -23 639 -37 -288
13141 -288 -300 289 526 83 -298 605 289 -863 -79 -94 594 -55 -306 565 -1606 753 -157 -247 -610 -534
13161 -534 1663 -849 -78 -93 697 1101 -282 -1094 17 2292 -809 689 -199 -875 1205 -123 1208
13178 1208 835 530 979 647 687 686 1280 -855 937 -472 -1211 -720 -1061 855 -1195 65 -470 -323
13196 -323 294 -1043 748 797 -290 839 256 -853 834 -698 -444 -413 1164 -197 -684 893 728
$$ packed form
13069g40P55j62p4Q08j181J232j774J959q45L66j371m31J176K0Q59K21k412J691
13087I7P2n07N93M72p12K90O87k075j07o37K720j335J048M11r42M94k049J693
13105B13l4n5o15L91J330j241K81m98R33n71k268K436k166K001n7Q60j922M93
13123d89K368p02r92l26J43N98O54j235k92q84J329m30K53j221J203O62o76k51
13141b88j2N89K37m43l81R03l16j152P84j5O88o49k51Q71k171K359r10r0l63P6
13161e34K197k512P71j5P90M04j383q12J111K275l101J498q88o76K080j328J331
13178A208l73l05M49l32M0jN94k135J792j409p39M91l41J916k050J260n35J47
13196c23O17j337J791M9j087J129n83j109J687j532K54L1J577j361m87J577j65
$$ plain form
13213 728 85 237 92 -458 267 -51 -662 1151 -1322 -710 -407 -1264 -543 917 358 -476 747 -262
13231 -262 -828 -270 850 680 -72 -848 396 -392 -775 -924 1368 433 1342 -424 1591 -558 -468 922
13249 922 -878 499 -342 -1130 823 -1250 593 -38 711 -162 -253 187 20 382 -522 475 -73 1571
13267 1571 316 110 -864 -899 538 -539 754 65 -502 -562 610 1794 -702 215 268 -575 -8 -589
13285 -589 493 -759 22 -587 -1588 -134 -456 293 -260 910 -769 -265 1222 331 776 -177 -525
13302 -525 454 -892 370 -478 355 386 734 -740 -1220 -1076 894 601 -473 844 388 -811 -783 401
13320 401 371 695 -570 -311 -104 36 -5 430 -301 857 538 -442 1259 -4 -677 1742 -973 -214
13338 -214 400 -480 1333 426 -545 -101 1182 -887 620 879 195 566 140 1069 535 711 133 826
$$ packed form
13213G28o43J52j45n50P25l18o11J813k473O12L03q57P21J460n59q34J223j009
13231b62n66N58J120j70p52p76J244p88l83j49K292r35R09j766K015k149R0J390
13249I22j800J377q41p88J953k073J843o31P49q73r1M40j67L62r04R97n48J644
13267A571j255k06r74l5J437j077J293o89n67o0J172J184k496R17N3q43N67n81
13285e89J082j252P81o09j001J454l22P49n53J170j679N04J487q91M45r53l48
13302e25R79j346J262q48Q33L1L48j474m80J44J970k93j074J317m56j199K8J184
13320D01l0L24j265K59K07J40m1M35p31J158l19r80J701j263o73K419k715P59
13338b14O14q80J813r07r71M44J283k069J507K59o84L71m26R29n34J76n78O93
$$ plain form
13356 826 -701 -1459 919 134 810 93 2012 -274 396 103 -1588 -89 -1426 113 1553 1028 979
13373 979 108 -791 -996 -57 124 -526 317 133 855 197 1059 -123 -238 66 -37 -491 -391 390 698
13392 698 246 1409 162 824 166 408 -409 -247 946 93 955 -397 1568 -58 171 782 -580
13409 -580 269 158 -208 -80 1221 -230 435 495 23 -803 -497 898 -189 203 -555 67 6 431 288
13428 288 -8 -111 -617 -196 733 723 715 283 628 -257 1573 188 1133 167 717 1902 -1857 1237 -770
13447 -770 -207 -1680 -857 255 -493 1170 -309 979 82 622 986 916 -469 -561 -169 166 909 761
13465 761 249 -994 -127 67 1495 -4 -831 196 116 43 480 556 -315 1823 -456 705 -677 212
13483 212 832 388 -431 -1986 331 -865 -195 382 -1126 165 -651 -1240 655 -623 -186 636 -170
$$ packed form
13356H26j527p58K378p85O76p17J919k286O70k93j691J499j337J539J440n25m9
13373I79q71q99k05R39J81o50Q43j84P22o58Q62j182j15L04j03m54J00P81L08
13392F98m52J163j247O62o58K42q17J62J193q53Q62j352J965j626K29O11j362
13409e80Q49j11l66J28J301j451O65O0m72q26L06J395j087L92p58O22o1M25j43
13428B88k96j03n06M21R29j0qm32L45q85J830j385R45r66N50J185l759L094k007
13447g70N63j473Q23J112p48J663j479J288q97N40L64p0j385r2L92L35P43j48
13465G61n12j243Q67J94J428j499q27J027q0p3M37P6q71K138k279J161j382Q89
13483B12O20m44q19j555K317j196O70N77j508J291q16n89J895j278M37Q22q06
$$ plain form
13500 -170 24 1262 -226 -1001 1098 -429 62 198 -728 1402 837 17 -1077 259 -1167 606 824
13517 824 -57 694 -1552 -149 368 -461 583 -1414 1331 -1525 302 -146 172 -347 -425 536 -569
13534 -569 1367 -821 -2185 397 -692 406 -1591 1139 239 715 21 -1948 211 -2269 858 -1692
13550 -1692 -1854 294 117 1512 -1994 590 -1476 -203 311 -100 1039 158 485 -176 -479 549 -1489
13567 -1489 1283 849 668 766 -1514 -1305 -1922 -109 -79 -375 -230 76 103 -16 1914 -1587 138 593
13585 593 -870 1489 -221 709 913 -1050 14 -1164 395 389 336 177 45 506 -1239 386 -271 -355
13603 -355 520 -115 1243 -1330 -96 228 917 1169 -1132 424 -657 -807 -1413 -1199 166 -291 1106
13620 1106 -638 1331 -410 1102 673 0 -21 -1157 1816 -437 -486 -854 -1180 461 -89 -296 -1294
$$ packed form
13500a70J94J238j488p75K099j527M91J36r26K130n65q20j094J336j426J773K18
13517H24q81P51k246J403N17q29J044j997K745k856J827m48L18n19p8R61j105
13534e69J936k188j364K582j089J098j997K730r00M76o94j969K159k480L127k550
13550a692j62K148j77J395l506K584k066J273N14m11J139q81L27o61l03J028k038
13567a489K772m34j81R8k280K09o17J813L0k96J45L06K7j19J930l501J725M55
13585E93j463K359j710R30K04j963J064j178J559on3j59j32M61j745J625o57q4
13603c55Q75o35J358k573J234L24O89K52k301J556j081j50o06K14J365m57J397
13620A106j744J969j741J512m29o73k1j136K973k253m9l68l26J641n50k07r98
$$ plain form
13637 -1294 305 -594 356 -852 -1792 1292 -202 -445 250 81 816 -1423 884 -780 -78 138 -404
13654 -404 -695 -541 -91 -228 677 -905 590 -469 335 -1069 257 1391 261 -83 449 -741 763
13671 763 -415 -305 36 -1509 -159 -341 -697 -537 400 536 1339 498 -367 462 1053 -1028 1815 -356
13689 -356 885 575 -273 1184 -946 580 208 -703 11 -657 609 -499 1678 -1979 -824 114 -376
13706 -376 2768 514 641 -690 374 1511 -210 826 29 38 -582 491 1189 690 -1889 -1058 336
13723 336 -586 -859 130 82 591 -1277 -284 -417 -483 516 263 57 2003 509 -599 582 -1278 -913
13741 -913 373 -302 -232 799 1240 1351 102 1051 334 922 -498 1173 -297 -392 288 -405 783 755
13759 755 217 -91 -113 -216 542 -165 2095 -1642 558 -849 952 -103 -552 1031 1049 -210 -1638
$$ packed form
13637a294J599q99R50j208r40L084j494k43O95j69P35k239K307j664P02K16n42
13654d04k91J54M50j37R05j582J495j059Q04j404J326J134j130l44N32j190J504
13671G63j178J10L41j545J350j82l56J60R37J36Q03q41q65Q29N91k081K843k171
13689c56J241l10q48J457k130J526l72r11P14o68J266j108K177l657J155R38m90
13706c76L144k254J27j331J064J137j721J036p97Ro20J073O98m99k579Q31J394
13723C36r22k73R89m8N09j868R93j33o6R99k53k06J946j494j108J181j860L65
13741i13J286o75P0J031M41J11j249R49p17N88j420J671j470r5O80o93J188k8
13759G55n38l08k2j03P58p07K260l737K200j407J801j055m49J583J8j259j428
$$ plain form
13776 -1638 -697 442 127 -261 896 497 115 -148 35 715 287 -161 1341 -1469 258 177 -597 -443
13794 -443 -1650 92 -336 194 8 -698 -281 339 571 462 21 -191 -1454 1244 -1361 -1099 -306 615
13812 615 -110 10 406 -1277 1395 -456 593 905 -297 150 422 955 345 -391 -314 -1304 918 -918
13830 -918 1518 -653 -564 -400 716 647 430 950 -277 476 -504 408 -1318 977 141 -440 -1012 -267
13848 -267 -1023 635 -530 331 -283 -28 296 -792 -39 -55 -358 -445 -329 -156 822 -849 395 226 -708
13867 -708 -1958 318 -418 699 488 990 832 -542 581 -1269 226 254 -612 472 -768 626 -280
13884 -280 -49 -536 -1606 906 -494 -137 884 -908 1435 -709 1750 310 575 49 781 -2153
13900 -2153 121 154 -591 707 -368 552 -745 422 -130 553 1144 74 494 -4 -1204 -1170 -791 407
$$ packed form
13776a638R41J139l15l88J157l99l82k63J83O80m28m48J502k810J727q1p74J54
13794d43j207J742m28N30j86p06M17O20K32j09m41k12j263K698k605K62P93R21
13812F15p25J20L96j683K672j851J049L12j202M47K72N33o10p36P7r90K222j836
13830i18K436k171Q9J64J116o9k17N20j227P53r80R12j726K295q36n81n72P45
13848b67p56J658j165Q61o14K55L24j088P53j6l03q7J16J73R78j671J244j69r34
13867g08j250K276p36J117k11N02j58j374J123j850J495K8q66J084j240J394r06
13884b80K31m87j070K512j400L57J021j792K343k144K459j440K65n26P32k934
13900b153K274L3p45J298j075R20j297J167n52O83N91j070M20m98j200L4L79J198
$$ plain form
13918 407 -673 1879 -855 410 1089 595 -965 -1835 930 -1437 -885 107 761 -646 -260 -749 -574
13935 -574 -417 -18 -560 34 -1006 -81 -884 373 874 705 -921 -95 263 210 618 827 -61 -152 500
13954 500 -654 -595 279 -1281 -128 -683 901 166 -628 331 62 26 -482 -836 -422 -219 -391 1198 -1250
13973 -1250 -1126 -478 1049 941 14 848 994 -651 27 -1622 955 -237 -262 -1504 524 -1012 668
13990 668 -312 -1365 1949 583 172 1612 -220 1035 -1456 369 -1588 -588 1450 -224 -1452
14005 -1452 -1059 615 -864 -741 1839 -279 523 -1056 1173 184 421 -58 -1123 -58 77 322 1422
14022 1422 -38 -254 1289 -400 13 -352 610 -535 373 472 1196 -488 451 421 110 -43 702 51
14040 51 250 1018 -233 -955 409 224 -14 -1604 -716 35 367 668 -1609 1542 848 -1488 729 -295
$$ packed form
13918D07j080K552k734J265O79m94j560q70K765k367N52R92O54j407L86m89J75
13935e74J57L99n42N94j040R25q03J257N01j69j626Q26L58n3M08K09q88r1O52
13954E00j154N9Q74j560J153n55J584p35p94R59k69l6n08l54M14K03j72J589k448
13973a250J24O48J527j08r27Q34J46j645O78j649K577j192k5j242K028j536J680
13990F68r80j053L314j366m11J440j832J255k491J825j957J000K038j674j228
14005a452L93J674j479J23K580k118Q02j579K229r89K37m79j065J065J35K45J100
14022A422j460k16J543j689M13l65R62j145R08R9P24j684R39l0l11j53P45o51
14040E1J99P68j251p22J364j85k38j590Q88P51L32L01k277L151o94k336K217j024
$$ plain form
14058 -295 123 767 -1009 281 -539 -833 -547 681 -614 -737 31 -555 142 -1849 378 -796 -261
14075 -261 469 -222 2058 -854 -22 1375 109 833 -566 -134 -424 -145 159 -1104 1611 -1674 622
14092 622 829 895 295 1809 -600 -517 326 -552 1501 432 -505 1397 -139 -527 -643 1423 -843 -968
14110 -968 72 263 -756 -415 -562 1078 -206 -932 -1182 1179 40 257 1084 -63 508 135 864
14127 864 566 694 1827 -414 554 -362 -1195 428 -807 335 -649 -24 -146 73 514 -1803 752
14144 752 337 156 -436 -227 -21 -645 1446 -184 1444 -947 770 1265 -1125 1419 183 -692 -647
14161 -647 1023 -264 850 735 -1325 688 -248 804 -8 -924 931 -453 1089 -2633 708 1111
14177 1111 -87 882 -1922 331 -1683 -400 -1 -860 539 -1285 76 734 -413 56 370 350 -2136
$$ packed form
14058b95M18O44j776J290q20k94K86J228j295j23P68n86O97j991K227j174N35
14075b61P30o91K280k912Q32J397j266P24j399M32k90K79L04j263K715l285K296
14092F22K07O6o00J514k409Q3Q43q78K053j069r37J902j536l88j16K066k266j25
14110i68J040J91j019L41j47J640j284p26k50K361j139K17Q27j147N71l73P29
14127H64k98J28J133k241R68r16q33J623j235J142r84O25j22K19M41k317K555
14144G52m15j81n92K09K06o24K091j630J628k391J717M95k390K544j236q75M5
14161f47J670j287J114j15k060K013r36J052q12r16J855j384J542l722L341M03
14177A111j198R69k804K253k014J283L99q59J399j824J361O58j147M69L14k0k486
$$ plain form
14194 -2136 1413 127 565 -910 1577 417 212 34 134 706 97 349 -1110 1395 -161 -489 617
14211 617 850 -57 -1197 -14 -364 -374 -604 235 15 636 -640 461 1 525 151 -540 -151 -118 719
14230 719 390 -1898 432 -940 -875 1382 761 262 -968 999 -635 -213 676 -2328 924 760 662
14247 662 584 -624 -1171 701 579 -460 868 769 -74 59 -520 662 -678 -273 -404 -614 -1020 655
14265 655 556 -700 477 -839 250 -573 -1492 751 -1685 -1034 -1822 -329 -1791 -1497 -116 76 17
14282 17 -820 589 -136 -1051 598 -561 -351 -748 287 -41 -317 -2 1313 337 -484 -679 810 -1336
14300 -1336 -561 -141 -944 640 -656 -515 390 386 -920 -598 -293 -637 604 -864 -203 767 360 1160
14318 1160 -338 1132 -161 -80 477 -625 880 -1410 2119 -523 622 673 -321 -154 -303 442 -300
$$ packed form
14194b136L549j286M38j475K487j160k05j78J00N72o09K52j459K505j556l28J106
14211F17K33r07j140J183l50j0k30Q39k20O21j276J101m60N24l74o91L89L3Q37
14230G19l29k288K330j372O5K257o21m99j230J967j634M22Q89l004L252j64r8
14247F62p8j208n47J872j22j039J328r9q43J33n79J182j340M05j31k10m06J675
14265F55r9j256J177j316J089q23r19K243k436O51p88J493j462K94J381J92n9
14282A7q37J409p25r15J649j159K10l97J035l28k76L15J315r76q21j95J489k146
14300a336P75M20q03J584j296J41R05mj306L22L05l44J241j468O61R70m07Q00
14318A160j498J470j293Q1N57j102J505k290L529k642J145N1r94J67j49P45p42
$$ plain form
14335 -300 174 -635 766 1347 -1248 -83 -1467 653 -681 -809 1496 -130 438 639 753 356 -244
14352 -244 366 -147 -201 -1172 776 367 365 674 -567 1386 -88 989 837 -452 169 578 1155 -682
14370 -682 -249 662 -611 69 -945 952 -612 752 546 1815 -137 1321 -231 -960 -496 1251
14386 1251 828 442 -497 259 -1052 -467 1481 -297 -152 -71 1475 -1580 1032 467 102 -936 1185
14403 1185 240 -1506 -907 1304 777 1835 12 403 1652 132 581 -498 -623 -1296 -405 531 -837
14420 -837 -93 -226 261 390 690 699 -495 617 -940 -1132 216 -545 285 -350 362 -1458 267 -1045
14438 -1045 -833 1128 108 186 -351 -207 -811 279 753 -573 604 -996 1098 -590 -354 1283 -1599
14455 -1599 1720 -2105 691 1022 -594 434 -1035 -148 -881 -661 -92 796 1927 54 727 -363
$$ packed form
14335c00M74q09J401N81k595J165j384K120j334j28K305j626N68K01J14l97o00
14352b44O10n13n4r71J948m09kL09j241J953j474J077j52j289O21M09N77j837
14370f82M33R11j273O80j014J897j564J364k06J269j952J458j552p29M64J747
14386A251m23l86r39P56j311N85J948j778J45Q1J546l055K612n65l65j038K121
14403A185r45j746N99K211n27J058j823L91J249j520M49j079j25o73Q91R36j368
14420h37P44j33M87J29L00Rj194J112j557j92J348p61Q30o35P12j820J725j312
14438a045K12J961j020P8n37J44o04J090M74j326J177j600K094j688K36J637k882
14455a599L319l825K796L31j616J028j469Q87p33K20N69Q88J131j873O73j090
$$ plain form
14471 -363 287 1331 -323 1097 91 -328 940 117 132 2357 -499 1143 -178 1361 -392 145
14487 145 169 320 -801 -1353 89 -390 785 -399 -769 884 686 920 173 2161 704 -585 574
14504 574 -220 771 -1074 -372 -360 458 1047 -991 -895 -1430 1576 -242 1451 298 979 -233 -567 1995
14522 1995 -347 1462 -224 1886 2239 -669 572 -1178 863 370 -1284 2021 -514 841 -524
14537 -524 696 -248 53 2080 71 670 -788 -311 198 -1848 93 -343 -210 -1160 370 -475 -204
14554 -204 -283 -245 854 -119 632 205 1790 914 -553 418 -307 2453 132 -678 -580 207 -670 -400 -815
14573 -815 813 -286 171 -177 507 81 -728 220 60 180 950 -96 -18 191 829 -783 197 -78 1018
14592 1018 748 -56 -589 -295 -162 -796 -1799 666 -1227 -412 616 -872 -1368 -377 183 -804 -524 -1297
$$ packed form
14471c63O50J044j654J420j006m19J268q23J5K225k856J642j321J539j753N37
14487A45K4J51j121n52J442m79J175j184l70J653j98K34p47J988j457j289J159
14504E74p94R91j845P02J2Q18N89k038R6n35L006j818J693j153O81j212l34K562
14522A995k342J809j686K110L53k908J241j750K041m93j654L305k535J355j365
14537e24J220r44L01K027k009N99j458M77N09k046J941m36J33r50J530q45K71
14554b04p9L8J099r73P51m27J585q76j467R71p25K760k321q10R8P87q77K70m15
14573h15J628j099M57l48O84m26q09R48j60J20P70j046P8K09O38j612R80k75J096
14592A018k70q04n33K94J33o34j003K465j893Q15J028j488m96R91N60r87K80p73
$$ plain form
14610 -1297 54 780 37 -348 -449 1348 -916 -655 -457 1024 537 -558 1748 126 614 -1129 827
14627 827 52 -1031 1597 -234 855 28 -697 382 128 -301 91 321 -160 494 275 -422 729 -1179
14645 -1179 2473 -135 -947 -616 654 607 965 351 -838 -1095 -788 396 108 -317 -680 -730 -1226 973
14663 973 -44 -67 -310 -417 655 593 1049 1478 310 -1462 -273 429 -1807 747 -422 -709 136 1557
14681 1557 724 -695 1172 -85 -1134 -29 0 -409 -1782 773 -217 94 796 -1648 775 -430
14697 -430 564 -574 -754 1076 336 -484 -1234 749 330 987 -307 539 1133 -691 -293 -1022 -108 359
14715 359 -1246 906 -805 423 -785 594 40 -517 586 -1539 -528 -674 564 772 408 1006
14731 1006 -765 1176 -328 -765 -419 -1200 91 284 893 -1248 740 -1020 185 -1153 -284 302
$$ packed form
14610a297J351P26p43l85j01J797k264K61J98J481m87j095K306j622M88j743J956
14627H27p75j083K628j831J089q27p25J079k54m29L92K30m81O54k19o97J151j908
14645a179L652k608q12L31J270m7L58o14j189k57L07J184k88m25l63n0m96K199
14663I73j017k3k43j07J072o2M56M29j168j772J189P02k236K554j169k87Q45J421
14681A557q33j419J867j257j049J105K9m09j373K555r90L11P02k444K423j205
14697d30R94j138j80J830p40q20p50J983m19O57j294Q46N94j824L98p29R14M67
14715C59j605K152j711J228j208J379n54n57J103k125J011j46J238K08l64N98
14731A006j771J941j504m37L46p81J291J93O09k141J988j760J205j338Q69N86
$$ plain form
14747 302 161 495 1784 646 556 34 -154 1045 22 472 -11 216 -664 -58 -345 -617 35 266 402
14766 402 651 -115 491 -358 866 -383 649 -700 -492 1462 495 232 -219 -135 -366 -775 234 19
14784 19 445 -754 -1039 -433 -1425 -101 -923 -120 61 439 -383 -995 1219 -1440 450 -937 1227 257
14802 257 -522 1433 -267 1015 -1044 892 336 -374 -483 -316 -420 -705 57 66 -404 367 -2658 -468
14820 -468 -649 580 -480 -12 676 -1150 591 402 698 -841 433 1148 475 -700 190 620 -276
14837 -276 1086 -459 -762 515 550 -948 -188 284 -258 -357 181 941 -442 689 -731 636 1479 1002
14855 1002 710 -35 -276 -893 -444 -436 -614 494 -456 -375 235 -457 446 69 -539 -1064 1224 -675 878
14874 878 -933 1051 -622 660 769 -706 1497 -1096 27 -588 -924 597 1385 -12 -843 -1259
$$ packed form
14747C02j41L34J289j138r0n22j88J199j023M50m83K27q80O06k87k72O52K31J36
14766D02K49p66O06q49J224j249J032j349K08J954r67k63m51Q4k31m09J009k15
14784A9M26j199k85O06r92J324q22Q03J81L78q22o12K214k659J890j387K164r70
14802B57p79J955j700J282k059J936n56p10j09J67j04k85P62Rm70P71l025K190
14820d68j81J229j060M68O88j826J741j89K96j539J274P15o73j175Q90M30q96
14837b76J362j545l03J277L5j498P60M72n42r9N38P60j383J131j420J367Q43m77
14855A002k92p45k41o17M49Qj78J108r50Q1O10o92R03l77o08n25K288j899J553
14874H78j811J984j673J282J09j475K203k593J123o15l36J521P88j397q31m16
$$ plain form
14890 -1259 1330 -1039 757 -875 -663 -325 -314 351 -1964 1912 768 1039 -793 431 1092 -523
14906 -523 1098 -1309 -655 790 -163 -44 -198 -404 -789 940 678 292 -606 -1041 -114 410 -150 240
14924 240 -309 773 -804 -248 578 -771 -892 -105 -35 465 579 989 -717 351 -331 732 -54 907
14942 907 1290 -1651 1459 -104 -730 69 -570 1257 -958 -651 170 -75 -45 -800 829 266 1320 -1271
14960 -1271 355 -516 89 -136 -666 617 -182 141 -633 -57 93 -394 397 514 1336 1099 -807 571
14978 571 799 737 -230 -183 106 -1484 1136 -1326 440 -1457 -1033 -816 -505 -164 -438 644 -1065 -212
14996 -212 56 913 757 90 168 -445 562 260 33 -817 -669 -936 874 55 68 1053 996 231 -634 -774
15016 -774 71 1248 530 -32 503 75 -489 196 905 924 -622 -109 -633 -1926 -41 664 -461 -159
$$ packed form
14890a259K589k369J796j632K12L38J1O65k315L876j144K71j832J224O61j615
14906e23J621k407O54J445r53J19j54k06l85J729k62l86q98m35R27N24n60L90
14924B40n49J082j577N56Q26j349j21P87P0N00J14M10j706J068o82J063p86R61
14942I07L83k941L110j563o26P99o39J827k215L07Q21k45L0p55J629n63J054k591
14960a271J626q71O05k25n30J283p99L23p74N76J50m87P91J17Q22k37j906J378
14978E71K28o2r67M7K89j590K620k462J766j897M24K17L11L41k74J082j709Q53
14996b12K68Q57j56o67P8o13J007l02k27q50J48k67J810q19J3R85n7p65q65j40
15016g74Q45J177p18n62N35m28n64O85P09J9j546N13n24j293J885P05j125L02
$$ plain form
15034 -159 1138 -1048 -437 -733 982 -305 -6 157 -769 133 588 76 -9 -208 -735 855 -976 6
15052 6 804 926 1053 -950 -918 1493 463 1538 -464 1614 261 -790 -175 -109 901 -118 578 -876
15070 -876 -494 378 -502 354 -176 -356 130 -999 108 -762 16 -2238 -668 47 99 223 -175 -191 -92
15089 -92 -372 -1204 -364 -227 -1218 579 616 901 1056 825 -626 -1495 -589 -668 1089 297 223 500 73 -1210
15109 -1210 -582 -706 -246 -1040 -930 507 -33 -823 -469 -1280 76 225 -221 -58 782 -124 567 -330 -307
15128 -307 1712 -1006 913 -349 1752 84 404 996 -407 -1840 72 1031 -150 -136 -228 -839 -103
15145 -103 -424 1108 -652 41 -626 1504 1139 -599 1087 -876 1439 -866 903 -1227 -1107 1930
15161 1930 -930 661 -456 179 309 475 805 946 980 -1106 -49 -1339 -502 327 -340 1158 572
$$ packed form
15034a59J297k186O11k96J715j287K99J63r26R02M55n12q5j99n27J590j831R82
15052FP98J22J27k003L2K411j030J075k002K078j353j051O15O6J010j019O96j454
15070h76L82Q72q80Q56n30j80M86j129J107q70P78k254J570P15N2J24l98j6R9
15089i2k80q32Q40J37r91J797L7K85J55k31j451q69R06p9J757p92p4K77m27j283
15109a210O28j24M60p94J10J437n40p90L54q11J356J49m46J63Q40r06O91q97K3
15128c07K019k718J919j262K101j668L20N92j403j433J912R59j181J4r2o11P36
15145a03l21J532j760O93o67K130l65j738J686j963K315k305J769k130J20L037
15161A930k860J591j117O35J30J66L30J41L4k086J057j290Q37Q29o67J498n86
$$ plain form
15178 572 424 1366 -1001 980 -547 -207 -162 262 -107 159 381 -26 1193 -235 498 894 -1882 31
15196 31 842 588 213 337 1130 -727 -138 1015 2455 -747 678 284 -50 -549 -538 406 -588 4 -233
15215 -233 -190 -216 981 221 1460 1574 677 -365 -76 578 -793 1619 -1651 132 -788 1270 -620
15232 -620 -717 252 512 182 -247 -190 -41 270 -397 -520 389 436 23 -583 329 2478 -1222 1006 -308
15251 -308 4 -360 88 1105 178 937 -1346 468 -360 -1149 -1239 -386 574 -120 1144 -615 536 -1272
15269 -1272 -937 130 1072 -98 246 1096 198 -140 643 -1327 216 92 473 9 -605 244 112 -339
15287 -339 940 939 628 -226 -393 40 36 -37 -882 893 351 39 165 -1693 -810 -1203 -802 443 380 201
15307 201 -403 -1198 290 -1227 787 831 596 -208 118 478 303 1479 1201 -556 -1049 1218 -519 966
$$ packed form
15178E72j48R42k367J981j527L40M5M24l69K66K22m07J219j428P33L96k776J913
15196C1Q11k54l75J24P93j857N89J153J440l202J425l94l34m99J1R44r94N92k37
15215b33M3k6J197p60J239J14q97j042K89O54j371K412l270J783r20K058j890
15232f20r7R69K60l30m29N7J49L11o67j23R09M7m13o06R12K149l700K228j314
15251c08L12l64M48J017r27P59k283J814q28p89r0Q53R60o94J264j759J151j808
15269a272L35J067R42j170L44Q50q98l38P83j970J543j24L81m64o14Q49j32m51
15287c39J279jl11q54j67M33mp3q45J775n42l12J26j858Q83l93M01J245o3j79
15307B01o04p95J488j517K014M4k35q04L26L60j75J176k78j757m93K267j737J485
$$ plain form
15325 966 -285 -207 115 -375 553 -119 -1302 738 52 132 -688 1024 -382 -613 14 470 1122 -1295
15343 -1295 1504 776 -601 506 144 -71 -86 613 -1266 681 243 -727 -530 -100 983 -1238 237
15360 237 -889 314 420 -1053 138 -840 -821 -1081 187 1661 302 413 149 625 -837 -1021 28
15377 28 -171 -1481 -730 897 223 -1381 -190 -145 343 311 214 -1327 620 704 426 995 1118 -336 -607
15396 -607 537 294 -46 -500 -315 -596 680 -1097 -3 1067 -1522 336 -1184 2107 410 -183
15412 -183 -1575 1049 1144 -1281 1607 201 1518 -15 461 803 -239 122 283 1178 -515 604 291
15429 291 -544 831 881 471 134 1474 1474 -641 1066 -349 979 1188 324 629 -424 126 -872 1124
15447 1124 800 994 209 -332 -275 -104 -356 -354 13 778 -1140 -137 -743 1657 -513 737 -502 369
$$ packed form
15325I66j251P8L22m90R28o72j183K040o86Q0q20J712j406k31O27M56O52k417
15343a295K799p28j377J107l62k15j5O99j879J947m38r70J97M30J083k221J475
15360B37j126J203J06j473J191r78J9k60J268J474j359J11k64M76j462j84J049
15377B8j99j310P51J627o74j604J191M5M88l2r7j541J947Q4k78N69J23j454k71
15396f07J144k43l40m54J85k81J276j777J094J070k589J858j520L291j697n93
15412a83j392K624R5k425K888j406J317j533M76L42j042L61J61Q95j693J119l13
15429B91q35J375N0m10l37J340%k115J707j415J328K09q64L05j053N50r98J996
15447A124l24J94p85n41N7J71k52KL67P65j918J003o06K400k170J250j239Q71
$$ plain form
15465 369 948 -23 670 964 -869 481 294 118 799 -358 -157 -1576 -44 473 -520 1011 -708
15482 -708 -234 717 -434 -1201 -1167 -971 -86 -457 -711 594 -678 1176 583 601 -526 -1593 595 626
15500 626 691 871 -1340 2129 320 515 -392 -662 1100 -346 -358 -480 851 751 8 62 26 687 -1819
15519 -1819 1711 639 764 -520 -1364 2420 -784 191 226 123 57 -198 -152 -480 1024 103 -140 808
15537 808 60 519 1124 187 -329 707 -134 -1176 1398 251 999 -1063 -669 285 -52 70 -619 1215
15555 1215 -491 441 -1309 839 879 -1108 -410 -718 391 -166 -397 1132 -717 -77 426 -860 352
15572 352 222 -429 -778 -1528 -553 36 -163 299 -915 1033 1210 660 -613 350 730 -902 25 -272
15590 -272 -482 171 1672 -101 1536 -570 -1016 795 -1649 1295 -2105 664 555 -1104 1149 -527
$$ packed form
15465C69N79r71O93K94j833J350j87j76O81j157K01j419J532N17r93J531j719
15482g08M74R51j151p67L4J96Q85l71k54J305j272J854n93J8j127j067K188L1
15500F26O5J80k211L469j809J95r07k70J762j446j2j22J331j00p43N4l6O61k506
15519a819L530j072J25j284q44L784l204R75L5j03o6k55M6l28J504r21k43R48
15537H08p48M59O05r37n16J036q41j042K574j147P48k062L94R54l37J22o89J834
15555A215j706R32j750K148M0j987O98l08J109n57k31J529j849O40N03j286J212
15572C52j30o51l49p50R75N89j99M62j214J948J77n50j273R63L80j632R27k97
15590b72k10O53J501j773J637k106m46J811k444K944l400K769j09j659K253j676
$$ plain form
15606 -527 1150 -809 -926 -734 -504 1247 -931 570 -217 203 -1634 -1748 1448 -695 1259 -905
15622 -905 1188 -338 -82 1193 -292 526 953 200 557 -450 550 -568 162 -388 -1979 -415 659
15639 659 -853 235 -1162 -1437 -316 632 -207 -43 808 -115 -838 -486 1223 -682 836 -235 342
15656 342 406 385 -105 -203 -133 -228 -393 872 -262 -60 -401 2171 -774 -246 15 76 846 214 495 -597
15676 -597 58 1683 388 -949 -1143 393 687 -547 829 -219 27 491 -508 416 -1131 636 -318
15693 -318 552 612 8 1378 -125 1994 -834 1632 -1286 -145 538 1034 1784 -950 1225 -595 645
15710 645 364 1320 205 -1838 -457 -508 -128 -1157 -656 1025 -1641 -387 -178 160 1628 273 11
15727 11 -347 -4 -517 1246 -765 -346 -151 19 441 292 470 1 637 -179 547 -164 766 -165 416
$$ packed form
15606e27J677j959j17J92K30J751k178J501p87M20j837j14L196k143J954k164
15622i05K093j526K56J275j485Q18M27p53L57j007J000j118P30n50j591J564J074
15639F59j512J088j397k75J121R48q39J64Q51r23p23L52J709j905J518j071N77
15656C42O4k1m90r8P0r5j65J265j134K02l41K572k945N28K61O1P70o32K81j092
15676e97O55J625j295j337j94J536K94j234J376j048K46M64r99R24j547J767r54
15693c18Q70O0o04J370j503K119k828K466k918J141O83M96P50k734K175j820J240
15710F45k81R56j115k043J381n1L80j029N01J681k666J254K09L38J468j355k62
15727A1l58L43n13J763k011M19J95J70M22j49J78m69O36q16P26p11R30r31N81
$$ plain form
15746 416 1386 1661 472 -408 -206 225 607 -687 780 249 -1205 253 124 1723 -364 -328 352 -658
15764 -658 344 797 497 64 -850 -1076 -648 755 -225 1368 -1020 -1060 -360 -900 1045 -574 2007 -973
15782 -973 41 -510 -979 626 -1743 65 -1088 -309 120 -1635 1419 -238 582 -941 -1278 -2217 -1124
15799 -1124 -200 365 80 417 910 1144 -1014 342 -770 1265 -145 247 1944 989 -823 -205 341
15816 341 863 -621 -717 8 602 -447 233 -418 -827 -767 -1663 713 -933 -1077 -1097 395 1150 473 605
15835 605 -516 118 912 460 435 -347 2717 119 -1032 570 -1040 -134 1190 180 203 597 208 159
15853 159 528 514 518 471 -795 753 -743 1402 -251 815 -82 -366 812 -768 422 -465 526 619
15871 619 556 737 -89 863 -1636 -752 19 -1521 597 -1843 377 -1302 1111 1136 -227 346 375 1416
$$ packed form
15746D16R70K75j189q80K02M31L82j294J467n31j454J458j29J599k087L6O80j010
15764f58J002M53l00m33r14k26M28J403r80J593k388m0P00n40J945j619K581k980
15782i73J014n51m69J605k369J808j153P79M29j755L054j657Q20j523l37r39J093
15799a124R24N65k85L37M93K34k158J356j112K035j410L92J697r55j812O18N46
15816C41N22j484r6P25N94j049O80o51m09O0q96K376j646j44k0J492P55o77J32
15835F05j121O34P94m52k5p82L064k598j151J602j610R06J324j010K3L94l89m9
15853A59L69j4Mm7j266J548j496K145j653J066q97k84J178j580J190q87R91R3
15871F19o3J81q26R52k499Q84P71j540K118k440K220j679K413K5j363N73K9J041
$$ plain form
15889 1416 -1194 858 782 408 685 -1661 2677 95 1783 388 -1237 -321 -552 2388 8 578
15905 578 345 345 388 588 924 109 -13 -430 -820 -352 125 289 254 -376 -72 -293 -832 361 253 260 -564
15926 -564 362 -551 256 -821 1044 340 -777 1265 -231 479 286 607 -518 -121 -53 727 1305 -945
15944 -945 -1692 1390 309 -384 268 -94 -541 955 1067 -388 664 -592 231 -541 -90 43 116 153
15962 153 -333 196 630 66 -181 -796 36 -562 422 358 -269 -74 -1680 1263 -1277 414 286 -236 1006
15981 1006 -505 -859 -1351 -8 -437 152 726 -352 -94 927 263 1677 891 1540 710 1667 -291
15998 -291 27 -249 -654 -868 552 983 -824 -29 843 272 41 208 619 288 -194 295 535 1667 -1628
16017 -1628 -799 -468 190 204 -1019 23 -602 -852 210 -1326 30 939 1442 -441 414 -453 -1703
$$ packed form
15889A416k610K052p6l74K77k346M338k582J688j395j625R16k31K940k380N70
15905E78k33%M3K00L36q15j22m17l90M68M77J64l5o30L04k21n39J193j08Pq24
15926e64R26r13Q07j077J865p04j117K042j496P10j93L21j125L97O8P80N78k250
15944i45p47L082j081o93O52l62m47J496J12j455J052j256Q23p72M51J33P3L7
15962A53m86N29M34n64k47o15Q32n98R84o4o27J95j606K943k540J691j28n22J242
15981A006j511l54m92J343m29N89N74j078K58J021o64J414p86O49q30R57j958
15998b91L18k76m05k14J420M31j807P95Q72n71k31J67M11l31m82M89K40J132l295
16017a628Q29L31O58J4j223J042o25k50J062j536J356R09N03j883Q55q67j250
$$ plain form
16034 -1703 749 -472 1736 -548 -76 5 64 -891 -956 1267 -493 312 -208 -1304 1093 89 312
16051 312 -202 246 1144 -861 -108 -1424 1840 -1383 366 -329 -1090 1478 -596 473 430 445 1662
16068 1662 210 1086 -1553 -522 -117 631 185 -397 1230 565 2 655 267 754 1896 649 -1936
16085 -1936 315 -571 681 -158 -187 198 -869 301 -2041 627 -77 741 -147 1287 -540 -921 -529
16102 -529 -549 520 107 -207 -928 748 -202 855 -1473 -615 -613 -758 187 -357 -627 344 360 497 872 632
16122 632 -237 -723 -1505 -564 666 -1445 1242 171 -1790 89 194 10 -1207 270 -1416 217
16138 217 -285 -521 -660 -524 687 -1501 -456 -768 310 -324 -925 444 -984 427 -346 733 527
16155 527 -1150 70 -317 1189 1197 1099 686 -717 217 145 2461 60 245 -890 -2238 316 -61 -195
$$ packed form
16034a703K452j221K208k284M72Q1N9r55o5K223j760Q05n20j096K397j004K23
16051C12n14M48Q98k005P53j316L264l223J749o95p61K568k074J069m3J5J217
16068A662j452Q76k639J031M05P48m46n82J627o65n63O53l88M87J142j247k585
16085a936K251q86J252q39k9L85j067J170k342K668p04Q18q88J434j827l81L92
16102e29k0J069m13l14p21J676r50J057k328Q58Kj45R45n44k70R71J6J37L75k40
16122F32q69m86p82R41J230k111K687j071j961J879J05j84j217J477j686J633
16138B17n02k36j39J36J211k188J045l12J078o34o01J369j428J411p73J079k06
16155E27j677J220l87J506Qr8m13j403R34p2K316k401J85j135j348K554l77j34
$$ plain form
16173 -195 -517 35 65 -1600 232 -609 409 67 1237 -97 156 137 502 318 121 -298 675 581 -1804
16192 -1804 -799 307 1180 -1133 -345 266 341 -586 822 318 -851 293 1397 -126 14 251 -8
16209 -8 -99 1006 538 230 829 -716 770 -854 -1123 768 377 1055 -273 -1344 -1736 -96 -529 -1269
16227 -1269 576 -564 2132 -476 665 219 -484 -1031 -769 1273 783 724 -823 -140 -558 1251 199
16244 199 -1669 2057 -470 861 -293 -2543 -88 1145 1399 -802 686 -270 305 -714 -577 956
16260 956 -499 -967 -520 -284 197 -601 986 450 548 385 -652 965 -589 -511 -574 -797 -226 273 508
16279 508 608 -395 -620 648 -635 517 808 -226 -753 1219 -135 -956 -907 232 1020 625 965
16296 965 -1077 407 797 -166 -1062 1104 456 -525 860 -947 -560 970 -1071 232 697 1284 -376
$$ packed form
16173a95l22N52L0j665J832q41J018l42J170j334K53j9L65j84j97m19R73r4k385
16192a804J005J106Q73k313P88O11P5r27J408n04j169J144J104j523J40K37k59
16209hr1J105m68l08N99j545J486j624k69J891l91O78j328j071l92J640m33p40
16227a269J845j140K696k608J141m46p03n47K62K042m90n9j547O83m18J809j052
16244A99j868L726k527J331j154k250K455J233K54k201J488r56N75j019J37J533
16260I56j455m68M47K36M81p98J587n36R8j63j037J617j554P8o3k23N71M99K35
16279E08J00j003k25J268j283J152K91j034n27J972j354q21M9J139P88l95L40
16296I65k042J484L90r63q96K166o48r81J385j807L87J530k041J303M65N87j660
$$ plain form
16313 -376 1560 -835 -505 230 -726 -1002 -413 -353 926 -897 -290 -755 -1335 603 708 -431 -526 816
16331 816 556 -556 -21 1033 829 -1119 1295 -376 1157 -1353 898 -1101 13 289 -648 231
16347 231 -762 1531 -35 -464 1068 -41 1584 -886 438 608 -77 -99 292 883 -1136 338 1744
16364 1744 -1493 -298 1307 696 1096 106 295 583 329 -431 917 381 -1413 -418 -1160 129 -245
16381 -245 1090 344
$$ packed form
16313c76J936k395L30P35r56k76N89O0J279j823O07m65n80J938J05j139r5J342
16331H16k60j112N35J054k04j948K414j671J533k510K251j999J114K76r37Q79
16347B31r93K293j566m29J532j109J625k470J324J70o85k2L91N91k019J474J406
16364A744l237J195J605o11M00r90J89K88k54p60J348n36j794R95p42J289l74
16381b45J335p46
16383C44
$$ Imaginary data points
##PAGE= N=2
##DATA TABLE= (X++(I..I)), XYDATA
$$ plain form
0 0 0 0 0 0 0 0 0 0 0 0 0 0 0 0 0 0 0 0 0 0 0 0 0 0 0 0 0 0 0 1 0 1 0 -1 2 -4 6 -8 5 -4 4 -8 8 -10 6 -6 12 -14 15 -15 16
51 16 -18 27 -25 28 -27 29 -37 40 -45 47 -57 68 -88 113 -174 -7929 10271 8932 6973 3895 402 -2498
73 -2498 -5274 -6121 -9304 -11428 -11063 -9366 -10325 -7717 -6705 -2939 -1582 243 4111 4077 10177 8787 11197
90 11197 10281 9905 9711 7612 6115 1084 492 -783 -3539 -6426 -9358 -9233 -9634 -11355 -9231 -6806 -6087
107 -6087 -5418 -3502 -1025 3206 5281 5416 8853 9461 10224 8907 8272 7596 4405 3523 680 -550 -2966
124 -2966 -7046 -6995 -8233 -8724 -10633 -8182 -8331 -5580 -3776 -2429 -907 2826 4253 7631 7993 8072 8812
141 8812 7615 7661 7100 5030 2468 1949 -2848 -4363 -6190 -8423 -8121 -9834 -9309 -9686 -6183 -5691 -5177
158 -5177 -1097 145 2754 4228 6252 7633 9009 9915 7621 8645 5335 5443 3998 1191 -380 -3410
$$ packed form
0@%%%%%%%%%%%%%%%%%%%%%%%%%%%%%JjJjjLoJ0j4J3rQj2J6j8J6j2J8k6K9l0L1
51A6l4M5n2N3n5N6o6P7q5R2j04J25j56K01k87p755J8200j339j959l078l493k900
73b498k776q47l183k124L65J697r59K608J012L766J357J825L868l4O100j390K410
90A1197r16l76j94k099j497n031n92j275k756k887k932J25m01j721K124K425P19
107f087O69J916K477M231K075J35L437O08P63j317o35o76l191q82k843j230k416
124b966m080N1j238m91j909K451j49K751J804J347J522L733J427L378L62P9P40
141H812j197M6n61k070k562n19m797j515j827k233L02j713N25l77L503M92N14
158e177M080J242K609J474K024J381J376R06k294J024l310J08j445k807j571l030
$$ plain form
174 -3410 -5972 -5576 -7461 -8987 -8361 -6764 -8509 -7282 -3863 -2858 866 1742 5225 6135 7009 8198
190 8198 8834 9405 6640 6985 4773 4166 96 -1971 -3722 -4657 -5861 -8094 -8459 -9795 -8430 -6393 -7038
207 -7038 -4904 -3503 -1230 1659 4801 5746 4752 7140 9177 10089 7787 6848 5531 2556 3506 -72
223 -72 -2962 -4772 -6393 -6774 -8632 -8715 -8638 -7200 -5611 -4021 -1755 68 1472 2710 5147 7199 8029
240 8029 8440 8645 6723 7091 5083 3548 441 -466 -2975 -5443 -6492 -7816 -8371 -7940 -7706 -8344 -4449
257 -4449 -3882 -4119 -605 1903 3770 5450 6092 7463 8086 10105 7843 6067 5562 3443 2117 -276
273 -276 -1369 -3149 -4903 -6258 -7338 -7138 -8468 -6641 -5134 -2842 -2514 293 1912 3461 4945 5636
289 5636 7073 6269 7824 7964 6145 5833 2529 1946 -1053 -1826 -4168 -6566 -6459 -7001 -6964 -6687 -6790 -6133
$$ packed form
174c410k562L96j885j526O26J597j745J227L419J005L724Q76L483R10Q74J189
190H198O36N71k765L45k212o07m070k067j751r35j204k233l65j336J365K037o45
207g038K134J401K273K889L142R45r94K388K037R12k302r39j317k975R50l578
223g2k890j810j621l81j858q3P7J438J589J590K266J823J404J238K437K052Q30
240H029M11K05j922L68k008j535l107r07k509k468j049j324n55M31K34o38L895
257d449N67k37L514K508J867J680O42J371O23K019k262j776n05k119j326k393
273b76j093j780j754j355j080K00j330J827J507K292L28K807J619J549J484O91
289E636J437q04J555J40j819l12l304n83k999p73k342k398J07n42L7K77j03O57
$$ plain form
307 -6133 -5215 -1306 -308 157 2325 4717 5160 6234 6886 7175 7127 6277 4631 2001 429 -1664 -2004 -2903
325 -2903 -4300 -6691 -6195 -6398 -7270 -6460 -4698 -3778 -1716 -1270 736 2797 4616 6593 6840 6344 6505
342 6505 6818 6484 4564 2338 1473 258 -1916 -4266 -5453 -5722 -6075 -6038 -7824 -4987 -4280 -3276 -2737
359 -2737 -868 1278 1634 4854 4404 5694 5637 7072 5768 5963 5590 3718 2607 247 -3324 -2361 -5312
376 -5312 -6035 -6436 -6659 -6837 -4678 -3875 -4430 -929 -1404 2142 3316 3359 6052 5959 7645 7792 7113 5014
394 5014 5274 1711 1062 212 -2384 -3659 -4012 -4975 -6136 -6200 -6284 -6205 -4093 -3025 -2083 -1234 2114 1351 2562
413 2562 5422 6194 6043 5956 6732 4998 4211 3013 2265 -1776 -842 -2390 -4291 -6011 -6558 -5406 -6373 -5846
431 -5846 -4815 -4030 -1827 -253 1624 2053 4502 5385 5016 5296 5673 5931 4483 2553 2329 2270 1315 -3110
$$ packed form
307f133R18L909R98M65K168K392M43J074O52K89m8q50j646k630j572k093l40q99
325b903j397k391M96k03q72Q10J762R20K062M46K006K061J819J977K47m96J61
342F505L13l34j920k226q65j215k174k350j187k69l53L7j786K837P07J004N39
359b737J869K146L56L220m50J290n7J435j304J95l73j872j111k360l571R63k951
376e312p23m01k23j78K159Q03n55L501m75L546J174M3K693r3J686J47o79k099
394E014K60l563o49q50k596j275l53r63j161o4q4P9K112J068R42Q49L348p63J211
413B562K860P72j51q7P76j734p87j198p48m041R34j548j901j720n47J152r67N27
431e846J031P85K203J574J877M29K449Q83l69K80L77K58j448j930k24n9r55m425
$$ plain form
449 -3110 -2931 -4838 -5340 -4991 -5101 -4729 -5283 -2697 -3683 -2128 -294 1887 3409 2465 4085 4574 5355 5737
467 5737 4687 4541 2785 3202 794 413 -1939 -2395 -3283 -7789 -5025 -6466 -4168 -3567 -3727 -1182 -541
484 -541 571 575 1980 2483 3419 4712 3910 5646 4088 3388 4145 2425 2677 -132 -660 -4111 -3625 -3367
502 -3367 -4898 -4562 -5037 -3402 -2587 -2520 -1752 1089 1507 2209 2779 4837 4529 3001 4140 3089 3815 2287
520 2287 1938 956 -1230 -2359 -2635 -3951 -5345 -4429 -4894 -4288 -3956 -2609 -2572 -2273 689 985 1739 2474
538 2474 4109 4230 4760 3584 3004 3787 2031 1816 722 220 -1676 -3569 -1738 -3775 -4003 -3796 -4389
555 -4389 -2933 -3718 -1289 -125 580 427 1886 4087 2741 3545 3586 4102 2356 2544 3179 442 1345 -617
573 -617 -1714 -3334 -3553 -3719 -3980 -2847 -3793 -2096 -2527 -1681 -764 1209 1095 1063 3092 3146 4909 4076 3638
$$ packed form
449c110J79j907n02L49j10L72n54K586r86J555J834K181J522r44J620M89P81L82
467E737j050j46j756M17k408l81k352m56q88m506K764j441K298O01j60K545O41
484e41J112MJ405N03R36J293q02J736j558p00P57j720K52k809n28l451M86K58
502c367j531L36m75J635Q15O7P68K841M18P02N70K058l08j528J139j051P26j528
520B287l49r82k186j129k76j316j394R16m65O06L32J347L7K99K962K96P54P35
538B474J635J21N30j176n80P83j756k15j094n02j896j893J831k037k28K07n93
555d389J456p85K429J164P05j53J459K201j346Q04M1N16j746J88O35k737R03j962
573f17j097j620k19j66k61J133r46J697m31Q46R17J973j14l2K029N4J763q33m38
$$ plain form
592 3638 3533 2495 1645 1386 -330 -450 -1192 -1910 -2992 -2866 -3365 -3711 -2439 -1734 -283 -1661 -995 45
610 45 1342 2992 3839 2730 4242 4256 5169 2588 1708 797 887 -384 -341 -1928 -3164 -2797 -3358 -5626 -4389
629 -4389 -2867 -1972 -2743 -1283 685 1831 490 757 4507 2303 3727 3125 2775 3642 516 2456 -407
646 -407 432 -2314 -1387 -1085 -4078 -2074 -4540 -2845 -3227 -1807 -827 -2007 1108 918 1878 2009 3663
663 3663 2695 2142 4866 1361 1412 2221 -110 -86 -194 -1009 -2278 -1656 -3414 -2472 -3312 -2256 -1448 -3096
681 -3096 -1113 -349 240 1555 1197 2611 2691 2244 1756 3767 2847 2479 1720 -129 435 -55 -3571 -1906
699 -1906 -1119 -3531 -2454 -2869 -3283 -2867 -406 -959 -722 508 2133 1549 1650 4234 3834 3783 2839 2085
717 2085 3825 243 1756 186 -769 -1723 -4301 -1963 -3385 -2512 -2389 -2065 -946 -1129 143 -273 1122
$$ packed form
592C638j05j038q50k59j716j20p42p18j082J26m99l46J272P05J451j378O66J040
610D5J297J650Q47j109J512J4R13k581q80r11R0j271M3j587j236L67n61k268J237
629d389J522Q95p71J460J968J146j341K67L750k204J424o02l50Q67l126J940k863
646d07Q39k746R27L02k993K004k466J695l82J420R80j180L115j90R60J31J654
663C663r68n53K724l505N1Q09k331K4j08q15j269O22j758R42q40J056Q08j648
681c096J983P64N89J315l58J414Q0m47m88K011r20l68p59j849N64m90l516J665
699a906P87k412J077m15m14M16K461n53K37J230J625n84J01K584m00n1r44p54
717B085J740l582J513j570r55r54k578K338j422Q73J23L24J119j83J272m16J395
$$ plain form
734 1122 866 1670 2764 3051 4550 1749 4450 2412 1230 1401 -62 1474 -1894 -830 -3533 -2101
750 -2101 -3592 -2763 -1761 -2929 -1300 -926 -1209 1191 778 2193 1231 3376 2189 2883 2597 2123 2782
767 2782 1545 660 -184 -1206 -1502 -1603 -2726 -4224 -3905 -2921 -3961 -1096 -2778 -1622 -1569 559 619 2211
785 2211 2558 3788 2232 1783 1873 2468 2740 1389 -799 -638 -1600 -3567 -3014 -2515 -931 -2781 -3168 -2367
803 -2367 -2471 -683 -1009 1340 528 2109 2401 2290 3037 2930 2500 2872 1572 1371 189 1558 -720 484
821 484 -2089 -1563 -2708 -3916 -1729 -3098 -2701 -1373 -615 -1214 131 1110 1202 3435 2526 1550 2642 2776
839 2776 4273 1692 1923 569 1117 -1065 -3706 -925 -2089 -2612 -4182 -2466 -5073 -2810 -2087 -1380
855 -1380 -792 470 1164 1653 1772 4318 2258 3326 2659 4301 2112 864 1279 -821 549 -1288 -2110
$$ packed form
734A122k56Q04J094K87J499k801K701k038j182J71j463J536l368J064k703J432
750b101j491Q29J002j168J629L74k83K400m13J415r62K145j187O94k86m74O59
767B782j237q85q44j022k96j01j123j498L19R84j040K865j682J156N3K128O0J592
785B211L47J230j556m49R0N95K72j351k188J61r62j967N53M99J584j850l87Q01
803b367j04J788l26K349q12J581K92j11P47j07m30L72j300k01j182J369k278J204
821D84k573N26j145j208K187j369L97J328P58n99J345R79R2K233r09r76J092J34
839B776J497k581K31j354N48k182k641K781j164n23j570J716k607K263P23P07
855a380N88J262O94M89J19K546k060J068o67J642k189j248M15k100J370j837q22
$$ plain form
872 -2110 -3036 -2576 -2231 -3472 -2961 -1755 -3035 -623 -884 -139 1560 1333 3935 1490 3170 3063 1892
889 1892 3008 484 1812 198 152 -931 -2532 -1985 -2795 -3269 -3388 -3186 -3543 -1703 -2079 -1644 818 874
907 874 1956 2335 2841 3296 1015 4040 2598 2505 388 708 1076 -8 640 -2461 -1733 -3678 -3689 -4304
925 -4304 -4087 -2343 -2580 604 -1498 196 1391 301 3606 2938 4365 3085 3149 2235 2098 1637 938
942 938 -333 -1064 -1693 -1264 -1728 -2983 -3282 -3119 -2879 -2559 -954 -591 -228 1048 1691 2219 1619 3220 2840
961 2840 3801 3258 2164 3601 1955 -213 1221 436 -1536 -3155 -4108 -2727 -3626 -4593 -2427 -2020 -1723
978 -1723 -1698 -1406 1217 384 1835 2711 1910 2803 3943 2849 2787 2365 1388 632 582 -2278 -1759 -3740 -2851
997 -2851 -2089 -4759 -3180 -4931 -1402 -1544 348 646 -685 1628 1887 5198 3159 2850 3915 1855
$$ packed form
872b110r26M60L45j241N11J206j280K412k61P45J699k27K602k445J680j07j171
889A892J116k524J328j614m6j083j601N47q10m74j19K02l57J840l76M35K462N6
907H74J082L79N06M55k281L025j442r3k117L20L68j084O48l101P28j945j1o15
925d304K17J744k37L184k102J694J195j090L305o68J427j280O4r14j37m61o99
942I38j271p31o29M29m64j255k99J63K40L20J605L63L63J276O43N28o00J601l80
961B840R61n43j094J437j646k168J434p85j972j619r53J381q99r67K166M07K97
978a723K5K92K623q33J451Q76q01Q93J140j094o2m22r77p56n0k860N19j981Q89
997b851P62k670J579j751L529j42J892K98j331K313K59L311k039l09J065k060
$$ plain form
1013 1855 3215 1243 2248 1781 509 -164 -1373 -1882 -2628 -2866 -2997 -4003 -2183 -2354 -1967 -1568 -483
1030 -483 -449 1464 2075 3602 3606 1289 4462 2623 2829 2078 1164 720 242 -1883 -596 -2281 -1909 -4734
1048 -4734 -2779 -1891 -2884 -3037 -1534 490 278 784 -93 2834 2503 3505 1944 4443 4100 2205 2303
1065 2303 2881 284 -1186 -1977 -1075 -1637 -1331 -1644 -5232 -2610 -2950 -2101 -1076 -2042 192 268 1452 2024
1083 2024 2414 2777 4781 3149 2548 4765 2699 1514 631 -554 -414 -2529 -2841 -3188 -3346 -3757 -3427
1100 -3427 -756 -3072 -476 -405 -46 99 1805 3535 1436 3689 2784 3941 2411 2921 3505 149 708
1117 708 387 -888 -1654 -759 -1643 -4008 -2883 -3548 -2790 -3963 -2017 -1569 -475 113 710 2107 1588 3161
1135 3161 3502 4184 3898 1987 3180 1183 870 -1056 -421 -411 -2318 -2268 -2762 -3011 -2490 -2669 -3120 -2184 -2433
$$ packed form
1013A855J360j972J005m67j272o73j209n09p46k38j31j006J820j71L87L99J085
1030d83L4J913O11J527Mk317L173j839K06p51r14m44m78k125J287j685L72k825
1048d734J955Q88r93j53J503K024k12N06q77K927l31J002j561K499l43j895R8
1065B303N78k597j470p91R02n62L06l13l588K622l40Q49J025r66K234P6J184N72
1083B024L90L63K004j632o01K217k066j185q83j185J40k115l12l47j58m11L30
1100c427K671k316K596P1L59J45J706J730k099K253r05J157j530N10N84l356N59
1117G08l21j275p66Q95q84k365J125o65P58j173J946M48J094N88N97J397n19J573
1135C161L41O82k86j911J193j997l13j926O35J0j907N0m94k49N21j79m51R36k49
$$ plain form
1154 -2433 -271 352 1350 1120 2588 2768 3876 3811 3946 2961 2162 2331 268 362 -627 -3621 -1580 -3062
1172 -3062 -4051 -2503 -4639 -2193 -3066 -802 -816 -1496 1077 1541 2650 2792 4100 1639 4021 2984 1425
1189 1425 3553 205 1363 438 -1521 -1834 -2169 -1922 -2856 -2795 -3428 -2677 -2928 -2882 -42 -2072 991 976
1207 976 2830 2224 2678 4411 2137 3751 2756 -307 1562 -773 -360 -130 -1445 -2181 -2926 -3247 -4256
1224 -4256 -3240 -2560 -2809 -3467 -1406 45 1155 686 936 1886 3192 3790 4244 4027 2279 862 2464
1241 2464 1241 -398 -852 -1040 -1984 -3299 -1635 -2250 -3513 -3165 -2443 -741 -1309 -586 -24 447 1919
1258 1919 980 2747 3590 2749 3905 1856 1604 1457 950 859 -171 -692 -2945 -1000 -4207 -1594 -3750
1275 -3750 -3758 -2586 -1492 622 -915 -233 769 1853 2836 2741 4851 2933 2527 1675 2093 1875 -259 437
$$ packed form
1154b433K162O23R98k30J468J80J108o5J35r85p99J69k063R4r89k994K041j482
1172c062r89J548k136K446q73K264j4o80K573M64J109J42J308k461K382j037j559
1189A425K128l348J158r25j959l13l35K47r34O1o33P51k51M6K840k030L063j5
1207I76J854o06M54J733k274J614r95l063J869k335M13K30j315p36p45l21j009
1224d256J016O80k49o58K061J451J110m69K50R50J306N98M54k17j748j417J602
1241B464j223j639m54j88r44j315J664o15j263L48P22J702n68P23N62M71J472
1258A919r39J767Q43q41J156k049k52j47n07r1j030n21k253J945l207K613k156
1275c750qJ172J094K114j537O82J002J084R83r5K110j918m06q52M18k18k134O96
$$ plain form
1293 437 -404 -640 -3264 -3808 -2930 -4198 -2606 -3528 -1549 -1074 -1132 -112 -407 1686 1735 2259 1937 2903 3253
1312 3253 1975 3216 1126 1173 251 33 -606 -853 -2242 -3651 -2285 -2402 -3072 -1798 -2247 -2107 -1810 -222
1330 -222 657 896 1423 1304 2268 1784 3403 2622 2627 2089 2415 424 2098 -243 -1576 -1603 -1640 -1555 -2839 -2440
1350 -2440 -2461 -3175 -2821 -1282 -853 -787 2027 371 2728 2482 3177 2974 2027 2241 2244 917 637 506 -631
1369 -631 -2245 -886 -2769 -1437 -2579 -2280 -2656 -2312 -1921 -2355 309 -289 184 1756 2210 3295 2631
1386 2631 2994 1608 1273 3064 -4 1444 223 239 -1489 -1579 -1732 -2662 -2420 -3009 -3490 -1630 -1476 -1085
1404 -1085 -219 673 -346 2096 710 2167 3142 2614 591 2070 2671 1250 881 897 -1426 -977 -302
1421 -302 -1727 -1895 -2514 -2569 -2299 -1674 -790 -2632 -160 -1750 1802 1623 2874 2066 278 2214 2422 3279
$$ packed form
1293D37q41k36k624n44Q78j268J592r22J979M75n8J020k95K093M9N24l22R66L50
1312C253j278J241k090M7r22k18o39k47j389j409J366j17o70J274m49J40K97J588
1330b22Q79K39N27j19R64m84J619p81Nn38L26j991J674k341j333k7l7Q5j284L99
1350b440k1p14L54J539M29O6K814j656K357k46O95k03r47K14Lj327k80j31j137
1369f31j614J359j883J332j142K99l76L44L91m34K664n98M73J572M54J085o64
1386B631L63j386l35J791l068J448j221J6j728r0j53r30K42n89m81J860J54L91
1404a085Q66Q92j019K442j386J457R75n28k023J479O01j421l69J6k323M49O75
1421c02j425j68o19n5K70O25Q84j842K472j590L552j79J251q08j788J936K08Q57
$$ plain form
1439 3279 335 -1068 1093 819 -92 -2164 522 -3014 -1287 -1104 -1801 -673 -2760 -1256 -388 -512
1455 -512 -219 -184 2249 69 999 2856 3401 2885 -428 2675 963 1952 -836 1944 -1192 -439 -2610
1472 -2610 -2757 -1806 -1799 -1659 -2462 -967 -1277 -74 276 -373 1761 690 1089 3495 931 1702 221 41
1490 41 703 -1046 682 -2354 -884 -935 -1660 619 -2621 -1735 -2243 -2121 -869 -519 407 -457 1274 -466
1508 -466 630 1760 1789 2040 1362 860 758 675 1840 -268 1525 -1158 -1662 -1476 -3067 -2023 -666 -243
1526 -243 -1814 -204 -685 -236 344 -298 437 367 1849 1866 1545 2045 1056 1727 123 1322 675 -294 -523
1545 -523 -697 -377 -2445 -1327 -443 740 -660 -538 -717 220 105 860 103 2084 -189 3008 1884
1562 1884 2077 2175 1871 1198 -1034 361 -1444 -1439 -1907 -1647 -325 -1997 -1051 -842 -1346 475 -1152 -1185 -389
$$ packed form
1439C279k944j403K161k74r11k072K686l536J727J83o97J128k087J504Q68j24
1455e12K93L5K433k180R30J857N45n16l313L103j712R89k788K780l136P53k171
1472b610j47R51PJ40q03J495l10J203L50o49K134j071L99K406k564P71j481j80
1490D1O62j749J728l036J470n1p25K279l240Q86n08J22J252L50R26q64J731j740
1508d66J096J130K9K51o78n02j02q3J165k108J793k683n04J86j591J044J357M23
1526b43j571J610m81M49N80o42P35p0J482J7l21N00r89O71j604J199o47r69k29
1545e23j74L20k068J118Q84J183j400J22j79R37j15P55p57J981k273L197j124
1562A884J93R8l04o73k232J395j805Nm68K60J322j672R46K09n04J821j627l3P96
$$ plain form
1581 -389 642 348 954 964 1257 1599 1566 2393 1290 1239 340 1024 638 -988 -1049 141 -1243 -194 -844
1600 -844 -1636 -716 776 -893 -525 1112 1104 -539 239 1762 471 908 1193 1264 1513 803 570 1476 490
1619 490 1019 13 -1109 -1893 -1623 -550 -1636 -933 -870 834 -642 -452 550 230 1302 435 884 1495
1637 1495 152 1768 111 602 714 1286 -254 -1275 -1142 -2313 -105 -2565 -1583 -958 -238 203 -1016
1654 -1016 111 -475 6 -703 1391 551 322 2033 -284 982 276 468 275 -386 -222 -670 176 -690
1672 -690 -1844 -978 -825 -973 -674 -52 764 404 844 -101 632 414 733 778 228 -792 1582 1101 312
1691 312 426 -692 -18 -785 501 -1891 -56 -19 -1691 -1049 -423 -336 -1196 700 108 -391 893 1953
1709 1953 213 1568 1534 761 -507 1104 711 844 -893 -1629 -1219 104 -1769 -1079 -782 -391 -188 -1050
$$ packed form
1581c89J031k94O06J0K93L42l3Q27j103n1q99O84l86j626o1J190j384J049o50
1600h44p92R20J492j669L68J637qj643P78J523j291M37K85P1K49p10k33R06r86
1619D90N29j006j122p84K70J073j086P03O3J704j476J90J002l20J072q67M49O11
1637A495j343J616j657M91J12N72j540j021J33j171K208k460R82O25P20M41j219
1654a016J127n86M81p09K094q40k29J711k317J266p06J92j93o61J64m48Q46q66
1672f90j154Q66J53j48K99O22Q16l60M40r45P33k18L19M5n50j020K374m81p89
1691C12J14j118O74p67J286k392J835L7j672O42O26Q7q60J896n92m99J284J060
1709A953j740J355l4p73j268J611l93J33j737p36M10J323j873O90K97L91K03q62
$$ plain form
1727 -1050 733 63 -196 1263 -511 513 581 1052 818 852 -1464 344 1020 -132 548 -633 -923 -638
1745 -638 -664 277 15 126 -690 -738 541 278 -248 581 -428 444 1619 135 1046 586 1963 939 138
1764 138 370 -729 -672 -67 624 552 -2466 -132 -2257 -13 125 -154 857 -49 391 268 817 1036 1387
1783 1387 2129 17 770 953 7 -487 645 -188 -1349 -265 -80 110 -961 -1025 -526 402 156 812
1801 812 -423 34 -399 1511 1297 818 1072 1581 274 388 342 -250 -1424 -248 -812 1228 -542 -1049
1819 -1049 -1738 -1292 -9 -543 1836 -1035 134 992 -490 496 1066 959 -543 109 -341 1667 7
1836 7 -1411 416 595 -485 411 343 -581 -2268 -329 -201 290 349 -562 795 -996 1085 116 355 -661
1855 -661 1475 -174 898 -59 394 1000 790 -102 -719 -279 -615 -858 -1912 -1768 -1346 -993 -484 46 -276
$$ packed form
1727a050J783o70k59J459j774J024O8M71k34L4k316J808O76j152O80j181k90K85
1745f38k6R41k62J11q16m8J279k63n26Q29j009Q72J175j484R11m60J377j024q01
1764A38K32j099N7O05O91p2l018K334k125K244J38k79J011r06M40j23N49K19L51
1783A387P42k112P53J83r46m94J132q33j161J084J85J90j071o4M99R28k46O56
1801H12j235M57m33J910k14m79K54N09j307J14m6n92j174J176n64K040j770n07
1819a049o89M46J283n34K379k871J169Q58j482R86N70j07j502O52m50K008j660
1836Gj418J827J79j080Q96o8r24j687J939J28M91N9r11J357j791K081r69K39j016
1855f61K136j649J072r57M53O06k10q92o17M40l36k43j054J44M22L53N09N30l22
$$ plain form
1874 -276 -1892 -56 1517 1353 1547 850 1656 -1600 1039 2192 387 470 151 1024 -1562 -1019 -69 126
1892 126 -633 -815 894 -174 -113 908 695 916 -367 1441 -766 1506 -560 1222 1493 350 2027
1909 2027 -658 636 -813 1338 -322 -1773 478 -1778 -701 -1905 224 -1407 -483 -641 496
1924 496 186 151 1457 882 399 1207 42 978 1689 886 183 889 293 -1331 354 -1718 -602 -668 -1540
1943 -1540 -76 -418 -1097 -898 -355 12 374 1121 -637 1420 1060 719 181 853 1801 -296 1071 -88
1961 -88 365 -479 -807 -110 366 -1364 410 -1194 -756 -854 -469 642 -368 -41 -519 1247 980 1141 1745
1980 1745 199 2307 -546 1575 269 837 252 -518 295 -2201 -1140 -2061 -1672 -1751 -1106 -639 -1691
1997 -1691 890 207 796 827 718 2083 -10 2791 -21 642 -360 100 1833 -204 292 -428 -412 -829
$$ packed form
1874b76j616J836J573j64J94o97Q06l256K639J153j805Q3l19Q73k586N43R50J95
1892A26p59j82J709j068O1J021k13K21j283J808k207K272k066J782K71j143J677
1909B027k685J294j449K151j660j451K251k256J077j204K129j631R24j58J137
1924D96l10l5J306n75m83Q08j165R36P11q03p03P06n96j624J685k072J116o6q72
1943a540J464l42o79J99N43L67L62P47j758K057l60l41n38O72R48k097J367j159
1961h8M53q44l28O97M76j730J774j604M38r8L85J111j010L27m78J766k67J61O04
1980A745j546K108k853K121j306N68n85p70Q13k496J061r21L89p9O45M67j052
1997a691K581o83N89L1j09J365k093K801k812O63j002M60J733k037M96p20J6m17
$$ plain form
2015 -829 28 -906 -2159 -678 -1231 -1124 -487 555 -156 -563 676 827 1848 782 2224 1795 1799 1136
2033 1136 34 919 -646 -67 -897 -860 -1755 -421 -1758 -1207 -1193 -1190 -532 -1033 -1052 -456 601 95 172 1034
2053 1034 299 1911 2148 557 176 -731 1738 567 -1137 10 -1285 -1028 -733 -207 -1323 -280 -1478
2070 -1478 -643 -969 83 -805 343 2096 223 263 1477 900 951 624 1371 -336 2676 548 693 -1104
2088 -1104 244 629 -1875 588 -857 83 -434 152 -236 -2328 1191 -172 1735 1889 -277 956
2104 956 463 1269 -183 1047 831 -711 183 -141 -17 -922 -543 -946 -646 -849 -1325 847 424 193 -155
2123 -155 -180 477 160 1148 1196 705 109 2828 11 743 1792 1058 306 -1166 -624 -954 -1929 -369 189
2142 189 -2715 -1523 -352 -193 -686 -2384 834 -1226 118 2185 1181 1456 1372 2666 -501 192 -202
$$ packed form
2015h29Q57r34j253J481n53J07O37J042p11m07J239J51J021j066J442m29Mo63
2033A136j102Q85j565N79q30L7q95J334j337N51J4LO58n01j9N96J057n06P7Q62
2053A034p35J612K37j591l81r07K469j171j704J147j295K57K95N26j116J043j198
2070a478Q35l26J052q88J148J753j873M0J214n77N1l27P47j707L012k128J45j797
2088a104J348L85k504K463j445R40n17N86l88k092L519j363J907J54k166J233
2104I56m93Q06j452J230k16j542Q94l24J24r05L79m03L00k03m76K172m23k31l48
2123a55k5O57l17R88M8m91n96K719k817P32J049p34p52j472N42l30r75J560N58
2142A89k904J192J171J59m93j698L218k060J344K067j004K75q4J294l167O93l94
$$ plain form
2159 -202 -785 1262 -1033 592 -107 -799 -1349 -314 -1937 -833 135 -1205 869 -238 -79 742 -342
2176 -342 410 -602 1975 610 553 917 1665 1654 -102 406 180 -970 1 -953 -360 -1220 -1840 -1686 -278
2195 -278 -1406 56 277 -1407 -270 824 765 170 502 266 854 1586 426 379 54 -228 -409 -1851
2213 -1851 -836 -1147 -41 -1451 759 -731 -1341 -489 -204 253 428 1253 2258 825 2004 -252 937
2230 937 2472 630 1067 472 1330 318 940 506 166 -251 667 -905 547 -594 -1940 -1699 571
2247 571 -303 1837 555 739 1880 863 895 670 726 571 499 1173 257 582 -686 -102 -251 -1005 -794
2266 -794 -2326 -49 -2597 -587 -382 -1880 -10 -1442 263 460 -278 3506 37 922 59 1824
2282 1824 21 1140 918 488 1240 -62 520 38 -226 -650 59 -935 -1307 -397 -2306 770 -755 -1269
$$ packed form
2159b02n83K047k295J625o99o92n50J035j623J104R68j340K074j107J59Q21j084
2176c42P52j012K577j365n7L64P48j1j756N08k26j150R71r54N93q60o20J54J408
2195b78j128J462K21j684J137J094n9n95L32k36N88P32j160m7l25k82j81j442
2213a851J015l11J106j410K210j490o10Q52K85M57J75Q25J005j433J179k256J189
2230I37J535j842M37n95Q58j012O22m34l40m17R18j572J452j141j346K41K270
2247E71q74K140j282J84J141j017L2k25N6j55p2O74r16L25j268N84j49p54K11
2266g94j532K277k548K010K05j498J870j432J705J97p38L784l469Q85q63J765
2282A824j803J119k22m30P52j302N82m82k64m24P09r94l72R10j909L076j525n14
$$ plain form
2300 -1269 818 -466 -326 747 1037 765 907 1457 -204 627 1026 -19 -1012 244 -365 -440 -1242 -742
2318 -742 -1430 199 879 101 -1165 -566 -163 1001 942 -481 656 1228 259 779 1449 -609 29 -1106
2336 -1106 1350 -79 -357 516 442 -835 -694 -713 -1032 -362 -716 -629 -81 473 522 33 1577 -942 323
2355 323 -20 833 620 1276 1565 -1461 1057 -316 848 -293 -1916 621 -117 -316 -2034 -271 -1490
2372 -1490 -1343 1311 562 745 -1514 66 1751 1290 886 -321 87 140 1392 -130 888 463 -1252
2389 -1252 -1273 -1392 -1251 -911 -1075 399 42 -1227 -146 -667 656 -236 1333 1170 1036 916 1967 1734
2407 1734 -823 1163 -1039 444 322 1908 -467 -383 180 -679 -1988 437 -499 -338 -1434 385 525
2424 525 -41 665 -1367 914 -1475 321 655 1064 934 -182 1203 -528 -913 906 -643 1192 -464
$$ packed form
2300a269K087j284J40J073K90k72J42N50j661Q31L99j045r93J256o09p5q02N00
2318g42o88J629O80p78j266N99M03J164n9j423J137N72r69N20O70k058O38j135
2336a106K456j429k78Q73p4j277J41j9l19O70l54Q7N48N54M9m89J544k519J265
2355C23l43Q53k13O56K89l026K518j373J164j141j623K537p38j99j718J763j219
2372a490J47K654p49J83k259J580J685m61m04j207M08N3J252j522J018m25j715
2389a252k1j19J41L40j64J474l57j269J081n21J323q92J569j63j34j20J051k33
2407A734k557J986k202J483j22J586k375Q4N63q59j309K425r36J61j096J819J40
2424E25n66P06k032K281k389J796L34M09j30j116J385j731l85J819j549J835j656
$$ plain form
2441 -464 243 -1011 -1076 -1234 -1222 -475 -505 1957 -183 666 -115 -737 -203 689 718 506 282 -409 -272 253
2461 253 -1573 685 246 397 -682 -213 -147 -2715 -8 -2175 779 -1541 -626 -743 1517 558 422
2478 422 941 882 -269 428 349 1076 -928 -421 569 -1523 -1250 -617 1111 -1883 -2037 -1267 -2223 285 -598
2497 -598 -288 312 1612 -553 -752 159 268 1091 720 385 405 794 376 0 -993 1433 -1312 -24 -2557
2516 -2557 -1645 469 -59 -183 -225 -421 -1423 564 -160 -639 -997 -310 468 624 -494 1031 -1168 1160
2534 1160 9 1166 -1382 1066 135 -602 957 2039 -1250 -453 -491 -2206 494 681 186 460 -1244
2551 -1244 662 -1423 930 451 358 2418 375 131 -1 1003 -558 977 775 -1011 -109 270 411
2568 411 -1240 76 121 815 -505 -945 -229 182 870 -359 199 -232 1055 337 -278 165 -231 1128
$$ packed form
2441d64P07j254o5j58J2P47l0K462k140Q49p81o22N34Q92K9k12k24o91J37N25
2461B53j826K258m39J51j079M69O6k568K707k167K954k320R15j17K260r59j36
2478D22N19n9j151O97p9P27k004N07R90k092K73O33J728k994j54P70r56K508q83
2497e98L10O00J300k165j99R11J09Q23l71l35K0L89m18l76r93K426k745J288k533
2516b557R12K114n28j24m2j96j002J987p24m79l58O87P78J56j118J525k199K328
2534A160j151J157k548K448r31p37J559J082l289P97l8j715K700J87m95K74j704
2551a244J906k085K353m79r3K060k043k44j32J004j561J535k02j786R02L79J41
2568D11j651J316M5O94j320m40P16M11O88j229N58m31J287p18o15M43l96J359
$$ plain form
2586 1128 -1168 438 -55 245 -551 -375 553 -12 805 -1081 -1498 -1645 -39 54 116 338 -1308 1436
2604 1436 1383 92 488 -141 -798 -274 933 166 -1508 530 -981 1479 87 595 -723 404 -593
2621 -593 -1570 441 -2115 -429 211 -1359 867 -1612 228 389 -59 976 804 -709 -556 186 -1332
2638 -1332 -543 287 279 -550 -448 274 -998 1639 -889 287 1261 -1157 517 -1642 -663 -186 159 -988
2656 -988 -137 859 93 -153 216 -1228 133 446 -103 -492 -774 12 564 -146 35 953 -734 -535 -598
2675 -598 172 -112 -38 2 560 1357 301 1360 1295 1133 913 601 1217 924 -1311 909 1167 -456 -11
2694 -11 -1118 69 287 1133 888 528 831 -22 723 -762 422 -519 -906 468 450 387 -800 419 -724
2713 -724 448 -649 -654 663 -29 1457 357 523 -262 -365 76 -563 -221 -886 -592 489 360 1391
$$ packed form
2586A128k296J606m93L00p96J76R28n65Q17j886m17j47J606R3O2K22j646K744
2604A436n3j291L96o29o57N24J207p67j674K038j511K460j392N08j318J127r97
2621e93r77K011k556J686O40j570K226k479J840J61m48J035j72j513J53P42j518
2638a332P89Q30qq29J02P22j272K637k528J176R74k418J674k159R79M77L45j147
2656i88Q51R96p66k46L69j444J361L13n49l89k82P86N52p10J81R18j687J99o3
2675e98P70k84P4M0N58P97j056J059o5j62k20l12O16k93k235K220K58j623M45
2694a1j107J187K18Q46k45l60L03q53P45j485J184r41l87J374j8o3j187J219j143
2713g24J172j097nJ317o92J486j100J66p85j03M41o39L42o65K94J081j29J031
$$ plain form
2731 1391 29 1109 -554 -36 -310 -416 -88 -42 539 824 754 884 255 539 -379 1188 336 -154 -314
2750 -314 -1218 771 -298 354 -739 -76 563 474 1185 515 942 571 -723 770 14 413 157 533 2018
2769 2018 -1359 1563 -1015 -247 451 84 -41 -185 -453 -792 -673 -1113 -712 1168 -670 -604 -267 913
2787 913 560 730 -362 378 583 -321 272 -441 -476 1052 1321 -311 -789 -793 63 -698 1074 -950 678
2806 678 -937 54 -614 5 1797 -272 245 87 -412 362 -335 434 702 912 203 797 243 -656 250
2825 250 -568 1596 -681 7 -450 -101 -1327 -1390 96 -391 -882 321 -222 48 -1223 165 250 140
2843 140 98 95 -106 825 1002 -474 -653 -655 -17 877 173 1003 -475 -767 -236 -496 531 -82 -783 97 -130
2864 -130 273 -594 -304 -190 -518 -1061 -876 426 -171 317 -203 64 665 -999 -252 -38 -105 -154 -461 1473
$$ packed form
2731A391j362J080j663N18k74j06L28M6N81K85p0J30o29K84r18J567q52m90j60
2750c14r04J989j069O52j093O63O39q9P11o70M27l71j294J493p56L99k56L76J485
2769B018l377K922k578P68O98l67j25j44k68l39J19m40M01J880j838O6L37J180
2787I13l53J70j092P40K05r04N93p13l5J528K69j632m78mQ56p61J772k024J628
2806F78j615R91o68O19J792k069N17j58m99P74o97P69K68K10p09N94n54q99R06
2825B50q18K164k277O88m57L49j226o3J486m87m91J203n43K70j271J388Q5j10
2843A40m2lk01R31J77j476j79kO38Q94p04Q30j478k92N31k60J027o13p01Q80k27
2864a30M03q67K90J14l28n43J85J302n97M88n20K67O01j664P47K14o7m9l07J934
$$ plain form
2884 1473 617 1508 41 -750 1002 42 445 -1231 288 -329 142 -685 -972 1149 -120 499 471 48
2902 48 656 202 1492 -1658 -55 -2150 -836 1985 -6 2645 1248 16 -505 36 548 312 819
2919 819 932 260 240 1505 698 -973 1305 171 -887 -1391 625 -686 49 -1183 -1546 -61 -1436
2936 -1436 669 1453 -971 -98 -204 -1936 -42 -5 232 -353 1907 469 -511 635 -768 506 -388
2953 -388 744 -776 -1296 -1079 487 -351 -1200 -1148 -646 272 475 207 912 256 57 687 -685 1656 805
2972 805 -206 -422 -30 174 -194 -119 -1655 -1393 650 1305 -938 13 -94 -1203 1365 -1459 36 -1086
2990 -1086 381 369 -1036 1365 -93 725 325 331 810 -730 1404 -336 577 -746 57 11 -773 -76
3008 -76 -2084 -479 -1412 -256 -29 -1299 249 -875 1237 277 -201 679 -774 363 389 -95 -30 -1119
$$ packed form
2884A473q56Q91j467p91J752r60M03j676J519o17M71q27k87K121j269O19k8m23
2902D8O08m54J290l150J603k095J314K821j991K651j397j232n21N41N12k36N07
2919H19J13o72k0J265q07j671K278j134j058n04K016j311P35j232l63J485j375
2936a436K105P84k424Q73j06j732J894L7K37n85K260j438r80J146j403J274q94
2953c88J132j520n20K17J566q38q49N2N02R18K03k68P05o56j99O30j372K341q51
2972H05j011k16L92K04l68P5j536K62K043O55k243R51j07j109K568k824J495j122
2990a086J467j2j405K401j458Q18m00OM79j540K134j740R13j323Q03m6p84O97
3008g6k008J605r33J156K27j270J548j124K112r60m78Q80j453J137K6m84O5j089
$$ plain form
3026 -1119 -1472 171 298 -1302 -597 -309 467 -1103 44 224 -1130 -520 -314 -713 68 1029 588 937
3044 937 572 -192 722 -1210 -525 503 -279 441 -1007 -2417 241 373 -1083 -1263 -1378 55 -866 76
3062 76 -392 -6 1005 -5 711 -1688 520 373 -187 7 -537 1290 -935 1 -654 1329 976 -324
3080 -324 -813 -546 1144 -524 -736 670 -74 459 -314 -35 -266 -364 1492 328 -539 -992 927 498
3098 498 -835 1246 46 397 -1943 484 789 -615 -414 -1171 -562 -1565 -514 -584 -887 114 -355
3115 -355 -478 48 797 315 -369 -33 -157 -576 -320 780 -101 -214 -1527 852 1908 32 154 -909
3133 -909 -334 868 -1432 -729 -1542 -1232 107 -1847 508 -589 861 -164 23 12 1197 913 -152
3150 -152 -720 1342 -1346 1226 -143 -826 -99 -1377 222 -234 285 -1695 -634 -1591 -42 -319 -373
$$ packed form
3026a119l53J643J27j600P05K88P76j570J147J80j354O10K06l99P81R61m41L49
3044I37l65p64R14j932O85J028p82P20j448j410K658J32j456j80j15J433r21R42
3062G6m68L86J011j010P16k399K208j47n60J94n44J827k225R36o55J983l53j300
3080c24m89K67J690j668k12J406p44N33p73K79k31r8J856j164q67m53J919m29
3098D98j333K081j200L51k340K427L05j404K01p57O09j003J051p0l03J001m69
3115c55j23N26P49m82o84L36j24m19K56J100q81j13j313K379J056j876J22j063
3133i09N75J202k300P03q13L10J339j954K355j097J450j025J87j1J185k84j065
3150a52n68K062k688K572j369o83P27j278J599m56N19j980J061r57J549k77n4
$$ plain form
3167 -373 149 93 -91 897 999 2560 40 629 -1812 -16 87 -745 -555 -499 -197 -1710 -997 8 -483
3186 -483 -551 282 35 -886 74 885 1119 -212 264 73 -145 1999 38 150 313 -214 185 -915 572
3205 572 311 875 -800 -111 770 290 303 -553 -1030 887 -727 -1229 415 -1090 874 141 89 -768 1386
3224 1386 93 195 546 -1447 -1295 1172 -635 250 1095 167 89 -744 -678 -1657 -499 -1369 1371 577
3242 577 1239 -37 1039 1147 208 1524 -204 557 -767 775 655 -491 598 -56 -916 -1040 -970 -536
3260 -536 -1528 654 148 125 -559 171 -426 -229 168 -388 1091 -489 186 -403 235 990 -1332 -936 -580
3279 -580 -27 -767 -734 -607 -672 637 -1128 -765 74 -1304 -245 236 -811 -1806 538 294 -1706 -154
3297 -154 -77 -364 319 202 120 -873 1476 709 -440 -51 308 -195 -999 98 -1064 415 -397 -1584 758
$$ packed form
3167c73N22n6j84R88J02J561k520N89k441J796J03q32J90N6L02j513P13J005m91
3186d83o8Q33k47r21R60Q11K34j331M76j91k18K144j961J12J63n27L99j100J487
3205E72k61N64j675O89Q81m80J3q56m77J917j614n02J644j505J964p33n2q57K154
3224A386j293J02L51j993J52K467j807Q85Q45r28p8q33O6r79J158q70K740p94
3242E77O62j276J076J08r39J316j728P61j324J542j20j146J089o54q60j24P0M34
3260e36r92K182n06k3o84P30n97J97L97n56J479j580O75n89O38P55k322L96L56
3279e80N53p40L3J27o5J309j765L63Q39j378J059M81j047r95K344k44k000J552
3297a54P7k87O83j17q2r93K349p67j149L89L59n03q04J097j162J479q12j187K342
$$ plain form
3316 758 458 -758 -386 -1134 461 -110 697 734 1224 1568 190 781 153 -844 -746 21 -1632 -511 19
3335 19 471 -52 -200 67 236 -742 -269 -895 202 -1006 651 191 -73 1326 -503 -306 1257 1696
3353 1696 178 -1259 -774 -697 -900 8 -711 646 -1012 1008 -316 197 -1339 1561 1042 -674 1899
3370 1899 -845 1865 -912 720 1839 52 1076 -594 761 -12 -82 58 -871 363 -456 620
3386 620 -531 234 719 -125 -298 29 986 -697 -108 -1084 -451 338 -31 340 1504 -198 -5 -217 -362
3405 -362 582 345 946 281 149 731 -240 447 567 -423 -169 340 176 716 386 54 715 1874 650
3424 650 -885 727 362 415 1061 -1199 -1087 71 -1156 -648 -539 1156 -171 1008 -888 -240 1035
3441 1035 -465 888 -321 -72 -1344 -685 -41 -707 412 -309 183 -576 -729 793 -1431 707 -1496
$$ packed form
3316G58l00j216L72p48J595n71Q07L7M90L44j378N91o28r97R8P67j653J121N30
3335A9M52n23j48K67J69r78M73o26J097j208J657m60k64J399j829J97J563M39
3353A696j518j437M85P7k03R08p19J357j658K020j324N13j536K900n19j716K573
3370A899k744K710k777J632J119j787J024j670J355p73p0J40r29J234q19J076
3386F20j151P65M85q44j73L27R57j683N89r76O33P89l69L71J164j702J93k12j45
3405c62R44k37O01o65j32N82r71O87J20r90K54N09j64N40l30l32O61J159j224
3424F50j535J612l65N3O46k260J12J158j227N08J09J695j327J179j896O48J275
3441A035j500J353j209K49j272O59O44o66J119p21M92p59j53J522k224K138k203
$$ plain form
3458 -1496 1067 -647 -214 -533 -1331 -473 -1988 1783 -1510 -584 719 -460 1110 -1063 -75 454 -834
3475 -834 -965 -918 470 136 217 463 -67 1265 1377 1022 446 -1028 -493 -1134 62 -989 255 -57 -1576
3494 -1576 -479 953 -374 -723 -280 -72 2062 4 72 -56 -410 121 -633 -641 -173 824 244 -1746 260
3513 260 -355 -641 -356 -1386 -337 527 1722 393 -242 181 -2307 844 -509 619 1040 1127 701 -250
3531 -250 1335 -115 -617 453 1317 1235 630 -243 -1142 1870 -506 223 1001 84 2203 -1704 402 -681
3549 -681 -1078 -269 400 810 -275 -881 -132 180 1073 110 361 -1007 1213 232 587 531 -1048 -632 822
3568 822 -633 -1461 458 -1421 -468 -113 203 -1007 -176 -32 -949 -317 415 -1709 949 581 308 413
3586 413 53 157 160 -807 46 -107 412 776 1385 161 -949 879 -143 1369 612 -629 -127 563 184
$$ packed form
3458a496K563j714M33l19p98Q58j515L771l293R26J303j179J570k173R88N29j288
3475h34j31M7J388l34Q1K46n30J332J12l55n76j474N35o41J196j051J244l12j519
3494a576J097J432j327l49M43K08K134k058O8j28l54N31p54qM68R97n80j990K006
3513B60o15k86K85j030J049Q64J195j329o35M23k488L151j353J128M21Q7m26r51
3531b50J585j450n02J070Q64q2o05q73q99L012k376P29P78r17K119l907K106j083
3549f81l97Q09O69M10j085o06P49L12Q93r63K51j368K220r81L55n6j579M16J454
3568H22j455q28J919j879R53L55L16j210Q31J44r17O32P32k124K658l68k73J05
3586D13l60J04Lr67Q53j53N19L64O09j224j110J828j022J512p57j241N02O90l79
$$ plain form
3605 184 72 80 -577 596 1898 -377 732 -633 -247 -747 -737 1140 -1210 278 -1181 307 307 583
3623 583 349 -1096 1319 177 372 445 46 844 963 1188 -553 -586 -257 -134 31 237 -527 -91 1207
3642 1207 -662 136 -197 -1552 99 -1593 -82 600 1 348 -282 587 -1656 1218 -790 -423 405
3659 405 504 -725 1614 44 334 268 -219 -897 -429 1121 -997 597 370 216 -101 -769 -248 -614 -496
3678 -496 -1037 1461 350 -1380 2692 -786 484 -67 1384 -1555 -37 768 -562 1586 95 497
3694 497 427 -569 -835 137 1248 -420 -1119 -1326 1109 -35 -845 714 -1100 1251 -381 100 529 -1469
3712 -1469 715 -1259 328 -1219 805 1141 -859 -496 -895 1340 412 647 264 -584 1205 -1614 -655
3729 -655 120 283 331 -1049 695 771 1859 -52 1084 290 -930 -205 -448 181 -353 -204 -464 1128
$$ packed form
3605A84j12Qo57J173J302k275J109j365L86n00J0J877k350J488j459J488%K76
3623E83k34j445K415j142J95P3l99P98J19K25j741l3L29J23J65K06p64M36J298
3642A207j869P98l33j355J651j692J511O82n99L47o30Q69k243K874k008L67Q28
3659D05R9j229K339j570K90o6m87o78M68J550k118J594k27j54l17o68N21l66J18
3678d96n41K498j111j730M072l478J270n51J451k939J518Q05j330K148j491M02
3694D97p0r96k66R72J111j668o99k07K435j144q10J559j814K351j632M81M29j998
3712a469K184j974J587j547K024L36k000L63l99K235r28K35l83q48J789k819R59
3729f55P75J63M8j380J744P6J088j911J136p94j220P25k43O29n34J49k60J592
$$ plain form
3747 1128 1831 -1324 1031 -645 831 698 -1712 630 282 -711 709 -121 991 -983 280 588
3763 588 -92 1790 191 -88 -12 721 887 374 575 -1674 -660 195 -399 67 -382 1613 -1480 813
3781 813 356 218 -111 540 157 -37 1198 926 269 1112 -833 648 -1068 -717 -366 -1339 -465 -2108
3799 -2108 1083 -1524 365 757 -706 768 -400 961 -1010 564 -255 -109 187 -18 148 362 159
3816 159 1161 -160 948 225 214 -587 -156 -1343 -463 839 -628 1455 -133 415 -459 -258 -555 -246
3834 -246 1417 262 585 401 1169 1732 167 813 -246 734 805 595 -267 -1348 593 -152 191 -471
3852 -471 -1097 -702 -851 372 -203 -391 94 -178 424 -401 25 517 61 198 641 -397 305 -311 157
3871 157 -1830 683 -877 369 127 -976 -50 -260 945 -1757 1273 151 1313 -581 258 638
$$ packed form
3747A128P03l155K355j676J476j33k410K342l48r93J420q30J112j974J263L08
3763E88o80J882j599k79P6P33J66n13K01k249J014Q55n94M66m49J995l093K293
3781H13m57j38l29O51l83j94J235k72o57Q43j945J481j716L51L51r73Q74j643
3799b108L191k607J889L92j463J474j168J361j971J574q19J46K96k05J66K14k03
3816A59J002j321J108p23j1q01M31j187Q80J302j467K083j588N48q74K01k97L09
3834b46J663j155L23j84P68N63j565O46j059R80P1k10q62j081J941p45L43o62
3852d71o26L95j49J223n75j88M85k72O02q25M26M92m56J37M43j038P02o16M68
3871A57j987K513j560J246k42j103R26k10J205k702L030j122J162j894Q39L80
$$ plain form
3887 638 -877 1532 -1245 608 102 -962 1000 808 376 -1882 -142 -1072 -886 1410 54 60 68 808
3905 808 686 596 1437 621 284 267 755 1022 -67 434 114 1029 -1919 434 -581 -1136 397 -588 943
3924 943 -991 578 -735 -492 102 -411 -244 199 459 1401 867 9 421 -1430 -394 595 -9 -254
3942 -254 347 755 -977 -840 150 -419 -415 240 -1188 20 722 -319 1057 115 70 7 219 337 -16 391
3962 391 477 845 2419 -1260 1785 -653 -217 40 -473 -826 -404 -128 -1511 1207 -232 228 381 -767
3980 -767 126 -1312 1312 -2074 -1125 589 431 1268 987 1413 38 619 104 373 571 -557 244 -466
3998 -466 -1016 -3010 46 -380 -712 517 -1351 -471 546 879 1025 1139 -155 122 803 -206 548 -92
4016 -92 -1169 740 -856 -86 -882 -2870 -1205 1101 -93 -523 -1323 0 165 -1021 -1917 61 286
$$ packed form
3887F38j515K409k777J853n06j064J962j92m32k258J740r30J86K296j356OQP40
3905H08j22r0Q41q16l37j7M88K67j089N01l20R15k948K353j015n55J533r85J531
3924I43j934J569j313K43N94n13J67M43K60R42n34q58M12j851J036R89o04k45
3942b54O01M08j732J37R90n69MO55j428J208P02j041J376r42m5o3K12J18l53M07
3962C91Q6L68J574l679L045k438M36K57n13l53M22K76j383K718j439M60J53j148
3980g67Q93j438K624l386R49J714j58Q37k81M26j375N81n15K69J98j128Q01p10
3998d66n50j994L056m26l32J229j868Q80J017L33J46J14j294K77O81j009P54o40
4016i2j077J909j596P70p96j988J665K306j194m30q00J323J65j186q96J978K25
$$ plain form
4033 286 908 980 -367 -65 -140 528 -132 211 1114 247 207 86 -555 1061 1232 1109 -18 -348 273 -1278
4053 -1278 183 -832 591 -416 966 -1083 203 469 -811 916 650 1235 -69 799 456 -40
4069 -40 543 382 138 130 -616 -251 -47 843 -84 -320 -333 -329 119 -904 -49 -430 1100 753 713 479 -986
4090 -986 -328 -818 721 -1015 707 -444 -912 -1205 -1838 194 -336 -129 -733 -116 395 -1321 462 1340
4108 1340 -1102 1179 -484 -503 558 -416 343 -746 631 -27 -16 -668 685 -779 88 -250 -1951
4125 -1951 77 -1496 -1805 936 -1342 1358 -1156 -885 -34 -1358 912 1010 371 -476 325 -80 -1235
4142 -1235 1272 -1326 732 -1240 -137 323 249 1558 -1662 -348 -327 761 397 -388 421 -1175 -379
4159 -379 -633 705 525 -172 126 -1312 793 -85 -476 429 -1344 -459 -986 785 194 420 1250 -799
$$ packed form
4033B86O22P2j347L02p5O68o60L43R03q67m0j21o41J616J71j23j127l30O21j551
4053a278J461j015J423j007J382k049J286K66j280J727k66N85j304Q68l43m96
4069d0N83j61k44qp46L65K04Q90r27k36j3MM48j023Q55l81J530l47m0k34j465
4090i86O58m90J539j736J722j151m68k93o33K032n30K07o04O17N11j716J783Q78
4108A340k442K281j663j9J061r74P59j089J377o58J1o52J353j464Q67l38j701
4125a951K028j573l09K741k278K700k514K71Q51j324K270R8o39q47Q01m05j155
4142a235K507k598K058j972J103M60p4J309l220J314K1J088l64p85Q09j596P96
4159c79k54J338j80o97K98j438K105q78l91R05j773Q85n27J771n91K26Q30k049
$$ plain form
4177 -799 1356 285 240 -170 -176 819 287 204 -255 160 315 109 891 -1419 -129 858 623 -124 -445 569
4197 569 -672 -35 -241 -7 -993 -136 337 -1017 -455 -1700 1180 303 -895 836 -906 622 -408
4214 -408 1077 1317 -176 450 -576 552 1288 732 737 -1535 649 -424 111 643 -903 -1329 295 831
4232 831 -536 -330 839 90 1290 -732 946 -328 -381 14 -55 157 -1100 -490 519 -979 -164 781
4250 781 -227 -153 169 -1088 832 856 815 1192 489 -1012 -317 1351 273 -215 858 -822 351 309
4268 309 651 760 165 276 -1341 652 -1141 -1065 -15 -223 536 -825 740 -171 350 -65 911 34
4286 34 -1848 1851 827 -71 527 1470 263 -818 634 -1380 -22 -26 -1085 -47 -34 38 -235 1121
4304 1121 -1680 1346 -183 1350 -20 4 -88 -1095 466 1358 693 -663 1603 -186 921 -1065
$$ packed form
4177g99K155j071m5m10oR95n32q3m59M15J55k06P82k310J290R87k35p47l21J014
4197E69j241O37k06K34r86Q57M73j354N62j245K880q77j198J731j742J528j030
4214d08J485K40j493O26j026J128P36n56Nk272K184j073N35N32j546m26J624N36
4232H31j367K06J169p49J200k022J678j274n3L95o9K12j257O10J009j498Q15R45
4250G81j008P4L22j257J920K4m1L77p03j501O95J668j078m88J073j680J173m2
4268C09L42J09n95J11j617J993j793P6J050k08P59j361J565r11N21m15R76q77
4286C4j882L699j024q98N98R43j207j081J452k014J358mj059J038J3P2k73J356
4304A121k801L026j529J533j370K4r2j007J561Q92o65j356K266j789J107j986
$$ plain form
4320 -1065 815 -136 1968 899 -167 -141 -1049 3 -470 704 1404 -739 1553 -510 478 -233 -1096
4337 -1096 575 -1951 -16 -100 -189 508 -794 81 66 849 457 308 554 -490 267 -1508 527 -444
4355 -444 -133 682 -22 470 -738 549 97 -5 -550 -667 650 -995 664 563 -474 1097 -1103
4372 -1103 2432 236 742 -376 921 -6 -2155 90 620 -543 -408 -780 415 488 372 645 -163
4389 -163 582 449 -1184 -136 -527 626 958 693 -1028 692 324 -1176 -225 -1546 43 -273 -190 176
4407 176 241 40 -973 -82 -1300 646 -719 48 -1103 -469 1692 -594 1833 -207 -1123 -705 -964
4424 -964 -595 -1821 448 -951 -73 -561 1077 1371 -967 -209 682 -392 -1137 -645 201 -66 509 -840
4442 -840 -712 -1024 -149 -174 -1877 355 -690 1132 -537 -499 646 -129 -859 51 -46 763 1123 -231 -614
$$ packed form
4320a065J880r51K104j069j066K6r08J052m73J174P00k143K292k063R88p11q63
4337a096J671k526J935q4q9O97j302Q75j5P83l92j49K46j044P57j775K035r71
4355d44L11Q15p04M92j208J287m52j02n45j17J317j645J659j01j037J571k200
4372a103L535k196N06j118J297r27k149K245N30j163J35l72J195P3j16K73q08
4389a63P45j33j633J048l91J153L32k65j721J720l68j500R51j321J589l16Q3L66
4407A76O5k01j013Q91j218J946j365P67j151O34K161k286K427k040r16M18k59
4424i64L69j226K269j399Q78m88J638K94k338P58Q91j074p45M92Q46k67N75j349
4442h40J28l12Q75k5j703K232j045J822j669L8J145p75p30R10r7Q09L60j354l83
$$ plain form
4461 -614 232 -285 -680 -403 609 -471 506 -1464 937 770 -77 115 654 429 729 732 -1432 1644 480
4480 480 906 78 -600 -991 416 638 -498 -176 -554 1973 764 604 -659 -7 1333 -370 -637 1909
4498 1909 -419 575 -2020 403 403 -884 -143 -956 411 -1398 -286 1359 -1046 445 -2390 -55
4514 -55 -972 -247 1231 -943 594 -871 69 -1587 1116 592 17 -121 -535 111 630 -339 -1681 -322
4532 -322 1358 -311 639 -1093 -214 -1449 -1354 966 -1463 396 -1035 539 745 975 932 -1278 1658
4549 1658 -402 934 -220 159 -57 -496 948 1072 -397 -892 -788 1276 522 66 621 -748 586
4566 586 -372 -7 925 -240 402 -313 -618 -727 -488 238 808 276 -1320 20 -1610 554 117 639
4584 639 -657 97 887 -64 -157 -447 772 231 -2371 885 -26 1348 370 1443 583 -208 1295 -106
$$ packed form
4461f14Q46n17l95K77J012j080R77j970K401j67q47J92N39k25L00Lk164L076j164
4480D80M26q28o78l91J407K22j136L22l78K527j209j60j263O52J340j703k67K546
4498A909k328R94k595K423%j287P41q13J367j809J112J645k405J491k835K335
4514e5r17P25J478k174J537j465R40j656K703n24n75j38m14O46N19r69j342J359
4532c22J680j669R50j732Q79j235R5K320k429J859j431J574K06K30m3k210K936
4549A658k060J336j154L79k16m39J444J24j469m95J04K064p54m56N55j369J334
4566E86r58L65R32j165O42p15l05j09K39P26N70n32j596J340j630K164m37N22
4584F39j296P54P90r51r3k90J219n41k602L256r11J374r78J073q60p91J503j401
$$ plain form
4602 -106 -756 1022 -1006 -1308 -450 1084 -1678 1043 -1057 302 829 -1148 -259 -1692 72 -574 -901
4619 -901 -798 -129 372 -730 1063 -1227 -690 744 -113 375 -1083 1784 -1208 293 1546 -806 784
4636 784 -17 622 -425 -154 -506 668 863 477 697 -56 -18 860 561 225 -628 111 248 -463 1408
4655 1408 786 592 1029 -23 158 950 608 502 393 -698 366 -101 -129 194 255 6 -5 -516 64 -200
4675 -200 -805 632 973 -12 1130 -218 -830 766 299 -390 246 -628 537 -2126 276 -17 -99 -807
4693 -807 -1083 -565 -785 764 -613 -573 1307 -1395 2508 -179 487 208 515 1596 -1072 886 -1240
4710 -1240 -57 -115 216 -79 -178 1843 20 1027 447 -210 -953 -730 251 -1036 1219 472 865 2103
4728 2103 -103 782 603 720 -691 239 659 -1113 -262 -651 -143 -699 459 1226 -316 -730 182 -456
$$ packed form
4602a06o50J778k028l02Q58J534k762K721k100J359N27j977Q89j433J764o46l27
4619i01J03O69N01j102J793k290N37J434q57M88j458K867k992J501J253k352J590
4636G84q01O39j047K71l52J174J95l86K20p53L8Q78k99l36q53P39J37p11J871
4655A408o22j94M37j052J81P92l42j06j09j091J064m67k8L23O1k49j1n11N80k64
4675b00o05J437L41r85J142j348o12J596m67o89O36q74J165k663K402k93q2p08
4693h07k76N18k20J549j377M0J880k702L903k687O66k79L07J081k668J958k126
4710a240J183n8L31k95r9K021j823J007n80o57p43K23R81j287K255p47L93J238
4728B103k206Q85j79J17j411R30M20j772Q51l89N08n56J158P67j542m14R12o38
$$ plain form
4746 -456 -200 -839 -599 -272 -701 -41 -786 -34 104 805 -197 891 550 -316 -55 -1404 895 30 -102
4765 -102 450 -257 2325 -176 16 268 257 546 -181 1241 -669 967 -1525 -630 358 -269 965 485
4783 485 524 -64 1322 173 -1305 324 -1099 -167 -36 -1952 381 -779 -49 -1967 1070 1022 -2122
4800 -2122 -51 -932 602 51 1233 -757 -640 428 -1143 183 -1353 1137 -898 -290 212 -1048
4816 -1048 1982 103 56 970 247 393 -1189 -199 -582 639 342 -101 559 18 -63 911 -930 -266 245
4835 245 -942 256 -292 -592 -836 321 -824 276 -520 16 -1200 -615 502 222 1128 116 561
4852 561 112 847 181 -367 2026 -518 -1015 883 -375 902 -1279 1737 -211 -349 426 759 714 230
4870 230 897 283 984 19 -849 1446 -114 290 279 259 396 57 23 358 495 -799 -736 1236 -214 623
$$ packed form
4746d56K56o39K40L27m29O60p45P52J38P01j002J088l41q66K61j349K299q65j32
4765a02N52p07K582k501J92K52j1K89p27J422j910J636k492Q95R88o27J234m80
4783D85L9n88J386j149j478J629j423R32J31j916K333j160P30j918L037m8l144
4800b122K071q81J534n51J182j990J17J068j571J326j536K490k035O08N02j260
4816a048L030j879m7R14p23J46j582R90l83J221k97m43O60n41q1R74j841O64N11
4835B45j187J198n48l00k44J157j145J100p96N36j216N85J117k80R06j012M45
4852E61m49P35o66n48K393k544m97J898j258J277k181L016j948j38P75L33m5m84
4870B30O67o14P01r65q68K295j560M04j1k0J37l39l4L35J37j294O3J972j450Q37
$$ plain form
4890 623 52 1645 -598 -491 218 -1212 1387 -654 867 22 678 227 394 897 28 650 1928 144
4908 144 14 -558 1945 -909 355 1230 -325 -620 -378 315 -341 -133 -111 216 -323 22 -529 -18 -106
4927 -106 843 490 -645 -144 484 622 -301 182 297 820 -1468 1212 -342 157 214 -916 -573 377 485
4946 485 -631 629 -259 -2084 83 943 1212 -428 -540 1386 -1846 133 -438 247 1440 390 333
4963 333 -781 1222 -951 -751 -860 -510 -487 -153 -603 529 -382 -706 -682 1581 373 -727 -524 -144
4981 -144 227 -292 398 -1251 1398 -640 -246 -900 -724 661 -436 473 -1270 -287 -1115 -421 1956 -422
4999 -422 -590 -658 -1921 1546 385 -345 612 175 -278 -423 225 -60 266 55 525 430 -1270 -478 -1789
5018 -1789 -263 -321 -1319 -111 -1692 574 139 206 -764 -69 182 471 225 491 558 60 -483 -646 -134
$$ packed form
4890F23n71J593k243J07P09j430K599k041J521q45O56m51J67N03q69O22J278j784
4908A44j30n72K503k854J264Q75j555k95K42O93o56K08K2L27n39L45n51N11q8
4927a06R49l53j135N01O28J38r23M83J15N23k288K680j554M99N7j130L43R50J08
4946D85j116J260q88j825K167Q60K69j640j12J926l232J979n71O85J193j050n7
4963C33j114K003k173K00j09L50K3L34m50J132r11l24K4K263j208j100K03L80
4981a44L71n19O90j649K649k038L94o54J76J385j097R09j743R83q28O94K377k378
4999d22j68o8j263L467j161p30R57m37m53j45O48k85L26k11M70r5j700P92j311
5018a789J526n8r98J208j581K266m35O7r70O95K51K89k46K66O7m98n43j63N12
$$ plain form
5037 -134 -263 329 -369 284 -1503 -545 -2053 -915 673 253 299 -628 126 274 2438 -11 516 761
5055 761 764 275 -973 1108 265 172 27 -343 -245 755 774 -998 264 520 491 -703 -57 -724 191 -1117
5075 -1117 -236 -207 -33 -832 664 -679 1958 -136 765 1317 -223 326 -775 169 -256 545 -687 -1171
5093 -1171 -5 -660 138 261 154 347 426 -437 371 386 -136 6 523 -67 305 1460 54 883 -1607
5112 -1607 50 -678 -352 -1047 630 782 -15 1447 623 -631 315 -301 -405 -735 515 -293 1594 685
5130 685 165 149 -353 -475 133 119 1334 -1005 -331 -278 1249 -190 -408 120 -22 914 -442 1407 -428
5149 -428 514 -891 395 1079 4 1341 176 -913 877 -631 1493 -218 2145 -25 -731 658
5165 658 1227 454 -755 482 20 1113 599 -883 1460 777 -105 157 691 1417 -360 848 10 -107
$$ packed form
5037a34j29N92o98O53j787R58j508J138J588m20M6r27P54J48K164k449N27K45
5055G61Lm89j248K081q43r3j45l70R8J000J9j772J262K56k9j194O46o67R15j308
5075a117Q81K9J74p99J496j343K637k094R01N52j540N49j101R44m25Q01j232m84
5093a171J166o55P98J23j07J93P9q63Q08J5n22J42N17n90L72J155j406Q29k490
5112a607J657p28L26o95J677J52p97J462q24j254R46o16j04l30J250q08J887r09
5130F85n20j6n02j22O08j4J215k339O74N3J527j439k18N28j42R36j356J849j835
5149d28R42j405J286O84j075J337j165j089J790j508K124j711K363k170p06J389
5165F58N69p73j209J237m62J093n14j482K343o83q82K62N34P26j777J208q38j17
$$ plain form
5183 -107 -127 -324 170 252 157 66 584 -1326 32 -172 -1549 610 574 179 -81 596 597 -331 812 220 -346
5204 -346 608 -95 527 1409 501 -153 -20 -137 -127 -50 63 -230 -664 -545 -431 -480 582 878 2 997 338
5225 338 97 168 1321 2141 536 938 -238 -304 -881 1142 1155 -688 1107 -583 852 -1010 998 -735
5243 -735 -163 179 -629 1451 -448 -90 443 688 228 1325 92 -839 3001 -887 -34 12 -721 624
5261 624 -543 -1328 -73 -795 -57 -996 578 -938 21 -1263 -122 1914 -504 2756 -1274 175
5277 175 629 987 -221 341 851 -340 442 147 -154 120 -713 23 -951 112 -369 -1525 -430 -96
5295 -96 1793 -359 54 1229 231 757 1926 -30 -601 -130 -633 -1240 1213 -119 793 372 -885 -212
5313 -212 -1001 526 476 101 720 -536 469 -1427 1304 797 306 693 -1128 1306 -676 842 -1181
$$ packed form
5183a07k0j97M94Q2r5r1N18j910J358k04j377K159l6l95k60O77Jr28J143n92n66
5204c46R54p03O22Q82r08o54J33j17J0P7J13k93m34J19J14m9J062K96q76R95o59
5225C38k41P1J153Q20j605M02j176o6n77K023J3j843J795j690J435j862K008j733
5243g35N72L42q08K080j899L58N33K45m60J097j233r31L840l888Q53M6p33J345
5261F24j167p85J255p22P38r39J574j516R59j284J141K036k418L260m030J449
5277A75M54L58j208N62N10j191P82k95l01K74q33P36r74J063m81j156J095L34
5295i6J889k152M13J175r98N26J169j956n71M71n03o07K453j332R12m21j257O73
5313b12p89J527n0l75O19j256J005j896K731n07m91L87j821K434j982J518k023
$$ [...]
16383a47
##END NTUPLES=NMR FID
##END=
