##TITLE=31P_DE-80H_X3
 64 sc D2O
 26.2.2025
##JCAMPDX= 6.0         $$ Bruker NMR JCAMP-DX V2.0
##DATA TYPE= NMR SPECTRUM
##DATA CLASS= NTUPLES
##ORIGIN= UXNMR, Bruker Analytische Messtechnik GmbH
##OWNER= root
$$ XWIN-NMR		Version 3.5
$$ Mon Apr 21 14:52:58 2025 Russian Standard Time (UT+4h)  Yarkov@DPX200
##.OBSERVE FREQUENCY= 81.013821
##.OBSERVE NUCLEUS= ^31P
##.ACQUISITION MODE= SIMULTANEOUS
##.ACQUISITION SCHEME= undefined
##.AVERAGES= 64
##.DIGITISER RES= 17
##SPECTROMETER/DATA SYSTEM= spect
##.PULSE SEQUENCE= zgpg30
##.SOLVENT NAME= DMSO
##.SHIFT REFERENCE= (INTERNAL, DMSO, 0, 198.062)
##AUDIT TRAIL= $$ (NUMBER, WHEN, WHO, WHERE, WHAT)
$$ ##TITLE= Audit trail, XWIN-NMR		Version 3.5
$$ ##JCAMPDX= 5.01
$$ ##ORIGIN= Bruker BioSpin GmbH
$$ ##OWNER= Yarkov
$$ C:/Bruker/XWIN-NMR/data/yarkov2/nmr/P31/2/pdata/1/auditp.txt
$$ ##AUDIT TRAIL=  $$ (NUMBER, WHEN, WHO, WHERE, WHAT)
(   1,<2025-04-21 14:44:31.85 +0400>,<Yarkov>,<DPX200>,
      <created by zg, POWCHK disabled, PULCHK disabled
       configuration hash MD5:
       00 E9 B6 7A A2 85 ED C7 34 08 36 98 17 FE 4E 26
       data hash MD5: 32K
       B0 D9 B0 49 91 B4 B4 1E 04 C9 14 D4 10 9C 2A 0D>)
(   2,<2025-04-21 14:46:46.50 +0400>,<Yarkov>,<DPX200>,
      <Start of raw data processing
       efp BC_mod = 2 LB = 1.5 FT_mod = 6 PKNL = 1 PHC0 = 1781.868 PHC1 = 34.29541 SI = 64K 
       data hash MD5: 64K
       96 4A 0D 02 B7 44 5E 38 42 C1 B6 DB 0C DB 74 B6>)
(   3,<2025-04-21 14:52:03.35 +0400>,<Yarkov>,<DPX200>,
      <abs ABSG = 5 
       data hash MD5: 64K
       71 EA E8 57 BE BD 26 56 17 43 E9 36 A3 E0 2B 22>)
(   4,<2025-04-21 14:52:14.51 +0400>,<Yarkov>,<DPX200>,
      <pk PHC0 = 2.396939 PHC1 = -11.2 
       data hash MD5: 64K
       0A 04 70 E2 F1 AF 4F 10 66 5E 05 81 4C 60 6E 64>)
$$ ##END=
$$ 
$$ hash MD5
$$ 82 DA 03 B0 20 19 F3 22 02 87 04 FD DB B3 E0 7F
##$RELAX= 
##$RELAX= 
##$RELAX= 
##$RELAX= 
##$RELAX= 
##$RELAX= 
##$RELAX= 
##$RELAX= 
$$ Bruker specific parameters
$$ --------------------------
##$DU= <C:/Bruker/XWIN-NMR>
##$EXPNO= 2
##$NAME= <P31>
##$PROCNO= 1
##$TYPE= <nmr>
##$USER= <yarkov2>
##$AMP= (0..31)
100 100 100 100 100 100 100 100 100 100 100 100 100 100 100 100 100 100 
100 100 100 100 100 100 100 100 100 100 100 100 100 100 
##$AQSEQ= 0
##$AQ_mod= 1
##$AUNM= <au_zg>
##$AUTOPOS= <>
##$BF1= 81.014009
##$BF2= 200.13
##$BF3= 200.13
##$BF4= 200.13
##$BF5= 200.13
##$BF6= 200.13
##$BF7= 200.13
##$BF8= 200.13
##$BYTORDA= 1
##$CFDGTYP= 0
##$CFRGTYP= 5
##$CHEMSTR= <none>
##$CNST= (0..31)
1 1 145 1 1 1 1 1 1 1 1 1 1 1 1 1 1 1 1 1 1 1 1 1 1 1 1 1 1 1 1 1 
##$CPDPRG= <waltz16>
##$CPDPRG1= <>
##$CPDPRG2= <waltz16>
##$CPDPRG3= <>
##$CPDPRG4= <mlev>
##$CPDPRG5= <mlev>
##$CPDPRG6= <mlev>
##$CPDPRG7= <mlev>
##$CPDPRG8= <mlev>
##$CPDPRGB= <>
##$CPDPRGT= <>
##$D= (0..31)
0 1 0 0 0 0 0 0 0 0.06 0 0.03 2e-05 3e-06 0 0 0.0002 0 0 0 0 0 0 0 0 0 
0 0 0 0 0 0 
##$DATE= 1745232271
##$DBL= (0..7)
120 120 120 11 120 120 24 19 
##$DBP= (0..7)
150 150 150 150 150 150 150 150 
##$DBP07= 0
$$ [...]
##$SUBNAM3= <"">
##$SUBNAM4= <"">
##$SUBNAM5= <"">
##$SUBNAM6= <"">
##$SUBNAM7= <"">
##$SUBNAM8= <"">
##$SUBNAM9= <"">
##$SW= 400.765351723535
##$SWIBOX= (0..15)
0 1 3 0 0 0 0 0 0 0 0 0 0 0 0 0 
##$SW_h= 32467.5324675325
##$TD= 32768
##$TD0= 1
##$TE= 0
##$TE2= 300
##$TE3= 300
##$TEG= 300
##$TL= (0..7)
0 120 53 12 22 120 120 120 
##$TP= (0..7)
150 150 150 150 150 150 150 150 
##$TP07= 0
##$TPNAME0= <>
##$TPNAME1= <>
##$TPNAME2= <>
##$TPNAME3= <>
##$TPNAME4= <>
##$TPNAME5= <>
##$TPNAME6= <>
##$TPNAME7= <>
##$TPOAL= (0..7)
0.5 0.5 0.5 0.5 0.5 0.5 0.5 0.5 
##$TPOFFS= (0..7)
0 0 0 0 0 0 0 0 
##$TUNHIN= 0
##$TUNHOUT= 0
##$TUNXOUT= 0
##$USERA1= <user>
##$USERA2= <user>
##$USERA3= <user>
##$USERA4= <user>
##$USERA5= <user>
##$V9= 5
##$VALIST= <valist>
##$VCLIST= <CCCCCCCCCCCCCCC>
##$VD= 0
##$VDLIST= <DDDDDDDDDDDDDDD>
##$VPLIST= <PPPPPPPPPPPPPPP>
##$VTLIST= <TTTTTTTTTTTTTTT>
##$WBST= 1024
##$WBSW= 4
##$XGAIN= (0..3)
0 0 0 0 
##$XL= 0
##$YL= 0
##$YMAX_a= 13793
##$YMIN_a= -19193
##$ZGOPTNS= <>
##$ZL1= 120
##$ZL2= 120
##$ZL3= 120
##$ZL4= 120
##$ABSF1= 198.0616
##$ABSF2= -202.7028
##$ABSG= 5
##$ABSL= 3
##$ALPHA= 0
##$AQORDER= 0
##$ASSFAC= 0
##$ASSFACI= 0
##$ASSFACX= 0
##$ASSWID= 0
##$AUNMP= <proc_1d>
##$AZFE= 0.1
##$AZFW= 0.5
##$BCFW= 0
##$BC_mod= 2
##$BYTORDP= 0
##$COROFFS= 0
##$CY= -3
##$DATMOD= 1
##$DC= 0
##$DFILT= <>
##$DTYPP= 0
##$F1P= 0
##$F2P= 0
##$FCOR= 1
##$FTSIZE= 65536
##$FT_mod= 6
##$GAMMA= 0
##$GB= 0
##$INTBC= 1
##$INTSCL= 9.790993e-09
##$ISEN= 30
##$LB= 1.5
##$LEV0= 0
##$LPBIN= 0
##$MAXI= 10000
##$MC2= 0
##$MEAN= 0
##$ME_mod= 0
##$MI= 50
##$NCOEF= 0
##$NC_proc= -8
##$NLEV= 6
##$NOISF1= 182.463
##$NOISF2= 159.3651
##$NSP= 0
##$NTH_PI= 0
##$NZP= 0
##$OFFSET= 198.0616
##$PC= 4
##$PHC0= 1784.265
##$PHC1= 23.09541
##$PH_mod= 1
##$PKNL= yes
##$PPARMOD= 0
##$PSCAL= 0
##$PSIGN= 0
##$REVERSE= no
##$SF= 81.0140089999434
##$SI= 65536
##$SIGF1= 159.3651
##$SIGF2= -187.1042
##$SINO= 113.3802
##$SIOLD= 16384
##$SREGLST= <1H.CDCl3>
##$SSB= 0
##$STSI= 65536
##$STSR= 0
##$SW_p= 32467.5324675325
##$SYMM= 0
##$S_DEV= 0
##$TDeff= 32768
##$TDoff= 0
##$TI= <>
##$TILT= no
##$TM1= 0
##$TM2= 0
##$TOPLEV= 0
##$USERP1= <user>
##$USERP2= <user>
##$USERP3= <user>
##$USERP4= <user>
##$USERP5= <user>
##$WDW= 1
##$XDIM= 65536
##$YMAX_p= 443199078
##$YMIN_p= -255526994
$$ End of Bruker specific parameters
$$ ---------------------------------
##NTUPLES= NMR SPECTRUM
##VAR_NAME=  FREQUENCY,     SPECTRUM/REAL,   SPECTRUM/IMAG
##SYMBOL=    X,             R,               I
##VAR_TYPE=  INDEPENDENT,   DEPENDENT,       DEPENDENT
##VAR_FORM=  AFFN,          ASDF,            ASDF
##VAR_DIM=   65536,         65536,           65536
##UNITS=     HZ,            ARBITRARY UNITS, ARBITRARY UNITS
##FACTOR=    0.49542278885378, 1,            1
##FIRST=     16045.7642231865, 0,            0
##LAST=      -16421.768244346, 0,            0
##MIN=       -16421.768244346, -255526994,   0
##MAX=       16045.7642231865, 443199078,    0
$$ Real data points
##PAGE= N=1
##DATA TABLE= (X++(R..R)), XYDATA
$$ [...]
37751B910625l441222l363280p03671J103063J2287j021773J041024L966835L545434
37742D049322N51k803103l083699k298641j590160p75362l15331p70856o30091
37733h217370J860415M894806M785314J595491p22838m38896k18793j799430k680273
37724i41574p70574J286439J83462k153913j157338K971861N006491K297526j458553
37715E263827j763636O02588J665993K57614j288968j524078j535992j827435
37707a50087p78707K072750L742972J487140k610245l780985r37558K169685K531531
37698C746496J459607J265776J340085k5677k016031k463488j497095j075032
37690G34641j435267r80577L29829N23206p82280j219144M74926J935145N51049
$$ y = [2910625, -530597, -3893877, -4597548, -3494485, -3482198, -4503971, -3462947, 503888, 4049322, 4049873, 1246770, -1836929, -4135570, -5725730, -6501092, -6816423, -7587279, -8217370, -6356955, -1462149, 3323165, 4918656, 4195818, 3756922, 3538129, 1738699, -941574, -1712148, -425709, -242247, -2396160, -3553498, -581637, 4424854, 6722380, 5263827, 3500191, 4102779, 5768772, 6026386, 4737418, 3213340, 1677348, -150087, -928794, 1143956, 4886928, 6374068, 3763823, -17162, -954720, 1214965, 3746496, 5206103, 6471879, 7811964, 7786287, 5770256, 3306768, 1809673, 734641, -700626, -1681203, -1351374, -828168, -1610448, -2829592, -2354666, -419521, 131528]
37681A31528k456553l770521k685168j449513j280985q21878Q32071K150829J784801
37672g565389J137456J973925K782709P21466k930366l040738J955236O276030
37664A310329L816552l143528o555211l277823J536745K547555J017778J009908
37656a737695K615184K734483M46368k126207l296806l092443j768927K47387
37648e978656J541596J236830O13886R99979J270569J06184p36122J112724L997719
37639D164709M109175J444532m63538o82218j846415m261452m330137r14924J702804
37630a077464L53397j820994n88197K460133K739505l8334k151616k035346j565816
37621c724732j757335j492603o78916p58180j411962k83230K836559M563358K357328
$$ y = [131528, -2325025, -6095546, -8780714, -10230227, -11511212, -12333090, -11501019, -9350190, -7565389, -6427933, -4454008, -1671299, -949833, -3880199, -6920937, -4965701, 1310329, 5126881, 1983353, -4571858, -7849681, -6312936, -3765381, -2747603, -1737695, 877489, 3611972, 4058340, 1932133, -1364673, -4457116, -6226043, -5978656, -4437060, -3200230, -2586344, -1586365, -315796, -209612, -945734, 166990, 4164709, 8273884, 9718416, 9254878, 8572660, 6726245, 2464793, -1865344, -2780268, -1077464, -724067, -2545061, -3133258, -673125, 2066380, 2028046, -123570, -2158916, -3724732, -5482067, -6974670, -7653586, -8411766, -9823728, -10106958, -7270399, -2707041, -349713]
37612c49713j733702l488958j341967K511775M800415L901447P17735k177128
37604B839904k683305j067391M98672L49449j180608k542199k507570r38063J193901
37595f037210K401810J891457K77546j235856k132602k590636k676253k269606
37587a2371350j476550m20416J009892K491827K847433J280616j184471k417691
37579a0240710j347874J092508K962697K906975J295370J47594J114282L121551
37571A052393L247930O80752j765926j431086M57346Q19659p20174j800742j227420
37562f87268k57678L5030J60767M45124N5941j320338k506305k389031j151871
37553g615629N83803K466201L749017L402487J605023j78319j252104k423068
$$ y = [-349713, -2083415, -5572373, -6914340, -4402565, 397850, 4299297, 5017032, 2839904, 156599, -910792, -412120, -62671, -1243279, -3785478, -6293048, -7231111, -6037210, -3635400, -1743943, -1466397, -2702253, -4834855, -7425491, -10101744, -12371350, -13847900, -14268316, -13258424, -10766597, -7919164, -6638548, -7823019, -10240710, -11588584, -10496076, -7533379, -4626404, -3331034, -3183440, -2069158, 1052393, 4300323, 4981075, 3215149, 1784063, 2241409, 3061068, 2340894, 540152, -687268, -944946, -909916, -749149, -304025, -248084, -1568422, -4074727, -6463758, -7615629, -7031826, -4565625, -816608, 2585879, 4190902, 4012583, 2760479, 337411]
37545C37411l889930l976470j439732J935925K807285L31599k491220k100596
37537h485728J461679M358077L259736o27747k910895j467871J051983J185711
37529b175055o06033j231179J50646J299764P47664l38414p01374q50434j296922
37520e001337j115760K98395J693281J638004N25929l10462l67248K02118J317190
37511a119890K366329K011712r0877k235983k538430j184941J33456K68615p74239
37502c164248k350497l317277k584540o17759M43869p08912k690362l153949j625082
37493a9768757N46802K266187L322185L474179K401978N30078j140986j963042
37485a0331376j697554j18177K425753M376514M088712J747354n88028j054343
$$ y = [337411, -3552519, -7528989, -8968721, -7032796, -4225511, -3893912, -6385132, -8485728, -7024049, -2665972, 593764, -33983, -2944878, -4412749, -3360766, -2175055, -2781088, -4012267, -3861621, -2561857, -1814193, -2152607, -2853981, -3704415, -5001337, -6117097, -5818702, -4125421, -2487417, -1961488, -2271950, -2639198, -2437080, -1119890, 1246439, 3258151, 3167274, 931291, -1607139, -2792080, -2658624, -2390009, -3164248, -5514745, -8832022, -11416562, -12034321, -11590452, -12299364, -14989726, -18143675, -19768757, -19221955, -16955768, -13633583, -10159404, -7757426, -7227348, -8368334, -10331376, -12028930, -12147107, -9721354, -5344840, -1256128, 491226, -96802, -1151145]
37477a151145K77658J740676J898723J031154O48074J291877J459021k64525k599823
37468D331690k978949j521851j196220l134923m287004j639296L101089N471701
37460a853763L842366O74415j214665j322683m99619N23628J119596P27681n34845
37451A462111j838980k266171j174218J298156L484213L191361O21579j085560
37443C692491O8006J726378M78358k689575l418848l66241K759503K500283R7748
37434D848103j024769J6075J476106K134556K181565J526577n25069l465953n032203
37425B134988l522369j14691K119688J585731k73419j215309j073643j224313
37417a583337j882812j948750j570049k321412l831851k948563J586882N925804
$$ y = [-1151145, -873487, 867189, 2765912, 3797066, 4445140, 5737017, 7196038, 6931513, 4331690, 1352741, -169110, -1365330, -4500253, -8787257, -10426553, -7325464, -1853763, 1988603, 2663018, 1448353, 125670, -373949, 149679, 1269275, 1996956, 1462111, -376869, -2643040, -3817258, -2519102, 965111, 4156472, 4778051, 3692491, 3760497, 5486875, 5965233, 3275658, -143190, -509431, 2250072, 4750355, 4848103, 3823334, 3839409, 5315515, 7450071, 9631636, 11158213, 10633144, 7167191, 2134988, -1387381, -1502072, 617616, 2203347, 1929928, 714619, -359024, -1583337, -3466149, -5414899, -6984948, -9306360, -13138211, -16086774, -14499892, -8574088]
37409h574088N628552J900029j88003J017212K072521L41559k160427k248581
37401b211226o5068J734552J497354j84874j503756q90864J293880K279261j45984
37392A803275m036498n031335k171992P70190P94549m54114p2945J593574K326011
37383d479285J810886J280276Q04921k84456j144231k28287J953765L096526K091709
37374D901824M5328j643279k722437l486433l777234k840091j03396L375658M693271
37365a556789K168967j364558j154890K691488M432950P59038l985664m128736
37357b138194r86612M9217j463484r83406K460935M069418J135391k527977k772980
37348c157692j022886m87375l94356J640669M177560L661916L25522k058463j975953
$$ y = [-8574088, -2945536, -1045507, -1233510, -216298, 1856223, 2197782, 37355, -2211226, -2276294, -541742, 955612, 770738, -733018, -1623882, -330002, 1949259, 1803275, -2233223, -7264558, -9436550, -8666360, -7871811, -8325925, -8398870, -6805296, -4479285, -2668399, -1388123, -583202, -867658, -2011889, -2240176, -286411, 2810115, 4901824, 4947152, 3303873, 581436, -2904997, -6682231, -9522322, -9625718, -6250060, -1556789, 612178, -752380, -1907270, 784218, 5217168, 5976206, 1990542, -2138194, -3124806, -3075589, -4539073, -5522479, -3061544, 1007874, 2143265, -384712, -3157692, -4180578, -4667953, -5062309, -3421640, 755920, 4417836, 4743358, 2684895, 708942]
37339G08942j647116k376126k324014k23428J880040J541908o27171k301528k532451
37330g900944j716157o5292J802283K071236K3573j730155k14122K949059K881926
37321a898593j452640m990893l466521N66663J907317N19278O80733L320501M409763
37312d04392J864207r21095q06043J22380j165750k845115j304333K133223K694668
37303f32250k58007k122969j51887K856493L462999K253037J354894N56065j193016
37294F125359k657407j877077K95360J094829r3111r96628O9655J940667K374613
37285F276260Q05271j350640k449419k102699j110014l32161N9059J98496L382
37276b465l95052k64875P01183J402453O35615r01515j414442o78225j37371l00783
$$ y = [708942, -938174, -3314300, -5638314, -5861742, -3981702, -2439794, -3066965, -5368493, -7900944, -9617101, -9682393, -7880110, -5808874, -5785301, -7515456, -7729578, -4780519, -1898593, -3351233, -8342126, -11808647, -11241984, -9334667, -8815389, -8134656, -4814155, -404392, 1459815, 538720, -267323, -144943, -1310693, -4155808, -5460141, -3326918, -632250, -890257, -3013226, -3165113, -308620, 3154379, 5407416, 6762310, 7318375, 6125359, 3467952, 1590875, 1886235, 2981064, 2887953, 1891325, 1960980, 3901647, 6276260, 7081531, 5730891, 3281472, 1178773, 68759, -263402, -204343, -5847, -2465, -397517, -662392, 38791, 1441244, 2076859, 1175344, -239098, -917323, -1054694, -1355477]
37266a355477j34901N10291K04344j331987k105083j008374N764j014342k515672
37257h745437j556620J565937L462956K246506k81730j340502l76052R24397P55003
37248c345542j000646k548691j968314L96786K111989J824196J020222J495953
37240b014047K500587K224606R51048L30758J42835j498838m521642o053702m152144
37231a2090539m81025J852037J813041Q07617N64355J604700L168397L919716
37223A158299L066925J108748q08852k156134l104167l667307l633181l136812
37215a1172481k371108r76685J204835L051476L197123K121842J790032K969661
37207a85305M222025L947812K282727M77389o80750j363849k231770l589349m519851
$$ y = [-1355477, -1490378, -980087, -775743, -2107730, -4212813, -5221187, -5215423, -6229765, -8745437, -10302057, -8736120, -5273164, -3026658, -3308388, -4648890, -5024942, -4100545, -3345542, -4346188, -6894879, -8863193, -8466407, -6354418, -4530222, -3510000, -2014047, 486540, 2711146, 3662194, 3992952, 4135787, 2636949, -1884693, -7938395, -12090539, -12571564, -10719527, -8906486, -8098869, -7534514, -5929814, -2761417, 1158299, 4225224, 5333972, 4525120, 2368986, -735181, -4402488, -8035669, -11172481, -13543589, -14520274, -13315439, -10263963, -7066840, -4944998, -3154966, -185305, 4036720, 7984532, 10267259, 10744648, 10063898, 8700049, 6468279, 2878930, -1640921]
37198a640921l320001J81553L256607K782918r24823m247260m301788j519186
37190i732901J728569L474693L023112J120275l60259k06029N74934K81475p57367
37181h53498q45139R972N5315j107625j925288j722664j471328j244366J59393
37172h945228K250831K679921J215223N46128J540353J403618j076382k295908
37164b681444O45100M431261L841887p08418m381146m977763m189813k945851
37156a0966187m17265K513100L365955K123945J324773J777980J879104J274427
37148B875832J157976P32820k051051n539666n131652n06660K899482J912669
37140c650250J56464J463233L568205K628120n9788r50509p38348k319246m343524
$$ y = [-1640921, -4960922, -4779369, -1522762, 1260156, 335333, -3911927, -8213715, -9732901, -8004332, -4529639, -1506527, -386252, -746511, -952540, -377606, -96131, -853498, -1698637, -1688665, -1633350, -2740975, -4666263, -6388927, -7860255, -9104621, -8945228, -6694397, -4014476, -2799253, -2253125, -712772, 690846, -385536, -2681444, -2036344, 2394917, 6236804, 5528386, 1147240, -3830523, -8020336, -10966187, -11383452, -8870352, -5504397, -3380452, -2055679, -277699, 1601405, 2875832, 4033808, 4766628, 2715577, -2824089, -7955741, -8462401, -5562919, -3650250, -3493786, -2030553, 1537652, 4165772, 4105984, 3155475, 2417127, 97881, -4245643]
37131d245643k840530J422965L073657J60976l106926k892793m82045J173035
37123g737304J663670J741449J053860l32523o89710Q44847K531953K680557K008437
37114C765236J619944Q58437p70116j712971q35360J89307l45233q49075Q61054
37105B781223K948517J570506k894150n661289m217748j474083q42382j496227
37097i285633p74856J265703K504711K421403K316541K562831K144434Q66528
37089D021662n6109O9059M25713p706j252816k552504k869799j355084J547209
37080b030375L673883L176775R15783n79078m63129k29254r05741j616968j592547
37071C49349j597696k152864k045080j78433K355752L613219L174198J780571
$$ y = [-4245643, -7086173, -5663208, -2589551, -2428575, -5535501, -8428294, -8910339, -7737304, -6073634, -4332185, -3278325, -3610848, -4300558, -3455711, -923758, 1756799, 3765236, 5385180, 6243617, 5473501, 3760530, 2925170, 3114477, 2769244, 1920169, 2781223, 5729740, 7300246, 4406096, -1255193, -5472941, -6947024, -7789406, -9285633, -10060489, -8794786, -6290075, -3868672, -1552131, 1010700, 3155134, 4021662, 3965553, 4034612, 4460325, 4452619, 3199803, 647299, -2222500, -3577584, -2030375, 1643508, 4820283, 5736066, 5156988, 4693859, 4464605, 3558864, 1941896, 349349, -1248347, -3401211, -5446291, -5624724, -3268972, 344247, 3518445, 5299016]
37063E299016j91073k181194k587153o96150J279318N61821k066808k991365p61432
37054d335020K072412K649594J019260j161226k913182l639823k473129L69157
37046h411957K792236K929911J250950n14750j573059k078936j999003j319296
37038h923904o74572n36189l26457O34358J890364K473815K132982J199184J11418
37029b019001k22710J105704L142898L215575M71480k262308k182592o25440q49712
37020b26106k794530l313356j358349N69261P48979O41664J576188K093203P32795
37011a330251r43631p20899N39955L08829j420988k112961o35941J251606J673387
37002c390894Q37307r5648o30251o88313j32753O50257Q09093M00391N79874J542364
$$ y = [5299016, 5107943, 2926749, 339596, -356554, 922764, 1484585, -582223, -3573588, -4335020, -2262608, 386986, 1406246, 245020, -2668162, -6307985, -8781114, -8411957, -5619721, -2689810, -1438860, -1953610, -3526669, -5605605, -7604608, -8923904, -9598476, -10134665, -10461122, -9826764, -7936400, -5462585, -3329603, -2130419, -2019001, -2241711, -1136007, 2006891, 5222466, 5693946, 3431638, 1249046, 623606, -226106, -3020636, -6333992, -7692341, -7123080, -6374101, -5732437, -4156249, -2063046, -1330251, -2273882, -2994781, -2454826, -2145997, -3566985, -5679946, -6315887, -5064281, -3390894, -2553587, -2649235, -3279486, -3967799, -4100552, -3450295, -2641202, -2240811, -1660937, -118573]
36992a18573J465446j071313m391645n243804k954703l01815L02660j44549P39793
36983a1718503K835447L540315J488264j573761l145496k704847j176023R26986
36975a1527618L214183M137079K227328j094353k027370R93682M566170M045569
36967D534670n25837m276524l651496o57793M52020q24652j091334J358517L729315
36958i53114K881172J3373j269819k90355L16131p20234j516915q04211l28980
36949b672952j529945k428196o77071K084857K320285J50369q50743M96777J134989
36940a971630r37779k952103j457336K164919L335278M98250l059621l618583
36932g998605j115779J615419K183593O40818r49649o14739J314135K313175Q04598
$$ y = [-118573, 1346873, 275560, -4116085, -9359889, -12314592, -12616407, -12313747, -12458296, -11718503, -8883056, -5342741, -3854477, -5428238, -8573734, -11278581, -12454604, -11527618, -8313435, -4176356, -1949028, -3043381, -5070751, -4077069, 489101, 4534670, 4008833, -267691, -3919187, -4576980, -4124960, -4949612, -6040946, -4682429, -953114, 1928058, 1941431, 671612, 381257, 697388, -22846, -1539761, -2343972, -2672952, -4202897, -6631093, -7308164, -5223307, -2903022, -2752653, -3603396, -3106619, -1971630, -2909409, -5861512, -7318848, -5153929, -1818651, -1320401, -4380022, -7998605, -9114384, -7498965, -5315372, -4674554, -5624203, -6238942, -4924807, -2611632, -1807034]
36923a807034j355121j093624J259998J730950j840180n931401n162630N85746
36915a3613296N321849L987350j460152m595248k224183K440699M388097K633158
36907c121726K37313k43376N98098R03478L23523m9691M11886J210066J678232
36898A947803J551142N48560j522830l739288m075584j515781K251080M418841
36890a36057M258394L386176K706068J018479k161853m329068k933778L95188
36882B203549J506638m69674k077286j009487O56195N23330J32780K096069M971279
36873H533393M665617L28580m428589o241464n130809k771507m12453Q82936M87162
36864d087134l67152M06286K425655K725054Q1555k724004k564388j07034J522534
$$ y = [-1807034, -3162155, -4255779, -2995781, -1264831, -3105011, -9036412, -14199042, -13613296, -8291447, -4304097, -5764249, -10359497, -12583680, -10142981, -5754884, -3121726, -2884413, -3127789, -2529691, -1626213, -1302690, -1352381, -940495, 269571, 1947803, 3498945, 4047505, 2524675, -1214613, -5290197, -6805978, -4554898, -136057, 4122337, 7508513, 10214581, 11233060, 9071207, 4742139, 1808361, 2203549, 3710187, 3240513, 1163227, 153740, 809935, 1333265, 1466045, 3562114, 8533393, 13199010, 13527590, 9099001, 2857537, -2273272, -5044779, -5457232, -4574296, -4087134, -4454286, -4048000, -1622345, 1102709, 1184264, -1539740, -4104128, -4211162, -2688628]
36855b688628R14772o62562j664866j839406j614295j225335n76068N30049J841724
36846f984615K352329J337440k89437q58143k97339n7321l86527K92146K374611
36837b516856L533254J803800j369734k985670k201796m54132J060711K074646
36829a055777K171012J079215j51132j6258J306335K013500R98177q85049j972549
36820C487474j502458j57139P05556M83312l8374l7034k52488j818877l629302
36811b759330l018147K98058L225552L400061K047604J197747L96930j529900
36803C258575l431694l345227j794731q73867r03066n29792N29155J249770J267862
36794d573015R57230K21652p92108p99070N96135J273167l21067j830522j01965
$$ y = [-2688628, -1773856, -2436418, -4101284, -5940690, -7554985, -8780320, -9356388, -8826339, -6984615, -4632286, -3294846, -3584283, -4442426, -4739765, -4797086, -5183613, -4891467, -2516856, 1016398, 2820198, 1450464, -1535206, -3737002, -4191134, -3130423, -1055777, 1115235, 2194450, 2043318, 2027060, 3333395, 5346895, 6345072, 5460023, 3487474, 1985016, 1827877, 2533433, 3016745, 2978371, 2941337, 2688849, 869972, -2759330, -5777477, -5479419, -2253867, 1146194, 3193798, 4391545, 4788475, 3258575, -173119, -3518346, -5313077, -6186944, -7090010, -7619802, -7090647, -5840877, -4573015, -3615785, -3394133, -4186241, -4985311, -4389176, -3116009, -3437076, -5267598, -5369563]
36785e369563L356181L975300R63734j541847p40212J270875J440783n0301j209433
36776B095517j254686o29312O1500J1995j120092j887035l97952K497524L566958
36767B944417J318869k332420m859862n306096l584197m03054J767236O97631
36759i757476k004596k332991M79547L038635L161450K426822K285476J651565
36751a051568J2016j042951j267906k561075m203897k154980L712377O724854
36743a833130K448483l762445m066072L98866K054329j173747l834398k660250
36735a2428364r92528j729841k179106O61081M248658M077409N48028j649732
36727i444395p6885K708972L175666J356097J83792J155101K276186J126024j240297
$$ y = [-5369563, -2013382, 1961918, 2925652, 1383805, 643593, 1914468, 3355251, 3304950, 2095517, 840831, 211519, 273019, 285014, -835078, -2722113, -3120065, -622541, 2944417, 4263286, 1930866, -2928996, -8235092, -11819289, -12222343, -10455107, -9757476, -11762072, -14095063, -13615516, -10576881, -7415431, -4988609, -2703133, -1051568, -1039552, -2082503, -3350409, -5911484, -10115381, -12270361, -8557984, -1833130, 615353, -3147092, -7213164, -6814298, -4759969, -5933716, -9768114, -12428364, -13420892, -15150733, -17329839, -16668758, -12420100, -8342691, -7794663, -9444395, -9521280, -6812308, -3636642, -2280545, -2096753, -941652, 1334534, 2460558, 1220261]
36718A220261j595129M04890J314400q47950l363793l054948j216693j187302
36710h326264k741427k534555M98700L527318L755887J486086r28282j383518
36702f646055M72773K590965K213885m08366j657027K92038K321202J184494j145345
36693g81436r88562M01246j021280m368386m156088J056543N869595N628142K234165
36684C873939J70705M76078J114085N04130j513393m111082n335303l452741O05955
36675g667627M025677N531218N697856M282642P37885k718679k796134m47779
36667F645059k3109k229928k934094m93831J219379k50171j533783K26016J756120
36658B381658o80139m227546l806001m94498N27213j452105k283039m57167Q34736
$$ y = [1220261, -374868, 30022, 1344422, 496472, -2867321, -5922269, -7138962, -8326264, -11067691, -13602246, -13103546, -9576228, -5820341, -4334255, -5262537, -6646055, -6173282, -3582317, -1368432, -1776798, -3433825, -3141787, -820585, 363909, -781436, -1769998, -1368752, -2390032, -6758418, -10914506, -9857963, -3988368, 1639774, 3873939, 4044644, 4520722, 5634807, 6138937, 4625544, 514462, -4820841, -8273582, -7667627, -3641950, 1889268, 7587124, 11869766, 12607651, 9888972, 7092838, 6645059, 6621950, 4392022, 1457928, 964097, 2183476, 1933305, 399522, 625538, 2381658, 1701519, -2526027, -6332028, -6826526, -6299313, -7751418, -10034457, -10491624, -9656888]
36649i656888k99061j376053J39287L161622N103670M948535L079674K65349k209626
36640C156509l034945k165593o28767P88603J642828J415005L62163j64209K66151
36631A637745L7987j908453l737447l009261l8511K995887M754577M511661J359990
36622F604175l501434n771666k951192J352412J914339o82906j502570Q24017
36614c714825K650453J850951P12877J141924J520378K01797j605033k440500
36606C18022k888630l295012k129305J125194L805202L105547k73551l266932
36598c499465l909974k397363r1468J355184J106843K41229O26764K292592L230441
36589a045217K010251q05440l688082m948249l144939J022521L924455K973431
$$ y = [-9656888, -9955949, -11332002, -11192715, -8031093, -2927423, 2021112, 5100786, 5366135, 3156509, 121564, -2044029, -2672796, -1884193, -241365, 1173640, 1535803, 1371594, 1637745, 1675732, -232721, -3970168, -6979429, -7017940, -4022053, 732524, 5244185, 6604175, 3102741, -2668925, -5620117, -4267705, -2353366, -3036272, -4538842, -3714825, -1064372, 786579, 1499456, 2641380, 4161758, 4363555, 2758522, 318022, -2570608, -5865620, -7994925, -6869731, -3064529, 41018, -232533, -3499465, -7409439, -9806802, -9898270, -8543086, -7436243, -7195014, -6568250, -4275658, -1045217, 965034, 159594, -3528488, -8476737, -11621676, -10599155, -6674700, -3701269]
36581c701269P04518J329759L817872L116477j371422l989329j398808K289654
36573G97452K126028m59022j082506N11800J342807P12725L30105M11627k34154
36564D456862j133189p62533L79079M72284l99504n69841K33299Q89415J281948
36555D847820K126636K911687K393395O78908j229348l153221m954336n195879
36547a574338l001103j74312J015011J022873J423912J542349j16679k248674
36539b110961k212248m51756K65885l09243K50643K212066K640736P5325l178958
36530b818511m472642l590272j353350J505385L258008K121990o58401j663081
36522g670874j97386Q60439J63885J31461K248408L826477K164316j084423k707468
$$ y = [-3701269, -2996751, -1666992, 2150880, 5267357, 3895935, -93394, -1492202, 797452, 2923480, 2464458, 1381952, 1893752, 3236559, 3949284, 4279389, 4691016, 4456862, 3323673, 2561140, 2940219, 3412503, 3012999, 2443158, 2676457, 3565872, 4847820, 6974456, 9886143, 12279538, 12958446, 11729098, 8575877, 3621541, -1574338, -4575441, -4749753, -3734742, -2711869, -1287957, 254392, 137713, -2110961, -4323209, -4774965, -4509080, -4818323, -4567680, -2355614, 285122, 360447, -2818511, -7291153, -10881425, -12234775, -10729390, -7471382, -5349392, -6007793, -7670874, -7868260, -7007821, -6843936, -6712475, -4464067, -637590, 1526726, 442303, -2265165]
36513b265165k593525k447954j980911J46255K930360L917431K773998J213659
36505A694148P2508r77034j567101j130370o19225j112756j349924M87023L001066
36496a501665K875843J23319j315248Q19933L906082M393865K430323N23347m51636
36487A1804163j469675k626800k655947j165391M38331P09144k25637j176931
36479C631257j290707o47116k73j42411j085492j707685p36987J540889L015428
36470B576903J868427j147843l268753k716725m46192J420526K025252J862431
36462B174026J235067J178j295410j455146k13546J144369J215474p6682j618243
36453A111087k061582p37024J564056K889597K161719N19527n85092j790182m129010
$$ y = [-2265165, -4858690, -7306644, -9287555, -9141300, -6210940, -2293509, 480489, 1694148, 1766656, 789622, -777479, -1907849, -2527074, -3639830, -4989754, -4502731, -1501665, 1374178, 1497497, 182249, 1002182, 4908264, 9302129, 11732452, 12255799, 11804163, 10334488, 7707688, 5051741, 3886350, 4324681, 5033825, 4808188, 3631257, 2340550, 1693434, 1693161, 1550750, 465258, -1242427, -1979414, -438525, 2576903, 4445330, 3297487, 28734, -2687991, -3134183, -1713657, 311595, 2174026, 3409093, 3410271, 2114861, 659715, 446169, 1590538, 2806012, 2729330, 1111087, -950495, -1687519, -123463, 2766134, 4927853, 5447380, 4862288, 3072106, -1056904]
36444a056904n620108l000850K594286N552771L246315p1639K90195K511920J885802
36435F331788j186977k093707J03821J259216p80590k855616k093427l99451n92501
36426b307444j527350m24560K238778L555978K592388R37499l46810j494598k036424
36417A187457p39644J940456L412112J947248j015494k484656j319569P15080
36409C642990J284158K64632n35683l81691q93697l167577m992590l362773P01971
36400g440260K785980J026076j517512j609737j3327R98412J532358K724479L595951
36391B082420K460294K09437q86245p85844j065445j399222M9541K836440M071257
36382G572633K479258j91600k248266l645617l893890j597998K431932M443441
$$ y = [-1056904, -6677012, -9677862, -7083576, -1530805, 1715510, 1643871, 1934066, 4445986, 6331788, 5144811, 3051104, 3154925, 4414141, 3633551, 777935, -1315492, -1714943, -2307444, -3834794, -4259354, -2020576, 1535402, 4127790, 5065289, 4718479, 3223881, 1187457, 447813, 2388269, 5800381, 7747629, 6732135, 4247479, 2927910, 3642990, 4927148, 5191780, 4656097, 4274406, 3380709, 213132, -4779458, -8142231, -7440260, -4654280, -3628204, -5145716, -6755453, -6768780, -5770368, -4238010, -1513531, 2082420, 4542714, 4752151, 3865906, 3080062, 2014617, 615395, 664936, 3501376, 7572633, 10051891, 9860291, 7612025, 3966408, 72518, -1525480, 906452, 5349893]
36374E349893K248557j538428k909571j570820m33831j047846j862150r12356
36366b676552J493267L160713K342447l81490k303386j117806K460515N215570
36358H193278M815768J936641j167933l139892m058359m444986m393735l273719
36350e532937l10911L827770O509744N679579K711624Q97952J130207J300761
36342A6213789K26897n72750j0578L98689q21695k615021l412581l535859l587954
36333B282937k605146k11590J372172K58076j819090k055071q67431l73382l4803
36324d053328K149170M809235M098157o5027k919968j541874J054271O45172k261827
36315A913981l832584k336506M32070K158665K206361J153517j86289j133928
$$ y = [5349893, 7598450, 6060022, 3150451, 1579631, 1145800, 97954, -1764196, -2676552, -1183285, 1977428, 4319875, 3938385, 1634999, 517193, 2977708, 8193278, 13009046, 14945687, 13777754, 10637862, 6579503, 2134517, -2259218, -5532937, -5843848, -2016078, 4493666, 10173245, 12884869, 13782821, 14913028, 16213789, 16440686, 15867936, 15857358, 16256047, 15434352, 12819331, 9406750, 5870891, 2282937, -322209, -533799, 838373, 1096449, -722641, -2777712, -3645143, -4018525, -4053328, -1904158, 2905077, 7003234, 6938207, 4018239, 2476365, 3530636, 4175808, 1913981, -1918603, -4255109, -3823039, -1664374, 541987, 1695504, 1509215, 375287]
36307C75287j368189r27302M1563J158026J683691J348425R95367J272941J120320
36298E700129p71958l204687l303903n11484K302573K512405P57125o20469n80992
36289B278739K10207P89078P73169N57956Q49161J213158j91528l673290n773649
36280b966999l013692K483470M954629L022995J322423K672975L655912J087229
36272A3218942j896578j059257J296079m8730m010353m235739P78021M898152
36264H940537L208489j622958m240735l617774k224589j422514r55040r68163
36256b902747j489131j074272J461879M611570N495606L309795N1595j853177
36248G611118j666547n61011m44801j996078l550651k939167n60639J024848R33749
$$ y = [375287, -992902, -1920204, -1878641, -720615, 963076, 2311501, 3306868, 4579809, 5700129, 4928171, 1723484, -1580419, -2091903, 210670, 2723075, 3480200, 2859731, 2278739, 2488946, 3278024, 4051193, 4609149, 5458310, 6671468, 6479940, 2806650, -2966999, -5980691, -3497221, 1457408, 4480403, 5802826, 8475801, 12131713, 13218942, 11322364, 10263107, 11559186, 11510456, 7500103, 3264364, 4042385, 8940537, 12149026, 10526068, 6285333, 2667559, 442970, -979544, -1934584, -2902747, -4391878, -5466150, -4004271, 607299, 6102905, 9412700, 9464295, 7611118, 5944571, 5383560, 4938759, 2942681, -607970, -3547137, -4107776, -3082928, -2149179]
36239b149179J111901K617122L393781J859874L23500J707410M443101M337822
36231A7645332R84789j565401r95588J87392p64379k498777k239720l50670P16686
36222A1119664N25382O27572J153960N57515j083226j405657O29808K766842K433350
36213A7325210j7289k455548l918927m743116m787135l424846j033554R84445
36205b070760J675018J108332j77391j336411j292333J71044J707722J871504
36197A656725Q71372j79209j012839j748999j545293K08370J884736J313418o13880
36188H34401q11660J167218K251970Q32407o47150j4114Q29370n64603k297503
36179A580336p00247L329254M761875J557409k298347k282572Q53002K747778
$$ y = [-2149179, -1037278, 1579844, 4973625, 6833499, 7156999, 8864409, 13307510, 17645332, 18630121, 17064720, 16069132, 16256524, 15492145, 12993368, 10753648, 10402978, 11119664, 11645046, 12272618, 13426578, 13984093, 12900867, 11495210, 12125018, 14891860, 17325210, 17307921, 14852373, 10933446, 6190330, 1403195, -2021651, -3055205, -2070760, -395742, 712590, 535199, -801212, -2093545, -1922501, -214779, 1656725, 2528097, 2348888, 1336049, -412950, -1958243, -1749873, 134863, 1448281, 834401, 22741, 1189959, 3441929, 4274336, 3627186, 3613072, 4442442, 3877839, 1580336, 880089, 4209343, 8971218, 10528627, 8230280, 5947708, 6800710, 9548488]
36171I548488J255735j551492k640426j403691N58347J792458K110776J664846
36163A1335041J19110k478662m638335m449005j759700J480045L089011K241501
36155D939006l02797k455159j991538Q36387K607729Q84191j764499j090731K010684
36146C673273K460233o90773k269229M40537K609577n19710n552993n880552j384352
36137g113989K611801L739547L861692L532894J541966o08814M5787K173564J566633
36128A1351081j455621k202479K45851J605874M06058N30945L353257M214913
36120A8049879M48495l364006k743420m32681r71171k898453k136800O20401J856581
36111H428825J623710K050053J873998j303100m876859l750502J412227M387541
$$ y = [9548488, 10804223, 9252731, 6612305, 5208614, 5766961, 7559419, 9670195, 11335041, 11454151, 8975489, 4337154, -111851, -1871551, -391506, 2697505, 4939006, 4636209, 2181050, 189512, 1025899, 3633628, 4517819, 2753320, 1662589, 3673273, 6133506, 5442733, 3173504, 3614041, 6223618, 5703908, 150915, -5729637, -7113989, -4502188, -762641, 3099051, 6631945, 8173911, 7565097, 7610884, 9784448, 11351081, 9895460, 7692981, 7938832, 9544706, 9950764, 10481709, 13834966, 18049879, 18498374, 15134368, 12390948, 11958267, 10987096, 8088643, 5951843, 6572244, 8428825, 10052535, 12102588, 13976586, 12673486, 7796627, 4046125, 5458352, 9845893]
36103I845893K280937j115232j830571p50384m90002j210755j655603j604431
36095C469852j417959q76275L10676J932328L486811L978436K207119j224683
36087A1866305l291873j987521P32218J701479Q70297J74682l66812j947717l516944
36078D234114k952673j095317o16401j183858P086K761275L395469N80086k479937
36069B649844k988747j923729j039928r2406J280822K107678K142343K420632
36061D556509K467929L10093l212553l882506j38321L804804L647345P12683j143275
36052G122708j427687k004553k358042k79174L420899M912735K526919j049526
36044A0864279k562850j945484j185601r23554L03307L387999O160447M920650
$$ y = [9845893, 12126830, 11011598, 9181027, 8430643, 7940641, 6729886, 5074283, 3469852, 2051893, 1175618, 1486294, 3418622, 6905433, 10883869, 13090988, 11866305, 8574432, 6586911, 7319129, 9020608, 9890905, 10065587, 9698775, 7751058, 4234114, 1281441, 186124, -430277, -1614135, -1607049, 1154226, 4549695, 5129781, 2649844, -338903, -2262632, -3302560, -3394966, -2114144, -6466, 2135877, 4556509, 7024438, 7334531, 4121978, 239472, 101151, 3905955, 7553300, 8265983, 7122708, 5695021, 3690468, 1332426, 1053252, 4474151, 9386886, 11913805, 10864279, 8301429, 6355945, 5170344, 4246790, 4550097, 7938096, 14098543, 19019193]
36036A9019193q01084o323044o620348k382652J234099J552541P58662R06282
36028G343649N16662j844331m040889l404823r14037P14532J288986K384383L643694
36019E687826L056139M22689k150396l063762k509366j319735l20386k99975r87925
36010a484891p65813J072995K785348K544113J110495K82245P1933l75470n21222
36001D719733K84262O20665q66112k310755j079848J455794J537492q42470j689936
35992A828825N75907K803419K514302J341444R41193l44968l484571m998998j640833
35983d64280L432252M104083R1646k684220r91531J322344j09051l339174l393964
35974b031895J08348K785162K167345O01595R24914K591173L543024L292735K233984
$$ y = [19019193, 18218109, 11895065, 5274717, 2892065, 4126164, 5678705, 6437367, 7343649, 7860311, 6015980, 1975091, -1429732, -2343769, -1629237, -340251, 2044132, 5687826, 8743965, 9166654, 7016258, 3952496, 1443130, 123395, -196991, -496966, -1484891, -2250704, -1177709, 1607639, 4151752, 5262247, 5544492, 5616425, 5240955, 4719733, 5003995, 5624660, 4758548, 2447793, 1367945, 2823739, 4361231, 3518761, 1828825, 2404732, 5208151, 7722453, 9063897, 10005090, 9660122, 6175551, 1176553, -464280, 2967972, 7072055, 7163701, 4479481, 3487950, 4810294, 4701243, 1362069, -2031895, -1923547, 861615, 3028960, 3630555, 4555469, 7146642, 10689666, 13982401, 16216385]
35965A6216385J9362l058687m694522l231574o20846Q6019n80181L98702K948858
35956G483516L270810j12497l287560k258170J293054K388797n90289m310431
35948C877230m858627j597091K930981N284024L738342J9525k047556p23028J596779
35939H220579J644875m90719j955373j037240J251479K961188L003552J528760
35931A5127101k29329q85304n68053q34560k129502k771081j674144l16134k30380
35922E488614m00343N09485J144357k71096k079671j241859J512894K497090R24811
35913H084282j68843M58116J3998l060488n379732l242656J488774L568288J353525
35904C115264j472291j152920J621670L275621J967224n81745j600892n83068
$$ y = [16216385, 16235747, 13177060, 8482538, 5250964, 4630118, 4716137, 4135956, 4534658, 7483516, 10754326, 10641829, 7354269, 5096099, 6389153, 8777950, 8187661, 3877230, -981397, -2578488, 352493, 5636517, 9374859, 9394384, 7346828, 6623800, 8220579, 9865454, 9374735, 7419362, 6382122, 7633601, 10594789, 13598341, 15127101, 14897772, 14012468, 13444415, 12609855, 10480353, 7709272, 6035128, 5718994, 5488614, 5088271, 5597756, 6742113, 6471017, 4391346, 3149487, 4662381, 7159471, 8084282, 7915439, 8373555, 8387553, 5327065, -52667, -3295323, -1806549, 1761739, 3115264, 1642973, 490053, 2111723, 5387344, 7354568, 6772823, 5171931, 4588863]
35896D588863O28924O54587J53398J76443M01391J55154o0776L86428P51187J87664
35886H023263n06663m37240p45706k579480l899255j668182K988413N393337L588161
35877A0156648N00703j074960j968653l311066l253065j5948M036547M611741
35869I681947Q71353l821558n998603n057403k570680k45318J385202K933206
35861b821854M664144N242938L194622m53329k809143k655072j323014J83013
35853C222305K220860L951328L015586n03175k851100j653599N86413O91797l00343
35844H380072J49507R92864n10746l409314m207684k720830k083841k825869j747517
35835g983358K125731M966021L688459L66998j532187k143958l193490l578938
$$ y = [4588863, 5217787, 5872374, 6025772, 6202215, 6603606, 6758760, 6697984, 7084412, 7835599, 8023263, 7516600, 7079360, 6333654, 3754174, -145081, -1813263, 1175150, 6568487, 10156648, 10657351, 9582391, 7613738, 4302672, 1049607, 1033659, 5070206, 9681947, 10553300, 6731742, 733139, -4324264, -6894944, -7140262, -5755060, -2821854, 1842290, 7085228, 10279850, 9826521, 7017378, 4362306, 3039292, 3222305, 5443165, 9394493, 12410079, 11906904, 9055804, 7402205, 7988618, 8680415, 8380072, 8529579, 9522443, 9011697, 5602383, 1394699, -1326131, -3409972, -6235841, -7983358, -5857627, -891606, 2796853, 3163851, 1631664, -512294, -3705784, -7284722]
35827g284722j088039K662416L337626K84762j972535p9326L410407L974896J557275
35818D802760r5661M74838N88595j765470m483751m553752k415454p01863j31734
35809h281492O05212J722516K103039K045034L143475M862099M284074O26291
35801A1110248k718607k617634n04803R2492j250438j800445j17042J963879K035305
35792F192955J08200j657304j446262K56950J095210m78337l105779l991034k239642
35783e265043O33004L194310M932226M690906J380197k832470l399021O12325
35775C946434M428560L852761O51665j223248j685765k810824l662753j812268
35767A684562J311428J761596m73040j276830Q51872K565576J399741m98979k41624
$$ y = [-7284722, -8372761, -5710345, -2372719, -2087957, -4060492, -4139818, -729411, 3245485, 4802760, 4707099, 5181937, 5770532, 4005062, -478689, -5032441, -7447895, -8149758, -8281492, -7676280, -5953764, -3850725, -1805691, 1337784, 6199883, 10483957, 11110248, 8391641, 5774007, 5269204, 5361696, 4111258, 2310813, 2193771, 4157650, 6192955, 6301155, 4643851, 3197589, 3454539, 4549749, 4071412, 965633, -3025401, -5265043, -4632039, -1437729, 3494497, 8185403, 9565600, 6733130, 3334109, 3946434, 8374994, 12227755, 12879420, 11656172, 9970407, 7159583, 3496830, 1684562, 2995990, 4757586, 4284546, 3007716, 3859588, 6425164, 7824905, 7325926, 7084302]
35758G084302J644532K919750K728317J206306j540532m381822n266744l898441
35750D95668k367222j975879j526677J75514K331341L730827M155320L377814
35742H396706J219592p31671m73093N61140j265672n357316o118798j182810M080680
35733h71242M080044R70848K23191J625724Q06601k294088l210637q60361R13083
35724A383163O41521J731715N386294O883437K756819k822128l545662O8174K076453
35715A4559786j18008l169950l649096k165052q44049j80010J42353j35536p39297
35706C701141k53658J681237K976953J692142r16084j792856j11153J903685K183896
35697A1065303J107266Q4265n12888r06294o11941P91120K049602J144839j831622
$$ y = [7084302, 8728834, 11648584, 14376901, 15583207, 14042675, 9660853, 4394109, 495668, -1871554, -3847433, -5374110, -5198596, -2867255, 863572, 5018892, 8396706, 9616298, 8884627, 8411534, 8972674, 7707002, 2349686, -3769112, -4951922, -871242, 3208802, 4179650, 4402841, 6028565, 6835166, 4541078, 1330441, 470080, 1383163, 2024684, 3756399, 9142693, 16026130, 18782949, 15960821, 12415159, 12483333, 14559786, 14441778, 11271828, 7622732, 5457680, 4613631, 4433621, 4575974, 4440438, 3701141, 3447483, 5128720, 8105673, 9797815, 8881731, 7088875, 6977722, 8881407, 11065303, 12172569, 12256834, 11743946, 10837652, 10225711, 11016831, 13066433, 14211272, 12379650]
35688A2379650m140348l617161j450549n19800j488023k129568q01015J060463
35680g06351J190050J84185Q32679L690457N611663L988118N48689j259616j310614
35671A2769260k108538l519281k182819K535663N902752M102032K40938J1131
35663A7751138L064095L548940q71506n515783n769212l344467k508719l253423
35655C101063k212214J074233K983928J331526j179360o81401K462334M062581
35647A0942690J649649k135008k775485K32369K583861Q94039k659715l427026
35639E305374p97890J394094R44756K89969J985443M209147L475564J6965k551500
35630A4271922k203037l77849J020961J950144K854409K924887J042409k263581
$$ y = [12379650, 8239302, 4622141, 3171592, 2651792, 1163769, -965799, -1766814, -706351, 483699, 667884, 1500563, 5191020, 10802683, 14790801, 15339490, 14079874, 12769260, 10660722, 7141441, 4958622, 7494285, 13397037, 17499069, 17740007, 17751138, 20815233, 24364173, 23492667, 17976884, 12207672, 8863205, 6354486, 3101063, 888849, 1963082, 4947010, 6278536, 5099176, 4417775, 6880109, 10942690, 12592339, 10457331, 7681846, 7914215, 10498076, 11392115, 8732400, 5305374, 4507484, 5901578, 6846334, 7136303, 9121746, 13330893, 16806457, 16823422, 14271922, 12068885, 11691036, 12711997, 14662141, 17516550, 20441437, 21483846, 19220265]
35622A9220265m723594m264593j063913K224845K736172L00176k323173k491004
35614I615181m19169J456374J100172j498978m291833m305156k59062N076513
35606F474042O784516L450727p41765j426748K11258o1266k599941l354772m54352
35597H281699K638943K285202r5374n67689J421408K632699Q98086k214100l879482
35588A1401392l191561j138059J112077K749208K974755J510544m99916j213228
35580A3705212k52089O31270j47693j707521j964931q71027n98949k051967l072781
35571C669524j477544J548172K938336J851335L32503J37947P96385J024153L95923
35562A1216734q60516k336849l136090k291236j89381J318917Q83548q81613k247376
$$ y = [19220265, 14496671, 10232078, 9168165, 11393010, 14129182, 14429358, 12106185, 9615181, 9196012, 10652386, 11752558, 10253580, 5961747, 1656591, 1397529, 6474042, 13258558, 16709285, 15967520, 14540772, 14752030, 14690764, 12090823, 8736051, 8281699, 10920642, 13205844, 13110470, 12542781, 13964189, 16596888, 17494974, 15280874, 11401392, 8209831, 7071772, 8183849, 10933057, 13907812, 15418356, 14918440, 13705212, 13453123, 14084393, 13936700, 12229179, 10264248, 9393221, 8794272, 6742305, 3669524, 2191980, 3740152, 6678488, 8529823, 8862326, 9000273, 9796658, 10820811, 11216734, 10356218, 8019369, 4883279, 2592043, 2402662, 3721579, 4605127, 3723514, 1476138]
35553A476138k019733j71758K269744L660763L021893J345051P13915J609226
35545A1905239K087441M41808k198761l060172j105973J816529L094615J741807
35537A4722533j266490m055514m917452l204627k8621K192215J771374m05449
35529D807969j675497n79472J545143K461520J767309O77234l11535j790695l377055
35520C524921l275491r25677J498120J696321K58333m47355N02484K101916L358649
35511H292221L795047K539512p95222m220636m616974j601164J665328K395840
35503G453952J232487L33567J27905k87979o83264J27067J745872J902377m63053
35494A1488931l146786k996616J79681L227976L296869Q70575j350706j734950
$$ y = [1476138, -543595, -715353, 1554391, 5215154, 8237047, 9582098, 10296013, 11905239, 13992680, 14434488, 12235727, 9175555, 8069582, 9886111, 12980726, 14722533, 13456043, 9400529, 4483077, 1278450, 1249829, 3442044, 5213418, 4807969, 3132472, 2553000, 4098143, 6559663, 8326972, 9004206, 8692671, 6901976, 3524921, 249430, -676247, 821873, 2518194, 2776527, 2329172, 2831656, 4933572, 8292221, 12087268, 14626780, 13831558, 9610922, 4993948, 3392784, 5058112, 7453952, 8686439, 9020006, 9147911, 8859932, 8176668, 8303735, 10049607, 11951984, 11488931, 8342145, 5345529, 5525210, 8753186, 12050055, 12920630, 11569924, 9834974]
35486I834974r13524j98475j11469n96210j527140k512075k924601k468384j153128
35477b570032J135895L992941N601487M156803N68016j895064j291732J125818
35469A0824132L118645L612521K223739p27207k692086m72147M744722P007113
35461B7639432K962197l306045o031434n336454m831253m548943k024493J247687
35453E770694J052549j887112k068475J796786M317750K184454p05700k16668
35445A0244278J480955P12450j009774k74852J711915J395091o59022r88688M24707
35436A3037060K82471k031215l360466j932016M57146J829196K039586J035076
35428A1356838j402771l547434k679717R12913L795636M095407L414997L045713
$$ y = [9834974, 8921450, 8722975, 8611506, 8015296, 6488156, 3976081, 1051480, -1416904, -2570032, -1434137, 2558804, 8160291, 12317094, 12885110, 10990046, 9698314, 10824132, 13942777, 17555298, 19779037, 19051830, 16359744, 15887597, 20632319, 27639432, 30601629, 27295584, 21264150, 15927696, 11096443, 6547500, 4523007, 5770694, 6823243, 4936131, 2867656, 4664442, 8982192, 11166646, 10460946, 10244278, 11725233, 12437683, 11427909, 11153057, 12864972, 14260063, 13601041, 12612353, 13037060, 13319531, 11288316, 7927850, 5995834, 6452980, 8282176, 10321762, 11356838, 9954067, 6406633, 3726916, 4639829, 8435465, 12530872, 15945869, 18991582]
35420A8991582J495731k282954n888280o287388m026379k103419j565991p22716
35412b389814J388008L059333K367145J58575q50764L26847J648429R46222r53791
35403E700190j431185P9527J356528Q47659j55194J18736J175092J485342J037017
35394A0213712P67701N38355k76484r43610k61351J135033J450238N22924n2676
35385A3093842M46430J074526J153488J087586R18773j28761k085437l693038
35377A1867409m022359l481118k806826k121630j289538k57888J086113K503919
35369A478082L012932J999230M58911j73439j29912o50186j424059o96735J684102
35360E558926L250930J945292j099316k821624j613263J188618K753852J474065
$$ y = [18991582, 20487313, 18204359, 12316079, 6028691, 2002312, -101107, -1667098, -2389814, -1001806, 2057527, 4424672, 4583247, 3732483, 4059330, 5707759, 6653981, 5700190, 4269005, 4348532, 5705060, 6552719, 6397525, 6516261, 7691353, 9176695, 10213712, 10981413, 11519768, 11243284, 10299674, 10038323, 11173356, 12623594, 13146518, 13093842, 13540272, 14614798, 15768286, 16855872, 17774645, 17645884, 15560447, 11867409, 7845050, 4363932, 1557106, -564524, -1854062, -2111950, -1025837, 1478082, 4491014, 6490244, 6949155, 6775716, 6645804, 5995618, 4571559, 3874824, 5558926, 8809856, 10755148, 9655832, 6834208, 5220945, 6409563, 9163415, 10637480]
35352A0637480j415790l100475k426743j124429j018147j248085L3357K152601
35344B489769K499774M41133j766907k325474j885703j468425n64909J323592
35336a257150K778288J772851j553636m502684m313917r49393K556053L010395
35328b459193O93768q59104N57239K853679K736714K91335j740701k065813j491317
35319a483393l58194J439458K229659l5448l764844m672327j680509J485426J860617
35310d979555R81003J232095J767598P61086q03663o84378P89548J263419q5693
35301B41460j829277k567368k051282m77587J695852L377796L430976J682104
35293C502674r11309k668262k038412P22337K962210K412653L32022l14510M21661
$$ y = [10637480, 9221690, 6121215, 3694472, 2570043, 1551896, 303811, 337168, 2489769, 4989543, 5430676, 3663769, 1338295, -547408, -2015833, -2580742, -1257150, 1521138, 3293989, 1740353, -2762331, -7076248, -8025641, -5469588, -2459193, -1765425, -2624529, -2067290, 786389, 3523103, 3814438, 2073737, 7924, -1483393, -1841587, -402129, 1827530, 1792082, -1972762, -6645089, -8325598, -6840172, -4979555, -3998552, -2766457, -998859, -237773, -1041436, -1725814, -936266, 327153, 241460, -1587817, -4155185, -6206467, -6684054, -4988202, -1610406, 1820570, 3502674, 2591365, -76897, -2115309, -1392972, 1569238, 3981891, 4313913, 3999403, 4421064]
35284D421064l72737l186353m567122k425295M67775N65303j494963k445270q74334
35275i911932J998390M261865M298494J775534q69032k37308L321631N585388
35267A0223030M515994K987613L476684M103320K968441K263480L988086N373969
35259C9900617L464039J007949K305412N788649O667166M993090M854566O867654
35251G5849142P977145Q090793J0200287J3750625J4657603J2937544J3745123
35244A57208262J9003765K4088468K5033368K3196133K0214886J4349884N589427
35237B88684193q28350o10986L488421N792031M852327K949062J509297P27621
35229C06563616J193687K462280K249484l8925j523412l86103Q12624m39459k026301
$$ y = [4421064, 4048327, 861974, -3705148, -6130443, -5662668, -5097365, -6592328, -9037598, -9911932, -7913542, -3651677, 646817, 2422351, 1553319, 1316011, 4637642, 10223030, 14739024, 17726637, 21203321, 25306641, 28275082, 30538562, 34526648, 39900617, 43364656, 44372605, 46678017, 52466666, 59133832, 64126922, 68981488, 75849142, 83826287, 91917080, 102117367, 115867992, 130525595, 143463139, 157208262, 176212027, 200300495, 225333863, 248529996, 268744882, 283094766, 288684193, 287855843, 287244857, 290733278, 296525309, 301377636, 304326698, 305835995, 306563616, 307757303, 310219583, 312469067, 312430142, 310906730, 310520627, 311333251, 310893792, 308867491]
35220C08867491q99213J565752K320848K338528M662789Q327670R172555O230118
35212C42586538L128853L294331O975764J2213837J5538543J3084883M917456
35205D01740205k875387m513145j906034j286989l574753l616790R08617N693925
35197C90569649O496711M676742L844423N004551P182432R279595R246296M937681
35189D41238080j948605o125300n277642l121902l390770m288294k391332J008178
35181D15702413J885261L7118q00093J219876M052044N609474O075235N753026
35173D39534354L664724m24000m640999p006416p651696q172262r508851j0997074
35165C94797780j1146657r376822p246800p285741r895392j2286059j1607646
$$ y = [308867491, 307968278, 309534030, 311854878, 314193406, 318856195, 327183865, 336356420, 342586538, 345715391, 349009722, 355985486, 368199323, 383737866, 396822749, 401740205, 398864818, 394351673, 392445639, 391158650, 387583897, 383967107, 384875724, 390569649, 397066360, 401743102, 405587525, 410592076, 417774508, 427054103, 436300399, 441238080, 439289475, 433164175, 427886533, 424764631, 421373861, 417085567, 414694235, 415702413, 417587674, 417624792, 416824699, 418044575, 422096619, 427706093, 433781328, 439534354, 443199078, 442775078, 438134079, 431127663, 423475967, 415303705, 405794854, 394797780, 383651123, 374274301, 367027501, 359741760, 349846368, 337560309, 325952663]
35158C25952663q351154n337541m132548m080604m232663m269046l671651j779599
35150B90097857J290598N208266J0445018J6843476K1781230K2498095K0173287
35143C88337827J8234333J5661781O004962j3784033l6101380m8393085m5755560
35136B84204845l4911518k5861272k2547025k2136424k0421207j6053751j0912046
35129A31361602p880755p939555r112313q934234p535128o697673o310209m510639
35121G2441096j861203j980434n936807q995172o333129j57109K802758J79447
35113E0159447l644921m208900k016870K27973J647506K253180J039396k098224
35105D3358587m521565l793047j185804K96708K45111M98493J382043J287698
$$ y = [325952663, 317601509, 312263968, 308131420, 304050816, 299818153, 295549107, 291877456, 290097857, 291388455, 296596721, 307041739, 323885215, 345666445, 368164540, 388337827, 406572160, 422233941, 428238903, 414454870, 378353490, 329960405, 284204845, 249293327, 223432055, 200885030, 178748606, 158327399, 142273648, 131361602, 123480847, 115541292, 106428979, 97494745, 89959617, 83261944, 76951735, 72441096, 70579893, 68599459, 62662652, 53667480, 47334351, 47177242, 49980000, 50159447, 46514526, 42305626, 40288756, 40516729, 42164235, 44417415, 45456811, 43358587, 38837022, 35043975, 33858171, 34154879, 34399990, 34898483, 36280526, 37568224]
35097C7568224j87241j453924j496701q40928J94712J765410K771493J547772
35089C9868817j066975k097820r43785o96388l233872n694953m430560n01686
35081B1202778J805054Q87866p55547o74187P84672K118478K628824K088989M36974
35072C0523901j356978j652184j92833J369858J586446P02720l46402j054121
35064B9580407r08831N83639K466266K363948o37579m106305m716375k051423
35056B2573747J242849K591807J592769n32231k239753k542589j674865q44874
35048B0166860o12235j4206J722351L327372K874814O17707j298586j841113j940439
35039B3002525k176464j673361m5467J355067J200025j44452j554657k396736
$$ y = [37568224, 37380983, 35927059, 34430358, 33589430, 33784142, 35549552, 38321045, 39868817, 38801842, 36704022, 35760237, 35063849, 31829977, 26135024, 21704464, 21202778, 23007832, 23895698, 23140151, 22465964, 23250636, 25369114, 27997938, 30086927, 30523901, 29166923, 27514739, 27321906, 28691764, 30278210, 30980930, 30634528, 29580407, 28671576, 29255215, 31721481, 34085429, 33447850, 29341545, 24625170, 22573747, 23816596, 26408403, 28001172, 27468941, 25229188, 22686599, 21011734, 20166860, 19554625, 19540419, 21262770, 24590142, 27464956, 28082663, 26784077, 24942964, 23002525, 20826061, 19152700, 19107233, 20462300, 21662325, 21517873, 19963216, 17566480]
35031A7566480k119744k92262J953910K334390N76357p01273J66657J300425P03305
35022B1488245J5263J628982L807710K811118p74621k305234j47918J899661P67892
35013B9191098j346928j156442K33800o42918l942390o097197m419098J59685
35005A1979610M452340N528166K689191j560367l469425k312810j374495l097825
34997A2834385n021230l062388K363471O491806O151549K827398l40292k027649
34989B0217050k489049j983170p09205P33851J735963K139726K119637J944931
34981B3709734J696014R86288m59089j862471k251939k395936l807217n243354
34973A0372030l264908J942047M801450J717000k953423k891626P61463J883159
$$ y = [17566480, 15446736, 15154474, 17108384, 19442774, 20019131, 19317858, 19484515, 20784940, 21488245, 21503508, 23132490, 26940200, 29751318, 28976697, 26671463, 26523545, 28423206, 29191098, 27844170, 26687728, 26921528, 26278610, 22336220, 16239023, 11819925, 11979610, 16431950, 21960116, 24649307, 23088940, 19619515, 17306705, 15932210, 12834385, 7813155, 4750767, 7114238, 13606044, 19757593, 22584991, 22244699, 20217050, 17728001, 15744831, 15035626, 15769477, 17505440, 19645166, 21764803, 23709734, 25405748, 26392036, 25932947, 24070476, 21818537, 19422601, 15615384, 10372030, 7107122, 9049169, 13850619, 15567619, 12614196, 9722570, 10484033, 12367192]
34965A2367192k01810K4749L998586N605679J016219m522605m379083j16509J929381
34956A5721799J32962j951056k364187k388317k322096p16706J985213L112371
34948A1209983J608568p93225k340345k551386j155740J339147K492111N35086
34940A0344199k159485j583358K004765M179617K544404p56637l079818l946877
34932G546810k928186P99187N085338N264619O47007l168440j736805J746393
34924A3255923J361620k748046n228696l728534j259996m28559m1992J337828
34916B519548K411553J731663M40863K73094Q27902Q00581L01394L6758m47646
34907H895710j700239k595684j744492l0622L67809p42147j284639k5205J890244
$$ y = [12367192, 12165382, 12190131, 16188717, 21794396, 22810615, 18288010, 13908927, 13792418, 15721799, 15854761, 13903705, 11539518, 9151201, 6829105, 6112399, 8097612, 11209983, 12818551, 12025326, 9684981, 7133595, 5977855, 7317002, 9809113, 10344199, 8184714, 6601356, 8606121, 12785738, 15330142, 14573505, 11493687, 7546810, 4618624, 5417811, 10503149, 15767768, 16414775, 13246335, 11509530, 13255923, 14617543, 11869497, 6640801, 2912267, 1652271, 1223712, 1181720, 2519548, 4931101, 6662764, 7103627, 7376721, 8204623, 9005204, 9306598, 9343356, 8895710, 7195471, 4599787, 2855295, 2824673, 3192482, 2450335, 1165696, 1140491, 3030735]
34898C030735K871161K652672J604093m3746j434716j088596J166758L414614
34890A2172975L883660K846159J241584j096609m107864n703396l774609L90008
34882E851908L072818K637382R65772J77627J71193P7989l8596q1182p10212j961020
34872A0163679k544163j732007n87385j83885L657Q07542J967162L146250M520257
34863A5561107M962173J976676m189520q518463o662742j160924J499642m44510
34855C023439k282656k73968L132966L381949R7013l223328l988037k540089l33993
34846c006704J692930K978409L091898K111702P59698o5138J7900M72708M49291
34837H502694R5214N54733J999541K738561J553611k46006r41386j377313l209667
$$ y = [3030735, 5901896, 8554568, 10158661, 10114915, 8680199, 7591603, 8758361, 12172975, 16056635, 18902794, 20144378, 19047769, 14939905, 9236509, 5461900, 5851908, 8924726, 11562108, 12527880, 12705507, 12876700, 12954689, 12916093, 12834911, 12124699, 10163679, 7619516, 5887509, 5300124, 5116239, 5119896, 5927438, 7894600, 11040850, 15561107, 20523280, 22499956, 18310436, 9791973, 3129231, 1968307, 3467949, 3023439, 740783, 466815, 3599781, 6981730, 7078743, 3855415, -132622, -2672711, -3006704, -1313774, 1664635, 4756533, 6868235, 7627933, 7562795, 7580695, 8053403, 8502694, 8597908, 9152641, 11152182, 13890743, 15444354, 15198348, 14256962, 12879649, 9669982]
34828I669982n081548l979154l46975J889943J174987M17723J771023L068802
34820H584783J835314m81722j284962j085438j605168j827931K94188L582072
34812H011136M772135L163127Q15251j206057l382679m934841m026677j086602
34804B124793J171984J507269J176453R56919J56578q61298l54045J470677J786723
34795I136053n51020k613390j320329K227933M469949L993606K316313R67215
34787A8626330j54016j620869l090222l407022j791146R34466K512681J488452
34779A3498654q40062j828045p47571P29330J219745J050834Q21810M68422K07571
34770A4580688N04497O02784q23543k912663k862638K0865K852322L035239J301805
$$ y = [9669982, 4588434, 609280, 262305, 2152248, 3327235, 3744958, 5515981, 8584783, 10420097, 9938375, 8653413, 7567975, 5962807, 4134876, 4429064, 8011136, 12783271, 15946398, 16761649, 15555592, 12172913, 7238072, 3211395, 2124793, 3296777, 4804046, 5980499, 6937418, 7093996, 6232698, 5878653, 7349330, 9136053, 8585033, 5971643, 4651314, 6879247, 11349196, 15342802, 17659115, 18626330, 18472314, 16851445, 13761223, 10354201, 8563055, 9497521, 12010202, 13498654, 12658592, 10830547, 10082976, 10812306, 12032051, 13082885, 13904695, 14373117, 14580688, 15085185, 15687969, 14864426, 11951763, 9089125, 9109990, 11962312, 14997551, 16299356]
34761A6299356n17735k179120l563633l193317q49129N84441j034387l210357
34753B336119k089814J725189M151824L518127J883709R27256J69536o07115o42553
34744A1372278m01258j340169k870088k585617k63432J370019P77114m49592q43468
34735D765787j184687j928313j600285K32116J148196n53476k748735k551287
34727d420684o55902N6251j117315k343208k291604j149521O12056K265088K360851
34718f683988M75818j144130Q3418L390085N358216M187192J420367n09777p38257
34709E838944O8761O96159J74697j346416k610225k806645k388104j593307M07206
34700c558930L472971N185183L671856M90605j528636j991546j962471r09565
$$ y = [16299356, 15781621, 13602501, 10038868, 6845551, 5996422, 6580863, 5546476, 2336119, 246305, 1971494, 6123318, 9641445, 11525154, 12452410, 12621946, 12014831, 11372278, 10971020, 9630851, 6760763, 4175146, 3911714, 5281733, 6058847, 5609255, 4765787, 3581100, 1652787, 52502, 284618, 1432814, 879338, -1869397, -4420684, -5076586, -5020335, -6137650, -8480858, -10772462, -11921983, -11309927, -9044839, -6683988, -6208170, -7352300, -7268882, -3878797, 1479419, 5666611, 7086978, 6577201, 5838944, 5907705, 6603864, 6778561, 5432145, 2821920, 15275, -2372829, -3966136, -3558930, -85959, 5099224, 8771080, 9261685, 7733049, 5741503, 3779032, 2869467]
34692B869467J811431L551455R04478m293632o026877k197915K533764L606478
34684B758649K175948J553984J782843R85116o24736j477370j545722j512431
34676D096281o72185J437860K810332J429933j111918j452588P88554K811942
34668A0138211K594002M68842k610860n663281o872616m893656j024126K078447
34660e785037L586928M303392M011239J896959o67030r72835R06571J764543j16735
34651H927995k584450k950591j438903p933M43368L58097K70661L20516K71199
34642C609959k78446r62688m65830J408965K474062J046944j013401j039865j92067
34633D587633j388619l291995j577185L163724M658514M45270l551076j804897
$$ y = [2869467, 4680898, 8232353, 9136831, 4843199, -1183678, -3381593, -847829, 2758649, 4934597, 6488581, 8271424, 9256540, 8631804, 7154434, 5608712, 4096281, 3424096, 4861956, 7672288, 9102221, 7990303, 6537715, 7326269, 10138211, 12732213, 13201055, 10590195, 4926914, -1945702, -6839358, -7863484, -5785037, -2198109, 2105283, 6116522, 8013481, 7346451, 6373616, 7280187, 9044730, 8927995, 6343545, 3392954, 1954051, 1946118, 2389486, 2747583, 3018244, 3338760, 3609959, 3331513, 2368825, 1902995, 3311960, 5786022, 6832966, 5819565, 4779700, 4587633, 3199014, -92981, -1670166, 1493558, 6152072, 6597342, 3046266, 1241369]
34625A241369K425927K613218j050969l135815j823802M0077J313623L485493
34617E109121N446316L693610j171868l826795j881523Q59125Q91724o7173M96630
34608I549167R73116j050415l816411l899899j623799j00498j76366O5364J409653
34599A329912K349006J806021N61119j60593J84296J473119K601766J848891q79262
34590A1114275l088280k733933j131709p64946j420532j198148l48164o94659
34582b66096j558952j64574L112169L792334l65646n216604n276879q60287K925899
34573c878636L169985J924274K027652L066220K671186J81868k420798k848763
34565C892988r89894J070764J400451L08200m49452l50119o81372j941428k327046
$$ y = [1241369, 3667296, 6280514, 5229545, 2093730, 269928, 310005, 1623628, 5109121, 10555437, 14249047, 13077179, 9250384, 7368861, 8227986, 9119710, 9052537, 9549167, 10522283, 9471868, 5655457, 1755558, 131759, 31261, -145105, -79741, 1329912, 3678918, 5484939, 6046058, 5885465, 6069761, 7542880, 10144646, 11993537, 11114275, 8025995, 5292062, 4160353, 3395407, 1974875, 776727, 428563, -266096, -1825048, -1989622, 1122547, 4914881, 4549235, -667369, -5944248, -6804535, -3878636, -708651, 1215623, 3243275, 6309495, 8980681, 9162549, 6741751, 3892988, 2903094, 3973858, 5374309, 5682509, 5233057, 4882938, 4201566, 2260138, -66908]
34556f6908l55032K236921K414566K10184j182198J67027K697839M175596M406242
34547A4704237L917587K160598r06717l035836k098201L85500P58533j641093
34539A4244608l377596j789263J212992J833578n20196k861714k905864j721307
34531D115238j558658k590401l186748k724366k285311k211394q74320K514951
34523h801009N228950L866153k44675j612509K150564O465577N600237K16229
34515A2869517m004348l928576j614758J15264R60994J456035J370508R25311
34507H149947R07305P43687p13316j879861L53715M771088N533817M53536m627453
34498A3692465l727550N78342J478842j672842l399308j454050L78822m73131
$$ y = [-66908, -421940, 1814981, 4229547, 4439731, 3257533, 3424560, 6122399, 10297995, 14704237, 18621824, 20782422, 19875705, 16839869, 14741668, 15127168, 15885701, 14244608, 10867012, 9077749, 10290741, 12124319, 11604123, 8742409, 5836545, 4115238, 2556580, -33821, -3220569, -5944935, -8230246, -10441640, -11315960, -8801009, -3572059, 294094, 49419, -1563090, 587474, 7053051, 12653288, 12869517, 8865169, 4936593, 3321835, 3437099, 4398093, 5854128, 7224636, 8149947, 9057252, 9800939, 9087623, 7207762, 7561477, 12332565, 17866382, 18319918, 13692465, 9964915, 10543257, 12022099, 10349257, 6949949, 5495899, 5874721, 5401590]
34490E401590j390451Q3548K004253J998451J320656J725272J758563k32185k149097
34481A0520600j172030J089840N53867k997583n297202l446729O85410L523972
34473C460145L813740K682978J430412L39290j058427l066494m886573m892746
34465b177675k476513Q33634K896757L124802K331357J174214k8573n13337L46470
34456E511136J715586J899836M98775j085880j530450j023302m36239P2858Q47774
34447F470094J483709Q16143j292204k834635j687952J095197J809149q76075
34439D983426l200391j031483L894137N784743K722050r33874j050214J034176
34431A2202570J798050Q38803j0485m79117j528966k700728k787102k146183j747697
$$ y = [5401590, 4011139, 4094687, 6098940, 8097391, 9418047, 11143319, 12901882, 12669697, 10520600, 9348570, 10438410, 10992277, 7994694, 2697492, -749237, -63827, 3460145, 7273885, 9956863, 11387275, 11726565, 10668138, 7601644, 2715071, -2177675, -4654188, -3820554, -923797, 2201005, 4532362, 5706576, 5678003, 5164666, 5511136, 7226722, 9126558, 9625333, 8539453, 7009003, 5985701, 5549462, 5622320, 6470094, 7953803, 8769946, 7477742, 4643107, 2955155, 4050352, 5859501, 4983426, 1783035, 751552, 4645689, 10430432, 13152482, 12218608, 11168394, 12202570, 14000620, 14839423, 14828938, 14349821, 12820855, 10120127, 7333025, 5186842, 3439145]
34422C439145j010399P83047K071013R44926j382830k066987r29478j84737l81223
34413A282477M8232J275557J507688L62014k52181P27979K186823L103678L472502
34404A3714769K628626l10025l697833m191593j363974J398453J631079M46173
34396A0255675o37948k134875m060724m211210j447584J844922L014110K530391
34388E152757J730584k76946m324510p824298p335296l504113j30958J154356
34380a5358424K115678L915860N039635M015055J865958O39472Q38327J326837
34372D398398J079318K61049l11174m08574o03346q90213L8990K713135M703225
34363A0980808K911049j789765m896585m067615j752679p87529n00819O77049
$$ y = [3439145, 2428746, 3211793, 5282806, 6227732, 4844902, 2777915, 1848437, 1663700, 1282477, 1330709, 2606266, 4113954, 4475968, 4223787, 4951766, 7138589, 10242267, 13714769, 16343395, 16033370, 12335537, 8143944, 6779970, 8178423, 9809502, 10255675, 9617727, 7482852, 3422128, -789082, -2236666, -391744, 2622366, 5152757, 6883341, 6606395, 2281885, -5542413, -12877709, -16381822, -16512780, -15358424, -13242746, -9326886, -4287251, -272196, 1593762, 2233234, 3071561, 4398398, 5477716, 5738765, 5427591, 5019017, 4415671, 3525458, 3564448, 6277583, 10980808, 13891857, 12102092, 7205507, 3137892, 1385213, 597684, 96865, 773914]
34355G73914J757362J287163M27334O57631M87650j950910m706166m270968r42123
34346f479113J836642K573527K411276J662000j39895j342813R2205K128664Q02265
34337C544758k833625l261775P38120L490151J182007k026517o18629L721386
34329C935876N010496J788539j866041k827065j962188j039817m01964n0376j72942
34320B414518j59875P64941J801605J335072o03443k325547k718252j902485j62329
34311a555795J968106L046979K185642Q44405J068769K173700J541983j172145
34303A0101644l178025k597137j027114q02800j619731j566923k42904R90929
34295E7939J285075J131057R07805O9868j525037k364385n91606L232941N725223
$$ y = [773914, 2531276, 3818439, 4245773, 4903404, 5391054, 3440144, -1266022, -5536990, -6479113, -4642471, -2068944, 342332, 2004332, 1864437, 521624, 613829, 2742493, 3544758, 711133, -2550642, -1812522, 1677629, 2859636, 833119, 214490, 3935876, 8946372, 10734911, 8868870, 6041805, 4079617, 3039800, 2637836, 2587460, 2414518, 2254643, 3019584, 4821189, 6156261, 5552818, 3227271, 509019, -1393466, -1555795, 412311, 3459290, 5644932, 6489337, 7558106, 9731806, 11273789, 10101644, 6923619, 4326482, 3299368, 2496568, 876837, -690086, -932990, 57939, 1343014, 2474071, 3381876, 3451744, 1926707, -437678, -1029284, 2203657, 7928880]
34286G928880M112987k87525l413779l375159k295070k509720l019729j681822
34278d540937O68520J207117k80328r66304L36656J148693m93993k425605j344093
34269f690274K142766M130570K559294n52261k046738r56392J345976K776519
34261B709460J978038n69908k548923k058750l9024Q76453N1875l72757R82389
34252A008853K373880J518029r70339k499800j869040M8703K131041L551291L148400
34243H441018N24191k386457l055089j736008r08146j287778j052358M18932R83009
34234e8686p40995k935338l397649k394276r02576J371341L916992M134700J255555
34225B49068r62488O98590L317108J971429k045711k700751J402291M986903M385132
$$ y = [7928880, 12041867, 11754342, 8340563, 4965404, 2670334, 160614, -2859115, -4540937, -3872417, -2665300, -2945628, -3911932, -3575276, -2426583, -2920576, -5346181, -6690274, -4547508, -416938, 2142356, 1590095, -456643, -1413035, -67059, 2709460, 4687498, 4117590, 1568667, -490083, -529107, 347346, 399221, 26464, 1008853, 3382733, 4900762, 3930423, 1430623, -438417, -389714, 1741327, 5292618, 8441018, 8965209, 6578752, 3523663, 1787655, 879509, -408269, -1460627, -1041695, -58686, -799681, -3735019, -7132668, -9526944, -10429520, -9058179, -5141187, -1006487, 249068, -713420, -14830, 3302278, 5273707, 3227996, 527245, 1929536, 6916439, 11301571]
34216A1301571K046500P43352j005677m294226n664038k301809K235564K596486
34208E657723n17847k155546j019761k18371q55078l98166J857081K660964M9729
34199E060728l078790l051436m49364J403193J235378O74856J051277J482637
34191D328479M80766j659098k895728j984574m14624p60774l037218m272878k578723
34182a2794372Q7367Q50851O3636J82115J521536J905203L66867j408113j732169
34173a0957079q70490J81874J103050J878528K423298K890969L251553K780689
34165B682392J305325L91500J430118L003255K375206n75563l216109l863118
34157C533006l141473j606903J092983M007619M632627K163587j094382k660167
$$ y = [11301571, 13348071, 14091423, 13085746, 8791520, 3127482, 825673, 3061237, 5657723, 5139876, 2984330, 1964569, 1746198, 891120, 492954, 2350035, 5010999, 5060728, 1981938, -1069498, -1518862, -115669, 1119709, 1794565, 2845842, 4328479, 4809245, 3150147, 254419, -1730155, -2144779, -2905553, -5942771, -10215649, -12794372, -12707005, -11856154, -11792518, -11610403, -10088867, -8183664, -7816797, -9224910, -10957079, -11827569, -11645695, -10542645, -8664117, -6240819, -3349850, -98297, 2682392, 3987717, 4379217, 5809335, 8812590, 11187796, 10612233, 7396124, 3533006, 391533, -1215370, -122387, 3885232, 8517859, 10681446, 9587064, 6926897]
34149F926897k377515j274953p9549K90735r77872k741022k517901p8193J770113
34140a059260J107413o80470j654645j997290k314773j728735K87495K217939
34132e822326K660569K277043J764992J50660k623817l715078r34299L394326
34124b847930N148254L700704J583780R8226j445028k784782k437909n61179O94183
34115A148319J68578j037632j530756j110929k80769J90310n06872j974464k253560
34106g187775l23967K004018K581557K091260K364845K836331J729425j71277
34098E924417n03252L34091l11383k328991k476388k6390J361031n70131k674178
34089a271174j110284K684355M135682K073739k66075l16935P41867N26239j053706
$$ y = [6926897, 4549382, 3274429, 3194880, 3485615, 2507743, -233279, -2751180, -2829373, -1059260, 48153, -632317, -2286962, -4284252, -6599025, -8327760, -8040265, -5822326, -3161757, -884714, 880278, 1030938, -1592879, -5307957, -6242256, -2847930, 2300324, 6001028, 7584808, 7683034, 6238006, 3453224, 1015315, 454136, 1148319, 1316897, 279265, -1251491, -2362420, -2643189, -2452879, -2959751, -4934215, -7187775, -7511742, -5507724, -2926167, -834907, 1529938, 4366269, 6095694, 5924417, 5421165, 5755256, 5443873, 3114882, 638494, 612104, 1973135, 1403004, -1271174, -2381458, 302897, 4438579, 6512318, 6246243, 5929308, 6671175, 7197414, 6143708]
34080F143708k023128j214209J80513J62550j395920k440700j437755N87695J708474
34071B71228J826181K087735K276029J066454j121945j945854m66091J440263
34063E434000J878625J216668N03798n13068k294776l825740l672920k023194
34055c296607m57485j43212r29650j657842j012759J100788K852952K315382J59190
34046a069243r64206o0069R84821N17617m16278M2847J712475K828853K425008
34037F001825J095414L1321m8297L05604n60589l218403n256063l597584R08673
34028d338099L624915J888619j593089k479010R1801L569925N233267L842667
34020I840996L4287l309364l087754j16203R55953k117772n447937m250666L36506
$$ y = [6143708, 4120580, 2906371, 3086884, 3249434, 1853514, -587186, -2024941, -1437246, 271228, 2097409, 4185144, 6461173, 7527627, 6405682, 4459828, 3993737, 5434000, 7312625, 8529293, 9033091, 8520023, 6225247, 2399507, -1273413, -3296607, -3754092, -3897304, -4826954, -6484796, -7497555, -6396767, -3543815, -1228433, -1069243, -2033449, -2093518, -1108697, -591080, -1007358, -964511, 747964, 3576817, 6001825, 7097239, 7128560, 7080263, 7385867, 6825278, 3606875, -1649188, -5246772, -4338099, -713184, 1175435, -417654, -2896664, -2804863, 765062, 5998329, 9840996, 9875283, 6565919, 3478165, 3361962, 4317915, 2200143, -3247794, -7498460, -7161954]
34011g161954L068779J777292q36519j854603j150928J46507J248869J553090
34003c209467J092305R59317J478035J012829j091489k009890O72641L912953
33995B817234K575073k498736m852920j780788J779021R62908k059109k411646
33987e468963j63120R56087M21647J441476M698963O099462K471742l462980o230336
33978G63978m241553q97455M74969K47995K46354K46725q56656j619995P27851
33969d907787N137778O399415K036185l378259l876104M8324K932527K351031
33961F743110J135183J716033K530946J276950j529562l766969m143198k389660
33953A572833P45599K928061K027372p53314j926195m89928J087631J270829J459223
$$ y = [-7161954, -4093175, -2315883, -3152402, -5007005, -6157933, -6011426, -4762557, -3209467, -2117162, -1157845, 320190, 1333019, 241530, -1768360, -1095719, 2817234, 5392307, 2893571, -1959349, -3740137, -1961116, -998208, -3057317, -5468963, -5632083, -4675996, -4254349, -2812873, 1886090, 7985552, 10457294, 6994314, 763978, -3477575, -4375030, -3900061, -3652066, -3405712, -3158987, -4015643, -5635638, -4907787, 229991, 6629406, 8665591, 5287332, 1411228, 1459552, 4392079, 6743110, 7878293, 9594326, 12125272, 13402222, 11872660, 8105691, 3962493, 1572833, 2318432, 5246493, 7273865, 6520551, 4594356, 4104428, 5192059, 6462888, 7922111]
33944G922111K325975J829531q63382k777163j417092R57288O06981k099700l693836
33935B790713k809821j139116p8554M79192M24040o91161k032607k043704q11036
33926e912054j26367j055258k699531l281801j661943J579446L887183K816179
33918f454146o75794k586824p23205K622447M239491L950178K974388R31680k416726
33909A861489m484986k706434J074300K727102J575672L42761M7711q36635k108374
33900b507394j200913K032924L899850K122325p34824j296231j70428j69497j612527
33891C63285k158380o21426J312820J440934r7577r15514O78419L146573L094583
33882F243717l67063m025118m511619k259383L10321K631329N022366N507361
$$ y = [7922111, 10248086, 12077617, 11214235, 8437072, 7019980, 7977268, 8584249, 6484549, 2790713, -19108, -1158224, -1236778, -757586, -333546, -1024707, -3057314, -5101018, -5912054, -6038421, -7093679, -9793210, -13075011, -14736954, -13157508, -9270325, -6454146, -7129940, -9716764, -10439969, -7817522, -3578031, 372147, 3346535, 4278215, 1861489, -2623497, -5329931, -4255631, -1528529, 47143, 389904, 437615, -399020, -2507394, -3708307, -1675383, 2224467, 4346792, 3611968, 2315737, 2145309, 1975812, 363285, -1795095, -2416521, -1103701, 337233, 239656, -675858, 2561, 3149134, 6243717, 5876654, 1851536, -2660083, -4919466, -4609145, -1977816, 3044550, 8551911]
33874H551911J912425l201900m362113q17359K062168O69631j881535j357744
33866A575484Q94607O76731k154298l689318j892593J055626K277625J389904
33858A33768o6816n13137N64724K150622K407655P25624j378663k171498j751340
33849A00939j304404j189533q66268j05351P13880J129238Q82775J77048k05913
33840f67589K01380P26181P55784J183390K748771L565687J198845k848418m214536
33831B649495j903170L52616J88708j34735J212383J652853j207311m615931m520656
33822f325748j676613L59623J017318K004204K817274J843300N39500J515511
33814B094369L385945K632323j1336m40072J626766K031769n12772k276799j271599
$$ y = [8551911, 10464336, 7262436, 2900323, 2082964, 4145132, 4814763, 2933228, 1575484, 2470091, 3146822, 992524, -2696794, -4589387, -3533761, -1256136, 133768, 66952, -446185, 118539, 2269161, 4676816, 5402440, 4023777, 1852279, 100939, -1203465, -2392998, -3259266, -3364617, -2650737, -1521499, -638724, -461676, -667589, -466209, 259972, 1015756, 2199146, 4947917, 8513604, 9712449, 6864031, 2649495, 746325, 1098941, 1287649, 1152914, 2365297, 4018150, 2810839, -1805092, -6325748, -8002361, -7642738, -6625420, -4621216, -1803942, 39358, 578858, 2094369, 5480314, 8112637, 8101301, 7661229, 9287995, 11319764, 10806992, 8530193, 7258594]
33805G258594m92835j857005k235364Q12681L833621K473991j546296l150861
33797E096526j551595n62353k178891m088432l841438k205651j360146j727448
33789a2419428j656508M11857L808773N730169M150423O04781j311011m46447
33781a127391O98900j34936j909719k213662m50044K078694L715005L203858O79348
33772D540053j425284o55463J650046J702852o90114j229694J805154L873826
33764I571376J031941l367348l592042l33583R53902j078184k375983q32438P72005
33755G49646J65133j059117j096253o82332l78216R74023K994883K680613q54290
33746C494090l835435k978009k98265N57305K12259J587699L654168K195346k838764
$$ y = [7258594, 6765759, 4908754, 2673390, 3486071, 7319692, 9793683, 8247387, 5096526, 3544931, 2982578, 803687, -3284745, -7126183, -9331834, -10691980, -12419428, -14075936, -13664079, -9855306, -4125137, 25286, 630067, -680944, -1127391, -428491, -563427, -2473146, -4686808, -5136852, -3058158, 656847, 3860705, 4540053, 3114769, 2459306, 4109352, 5812204, 5122090, 3892396, 5697550, 9571376, 10603317, 7235969, 3643927, 3310344, 4264246, 3186062, 810079, -22359, 749646, 914779, -144338, -1240591, -1922923, -2301139, -1327116, 1667767, 4348380, 3494090, -341345, -3319354, -3617619, -3060314, -2848055, -1260356, 2393812, 4589158, 1750394]
33737A750394n442220j316513N619341P697402L055608k630715l982844k145578
33729B604875j483311k746277k985398j334353o20813k098042k602811J92417
33721a1073713K963221J409108k342542k324231J738822L366737o29785m625186
33713a1517569k312121L882120O440516L413944M8102L00546J925889J321542
33705C502969q93251j736236p21217J10033j08040j03244P79216J174184k2497
33696A981917j538870j342578M23462J757951J801069J614492J591894L35447
33688F624784k430835l910805j806218J432645J241534k370624m309093j456770
33680f985382L075537M554669K672010N86728J13008O29745J289802J503614K52911
$$ y = [1750394, -3691826, -5008339, 611002, 8308404, 11364012, 8733297, 4750453, 2604875, 1121564, -1624713, -4610111, -5944464, -6565277, -8663319, -11266130, -11073713, -8110492, -6701384, -9043926, -11368157, -9629335, -6262598, -6892383, -11517569, -13829690, -9947570, -3507054, -93110, -45008, 255538, 2181427, 3502969, 2609718, 873482, 152265, 262298, 154258, 51014, 830230, 2004414, 1981917, 443047, -899531, -476069, 1281882, 3082951, 4697443, 6289337, 6624784, 4193949, 283144, -1523074, -90429, 1151105, -1219519, -5528612, -6985382, -3909845, 644824, 3316834, 3903562, 4016570, 4646315, 5936117, 7439731, 7692642]
33671G692642k300115l360180p30220K931627K602298j863253m606322j659823
33663a293346L080584K808268k860853o997131m029250L493838Q223850O406469
33655H832429J055589k569715k490822n15288R23539Q98588j93060j335446j556904
33646C048910r83856q90713j650000j478951J008652L799724L575220N35910j837659
33637E127237k046836k123462l046578k601889J22632K012718Q46803n25018J088535
33628a145858L274321J698283k322509l424731m50357K455866K872378K581874
33620E539267K390345L35790l092593l553484L11247L453912J558419k419844
33612D523059l064562n36848R78877N20233P68649K122226J496799k215060n528178
$$ y = [7692642, 5392527, 2032347, 1302127, 4233754, 6836052, 4972799, 366477, -1293346, 1787238, 4595506, 1734653, -5262478, -9291728, -5797890, 2425960, 8832429, 9888018, 7318303, 4827481, 4312193, 5235732, 6134320, 5941260, 4605814, 3048910, 2065054, 1174341, -475659, -1954610, -945958, 2853766, 6428986, 6964896, 5127237, 3080401, 956939, -2089639, -4691528, -4568896, -2556178, -1709375, -2234393, -1145858, 2128463, 3826746, 1504237, -1920494, -2370851, 85015, 2957393, 5539267, 7929612, 8265402, 5172809, 1619325, 1930572, 5384484, 6942903, 4523059, 1458497, 921649, 1900526, 2420759, 3189408, 5311634, 6808433, 4593373, -934805]
33603i34805m865939j147633J746538J636951j72890j150518n55708J64001j06025
33594e386028k75795R66084K183890Q97656j752789j580829K196506M844634K819232
33585D912561j008658k174319j354089j899221l301992k469550r097N27433o94055
33576g470987K19878L499375M223426L92241k791233j97087N538562P567060L728087
33567A4709322j738590m068036k496838M94902K142420J621273L92277L6190j19417
33558A0973503j575349l123459j868637J412091J805044k489092o105558l546025
33550d517482K394097M053167l36313m380856k628352K560928N295510M015766
33542F456465K076645K025982K421302P40033k543343m288403k783794j30697
$$ y = [-934805, -5800744, -6948377, -5201839, -3564888, -3737778, -4888296, -5444004, -5280003, -5386028, -5661823, -4695739, -2511849, -1614193, -3366982, -4947811, -2751305, 2093329, 4912561, 3903903, 1729584, 375495, -1523726, -4825718, -7295268, -7304365, -6776932, -7470987, -7251109, -3751734, 471692, 863933, -1927300, -2124387, 3414175, 10981235, 14709322, 12970732, 8902696, 6405858, 6900760, 9043180, 10664453, 11056730, 11092920, 10973503, 9398154, 6274695, 4406058, 5818149, 7623193, 5134101, -971457, -4517482, -2123385, 1929782, 1593469, -2787387, -5415739, -2854811, 2440699, 6456465, 8533110, 10559092, 12980394, 13720427, 11177084, 6888681, 4104887, 3974190]
33534C974190L80506j435007k532958r05385J717634K268828J20114k623086l599187
33525b634351j961388J299897L687337K832543r03806m173704m114596j411292
33517g379360J042010J618193J022523Q13601J967734M022301M779184K215756
33509A0101942k253927m246549j792121J653437J812458o71851k056687j497990
33501A048712j418291k499155k474566n11730J008239N08671j70922R16573K474046
33492a118423K181886M68573l11974M89232J137731K44106j404063k015640j005002
33483a333574L84887O70964Q7671J55334J021879P32035j530006l083039j164274
33474d058123K261026K434499j326503m168853k314385J915911L641565J693735
$$ y = [3974190, 4354696, 2919689, 386731, -518654, 1198980, 3467808, 3587922, 964836, -2634351, -4595739, -3295842, 391495, 3224038, 2320232, -1853472, -5968068, -7379360, -6337350, -4719157, -3696634, -2883033, -915299, 3107002, 7886186, 10101942, 7848015, 3601466, 1809345, 3462782, 5275240, 4603389, 2546702, 1048712, -369579, -2868734, -5343300, -5855030, -4846791, -4338120, -4509042, -3592469, -1118423, 1063463, 1532036, 1220062, 1709294, 2847025, 3091131, 1687068, -328572, -1333574, -948687, -277723, -190052, -34718, 987161, 1719196, 189190, -2893849, -4058123, -1797097, 637402, -689101, -4857954, -7172339, -5256428, -1614863, 78872]
33466G8872q84591j099085J299244M385014N602991L496186o84574l688083l591358
33457D914616j719565n51554q19689j540191j695548q26660R61063K553323K399503
33448C675298M28926j616933k409924k262709j560129J18053K165346K267530
33440H05458n84499l858555m235524j664834J005351J619321M52568q34829o57507
33431g953050J298376L295830K988534N46534j060852N7556K223573K843796J740774
33422E981071L13796p73334j355318j053328n25093j411412l268116l026032K72870
33413d844896K979528J942615o97342j264570k72524k44058n49699N43439J015102
33404a392405j789509m810068k703849K986076N161320K068442m55699Q94181
$$ y = [78872, -805719, -1904804, -605560, 3779454, 9382445, 12878631, 12194057, 8505974, 4914616, 3195051, 2643497, 1823808, 283617, -1411931, -2238591, -1277528, 1275795, 3675298, 4104224, 2487291, 77367, -2185342, -3745471, -3627418, -1462072, 805458, 220959, -3637596, -7873120, -9537954, -8532603, -6913282, -6460714, -7295543, -7953050, -6654674, -3358844, -370310, 176224, -884628, -827072, 1396501, 4240297, 5981071, 6294867, 5521533, 4166215, 3112887, 2587794, 1176382, -2091734, -5117766, -4844896, -1865368, 77247, -620095, -1884665, -2157189, -2401247, -2950946, -2407507, -1392405, -3181914, -7991982, -10695831, -7709755, -2548435, -479993, -935692, -41511]
33396d1511K080645l7950j894952o5683K251385Q84058k180929k831195j771559
33387c607691j710447j282950J978481N347618M083084o85678l406122k499533
33379a783238j402084j654990q78136J849722L908273L520410J831899k12791
33371E179065k883183m833628l579841J01103K257836J376018L4197k9661k64441
33362b642535j331242j198808P32983J758408N40854l24397P90479J085606j630018
33353b218670l989169j591574L931978O862698M907090P06222k888744m893590
33345H26241m402189j112432K284633K194418p82339k198229J03513L333747M074910
33336D322273K227346m84043l067256m765126m446506k325133m84634j35048k6205
$$ y = [-41511, 2039134, 2001184, 106232, 40549, 2291934, 3175992, 995063, -1836132, -3607691, -5318138, -6601088, -4622607, 725011, 4808095, 4122417, 716295, -1783238, -3185322, -4840312, -5718448, -3868726, 39547, 3559957, 5391856, 5179065, 2295882, -2537746, -6117587, -6016484, -3758648, -2382630, -2348433, -2378094, -2642535, -3973777, -5172585, -4439602, -2681194, -2140340, -2464737, -1674258, -588652, -2218670, -6207839, -7799413, -3867435, 2995263, 7902353, 8608575, 5719831, 826241, -3575948, -4688380, -2403747, -209329, -991668, -3189897, -3086384, 247363, 4322273, 6549619, 6065576, 2998320, -1766806, -6213312, -8538445, -9023079, -9158127, -9184332]
33327i184332J003792J821678J174795L09272J077502K630585K541953O75258
33319B050503n69096O3181R76669K99815j527541k546347j557149R88303L477142
33310A655480M081679K104812j118436l321358l563203k635569j177878J229552
33302b744921M349415N993800M035549o16847m444965m944430k889782p46140
33294b008321J89049L48083K95395j60145r88917j140432K32689K126319K568058
33285A461778J389814P22260J841330K852062J169452k479583m595718l320322
33277i58927k72731K168780L161801K422771m46747m189366n711340l698902o64049
33268h188710O90033J313485L378904N640136M697002K89747m067467n721377
$$ y = [-9184332, -8180540, -6358862, -5184067, -4874795, -3797293, -1166708, 1375245, 2050503, 1481407, 1544588, 2521257, 2821072, 1293531, -1252816, -2809965, -1821662, 1655480, 5737159, 7841971, 6723535, 3402177, -161026, -2796595, -3974473, -2744921, 1604494, 7598294, 11633843, 11016996, 6572031, 1627601, -1262181, -2008321, -1819272, -1471189, -1175794, -1335939, -2324856, -3465288, -3232599, -1106280, 1461778, 2851592, 3573852, 5415182, 8267244, 9436696, 6957113, 2361395, -958927, -1231658, 937122, 4098923, 6521694, 6074947, 1885581, -3825759, -7524661, -8188710, -7498677, -6185192, -2806288, 2833848, 7530850, 7820597, 3753130, -1968247]
33260a968247n009861k732665J002519M728723N853762M211465K395200J388131
33252I869027q44962m822761p204212n559640k373244j141669j079018O92851
33244a2463628L682881M775370L377124J955918J783308J650528R39845P83653
33236F484999J550487J740801K44643j957601k813098r72460K914564N712409
33228A2904744M141702p53194l581166j533034J177803m81231m237602m001732
33220C636290l1505J069555l031336o620990m971294q42099J461280K801618N313926
33211a214555O557764L367257j527169k687923j40853J216987l94557j614069
33203C562882j38251J896030J896339M01960p03553p37106P9944J051771N10992
$$ y = [-1968247, -6978108, -9710773, -8708254, -3979531, 1874231, 6085696, 8480896, 9869027, 9024065, 4201304, -3002908, -8562548, -10935792, -12077461, -13156479, -12463628, -8780747, -4005377, -628253, 1327665, 3110973, 4761501, 5701346, 6484999, 8035486, 9776287, 10020930, 8063329, 5250231, 4277771, 7192335, 12904744, 17046446, 16293252, 12712086, 11179052, 12356855, 11875624, 7638022, 3636290, 3604785, 4674340, 1643004, -4977986, -9949280, -10791379, -9330099, -6528481, -1214555, 5343209, 8710466, 7183297, 4495374, 4354521, 5571508, 5176951, 3562882, 3424631, 5320661, 7217000, 7618960, 6915407, 6178301, 6258245, 7310016, 7821008]
33194G821008k586081n989628n834885j906057J521323J411880p8623P94911M058992
33185g87160O600272O464280M143118O13840l236400n455145m029823j4566K343434
33176F641850K84110l692156m637161j467403J693694J194746j308394j704268
33168b994982L71195J235082j028953l631707l151515k4959K766042L563284K720980
33159a75533J054578l77381k50172J266785J913069M70651q61643M11421K859748
33150F311523K928492K11647k179153k322431j479141j104923q46823k79908j6272
33141A223011j05489L52904J002626m7505k947193m635240k464326K034457M748745
33132h38010L694451Q63265l34290J253934L306031K557046j087588l812771k557624
$$ y = [7821008, 5234927, -754701, -6589586, -8495643, -6974320, -5562440, -5641063, -4846152, -787160, 5813112, 12277392, 16420510, 17034350, 13797950, 8342805, 4312982, 4298416, 6641850, 6925960, 3233804, -1403357, -2870760, -1177066, 17680, -1290714, -2994982, -2623787, -1388705, -2417658, -6049365, -9200880, -9225839, -6459797, -2896513, -175533, 879045, 501664, 251492, 1518277, 3431346, 3901997, 3040354, 3451775, 6311523, 9240015, 9451662, 7272509, 4950078, 3470937, 2366014, 1519191, 1239283, 1223011, 1117522, 1470426, 2473052, 2425547, -521646, -5156886, -7621212, -5586755, -838010, 2856441, 3719706, 3385416, 4639350, 7945381, 10502427, 9414839, 5602068, 3044444]
33123C044444N59966Q46910k286827m283415j835068K562062M143376J787221
33115D538669j634462l303247k736347q64490J170033K327820K066656P34444
33107B299076p22039j344918o97185N26098P82711l64354j101770K38923K163530
33098A780072J668939j165538k943709j869051j23304j90172j411125j807069
33090f060957j065390J11781J703822L519822M261431L230729J614113O25682
33082G941033p3042p85617n64990P74195J410964J55082j589435k381753l073440
33073A812997m306540m024525n09655L906280N432650L822602J696507J91134
33065H021450j341666k388939j747788m55248o91518j936328j605364N32215J940262
$$ y = [3044444, 3604410, 4451320, 2164493, -2118922, -3953990, -1391928, 2751448, 4538669, 2904207, -399040, -3135387, -3999877, -2829844, -502024, 1564632, 2299076, 1577037, 232119, -465066, 61032, 843743, 479389, -622381, -383458, 1780072, 3449011, 2283473, -660236, -2529287, -2652591, -2842763, -4253888, -6060957, -7126347, -7014566, -5310744, -1790922, 2470509, 5701238, 7315351, 7941033, 7867991, 7082374, 6517384, 7291579, 8702543, 8857625, 7268190, 4886437, 1812997, -2493543, -6518068, -7027723, -3121443, 2311207, 6133809, 7830316, 8021450, 6679784, 4290845, 2543057, 2087809, 1396291, -540037, -2145401, -1613186, 327076]
33056C27076J445528M63787j57211j147141k160235j496839O25055J610366L30786
33047a58828j349226j745927j243776k53697J587879L115158J807484k104000
33039c44933m634515l002936Q85053L492693L630987J871932j088942l481404
33031b672065k729065Q65288L147784J323760k144533l316463j979198k48798
33023g753290J438931L325691L514267N24693k599281j402821K999259M648490
33015D695939J200476k653082k085895J067385J329113k551696n867790m026636
33007h892186J694138N431569L269364k441621n855961m090156N25211M395701
32999e963941O314798O189893L205424j926444n118582l149776J241762K433538
$$ y = [327076, 1772604, 2236391, 2079180, 932039, -1228196, -2725035, -2099980, -489614, -158828, -1508054, -3253981, -4497757, -4751454, -3163575, -48417, 1759067, -344933, -4979448, -7982384, -7097331, -3604638, 26349, 1898281, 809339, -2672065, -5401130, -4535842, -1388058, -64298, -2208831, -5525294, -7504492, -7753290, -6314359, -2988668, 525599, 1050292, -1548989, -2951810, 47449, 4695939, 5896415, 3243333, 1157438, 2224823, 3553936, 1002240, -4865550, -8892186, -7198048, -1766479, 1502885, -938736, -6794697, -10884853, -10359642, -5963941, 350857, 6540750, 9746174, 7819730, 2701148, -448628, 793134, 3226672]
32991C226672k59320k063179m76667J114851n60732l255499l024782m63754O96245
32982e066165m83522j464911q25916P9936L10503R34283K327346K505706Q9802
32973a592938k618254j821926K673126O389031N045596l81836m625401m062404
32965i95006m83305J707511Q84107p92382j212029q61985q70652o96503N00921
32956b819323J651265J177831o5567L33626K476923L529788J789268o78198r52088
32947F443525O36476J198609n81900k919914l599925k589377j396626q74694m89635
32938d173461N74774K102843K722303J308639j271789k475950j032871J011793
32930a233719P73544j078726o05563L752668P864098O349217o44442p345919q880720
$$ y = [3226672, 2967352, 904173, 427506, 1542357, 981625, -2273874, -5298656, -5762410, -5066165, -5549687, -7014598, -7840514, -7760578, -7450075, -6515792, -4188446, -1682740, -1592938, -4211192, -6033118, -3359992, 3029039, 8074635, 7692799, 3067398, -995006, -1478311, 229200, 1113307, 320925, -891104, -1753089, -2623741, -3320244, -2819323, -1168058, 9773, -55794, 277832, 2754755, 6284543, 8073811, 7395613, 6443525, 7080001, 8278610, 7696710, 4776796, 1176871, -1412506, -2809132, -3683826, -4173461, -3598687, -1495844, 1226459, 2535098, 1263309, -1212641, -2245512, -1233719, -460175, -1538901, -2144464, 1608204, 9472302, 15821519, 15177077, 7831158, -1049562]
32921a049562n931312k620042j553475j926525j540767L81924K455270K993888
32913h790601K272735K007105K423130J587650j152241l084144j912308O3688
32905f584986r04643l606367l096461J311027M225636K291903n98184M03692L542302
32896c016081L776279R99374k71917J671762L636423K947524O08820j619924l489045
32887E243215m623167l976864k058761p54565p093K178352N313445N588162J505056
32878H407780k882283l206758p77967p1710j923033k840973o47579K489975L284666
32869A832118J314956j135160j844147m81013J523429K361736J470463j7845n98214
32860D426323o376P57740P95867L36220L34438J072109J378644k2695k222257
$$ y = [-1049562, -6980874, -9600916, -11154391, -13080916, -14621683, -14239759, -11784489, -8790601, -6517866, -4510761, -2087631, -499981, -1652222, -4736366, -6648674, -6584986, -7489629, -11095996, -14192457, -12881430, -8655794, -6363891, -6962075, -6558383, -3016081, 760198, 1759572, 1487655, 3159417, 6795840, 9743364, 10352184, 8732260, 5243215, 620048, -3356816, -5415577, -6170142, -6177235, -3998883, 1314562, 6902724, 8407780, 5525497, 2318739, 1540772, 1469062, -453971, -3294944, -3942523, -1452548, 1832118, 3147074, 2011914, 167767, -313246, 1210183, 3571919, 5042382, 5024537, 4426323, 4419947, 5177687, 5973554, 6309774, 6644212, 7716321, 9094965, 9072270, 6850013]
32851F850013k549161l23813J411299k8408k562763k124781R10899K092006P5477
32842C750768j031631J580109M492507L091265j623110n000626n237653l984236
32834c962607k184539L78608K229584J257827j284087j767015L34848J661722
32826c335659N08841o11152M17337J569485J11735k689165l292505j051368J195641
32817g176810J427338Q94390J603893K984811K497701o32555l589779k942640
32809d933651R54408M104363L767809J385917m18539j576084l138801m023770
32801c878348k449792K94265J084582j89738o23702N45921O88535j187295k107871
32792g823443K129K577366K402222O13183M33623J857126K038480o5171k543744
$$ y = [6850013, 4300852, 3977039, 5388338, 5359930, 2797167, 672386, 1583285, 3675291, 3750768, 2719137, 4299246, 8791753, 11883018, 10259908, 5259282, 21629, -3962607, -6147146, -5768538, -3538954, -2281127, -3565214, -5332229, -4997381, -3335659, -2826818, -3437970, -3020633, -1451148, -1339413, -4028578, -7321083, -8372451, -7176810, -5749472, -4855082, -3251189, -266378, 2231323, 1598768, -1991011, -4933651, -3979243, 125120, 3892929, 5278846, 4860307, 3284223, 145422, -3878348, -6328140, -6033875, -4949293, -5139031, -5762733, -5216812, -4528277, -5715572, -7823443, -7821314, -5243948, -2841726, -2228543, -1794920, 62206, 2100686, 2035515, -508229]
32783e08229l463517k369078M97720L878327M914300J665609l718990o711465
32775e815323n491629k363236j68117N17095M39003J46180L8370K96963L59172
32766a2041522j63585j58458J602485L880926M019968J818169j8378J27966Q07323
32757a25106M61309k28641n00447j523183l907852n128065k409874K637592N193100
32748e531167L099214q06757k655496j745589K8665J141216J436394J176898N59739
32739c296883M33p0028K50720N64035Q70823J428803J913469J536668M03727p2974
32729C528793R05574J708270n0160l766849n572025l015031J397370L251779J926515
32720C14236Q19737K062885L788560L515959J658014n0705j504640l276480m201982
$$ y = [-508229, -3971746, -6340824, -5843104, -1964777, 2949523, 4615132, 896142, -5815323, -11306952, -13670188, -13838305, -13321210, -12882207, -12736027, -12697657, -12400694, -12041522, -12205107, -12363565, -10761080, -6880154, -2860186, -1042017, -1060395, -932429, -125106, 336203, 107562, -392885, -1916068, -5823920, -10951985, -13361859, -10724267, -5531167, -2431953, -3238710, -5894206, -7639795, -7611130, -6469914, -5033520, -3856622, -3296883, -3296450, -3366478, -3115758, -2551723, -1680900, -252097, 1661372, 3198040, 3601767, 3528793, 4434367, 6142637, 6092477, 2325628, -3246397, -6261428, -4864058, -1612279, 314236, 1133973, 3196858, 6985418, 10501377, 12159391, 12108686, 10604046, 7327566, 3125584]
32711C125584k716359l2634P84871r28509k594108k284708j021785k20182P34671
32702e153159K603835L929215K908861N03444q15184q38483j475266k814390k308844
32693c459971R62811L879755L298409O58502j72386J312704J794279m18545k679003
32684E176555k139773j5856N22345r44496k046814j501831m92090k58536n72466
32675b272962r35269j359872j458606m83131J176681K144489K145429K146159
32667A102918J998671L07179k384757k992288l85830K034065R86819j555366j366778
32658b255367J297015K118128l68952k554131j426250J276123K324062J351282
32650A761910r4081j314316k074494j551611R5656Q97555o7234q16282K82040
$$ y = [3125584, 409225, 376591, 1161462, 232953, -2361155, -4645863, -5667648, -5887830, -5153159, -2549324, 1379891, 4288752, 4792196, 3977012, 3138529, 1663263, -1151127, -3459971, -2497160, 1382595, 4681004, 5339506, 5167120, 6479824, 8274103, 7855558, 5176555, 3036782, 3020926, 3543271, 2598775, 551961, -949870, -1441960, -1700496, -2272962, -3208231, -4568103, -6026709, -6509840, -5333159, -3188670, -1043241, 1102918, 3101589, 3408768, 1024011, -1968277, -2354107, -320042, 666777, -888589, -2255367, -958352, 1159776, 790824, -1763307, -3189557, -1913434, 410628, 1761910, 1667829, 353513, -1720981, -3272592, -3176936, -2279381, -2346615, -3162897, -2880857]
32641b880857J403818K40475j733596j385988R56053K271513J947579J995616
32633B814613K343838N03923l085729l883635L50939N555775O489674L128707
$$ y = [-2880857, -1477039, -1236564, -2970160, -4356148, -3400095, -1128582, 818997, 2814613, 5158451, 5662374, 2576645, -1306990, -956051, 4599724, 11089398, 14218105]
$$ [...]
##END NTUPLES=NMR SPECTRUM
##END=
