##TITLE=31P_DE-80H_X3
 64 sc D2O
 26.2.2025
##JCAMPDX= 6.0         $$ Bruker NMR JCAMP-DX V2.0
##DATA TYPE= NMR SPECTRUM
##DATA CLASS= NTUPLES
##ORIGIN= UXNMR, Bruker Analytische Messtechnik GmbH
##OWNER= root
$$ XWIN-NMR		Version 3.5
$$ Thu Apr  3 12:24:03 2025 Russian Standard Time (UT+4h)  Yarkov@DPX200
##.OBSERVE FREQUENCY= 81.013821
##.OBSERVE NUCLEUS= ^31P
##.ACQUISITION MODE= SIMULTANEOUS
##.ACQUISITION SCHEME= undefined
##.AVERAGES= 64
##.DIGITISER RES= 17
##SPECTROMETER/DATA SYSTEM= spect
##.PULSE SEQUENCE= zgpg30
##.SOLVENT NAME= CDCl3
##.SHIFT REFERENCE= (INTERNAL, CDCl3, 0, 198.062)
##AUDIT TRAIL= $$ (NUMBER, WHEN, WHO, WHERE, WHAT)
$$ ##TITLE= Audit trail, XWIN-NMR		Version 3.5
$$ ##JCAMPDX= 5.01
$$ ##ORIGIN= Bruker BioSpin GmbH
$$ ##OWNER= Yarkov
$$ C:/Bruker/XWIN-NMR/data/yarkov2/nmr/P31/2/pdata/1/auditp.txt
$$ ##AUDIT TRAIL=  $$ (NUMBER, WHEN, WHO, WHERE, WHAT)
(   1,<2025-04-03 12:22:57.03 +0400>,<Yarkov>,<DPX200>,
      <created by zg, POWCHK disabled, PULCHK disabled
       configuration hash MD5:
       00 E9 B6 7A A2 85 ED C7 34 08 36 98 17 FE 4E 26
       data hash MD5: 32K
       95 9A 5A BF 01 1B 9C 3B 86 92 73 AC 3A C5 28 C6>)
(   2,<2025-04-03 12:23:04.87 +0400>,<Yarkov>,<DPX200>,
      <Start of raw data processing
       efp BC_mod = 2 LB = 1.5 FT_mod = 6 PKNL = 1 PHC0 = 1797.677 PHC1 = 19.89542 SI = 64K 
       data hash MD5: 64K
       BC 58 65 2E 45 13 CF 72 AE F6 D1 25 57 86 B2 46>)
(   3,<2025-04-03 12:23:31.53 +0400>,<Yarkov>,<DPX200>,
      <pk PHC0 = -20.22828 PHC1 = 3 
       data hash MD5: 64K
       21 CB AD 60 8D 75 62 AD 82 B3 90 BF 12 E9 71 31>)
$$ ##END=
$$ 
$$ hash MD5
$$ 70 A6 E1 AD 79 17 D8 4B 27 73 DE 76 23 B9 8C 08
##$RELAX= 
##$RELAX= 
##$RELAX= 
##$RELAX= 
##$RELAX= 
##$RELAX= 
##$RELAX= 
##$RELAX= 
$$ Bruker specific parameters
$$ --------------------------
##$DU= <C:/Bruker/XWIN-NMR>
##$EXPNO= 2
##$NAME= <P31>
##$PROCNO= 1
##$TYPE= <nmr>
##$USER= <yarkov2>
##$AMP= (0..31)
100 100 100 100 100 100 100 100 100 100 100 100 100 100 100 100 100 100 
100 100 100 100 100 100 100 100 100 100 100 100 100 100 
##$AQSEQ= 0
##$AQ_mod= 1
##$AUNM= <au_zg>
##$AUTOPOS= <>
##$BF1= 81.014009
##$BF2= 200.13
##$BF3= 200.13
##$BF4= 200.13
##$BF5= 200.13
##$BF6= 200.13
##$BF7= 200.13
##$BF8= 200.13
##$BYTORDA= 1
##$CFDGTYP= 0
##$CFRGTYP= 5
##$CHEMSTR= <none>
##$CNST= (0..31)
1 1 145 1 1 1 1 1 1 1 1 1 1 1 1 1 1 1 1 1 1 1 1 1 1 1 1 1 1 1 1 1 
##$CPDPRG= <waltz16>
##$CPDPRG1= <>
##$CPDPRG2= <waltz16>
##$CPDPRG3= <>
##$CPDPRG4= <mlev>
##$CPDPRG5= <mlev>
##$CPDPRG6= <mlev>
##$CPDPRG7= <mlev>
##$CPDPRG8= <mlev>
##$CPDPRGB= <>
##$CPDPRGT= <>
##$D= (0..31)
0 1 0 0 0 0 0 0 0 0.06 0 0.03 2e-05 3e-06 0 0 0.0002 0 0 0 0 0 0 0 0 0 
0 0 0 0 0 0 
##$DATE= 1743668576
##$DBL= (0..7)
120 120 120 11 120 120 24 19 
##$DBP= (0..7)
150 150 150 150 150 150 150 150 
##$DBP07= 0
##$DBPNAM0= <>
##$DBPNAM1= <>
##$DBPNAM2= <>
##$DBPNAM3= <>
##$DBPNAM4= <>
##$DBPNAM5= <>
##$DBPNAM6= <>
##$DBPNAM7= <>
##$DBPOAL= (0..7)
$$ [...]
##$SUBNAM3= <"">
##$SUBNAM4= <"">
##$SUBNAM5= <"">
##$SUBNAM6= <"">
##$SUBNAM7= <"">
##$SUBNAM8= <"">
##$SUBNAM9= <"">
##$SW= 400.765351723535
##$SWIBOX= (0..15)
0 1 3 0 0 0 0 0 0 0 0 0 0 0 0 0 
##$SW_h= 32467.5324675325
##$TD= 32768
##$TD0= 1
##$TE= 0
##$TE2= 300
##$TE3= 300
##$TEG= 300
##$TL= (0..7)
0 120 53 12 22 120 120 120 
##$TP= (0..7)
150 150 150 150 150 150 150 150 
##$TP07= 0
##$TPNAME0= <>
##$TPNAME1= <>
##$TPNAME2= <>
##$TPNAME3= <>
##$TPNAME4= <>
##$TPNAME5= <>
##$TPNAME6= <>
##$TPNAME7= <>
##$TPOAL= (0..7)
0.5 0.5 0.5 0.5 0.5 0.5 0.5 0.5 
##$TPOFFS= (0..7)
0 0 0 0 0 0 0 0 
##$TUNHIN= 0
##$TUNHOUT= 0
##$TUNXOUT= 0
##$USERA1= <user>
##$USERA2= <user>
##$USERA3= <user>
##$USERA4= <user>
##$USERA5= <user>
##$V9= 5
##$VALIST= <valist>
##$VCLIST= <CCCCCCCCCCCCCCC>
##$VD= 0
##$VDLIST= <DDDDDDDDDDDDDDD>
##$VPLIST= <PPPPPPPPPPPPPPP>
##$VTLIST= <TTTTTTTTTTTTTTT>
##$WBST= 1024
##$WBSW= 4
##$XGAIN= (0..3)
0 0 0 0 
##$XL= 0
##$YL= 0
##$YMAX_a= 20705
##$YMIN_a= -13441
##$ZGOPTNS= <>
##$ZL1= 120
##$ZL2= 120
##$ZL3= 120
##$ZL4= 120
##$ABSF1= 0
##$ABSF2= 0
##$ABSG= 0
##$ABSL= 0
##$ALPHA= 0
##$AQORDER= 0
##$ASSFAC= 0
##$ASSFACI= 0
##$ASSFACX= 0
##$ASSWID= 0
##$AUNMP= <proc_1d>
##$AZFE= 0.1
##$AZFW= 0.5
##$BCFW= 0
##$BC_mod= 2
##$BYTORDP= 0
##$COROFFS= 0
##$CY= -3
##$DATMOD= 1
##$DC= 0
##$DFILT= <>
##$DTYPP= 0
##$F1P= 0
##$F2P= 0
##$FCOR= 1
##$FTSIZE= 65536
##$FT_mod= 6
##$GAMMA= 0
##$GB= 0
##$INTBC= 1
##$INTSCL= 9.790993e-09
##$ISEN= 30
##$LB= 1.5
##$LEV0= 0
##$LPBIN= 0
##$MAXI= 10000
##$MC2= 0
##$MEAN= 0
##$ME_mod= 0
##$MI= 50
##$NCOEF= 0
##$NC_proc= -5
##$NLEV= 6
##$NOISF1= 182.463
##$NOISF2= 159.3651
##$NSP= 0
##$NTH_PI= 0
##$NZP= 0
##$OFFSET= 198.0616
##$PC= 4
##$PHC0= 1777.449
##$PHC1= 22.89542
##$PH_mod= 1
##$PKNL= yes
##$PPARMOD= 0
##$PSCAL= 0
##$PSIGN= 0
##$REVERSE= no
##$SF= 81.0140089999434
##$SI= 65536
##$SIGF1= 159.3651
##$SIGF2= -187.1042
##$SINO= 113.3802
##$SIOLD= 16384
##$SREGLST= <1H.CDCl3>
##$SSB= 0
##$STSI= 65536
##$STSR= 0
##$SW_p= 32467.5324675325
##$SYMM= 0
##$S_DEV= 0
##$TDeff= 32768
##$TDoff= 0
##$TI= <>
##$TILT= no
##$TM1= 0
##$TM2= 0
##$TOPLEV= 0
##$USERP1= <user>
##$USERP2= <user>
##$USERP3= <user>
##$USERP4= <user>
##$USERP5= <user>
##$WDW= 1
##$XDIM= 65536
##$YMAX_p= 474111106
##$YMIN_p= -36591605
$$ End of Bruker specific parameters
$$ ---------------------------------
##NTUPLES= NMR SPECTRUM
##VAR_NAME=  FREQUENCY,     SPECTRUM/REAL,   SPECTRUM/IMAG
##SYMBOL=    X,             R,               I
##VAR_TYPE=  INDEPENDENT,   DEPENDENT,       DEPENDENT
##VAR_FORM=  AFFN,          ASDF,            ASDF
##VAR_DIM=   65536,         65536,           65536
##UNITS=     HZ,            ARBITRARY UNITS, ARBITRARY UNITS
##FACTOR=    0.49542278885378, 1,            1
##FIRST=     16045.7642231865, 0,            0
##LAST=      -16421.768244346, 0,            0
##MIN=       -16421.768244346, -36591605,    0
##MAX=       16045.7642231865, 474111106,    0
$$ Real data points
##PAGE= N=1
##DATA TABLE= (X++(R..R)), XYDATA
$$ [...]
$$ plain form
38065 -649307 -929900 -1279445 -1445332 -1161369 -510763 135339 498959 616113 711645 944388
38055 944388 1275429 1523623 1523371 1246428 797491 325246 -38790 -188976 -75334 231933
38045 231933 541209 654341 494605 117940 -367827 -842979 -1149377 -1126959 -768694 -311122
38035 -311122 -64544 -117427 -276117 -329435 -292615 -318694 -426068 -417407 -87913 519930 1076613
38024 1076613 1206015 842269 351172 175323 312119 299603 -169507 -796895 -1055852 -895477
38014 -895477 -772093 -993647 -1345328 -1464293 -1315522 -1112950 -957407 -778326 -550730 -367053
38004 -367053 -295736 -302019 -330074 -387624 -522617 -731156 -896167 -870026 -685674 -616521 -872092
37993 -872092 -1263696 -1382550 -1139020 -885562 -912239 -1076890 -1107502 -1022409 -982706 -917656
$$ packed form
38065f49307k80593l49545j65887K83963O50606O46102L63620J17154R5532K32743
38055I44388L31041K48194k52k76943m48937m72245l64036j50186J13642L07267
38045B31933L09276J13132j59736l76665m85767m75152l06398K2418L58265M57572
38035c11122K46578n2883j58690n3318L6820k6079j07374Q661L29494O07843N56683
38024A076613J29402l63746m91097j75849J36796j2516m69110o27388k58957J60375
38014h95477J23384k21554l51681j18965J48771K02572J55543J79081K27596J83677
38004c67053P1317o283k8055n7550j34993k08539j65011K6141J84352O9153k55571
37993h72092l91604j18854K43530K53458k6677j64651l0612Q5093L9703O5050
$$ plain form
37983 -917656 -643979 -280462 -185282 -448146 -756617 -858962 -884439 -1048024 -1248303 -1167704
37973 -1167704 -685103 -34816 414425 470184 273201 203345 543794 1163907 1602695 1523762
37963 1523762 1019167 443125 88118 99454 520625 1205471 1754904 1774657 1251340 554409
37953 554409 56861 -122150 -19636 306368 713422 954929 904308 714196 582732 426450
37943 426450 -1047 -664918 -1165727 -1210554 -978796 -849584 -899633 -886332 -665244 -389042
37933 -389042 -270734 -348909 -544193 -773327 -928726 -906303 -759068 -686493 -757268 -771471
37923 -771471 -533843 -153273 82792 50040 -140764 -327903 -396654 -278293 -39708 86359
37913 86359 -39660 -222478 -167917 75213 164711 -44530 -349802 -593756 -886007 -1282451
$$ packed form
37983i17656K73677L63517R5180k62864l08471j02345k5477j63585k00279Q0599
37973a167704M82601O50287M49241N5759j96983o9856L40449O20113M38788p8933
37963A523762n04595n76042l55007J1336M21171O84846N49433J9753n23317o96931
37953E54409m97548j79011J02514L26004M07054K41507n0621j90112j31464j56282
37943D26450m27497o63871n00809m4827K31758J29212n0049J3301K21088K76202
37933c89042J18308p8175j95284k29134j55399K2423J47235P2575p0775j4203
37923g71471K37628L80570K36065l2752j90804j87139o8751J18361K38585J26067
37913H6359j26019j82818N4561K43130Q9498k09241l05272k43954k92251l96444
$$ plain form
37903 -1282451 -1546546 -1477545 -1254408 -1172446 -1197114 -1078724 -803163 -606298 -580699 -593955
37893 -593955 -620869 -824485 -1184947 -1328939 -936097 -158207 542818 862867 812483 525237
37883 525237 114082 -306486 -628343 -822799 -918566 -890448 -653783 -214278 225063 385557
37873 385557 193822 -76206 -40036 358719 748349 791194 634483 665580 873576 810406
37863 810406 300771 -175983 -106536 317787 477866 202747 -82406 -85864 -61251 -318142
37853 -318142 -704434 -870839 -813681 -838915 -1099072 -1433094 -1605990 -1484015 -1030176 -365754
37843 -365754 174957 284570 23872 -251685 -336086 -358188 -477675 -612086 -602468 -490265
37833 -490265 -447520 -519887 -632481 -825562 -1272142 -1966345 -2527940 -2486895 -1782265 -884598
$$ packed form
37903a282451k64095O9001K23137Q1962k4668J18390K75561J96865K5599j3256
37893e93955k6914k03616l60462j43992L92842P77890P01025L20049n0384k87246
37883E25237m11155m20568l21857j94456r5767K8118K36665M39505M39341J60494
37873C85557j91735k70028L6170L98755L89630M2845j56711L1097K07996o3170
37863H10406n09635m76754O9447M24323J60079k75119k85153l458K4613k56891
37853c18142l86292j66405N7158k5234k60157l34022j72896J21975M53839O64422
37843c65754N40711J09613k60698k75557q4401k2102j19487j34411R618J12203
37833d90265M2745p2367j12594j93081m46580o94203n61595M1045P04630Q97667
$$ plain form
37823 -884598 -365958 -387601 -662609 -873526 -996547 -1163092 -1328302 -1257108 -861551 -396365
37813 -396365 -190716 -245102 -247680 -12413 255367 242272 -48121 -357492 -613294 -1016479
37803 -1016479 -1579783 -1871285 -1511456 -767863 -300725 -358181 -591227 -699054 -833112 -1165079
37793 -1165079 -1429271 -1231492 -593437 129045 703144 1081852 1165799 869516 358928 -103332
37783 -103332 -481924 -813423 -849940 -330141 398489 562203 -67840 -850634 -1149198 -1077353
37773 -1077353 -1047197 -1008337 -656745 -156705 -63820 -517346 -982851 -943677 -529236 -279117
37763 -279117 -480610 -914389 -1171344 -1085737 -833669 -639462 -468475 -134202 313153 532790
37753 532790 334677 -38606 -246510 -274010 -298403 -317432 -211154 -63943 -105530 -374961
$$ packed form
37823h84598N18640k1643k75008k10917j23021j66545j65210P1194L95557M65186
37813c96365K05649n4386k578K35267K67780j3095k90393l09371k55802m03185
37803a016479n63304k91502L59829P43593M67138n7456k33046j07827j34058l31967
37793a165079k64192J97779O38055P22482N74099L78708Q3947k96283n10588m62260
37783a03332l78592l31499l6517N19799P28630J63714o30043p82794k98564P1845
37773a077353L0156L8860L51592N00040R2885m53526m65505L9174M14441K50119
37763b79117k01493m33779k56955Q5607K52068J94207J70987L34273M47355K19637
37753E32790j98113l73283k07904k7500k4393j9029J06278J47211m1587k69431
$$ plain form
37743 -374961 -727418 -1115017 -1534318 -1737768 -1408239 -705616 -255425 -410284 -816553 -904787
37733 -904787 -555998 -89702 159660 28206 -475879 -1058861 -1188240 -580660 396255 1060962
37723 1060962 1133825 907145 755151 748385 790800 871466 1018624 1138075 1064039 755099
37713 755099 350111 11642 -251144 -570013 -1014744 -1445645 -1644756 -1572529 -1365290 -1066197
37703 -1066197 -560973 94199 481491 219428 -516255 -1126119 -1239525 -997388 -676957
37694 -676957 -341746 555 176989 58231 -160213 -170901 9658 94040 13149 59374
37684 59374 431147 873278 957496 581110 12235 -451239 -683413 -684536 -564182 -552337
37674 -552337 -807142 -1175904 -1332998 -1196355 -1013070 -966162 -915078 -667992 -322288 -123671
$$ packed form
37743c74961l52457l87599m19301k03450L29529P02623M50191j54859m06269q8234
37733i04787L48789M66296K49362j31454n04085n82982j29379O07580R76915O64707
37723A060962P2863k26680j51994o766M2415Q0666J47158J19451p4036l08940
37713G55099m04988l38469k62786l18869m44731m30901j99111P2227K07239K99093
37703a066197N05224O55172L87292k62063p35683o09864j13406K42137L20431
37694f76957L35211L42301J76434j18758k18444j0688J80559Q4382q0891M6225
37684E9374L71773M42131Q4218l76386n68875m63474k32174j123J20354J1845
37674e52337k54805l68762j57094J36643J83285M6908N1084K47086L45704J98617
$$ plain form
37664 -123671 -95577 -33771 159757 339361 352301 278503 356771 693893 1068355 1077222 584726
37653 584726 257 -95245 338020 705348 543376 100234 -120613 -129341 -330963 -780943
37643 -780943 -1083901 -1066892 -1030783 -1143689 -1053277 -432654 424395 935506 952278 795603
37633 795603 716969 685893 635048 557946 366630 -17744 -385983 -365569 62217 440490
37623 440490 404142 157565 167107 516982 829506 786286 469349 125263 -171639 -451073
37613 -451073 -608318 -497588 -234949 -140520 -297168 -394640 -155798 280520 593723 719442
37603 719442 799946 837878 717992 507560 390331 301362 -15901 -528144 -851172 -798589
37593 -798589 -644304 -655931 -703640 -586313 -447512 -542194 -797359 -932415 -877278 -775743
$$ packed form
37664a23671K8094O1806J93528J79604J2940p3798P8268L37122L74462Q867m92496
37653E84726n84469r5502M33265L67328j61972m43142k20847q728k01622m49980
37643g80943l02958J7009L6109j12906R0412O20623Q57049N11111J6772j56675
37633G95603p8634l1076n0845p7102j91316l84374l68239K0414M27786L78273
37623D40490l6348k46577R542L49875L12524m3220l16937l44086k96902k79434
37613d51073j57245J10730K62639R4429j56648r7472K38842M36318L13203J25719
37603G19442Q0504L7932j19886k10432j17229q8969l17263n12243l23028N2583
37593g98589J54285j1627m7709J17327J38801r4682k55165j35056N5137J01535
$$ plain form
37583 -775743 -694279 -613655 -603139 -716120 -799631 -689769 -522340 -568622 -825498 -1050320
37573 -1050320 -1148780 -1238271 -1360233 -1415261 -1362287 -1212124 -874136 -326418 96825 -35306
37563 -35306 -650055 -1174833 -1224502 -958818 -667447 -372930 -40139 149171 22954 -267043
37553 -267043 -417539 -357500 -263939 -272103 -336425 -349113 -289999 -253233 -326948 -421625 -314375
37542 -314375 15618 233239 65154 -241782 -204554 216855 609450 756342 832252 887410
37532 887410 673897 202059 -54646 141725 351288 144152 -180359 -96521 248679 274030
37522 274030 -65579 -213231 81466 405257 368336 116707 -66164 -232327 -551360 -928914
37512 -928914 -1142243 -1167486 -1131383 -1078889 -990637 -914127 -889128 -820053 -586427 -242819 14292
$$ packed form
37583g75743Q1464Q0624J0516j12981q3511J09862J67429m6282k56876k24822
37573a050320r8460q9491j21962n5028N2974J50163L37988N47718M23243j32131
37563c5306o14749n24778m9669K65684K91371K94517L32791J89310j26217k89997
37553b67043j50496O0039R3561q164o4322j2688N9114L6766p3715r4677J07250
37542c14375L29993K17621j68085l06936L7228M21409L92595J46892P5910N5158
37532H87410k13513m71838k56705J96371K09563k07136l24511Q3838L45200K5351
37522B74030l39609j47652K94697L23791l6921k51629j82871j66163l19033l77554
37512i28914k13329k5243L6103N2494Q8252P6510K4999O9075K33626L43608K57111
$$ plain form
37501 14292 69606 14252 64448 375037 881775 1298165 1311066 819688 12363 -732108
37491 -732108 -1036496 -789071 -312563 -105364 -269310 -377938 -115391 188381 20712 -484391
37481 -484391 -679075 -364130 -90714 -331379 -822278 -1022599 -852192 -616730 -482047 -408413
37471 -408413 -410045 -485104 -406633 30882 605278 858106 679073 372221 139476 -146647
37461 -146647 -580410 -975851 -1151758 -1209545 -1332887 -1486432 -1495787 -1302169 -982135 -618035
37451 -618035 -286055 -75079 14220 92426 171485 47903 -417620 -985313 -1236821 -1097841
37441 -1097841 -943608 -1111585 -1483730 -1662519 -1432746 -921112 -388323 -6925 194058
37432 194058 298920 424159 574223 589793 344002 -19534 -185591 -51179 122492 45726
$$ packed form
37501A4292N5314n5354N0196L10589N06738M16390J2901m91378q07325p44471
37491g32108l04388K47425M76508K07199j63946j08628K62547L03772j67669n05103
37481d84391j94684L14945K73416k40665m90899k00321J70407K35462J34683P3634
37471d08413j632p5059P8471M37515N74396K52828j79033l06852k32745k86123
37461a46647m33763l95441j75907n7787j23342j53545r355J93618L20034L64100
37451f18035L31980K10976Q9299P8206P9059j23582m65523n67693k51508J38980
37441a097841J54233j67977l72145j78789K29773N11634N32789L81398K00983
37432A94058J04862J25239J50064J5570k45791l63536j66057J34412J73671p6766
$$ plain form
37422 45726 -200365 -239891 133726 684459 967644 789739 402179 244695 499759 913996
37412 913996 1093850 959871 821042 978626 1374147 1712712 1825919 1770007 1626849 1382466
37402 1382466 1015406 569258 105922 -314929 -607335 -724206 -747914 -773825 -695957 -295007
37392 -295007 391245 973001 1118902 923000 714743 629207 555152 423079 312465 268614
37382 268614 212353 85048 -63420 -180564 -271976 -310102 -230355 -95015 -109575 -349647
37372 -349647 -599475 -629879 -539419 -600608 -806133 -834993 -538997 -205349 -155775 -276448
37362 -276448 -204438 109711 310932 126721 -302565 -648948 -736207 -560330 -188929 200095
37352 200095 351620 203102 18873 82527 344832 537909 535795 419754 289131 212995
$$ packed form
37422D5726k46091l9526L73617N50733K83185j77905l87560j57484K55064M14237
37412I13996J79854j33979j38829J57584L95521L38565J13207n5912j43158k44383
37402A382466l67060m46148m63336m20851k92406j16871k3708k5911P7868M00950
37392b95007O86252N81756J45901j95902k08257q5536p4055j32073j10614m3851
37382B68614n6261j27305j48468j17144r1412l8126P9747J35340j4560k40072
37372c49647k49828l0404R0460o1189k05525k8860K95996L33648M9574j20673
37362b76448P2010L14149K01221j84211m29286l46383q7259J75877L71401L89024
37352B00095J51525j48518j84229O3654K62305J93077k114j16041j30623p6136
$$ plain form
37342 212995 260689 329585 47316 -819982 -1884895 -2419794 -2180124 -1624846 -1251927 -1091541
37332 -1091541 -1011885 -1120208 -1529546 -1988644 -2111749 -1863364 -1534109 -1331600 -1241142 -1190023
37322 -1190023 -1094432 -816279 -314515 211862 534151 667981 736956 685242 392717 -15319
37312 -15319 -275014 -360391 -464476 -634547 -728764 -728774 -775902 -865499 -824330 -653899 -580009
37301 -580009 -671449 -726989 -664861 -703159 -969361 -1215113 -1145678 -818303 -511817 -399991
37291 -399991 -535522 -925848 -1392090 -1560914 -1267014 -813621 -588306 -576743 -516883 -364007
37281 -364007 -270012 -212538 -20090 246823 291337 15846 -336585 -566538 -776700 -1109847
37271 -1109847 -1442123 -1520007 -1297846 -989990 -817962 -791641 -750954 -611551 -535826 -757554
$$ packed form
37342B12995M7694O8896k82269q67298j064913n34899K39670N55278L72919J60386
37332a091541P9656j08323m09338m59098j23105K48385L29255K02509R0458N1119
37322a190023R5591K78153N01764N26377L22289J33830O8975n1714k92525m08036
37312a5319k59695q5377j04085j70071r4217j0m7128q9597M1169J70431P3890
37301e80009r1440n5540O2128l8298k66202k45752O9435L27375L06486J11826
37291c99991j35531l90326m66242j68824K93900M53393K25315J1563N9860J52876
37281c64007R3995N7474J92448K66913M4514k75491l52431k29953k10162l33147
37271a109847l32276p7884K22161L07856J72028K6321M0687J39403P5725k21728
$$ plain form
37261 -757554 -1202668 -1451954 -1226048 -766844 -538038 -662488 -890336 -1014369 -1013706 -847678
37251 -847678 -470629 -88997 -54700 -398636 -770262 -934507 -997927 -1018800 -790865 -274111
37241 -274111 116255 23372 -291989 -302541 33110 267747 120589 -260574 -645508 -924326
37231 -924326 -953689 -621799 -174256 -94718 -488466 -907455 -977035 -872541 -912744 -982439
37221 -982439 -743513 -255791 27751 -129647 -497627 -794561 -1039728 -1344362 -1584173 -1497990
37211 -1497990 -1039987 -486448 -192914 -286541 -565322 -692784 -546936 -352722 -370627 -504616
37201 -504616 -423919 -100534 38405 -339802 -982648 -1363187 -1356387 -1313418 -1499777 -1770132
37191 -1770132 -1870531 -1789935 -1659639 -1498802 -1239701 -888770 -510168 -143065 128639 123640
$$ packed form
37261g57554m45114k49286K25906M59204K28806j24450k27848j24033O63J66028
37251h47678L77049L81632L4297l43936l71626j64245o3420k0873K27935N16754
37241b74111L90366r2883l15361j0552L35651K34637j47158l81163l84934k78818
37231i24326k9363L31890M47543P9538l93748m18989o9580J04494m0203o9695
37221i82439K38926M87722K83542j57398l67980k96934k45167l04634k39811Q6183
37211a497990M58003N53539K93534r3627k78781j27462J45848J94214j7905j33989
37201e04616Q0697L23385J38939l78207o42846l80539O800M2969j86359k70355
37191a770132j00399Q0596J30296J60837K59101L50931L78602L67103K71704m999
$$ plain form
37181 123640 -253769 -830470 -1307510 -1544231 -1580530 -1457911 -1200343 -935557 -826034 -838031
37171 -838031 -741005 -402241 32525 307922 316481 141348 -82405 -304376 -589570 -999713
37161 -999713 -1403011 -1480121 -1047317 -337985 173739 214000 -136180 -649876 -1127628 -1415016
37151 -1415016 -1495280 -1577547 -1853208 -2145012 -2077674 -1654025 -1334102 -1397926 -1560776 -1461502
37141 -1461502 -1241519 -1308669 -1718098 -2136529 -2311511 -2241044 -1936978 -1361465 -637076 -61119
37131 -61119 160135 50202 -237313 -501602 -552934 -391555 -266426 -356448 -490713 -425738
37121 -425738 -275120 -332295 -550584 -600360 -439964 -406010 -661583 -972382 -1158101 -1336656
37111 -1336656 -1518567 -1395983 -861350 -377105 -423321 -819690 -1007688 -837169 -647668 -655564
$$ packed form
37181A23640l77409n76701m77040k36721l6299J22619K57568K64786J09523j1997
37171h38031R7026L38764M34766K75397Q559j75133k23753k21971k85194m10143
37161i99713m03298p7110M32804P09332N11724M0261l50180n13696m77752k87388
37151a415016q0264q2267k75661k91804O7338M23649L19923o3824j62850R9274
37141a461502K19983o7150m09429m18431j74982P0467L04066N75513P24389N75957
37131f1119K21254j09933k87515k64289n1332J61379J25129r0022j34265O4975
37121d25738J50618n7175k18289m9776J60396L3954k55573l10799j85719j78555
37111a336656j81911J22584N34633M84245m6216l96369j87998J70519J89501p896
$$ plain form
37101 -655564 -692011 -580779 -417508 -377545 -505514 -774825 -1128677 -1380302 -1287441 -854295
37091 -854295 -416937 -302560 -481438 -652357 -629509 -555183 -696430 -1059564 -1306444 -1158904
37081 -1158904 -813175 -729166 -983815 -1115503 -758695 -162332 171081 135184 -16082 -184943
37071 -184943 -503590 -927366 -1149142 -1002701 -660776 -355509 -157191 -87789 -177560 -310276
37061 -310276 -266475 -45011 73480 -101295 -432382 -685779 -782064 -719298 -492661 -242693
37051 -242693 -249725 -585267 -955749 -1078730 -1027630 -1006425 -991301 -865967 -744199 -820795 -969499
37040 -969499 -832979 -362087 1110 -215128 -1015263 -1945549 -2469024 -2332652 -1744273 -1240970
37030 -1240970 -1230243 -1582702 -1777830 -1491216 -918487 -476698 -339145 -377118 -439829 -513805
$$ packed form
37101f55564l6447J11232J63271L9963j27969k69311l53852k51625R2861M33146
37091h54295M37358J14377j78878j70919K2848P4326j41247l63134k46880J47540
37081a158904L45729Q4009k54649j31688L56808N96363L33413l5897j51266j68861
37071a84943l18647m23776k21776J46441L41925L05267J98318O9402q9771j32716
37061c10276M3801K21464J18491j74775l31087k53397r6285O2766K26637K49968
37051b42693p032l35542l70482j22981N1100K1205J5124J25334J21768p6596j48704
37040i69499J36520M70892L63197k16238q00135r30286n23475J36372N88379N03303
37030a240970J0727l52459j95128K86614N72729M41789J37553l7973o2711p3976
$$ plain form
37020 -513805 -624960 -746096 -861059 -1009664 -1173070 -1194321 -968340 -700367 -768726 -1212529
37010 -1212529 -1530582 -1215458 -403541 271009 450647 372153 342535 257600 -109089 -604656
37000 -604656 -840551 -728402 -534992 -425490 -270130 36232 335540 413414 266571 53212
36990 53212 -94812 -135418 -120760 -205330 -513709 -919013 -1083918 -827735 -355888 -26733
36980 -26733 31810 -7215 97782 428095 825774 978959 692710 157312 -174338 -84644
36970 -84644 169904 262200 259787 410346 576123 301156 -453324 -1033206 -849245 -171416
36960 -171416 198649 -58318 -479653 -538802 -257681 42258 228853 316286 206892 -151954
36950 -151954 -496748 -524571 -395059 -562734 -1072783 -1419430 -1228071 -697611 -169391 353728
$$ packed form
37020e13805j11155j21136j14963j48605j63406k1251K25981K67973o8359m43803
37010a212529l18053L15124Q11917O74550J79638p8494k9618q4935l66689m95567
37000f04656k35895J12149J93410J09502J55360L06362K99308P7874j46843k13359
36990E3212j48024m0606J4658q4570l08379m05304j64905K56183M71847L29155
36980b6733N8543l9025J04997L30313L97679J53185k86249n35398l31650Q9694
36970h4644K54548R2296k413J50559J65777k74967p54480n79882J83961O77829
36960a71416L70065k56967m21335n9149K81121K99939J86595Q7433j09394l58846
36950a51954l44794k7823J29512j67675n10049l46647J91359N30460N28220N23119
$$ plain form
36940 353728 931317 1264178 1022853 437333 71077 39438 -74188 -468384 -783714 -723607
36930 -723607 -582830 -790895 -1203180 -1278428 -866547 -409750 -303844 -392151 -266967 128882
36920 128882 424191 297002 -136138 -454994 -386467 -58896 186040 178711 62712 56473
36910 56473 155002 144801 -104734 -456184 -657907 -634489 -548954 -575176 -686572 -722602 -615557
36899 -615557 -478416 -490404 -761373 -1262520 -1771826 -1924331 -1519009 -837937 -458667 -611886
36889 -611886 -900200 -836567 -485458 -290449 -381062 -425393 -204135 41962 16661 -162118
36879 -162118 -160693 54150 165517 -58292 -475325 -734240 -610527 -178840 258120 410473
36869 410473 232212 -85991 -355879 -553357 -727788 -879827 -1010505 -1167472 -1319059 -1293536
$$ packed form
36940C53728N77589L32861k41325n85520l66256l1639j13626l94196l15330O0107
36930g23607J40777k08065m12285p5248M11881M56797J05906q8307J25184L95849
36920A28882K95309j27189m33140l18856O8527L27571K44936p329j15999o239
36910E6473R8529j0201k49535l51450k01723K3418Q5535k6222j11396l6030J07045
36899f15557J37141j1988k70969n01147n09306j52505M05322O81072L79270j53219
36889f11886k88314O3633L51109J95009r0613m4331K21258K46097k5301j78779
36879a62118J425K14843J11367k23809m17033k58915J23713M31687M36960J52353
36869D10473j78261l18203k69888j97478j74431j52039j30678j56967j51587K5523
$$ plain form
36859 -1293536 -1011189 -700745 -681977 -948837 -1174263 -1166496 -1116202 -1275876 -1551985 -1602170
36849 -1602170 -1293008 -887127 -725731 -833470 -932064 -809451 -565964 -445211 -494260 -508524
36839 -508524 -330378 -91355 -62860 -310765 -606292 -692255 -552762 -383778 -371024 -559851
36829 -559851 -881313 -1193800 -1307199 -1104675 -714485 -448977 -442785 -429827 -67093 540702
36819 540702 875884 642630 136965 -171622 -216461 -258438 -408460 -545672 -631631 -749917
36809 -749917 -821237 -641829 -299405 -189656 -429333 -579754 -234426 374489 693802 589328
36799 589328 380430 231322 -43898 -498123 -785155 -609831 -182260 50643 -19713 -136984
36789 -136984 -166749 -297333 -658243 -986235 -900515 -414462 71223 293168 399759 602270
$$ packed form
36859a293536K82347L10444J8768k66860k25426P767N0294j59674k76109n0185
36849a602170L09162M05881J61396j07739r8594J22613K43487J20753m9049j4264
36839e08524J78146K39023K8495k47905k95527q5963J39493J68984J2754j88827
36829e59851l21462l12487j13399K02524L90190K65508O192J2958L62734O07795
36819E40702L35182k33254n05665l08587m4839m1977j50022j37212q5959j18286
36809g49917p1320J79408L42424J09749k39677j50421L45328O08915L19313j04474
36799E89328k08898j49108k75220m54225k87032J75324M27571K32903p0356j17271
36789a36984k9765j30584l60910l27992Q5720M86053M85685K21945J06591K02511
$$ plain form
36779 602270 790975 726335 462803 290686 299398 288380 136883 -17181 -44772 -18654 -40507
36768 -40507 -116822 -307478 -720148 -1204514 -1347654 -1003401 -555917 -375921 -275085 132584
36758 132584 731662 1014979 801640 385983 -35233 -612498 -1375170 -1918269 -1839368 -1280322
36748 -1280322 -787657 -713684 -899721 -907903 -505363 40634 175987 -332282 -1058273 -1346794
36738 -1346794 -1031002 -531368 -293078 -365161 -512823 -477677 -120544 412174 648929 245276
36728 245276 -463288 -716031 -263122 307210 362932 -10262 -314724 -375530 -381807 -410614
36718 -410614 -351293 -247878 -323682 -606582 -820343 -747195 -497970 -319705 -271110 -200733
36708 -200733 4065 235157 265868 19378 -341912 -644301 -897685 -1115064 -1086094 -643531
$$ packed form
36779F02270J88705o4640k63532j72117Q712j1018j51497j54064k7591K6118k1853
36768d0507p6315j90656m12670m84366j43140L44253M47484J79996J00836M07669
36758A32584N99078K83317k13339m15657m21216n77265p62672n43099P8901N59046
36748a280322M92665P3973j86037q182M02540N45997J35353n08269p25991k88521
36738a346794L15792M99634K38290p2083j47662L5146L57133N32718K36755m03653
36728B45276p08564k52743M52909N70332N5722l73194l04462o0806o277k8807
36718d10614N9321J03415p5804k82900k13761P3148K49225J78265M8595P0377
36708b00733K04798K31092L0711k46490l61290l02389k53384k17379K8970M42563
$$ plain form
36698 -643531 -109323 -72184 -613687 -1128412 -1090754 -650051 -252280 -47607 21873 -99989
36688 -99989 -422490 -696203 -756522 -823055 -1051223 -1090716 -623666 -82546 -170893 -800004
36678 -800004 -1212298 -1136234 -1045968 -1151533 -956295 -193816 499536 397426 -310395 -862540
36668 -862540 -907583 -612937 -109432 566084 1111623 1106700 547007 -137713 -586028 -733060
36658 -733060 -640197 -446709 -415599 -666540 -905011 -764681 -380472 -250857 -530717 -838670
36648 -838670 -819923 -544431 -254343 -45665 67990 53837 -30665 -32544 95850 271114
36638 271114 471716 716257 853432 701042 437892 474928 817149 956463 596264 78791
36628 78791 -181090 -282585 -484392 -638376 -482551 -232951 -291528 -488856 -254614 411055
$$ packed form
36698f43531N34208L7139n41503n14725L7658M40703L97771K04673O9480j21862
36688i9989l22501k73713o0319o6533k28168l9493M67050N41120q8347o29111
36678h00004m12294P6064R0266j05565J95238P62479O93352j02110p07821n52145
36668h62540m5043K94646N03505O75516N45539m923n59693o84720m48315j47032
36658g33060R2863J93488L1110k50941k38471J40330L84209J29615k79860l07953
36648h38670J8747K75492K90088K08678J13655j4153q4502j879J28394J75264
36638B71114K00602K44541J37175j52390k63150L7036L42221J39314l60199n17473
36628G8791k59881j01495k01807j53984J55825K49600n8577j97328K34242O65669
$$ plain form
36618 411055 752812 268227 -598310 -1080035 -1019947 -821686 -765380 -796365 -854713 -1002671
36608 -1002671 -1211130 -1324839 -1307274 -1304488 -1393571 -1440698 -1303616 -1049376 -850014 -721378
36598 -721378 -500333 -112789 244634 317226 161043 117551 335075 507779 299701 -117082
36588 -117082 -263152 -42031 147613 59160 -49903 66915 142887 -219590 -879601 -1270599
36578 -1270599 -1098686 -575280 7741 575291 1086758 1362765 1234268 714141 -31027
36569 -31027 -755362 -1212032 -1343502 -1372010 -1508075 -1615782 -1405178 -908770 -467109 -250481
36559 -250481 -136320 -94166 -287345 -644883 -727710 -285642 350919 713698 772964 775919
36549 775919 757507 592443 386576 411397 671450 870888 825101 617132 322079 -125058
$$ packed form
36618D11055L41757m84585q66537m81725O0088J98261N6306l0985n8348j47958
36608a002671k08459j13709J7565K786q9083m7127J37082K54240J99362J28636
36598g21378K21045L87544L57423P2592j56183m3492K17524J72704k08078m16783
36588a17082j46070K21121J89644q8453j09063J16818P5972l62477o60011l90998
36578a270599J71913N23406N83021N67550N11467K76007j28497n20127p45168
36569c1027p24335m56670j31470k8508j36065j07707K10604M96408M41661K16628
36559b50481J14161M2154j93179l57538q2827M42068O36561L62779N9266K955
36549G75919j8412j65064k05867K4821K60053J99438m5787k07969k95053m47137
$$ plain form
36539 -125058 -685146 -1083789 -1101428 -887005 -833071 -1129958 -1490884 -1373497 -554591 521175
36529 521175 1107806 921448 373297 -18239 -189528 -337923 -460109 -421481 -306864 -318907
36519 -318907 -413082 -406125 -385394 -592658 -899322 -860033 -410872 -80126 -275927 -711226
36509 -711226 -806761 -399878 210919 688879 835123 539614 -99712 -679877 -802722 -488543
36499 -488543 -114917 5505 -158194 -446196 -605349 -380876 236559 856403 993439 572742
36489 572742 -3938 -304630 -261300 -137799 -238535 -637650 -1074567 -1143582 -719007 -160374
36479 -160374 49263 -172338 -515677 -758045 -972998 -1230888 -1382810 -1305487 -1147239 -1117225
36469 -1117225 -1167465 -1107778 -950885 -906342 -1055273 -1252699 -1361574 -1362852 -1199110 -765661
$$ packed form
36539a25058n60088l98643j7639K14423N3934k96887l60926J17387Q18906J075766
36529E21175N86631j86358n48151l91536j71289j48395j22186L8628J14617j2043
36519c18907r4175O957K0731k07264l06664L9289M49161L30746j95801m35299
36509g11226r5535M06883O10797M77960J46244k95509o39326n80165j22845L14179
36499d88543L73626J20422j63699k88002j59153K24473O17435O19844J37036m20697
36489E72742n76680l00692M3330J23501j00736l99115m36917o9015M24575N58633
36479a60374K09637k21601l43339k42368k14953k57890j51922P7323J58248L0014
36469a117225n0240N9687J56893M4543j48931j97426j08875j278J63742M33449
$$ plain form
36459 -765661 -178939 182962 106250 -173071 -334784 -448228 -765585 -1163142 -1210912 -835745
36449 -835745 -494985 -524621 -689376 -639256 -483148 -537597 -722984 -645645 -226461 140269
36439 140269 109888 -209532 -444814 -354616 -8720 279388 223301 -100890 -294680 -174447
36429 -174447 -64340 -261904 -443848 -83159 655005 1011567 677942 173776 21863 101950
36419 101950 98378 73520 202170 335304 254574 64124 -62071 -242849 -594723 -834514
36409 -834514 -628016 -153211 121220 81016 -24568 -88616 -225774 -421103 -518610 -534697
36399 -534697 -622681 -761072 -805783 -782201 -794980 -755577 -563926 -428091 -580722 -810629
36389 -810629 -763868 -591152 -722409 -1066544 -1101741 -799512 -733705 -1088066 -1280441 -897889
$$ packed form
36459g65661N86722L61901p6712k79321j61713j13444l17357l97557m7770L75167
36449h35745L40760k9636j64755N0120J56108n4449j85387P7339M19184L66730
36439A40269l0381l19420k35282R0198L45896K88108n6087l24191j93790J20233
36429a74447J10107j97564j81944L60689P38164L56562l33625n04166j51913Q0087
36419A01950l572k4858J28650J33134q0730j90450j26195j80778l51874k39791
36409h34514K06498M74805K74431m0204j05584o4048j37158j95329r7507j6087
36399e34697q7984j38391m4711K3582j2779L9403J91651J35835j52631k29907
36389h10629M6761J72716j31257l44135l5197L02229O5807l54361j92375L82552
$$ plain form
36379 -897889 -327427 -21467 233450 748749 1167682 954202 297407 -171743 -357405 -708238
36369 -708238 -1340198 -1807318 -1791868 -1466347 -1077099 -663087 -320655 -297748 -622774 -973737
36359 -973737 -1094126 -1068736 -1063633 -1083150 -1125560 -1288601 -1537238 -1623204 -1445838 -1279498 -1413755
36348 -1413755 -1729109 -1856714 -1640451 -1229138 -819067 -542738 -545657 -899127 -1393965 -1638654
36338 -1638654 -1464485 -1098950 -854421 -775805 -711655 -617169 -600230 -692083 -759679 -698343 -564177
36327 -564177 -436724 -287478 -99608 7264 -66604 -206742 -223623 -123678 -58366 -73183
36317 -73183 -133753 -333342 -764418 -1188299 -1205094 -853292 -656492 -870966 -1059946 -733488
36307 -733488 -94089 276153 254556 212632 297649 207285 -214545 -599168 -506938 14586
$$ packed form
36379h97889N70462L05960K54917N15299M18933k13480o56795m69150j85662l50833
36369g08238o31960m67120J5450L25521L89248M14012L42432K2907l25026l50963
36359i73737j20389K5390N103j9517m2410j63041k48637q5966J77366J66340j34257
36348a413755l15354j27605K16263M11313M10071K76329k919l53470m94838k44689
36338a638654J74169L65535K44529P8616O4150R4486J6939r1853o7596O1336J34166
36327e64177J27453J49246J87870J06872p3868j40138j6881R9945O5312j4817
36317g3183o0570j99589m31076m23881j6795L51802J96800k14474j88980L26458
36307g33488O39399L70242k1597m1924Q5017r0364m21830l84623R2230N21524
$$ plain form
36297 14586 559066 873049 1019336 1115548 1107144 838098 284357 -332122 -720639 -830191
36287 -830191 -874249 -983954 -1004563 -798747 -573244 -624715 -870386 -963258 -826062 -700171
36277 -700171 -654475 -476655 -180374 -173826 -631302 -1046141 -802911 4610 713506 930754
36267 930754 838711 704825 522876 277703 208818 520387 985818 1126643 775394 243300
36257 243300 -124122 -358287 -680396 -1045610 -1148602 -900912 -612295 -534049 -473289 -147420
36247 -147420 253788 257789 -169446 -512989 -428374 -188549 -206089 -435808 -536259 -385537
36237 -385537 -133360 80412 158350 -41501 -491538 -815982 -692483 -364076 -362372 -733611
36227 -733611 -958304 -710149 -264335 23800 239492 618199 1058466 1294766 1352878 1449380
$$ packed form
36297A4586N44480L13983J46287R6212q404k69046n53741o16479l88517j09552
36287h30191m4058j09705k0609K05816K25503n1471k45671r2872J37196J25891
36277g00171M5696J77820K96281O548m57476m14839K43230Q07521P08896K17248
36267I30754r2043j33886j81949k45173o8885L11569M65431J40825l51249n32094
36257B43300l67422k34165l22109l65214j02992K47690K88617P8246O0760L25869
36247a47420M01208M001m27235l43543Q4615K39825j7540k29719j00451J50722
36237c85537K52177K13772P7938j99851m50037l24444J23499L28407J704l71239
36227g33611k24693K48155M45814K88135K15692L78707M40267K36300N8112R6502
$$ plain form
36217 1449380 1550309 1411765 1021793 626399 290344 -185184 -793776 -1150001 -1025660
36208 -1025660 -770604 -875409 -1284722 -1493960 -1271033 -947596 -951091 -1322701 -1786720 -2067205
36198 -2067205 -2021016 -1659420 -1196574 -941802 -994699 -1135215 -1114612 -936459 -746532 -599136
36188 -599136 -489518 -472739 -545924 -525490 -277801 -374 -21635 -349910 -669632 -775227
36178 -775227 -744431 -664376 -484663 -237685 -127673 -239919 -371112 -310691 -119808 11584
36168 11584 12824 -101316 -320744 -527601 -489860 -182687 54921 -67233 -363688 -439792
36158 -439792 -282594 -267118 -591540 -1005987 -1152628 -934724 -490318 -16191 302242 358975
36148 358975 206321 -41004 -368808 -765855 -1002785 -784105 -193182 276374 284541 43942
$$ packed form
36217A449380J00929j38544l89972l95394l36055m75528o08592l56225J24341
36208a025660K55056j04805m09313k09238K22927L23437l495l71610m64019k80485
36198b067205M6189L61596M62846K54772n2897j40516K0603J78153J89927J47396
36188e99136J09618J6779p3185K0434K47689K77427k1261l28275l19722j05595
36178g75227L0796Q0055J79713K46978J10012j12246j31193O0421J90883J31392
36168A1584J240j14140k19428k06857L7741L07173K37608j22154k96455p6104
36158d39792J57198J5476l24422m14447j46641K17904M44406M74127L18433N6733
36148C58975j52654k47325l27804l97047k36930K18680N90923M69556Q167k40599
$$ plain form
36138 43942 -1937 275610 648527 883054 901601 674078 199895 -364897 -737587 -758024
36128 -758024 -552036 -409253 -521078 -831655 -1114724 -1198948 -1119759 -1031558 -1014372 -1056471
36118 -1056471 -1184026 -1425781 -1614884 -1451358 -916974 -456074 -522487 -1034649 -1492320 -1566090
36108 -1566090 -1337908 -1010933 -691451 -510656 -635408 -967248 -1078825 -718360 -233329
36099 -233329 -203322 -709498 -1253576 -1404808 -1230982 -1003185 -772935 -458090 -140856 9979
36089 9979 38167 147212 341203 365621 84867 -279943 -416404 -293137 -137258 -124062
36079 -124062 -214812 -266273 -201841 -75756 -15247 -98828 -303700 -610339 -1086160 -1713298
36069 -1713298 -2173469 -2064026 -1420391 -778328 -552219 -583003 -527088 -443411 -619500 -958927
$$ packed form
36138D3942m5879K77547L72917K34527J8547k27523m74183n64792l72690k0437
36128g58024K05988J42783j11825l10577k83069q4224P9189Q8201J7186m2099
36118a056471j27555k41755j89103J63526N34384M60900o6413n12162m57671p3770
36108a566090K28182L26975L19482J80795j24752l31840j11577L60465M85031
36099b33329L0007n06176n44078j51232J73826K27797K30250L14845L17234J50835
36089I979K8188J09045J93991K4418k80754l64810j36461J23267J55879J3196
36079a24062r0750n1461O4432J26085O0509q3581k04872l06639m75821o27138
36069a713298m60171J09443O43635O42063K26109l0784N5915Q3677j76089l39427
$$ plain form
36059 -958927 -1016888 -690559 -434615 -605235 -935293 -920190 -482116 31138 344570 452583
36049 452583 389283 102131 -382139 -855034 -1098077 -1094780 -1013408 -993440 -978652 -800372 -449663
36038 -449663 -189033 -278768 -637396 -932624 -991468 -924145 -830901 -636601 -314167 -43073
36028 -43073 3867 -141703 -375187 -645676 -826590 -711699 -331958 -27039 34193 141752
36018 141752 551675 976622 985179 701066 596891 700496 577374 124900 -204638 -139669
36008 -139669 -1469 -92461 -139098 260667 957906 1425609 1403607 1024313 487914 -22848
35998 -22848 -245642 -42197 334141 471421 272007 -40653 -293292 -454205 -434904 -144511
35988 -144511 252025 448597 426492 489885 793985 1084493 1014641 537224 -100455 -594864
$$ packed form
36059i58927n7961L26329K55944j70620l30058J5103M38074N13254L13432J08013
36049D52583o3300k87152m84270m72895k43043L297Q1372J9968J4788J78280L50709
36038d49663K60630q9735l58628k95228n8844O7323R3244J94300L22434K71094
36028d3073M6940j45570k33484k70489j80914J14891L79741L04919O1232J07559
36018A41752M09923M24947Q557k84113j04175J03605j23122m52474l29538O4969
36008a39669J38200r0992m6637L99765O97239M67703k2002l79294n36399n10762
35998b2848k22794K03445L76338J37280j99414l12660k52639j60913J9301K90393
35988a44511L96536J96572k2105O3393L04100K90508o9852m77417o37679m94409
$$ plain form
35978 -594864 -773271 -702579 -636019 -696525 -654308 -256006 271558 401269 48902 -249562
35968 -249562 -72898 341006 543493 528223 573709 691319 671611 548484 561432 676780
35958 676780 584836 247237 41387 195308 424004 365233 107917 -10818 29629 -97610
35948 -97610 -548708 -1025584 -1098976 -684639 -131033 98734 -193801 -805219 -1315784 -1433832
35938 -1433832 -1200940 -894406 -757572 -814791 -898943 -838964 -645601 -507754 -565149 -706514
35928 -706514 -670223 -338044 162784 638612 968854 1039071 722560 69288 -598409 -939352
35918 -939352 -902650 -681203 -433890 -189573 39314 218658 355648 461707 474104 355660
35908 355660 240012 305573 520445 701051 808242 937636 984646 632711 -157160 -908809
$$ packed form
35978e94864j78407P0692O6560o0506M2217L98302N27564J29711l52367k98464
35968b49562J76664M13904K02487j5270M5486J17610j9708j23127J2948J15348
35958F76780r1944l37599k05850J53921K28696n8771k57316j18735M0447j27239
35948i7610m51098m76876p3392M14337N53606K29767k92535o11418n10565j18048
35938a433832K32892L06534J36834n7219q4152N9979J93363J37847n7395j41365
35928g06514L6291L32179N00828M75828L30242P0217l16511o53272o67697l40943
35918i39352L6702K21447K47313K44317K28887J79344J36990J06059J2397j18444
35908C55660j15648O5561K14872J80606J07191J29394M7010l51935p89871p51649
$$ plain form
35898 -908809 -1136930 -923243 -732113 -788196 -933423 -1022478 -1117757 -1251873 -1293191 -1155969
35888 -1155969 -920774 -637654 -217727 340468 795558 908320 729044 489316 305466
35879 305466 140286 -31973 -204224 -434882 -778759 -1105070 -1153266 -851739 -483893 -432805
35869 -432805 -765092 -1125797 -1086022 -593300 -27202 227719 191395 168713 291139 378955
35859 378955 276235 82349 -69610 -243874 -512931 -715351 -663780 -485947 -469368 -611067
35849 -611067 -623808 -407723 -208544 -217632 -305556 -315874 -374605 -674045 -1110229 -1388207 -1413138
35838 -1413138 -1348902 -1314866 -1242144 -1067842 -889577 -825368 -820233 -709261 -458359 -251846
35828 -251846 -285537 -500186 -604790 -405811 -38365 214093 263348 248836 270785 271769 202782
$$ packed form
35898i08809k28121K13687J91130n6083j45227q9055r5279j34116m1318J37222
35888a155969K35195K83120M19927N58195M55090J12762j79276k39728j83850
35879C05466j65180j72259j72251k30658l43877l26311m8196L01527L67846N1088
35869d32805l32287l60705L9775M92722N66098K54921l6324k2682J22426Q7816
35859C78955j02720j93886j51959j74264k69057k02420N1571J77833J6579j41699
35849f11067j2741K16085J99179r088q7924j0318n8731k99440m36184k77978k4931
35838a413138O4236L4036P2722J74302J78265O4209N135J10972K50902K06513
35828b51846l3691k14649j04604J98979L67446K52458M9255j4512K1949R84o8987
$$ plain form
35817 202782 125372 86159 51768 34410 99907 154930 -64485 -614986 -1123131 -1166556 -785923
35806 -785923 -404870 -302348 -376300 -401915 -310091 -176545 -89305 -71290 -48548 96289 360723
35795 360723 557544 501722 202534 -204648 -601387 -859290 -844253 -625868 -502245 -577434
35785 -577434 -508211 -6188 575930 602659 25971 -594100 -937405 -1224144 -1537569 -1475334
35775 -1475334 -850733 -238340 -301742 -882739 -1269097 -1162912 -869733 -647003 -407056 -100091
35765 -100091 76065 -10310 -218528 -354804 -358602 -229054 -24510 35150 -245420 -688961
35755 -688961 -872091 -682500 -458129 -458030 -500200 -313790 12219 179365 101345 -69288 -221598
35744 -221598 -360439 -451039 -392648 -175425 32836 -14462 -433128 -1018945 -1314598 -1053752
$$ packed form
35817B02782p7410l9213l4391j7358O5497N5023k19415n50501n08145m3425L80633
35806g85923L81053J02522p3952k5615R1824J33546Q7240J8015K2742J44837K64434
35795C60723J96821n5822k99188m07182l96739k57903J5037K18385J23623p5189
35785e77434O9223N02023N82118K6729n76688o20071l43305k86739l13425O2235
35775a475334O24601O12393o3402n80997l86358J06185K93179K22730K39947L06965
35765a00091J76156q6375k08218j36276l798J29548K04544N9660k80570m43541
35755f88961j83130J89591K24371R9m2170J86410L26009J67146p8020j70633j52310
35744b21598j38841r0600N8391K17223K08261m7298m18666n85817k95653K60846
$$ plain form
35734 -1053752 -543640 -359370 -599265 -751223 -454172 -53602 -98465 -559413 -950769 -1058210
35724 -1058210 -1086875 -1153372 -1129195 -1056248 -1225483 -1626089 -1727335 -1131243 -167073 491063
35714 491063 600075 429094 254302 150636 174283 324858 320945 -161779 -910795 -1219887
35704 -1219887 -729768 76110 471879 323342 4744 -293661 -724303 -1289260 -1648095
35695 -1648095 -1580476 -1328301 -1266909 -1440367 -1623034 -1680808 -1652194 -1573665 -1446034 -1330543
35685 -1330543 -1277351 -1166871 -815366 -283756 75316 -30197 -509086 -980952 -1145956 -1020967
35675 -1020967 -857198 -886143 -1146884 -1512694 -1820164 -1940990 -1795961 -1417786 -1009709 -825860
35665 -825860 -940925 -1209511 -1453291 -1560044 -1405414 -916714 -326405 -117861 -495371 -1075068
$$ packed form
35734a053752N10112J84270k39895j51958K97051M00570m4863m60948l91356j07441
35724a058210k8665o6497K4177P2947j69235m00606j01246N96092R64170O58136
35714D91063J09012j70981j74792j03666K3647J50575l913m82724p49016l09092
35704a219887M90119Q05878L95769j48537l18598k98405m30642n64957l58835
35695a648095O7619K52175O1392j73458j82667n7774K8614P8529J27631J15491
35685a330543N3192J10480L51505N31610L59072j05513m78889m71866j65004J24989
35675a020967J63769k8945k60741l65810l07470j20826J45029L78175M08077J83849
35665h25860j15065k68586k43780j06753J54630M88700N90309K08544l77510n79697
$$ plain form
35655 -1075068 -1341229 -1258036 -1147487 -1098365 -869772 -358190 200322 540708 573157 251404
35645 251404 -405647 -1076482 -1292446 -990726 -588169 -358850 -126386 200641 235708 -319077
35635 -319077 -1044938 -1278163 -1042405 -963367 -1297084 -1603591 -1505294 -1261641 -1307345 -1572061
35625 -1572061 -1616869 -1286639 -906812 -840774 -1056156 -1189547 -974452 -567887 -413183 -721290
35615 -721290 -1143858 -1105854 -461971 340899 790755 822071 712812 644893 547561 312811
35605 312811 -7928 -258553 -349475 -336363 -349745 -458265 -601397 -658617 -566288 -347963
35595 -347963 -59329 255559 565186 828796 952557 789730 295475 -289690 -570424 -424467
35585 -424467 -157533 -77111 -68870 159489 535775 670205 445027 196809 188129 216684 -24493
$$ packed form
35655a075068k66161Q3193J10549M9122K28593N11582N58512L40386L2449l21753
35645B51404o57051o70835k15964L01720M02557K29319K32464L27027L5067n54785
35635c19077p25861k33225K35758P9038l33717l06507R8297K43653m5704k64716
35625a572061m4808L30230L79827O6038k15382j33391K15095M06565J54704l08107
35615g21290m22568L8004O43883Q02870M49856L1316j09259o7919r7332k34750
35605C12811l20739k50625r0922J3112j3382j08520j43132n7220R2329K18325
35595c47963K88634L14888L09627K63610J23761j62827m94255n85165k80734J45957
35585d24467K66934Q0422Q241K28359L76286J34430k25178k48218q680K8555k41177
$$ plain form
35574 -24493 -422235 -555900 -242924 253469 530790 401408 -26559 -475396 -710183 -730565
35564 -730565 -746820 -907675 -1108028 -1147877 -1013794 -884171 -887719 -970119 -987235 -823528 -417951
35553 -417951 205044 862237 1241392 1126389 648845 259507 330897 745306 976476 666894
35543 666894 34108 -415536 -473304 -334546 -199788 -61803 72656 54786 -151087 -311455
35533 -311455 -225168 -24519 23931 -102347 -204128 -172335 -79932 -19551 -34398 -177309 -469856
35522 -469856 -810598 -1047050 -1111256 -989788 -651411 -157375 242426 329088 205828 179713
35512 179713 353686 517265 464317 245785 43254 -88681 -285638 -722017 -1386150 -1971555
35502 -1971555 -2098475 -1765849 -1462557 -1620710 -2044169 -2157302 -1798207 -1421069 -1396838 -1439488
$$ packed form
35574b4493l97742j33665L12976M96393K77321j29382m27967m48837k34787k0382
35564g30565j6255j60855k00353l9849J34083J29623l548q2400j7116J63707M05577
35553d17951O22995O57193L79155j15003m77544l89338P1390M14409K31170l09582
35543F66894o32786m49644n7768J38758J34758J37985J34459j7870k05873j60368
35533c11455Q6287K00649M8450j26278j01781L1793R2403O0381j4847j42911k92547
35522d69856l40742k36452o4206J21468L38377M94036L99801Q6662j23260k6115
35512A79713J73973J63579n2948k18532k02531j31935j96957m36379o64133n85405
35502a971555j26920L32626L03292j58153m23459j13133L59095L77138K4231m2650
$$ plain form
35492 -1439488 -1001224 -71565 718214 783665 171481 -592734 -1090130 -1331384 -1543350 -1769754
35482 -1769754 -1798975 -1490120 -1040321 -808496 -914564 -1125867 -1133253 -853604 -476483 -292382
35472 -292382 -442184 -751257 -862105 -624843 -277854 -129100 -187884 -298578 -484841 -846101
35462 -846101 -1193599 -1190143 -897482 -782188 -1035895 -1276305 -1152752 -890694 -905020 -1149746
35452 -1149746 -1245691 -1082103 -882715 -755806 -588062 -400063 -421428 -685877 -841238 -544677
35442 -544677 115599 740748 1064969 1160810 1240510 1335363 1222102 722047 48246 -316135
35432 -316135 -174123 130834 176064 -10179 -114774 -58630 -10298 17988 180552 388889
35422 388889 301575 -149268 -567713 -601821 -350367 -93574 79237 151846 -12182 -433128
$$ packed form
35492a439488M38264R29659P89779O5451o12184p64215m97396k41254k11966k26404
35482a769754k9221L08855M49799K31825j06068k11303p386K79649L77121J84101
35472b92382j49802l09073j10848K37262L46989J48754n8784j10694j86263l61260
35462h46101l47498L456K92661J15294k53707k40410J23553K62058j4326k44726
35452a149746r5945J63588J99388J26909J67744J87999k1365k64449j55361K96561
35442e44677O60276O25149L24221R5841P9700R4853j13261n00055o73801l64381
35432c16135J42012L04957M5230j86243j04595N6144M8332K8286J62564K08337
35422C88889q7314m50843m18445l4108K51454K56793J72811P2609j64028m20946
$$ plain form
35412 -433128 -792836 -779504 -524492 -390793 -444207 -468145 -425315 -524306 -803041 -1004859
35402 -1004859 -975863 -878815 -856923 -756391 -412552 -26913 14813 -353293 -779784 -918632
35392 -918632 -784238 -634843 -629581 -702137 -728344 -709565 -740594 -836510 -863229 -663632 -221167
35381 -221167 311528 708329 797795 581734 270687 125814 201829 305056 249113 54178
35371 54178 -168651 -378241 -505507 -355406 131568 587769 500883 -152079 -812537 -982917
35361 -982917 -732121 -443591 -317235 -337740 -525157 -897310 -1251672 -1291481 -1010485 -718250
35351 -718250 -613004 -540418 -299271 -7657 40760 -183439 -370746 -286712 -83409 -58642
35341 -58642 -208594 -225657 55418 427969 631677 702354 818067 958955 990447 991038 1166653
$$ packed form
35412d33128l59708J3332K55012J33699n3414k3938M2830r8991k78735k01818
35402a004859K8996R7048K1892J00532L43839L85639M1726l68106m26491j38848
35392i18632J34394J49395N262p2556k6207J8779l1029r5916k6719J99597M42465
35381b21167N32695L96801Q9466k16061l11047j44873P6015J03227n5943j94935
35371E4178k22829k09590j27266J50101M86974M56201q6886o52962o60458j70380
35361i82917K50796K88530J26356k0505j87417l72153l54362l9809K80996K92235
35351g18250J05246P2586K41147K91614M8417k24199j87307Q4034K03303K4767
35341e8642j49952j7063K81075L72551K03708P0677J15713J40888L1492N91J75615
$$ plain form
35330 1166653 1446531 1526711 1393199 1412322 1710056 1845287 1431456 789849 568296 878560
35320 878560 1235271 1266960 1069316 869872 753060 770572 947516 1083440 888419 432681
35310 432681 144984 243474 483116 596267 633314 672881 548415 154289 -248565 -344071
35300 -344071 -173360 42349 272144 554020 711139 570744 338198 368119 634338 799298
35290 799298 762922 747915 829777 786531 511079 214261 74293 -7138 -131141 -156930 63004
35279 63004 401147 602726 573320 373451 80522 -187533 -249661 -37074 287615 506547
35269 506547 555567 471469 270973 25471 -53862 217058 763459 1286822 1515043 1394852
35259 1394852 1128026 1049662 1330174 1722850 1753324 1261763 610966 235054 140687 28162
$$ packed form
35330A166653K79878Q0180j33512J9123K97734J35231m13831o41607k21553L10264
35320H78560L56711L1689j97644j99444j16812J7512J76944J35924j95021m55738
35310D32681k87697R8490K39642J13151L7047L9567j24466l94126m02854r5506
35300c44071J70711K15709K29795K81876J57119j40395k32546K9921K66219J64960
35290G99298l6376j5007Q1862m3246k75452k96818j39968q1431j24003k5789K19934
35279F3004L38143K01579k9406j99869k92929k68055o2128K12587L24689K18932
35269E06547M9020q4098k00496k45502p9333K70920N46401N23363K28221j20191
35259A394852k66826p8364K80512L92676L0474m91561o50797l75912r4367j12525
$$ plain form
35249 28162 -230226 -459230 -467932 -259084 44753 331225 554335 764096 1041293 1312827
35239 1312827 1336182 1026481 702102 777535 1232043 1600857 1518631 1080972 632051 393915
35229 393915 393819 584338 880235 1142351 1250323 1205109 1125122 1132804 1226067 1253399 1077136
35218 1077136 792960 679484 845541 1064022 1118683 1188650 1635530 2458460 3242243 3673417
35208 3673417 3841791 3967799 4106557 4250483 4478941 4827926 5198152 5561776 6082288
35199 6082288 6843303 7622633 8146952 8441298 8718597 9046974 9354301 9658325 10044236
35190 10044236 10474647 10842853 11144015 11372358 11353791 10969247 10470017 10241522 10287563 10302442
35180 10302442 10238780 10378046 10773831 11104463 11281628 11762582 12950376 14645951 16439289
$$ packed form
35249B8162k58388k29004q702K08848L03837K86472K23110K09761K77197K71534
35239A312827K3355l09701l24379P5433M54508L68814q2226m37659m48921k38136
35229C93915r6J90519K95897K62116J07972m5214p9987P682R3263K7332j76263
35218A077136k84176j13476J66057K18481N4661O9967M46880Q22930P83783M31174
35208C673417J68374J26008J38758J43926K28458L48985L70226L63624N20512
35199F082288P61015P79330N24319K94346K77299L28377L07327L04024L85911
35190A0044236M30411L68206L01162K28343j8567l84544m99230k28495M6041J4879
35180A0302442o3662J39266L95785L30632J77165M80954J187794J695575J793338
$$ plain form
35171 16439289 18330590 20590168 23282970 26348121 29937254 34296902 39571152 46137974
35163 46137974 54847653 66449502 81166631 99534710 123380019 155246902 197199165
35156 197199165 250687296 315678827 386260573 446342802 474111106 456232427 399283833
35149 399283833 325610303 257156240 203503542 163364245 132838617 109687760 92248543
35142 92248543 78449412 66962213 57722328 50667427 44947333 39746311 35007381 30933405
35134 30933405 27437136 24423490 22017871 20150488 18387349 16489635 14723151 13341258
35126 13341258 12189623 11118618 10347276 10023032 9772496 9135222 8214756 7482454 7097020
35117 7097020 6810366 6430051 5985827 5495926 4946116 4511748 4454338 4716476 4899632 4758135
$$ packed form
35171A6439289J891301K259578K692802L065151L589133M359648N274250O566822
35163D6137974Q709679J1601849J4717129J8368079K3845309L1866883M1952263
35156A97199165N3488131O4991531P0581746O0082229K7768304j7878679n6948594
35149C99283833p3673530o8454063n3652698m0139297l0525628k3150857j7439217
35142I2248543j3799131j1487199r239885p054901n720094n201022m738930m073976
35134C0933405l496269l013646k405619j867383j763139j897714j766484j381893
35126A3341258j151635j071005p71342l24244k50536o37274r20466p32302l85434
35117G097020k86654l80315m44224m89901n49810m34368n7410K62138J83156j41497
$$ plain form
35107 4758135 4492817 4420946 4533644 4556119 4353950 4092104 3968636 3920722 3705885 3257961
35097 3257961 2834425 2712475 2812430 2778962 2424959 1918633 1500387 1221987 1066509 1113398
35087 1113398 1389878 1698961 1808733 1724954 1578923 1346286 937825 524540 463435 821415
35077 821415 1221319 1291894 1083460 892592 838851 815009 770512 821224 1045813 1325152
35067 1325152 1470535 1451651 1421337 1514648 1673468 1716485 1581872 1433084 1456378 1589164
35057 1589164 1560455 1232395 807893 629997 833506 1263644 1678454 1923363 1930978 1692627
35047 1692627 1300070 934454 724375 638359 572920 506149 479717 452204 293491 -25008
35037 -25008 -324127 -385920 -193757 60558 179830 109877 -80563 -275454 -353839 -232594
$$ packed form
35107D758135k65318p1871J12698K2475k02169k61846j23468m7914k14837m47924
35097C257961m23536j21950R9955l3468l54003n06326m18246k78400j55478M6889
35087A113398K76480L09083J09772q3779j46031k32637m08461m13285o1105L57980
35077H21415L99904P0575k08434j90868n3741k3842m4497N0712K24589K79339
35067A325152J45383j8884l0314R3311J58820M3017j34613j48788K3294J32786
35057A589164k8709l28060m24502j77896K03509M30138M14810K44909P615k38351
35047A692627l92557l65616k10079q6016o5439o6771k6432k7513j58713l18499
35037b5008k99119o1793J92163K54315J19272o9953j90440j94891p8385J21245
$$ plain form
35027 -232594 73739 428282 617990 471157 13364 -485230 -738651 -789084 -985472 -1477043
35017 -1477043 -1859033 -1572188 -626449 343018 797086 808662 737787 661293 387859 -99760
35007 -99760 -517681 -612543 -424804 -177961 -27218 57300 238080 622020 1043931 1112708
34997 1112708 632585 -60179 -378643 -123156 354020 665511 835730 1084714 1375902
34988 1375902 1456703 1291875 1174823 1329628 1605490 1703512 1579502 1461897 1530003 1731863
34978 1731863 1914713 1999518 2001766 1987973 2033969 2120482 2061019 1680369 1102822 683724 571146
34967 571146 544304 434638 455847 817760 1200084 1045067 363020 -184365 -118395 319766
34957 319766 638744 725885 728560 637728 389104 189631 319537 666482 827345 675010
$$ packed form
35027b32594L06333L54543J89708j46833m57793m98594k53421n0433j96388m91571
35017a477043l81990K86845R45739R69467M54068J1576p0875p6494k73434m87619
35007i9760m17921r4862J87739K46843J50743Q4518J80780L83940M21911O8777
34997A112708m80123o92764l18464K55487M77176L11491J70219K48984K91188
34988A375902Q0801j64828j17052J54805K75862R8022j24010j17605O8106K01860
34978A731863J82850Q4805K248j3793M5996Q6513n9463l80650n77547m19098j12578
34967E71146k6842j09666K1209L61913L82324j55017o82047n47385O5970M38161
34957C19766L18978Q7141K675r0832k48624j99473J29906L46945J60863j52335
$$ plain form
34947 675010 496067 539702 748065 995486 1273158 1499873 1428628 949076 313519 -117329
34937 -117329 -236189 -166677 -20592 151607 259446 198054 -41007 -382512 -749567 -1049165
34927 -1049165 -1139959 -930261 -491282 3780 429925 744779 927452 967755 883653 671897
34917 671897 279508 -273791 -756638 -832129 -370300 389956 1039100 1334754 1313545 1114453
34907 1114453 788988 325573 -212158 -669935 -923481 -948730 -794580 -589239 -555953 -842886
34897 -842886 -1259468 -1352150 -893762 -180446 316879 476565 497570 463137 242676 -161180
34887 -161180 -474796 -488766 -319381 -204387 -207250 -254344 -315086 -397786 -474055 -534428 -626667
34876 -626667 -737702 -751293 -634020 -533982 -550400 -529910 -282450 84689 270681 207551
$$ packed form
34947F75010j78943M3635K08363K47421K77672K26715p1245m79552o35557m30848
34937a17329j18860O9512J46085J72199J07839o1392k39061l41505l67055k99598
34927a049165r0794K09698M38979M95062M26145L14854J82673M0303q4102k11756
34917F71897l92389n53299m82847p5491M61829P60256O49144K95654k1209j99092
34907A114453l25465m63415n37731m57777k53546k5249J54150K05341L3286k86933
34897h42886m16582r2682M58388P13316M97325J59686K1005l4433k20461m03856
34887a61180l13616j3970J69385J14994k863m7094o0742q2700p6269o0373r2239
34876f26667j11035j3591J17273J00038j6418K0490K47460L67139J85992o3130
$$ plain form
34866 207551 173493 412920 778175 846888 369832 -423065 -966339 -865551 -302710 137539
34856 137539 107852 -137781 -123078 232534 571210 609554 447925 323690 274153 175799
34846 175799 -6522 -149295 -112790 115101 384761 479007 326898 153146 290545 756628
34836 756628 1131241 999051 452096 -9825 -63999 122287 199598 75871 -73938 -100847
34826 -100847 9659 274451 736540 1289726 1660886 1707119 1628959 1732744 2020874 2160449
34816 2160449 1857382 1148563 328053 -294902 -558208 -509886 -365114 -298961 -242997 -3921
34806 -3921 374092 533120 225037 -300686 -514174 -184698 403875 812286 875320 739911
34796 739911 612551 567983 549101 460009 254507 -22013 -270870 -437566 -556252 -664023
$$ packed form
34866B07551l4058K39427L65255O8713m77056p92897n43274J00788N62841M40249
34856A37539k9687k45633J4703L55612L38676L8344j61629j24235m9537r8354
34846A75799j82321j42773L6505K27891K69660R4246j52109j73752J37399M66083
34836G56628L74613j32190n46955m61921n4174J86286P7311j23727j49809k6909
34826a00847J10506K64792M62089N53186L71160M6233p8160J03785K88130J39575
34816B160449l03067p08819q20510o22955k63306M8322J44772O6153N5964K39076
34806c921L78013J59028l08083n25723k13488L29476N88573M08411O3034j35409
34796G39911j27360m4568j8882q9092k05502k76520k48857j66696j18686j07771
$$ plain form
34786 -664023 -689750 -510069 -164081 63689 -100533 -583627 -1018012 -1165000 -1128835 -1060120
34776 -1060120 -844603 -315606 345722 736374 765984 762072 948411 1102862 912911 441187
34766 441187 -688 -288271 -538226 -808164 -990240 -992863 -839698 -597851 -371663 -340881
34756 -340881 -616273 -1046638 -1337007 -1379431 -1320076 -1299817 -1308034 -1317874 -1363210 -1395139 -1240088
34745 -1240088 -837665 -409613 -259704 -460129 -816266 -1074314 -1100098 -951261 -866240 -1084641
34735 -1084641 -1554450 -1894047 -1787223 -1361393 -1021572 -961274 -1039472 -1126795 -1299121 -1571961
34725 -1571961 -1694269 -1444608 -987303 -669508 -550158 -431170 -324276 -507281 -997021
34716 -997021 -1326646 -1106865 -554165 -165872 -77415 -88286 -158938 -437800 -826743 -973604
$$ packed form
34786f64023k5727J79681L45988K27770j64222m83094m34385j46988L6165O8715
34776a060120K15517N28997O61328L90652K9610l912J86339J54451j89951m71724
34766D41187m41875k87583k49955k69938j82076k623J53165K41847K26188L0782
34756c40881k75392m30365k90369m2424N9355K0259q217r840m5336l1929J55051
34745a240088M02423M28052J49909k00425l56137k58048k5784J48837Q5021k18401
34735a084641m69809l39597J06824M25830L39821O0298p8198q7323j72326k72840
34725a571961j22308K49661M57305L17795J19350J18988J06894j83005m89740
34716i97021l29625K19781N52700L88293Q8457j0871p0652k78862l88943j46861
$$ plain form
34706 -973604 -793223 -606061 -613016 -588130 -284004 178675 546455 755985 768550 383185
34696 383185 -437547 -1263824 -1594519 -1456192 -1302631 -1422643 -1747753 -2132969 -2471729 -2575697
34686 -2575697 -2292611 -1768311 -1303670 -945656 -512185 -23146 238337 178664 90026 243712
34676 243712 529712 658448 531041 257821 -42832 -321131 -566179 -796459 -1015918 -1158472
34666 -1158472 -1173644 -1147749 -1184101 -1178288 -921035 -451727 -81920 13331 15862 158342 380885
34655 380885 448954 294348 81059 -22760 -25129 -56700 -177581 -270310 -190403 -26297 -52616
34644 -52616 -334076 -577573 -571886 -565994 -899213 -1402771 -1552084 -1156065 -516287 62151
34634 62151 502995 708058 551060 221489 127391 312347 393663 224892 146691 358962
$$ packed form
34706i73604J80381J87162o955K4886L04126M62679L67780K09530J2565l85365
34696C83185q20732q26277l30695J38327J53561j20012l25110l85216l38760j03968
34686b575697K83086N24300M64641L58014M33471M89039K61483n9673q8638J53686
34676B43712K86000J28736j27407k73220l00653k78299k45048k30280k19459j42554
34666a158472j5172K5895l6352N813K57253M69308L69807R5251K531J42480K22543
34655C80885O8069j54606k13289j03819k369l1571j20881r2729P9907J64106k6319
34644e2616k81460k43497N687N892l33219n03558j49313L96019O39778N78438
34634F2151M40844K05063j56998l29571r4098J84956Q1316j68771p8201K12271
$$ plain form
34624 358962 523131 303589 -109911 -350237 -351211 -145655 386626 1149869 1610390 1436074
34614 1436074 1025442 890618 842683 389385 -319346 -626349 -329730 137722 436235 587629
34604 587629 525960 57143 -610198 -910806 -698376 -440564 -440506 -407635 -87278 191522 1843
34593 1843 -499516 -780964 -614904 -232300 28000 -34042 -421365 -891407 -1086826 -886560
34583 -886560 -505666 -148805 231817 708057 1142906 1369381 1406805 1321090 1057761 604845
34573 604845 160805 -50175 -13857 155943 394222 659037 882178 1060115 1239672 1330442
34563 1330442 1133831 657688 177044 -129819 -357615 -567472 -607250 -430017 -292461 -378676
34553 -378676 -480268 -322141 27324 349278 633087 916134 987234 633339 42272 -397997
$$ packed form
34624C58962J64169k19542m13500k40326r74K05556N32281P63243M60521j74316
34614A436074m10632j34824m7935m53298p08731l07003K96619M67452K98513J51394
34604E87629o1669m68817o67341l00608K12430K57812N8L2871L20357K78800j89679
34593A843n01359k81448J66060L82604K60300o2042l87323m70042j95419K00266
34583h86560L80894L56861L80622M76240M34849K26475L7424q5715k63329m52916
34573F04845m44040k10980L6318J69800K38279K64815K23141J77937J79557R0770
34563A330442j96611m76143m80644l06863k27796k09857l9778J77233J37556q6215
34553c78676j01592J58127L49465L21954K83809K83047P1100l53895n91067m40269
$$ plain form
34543 -397997 -581287 -624256 -483469 -67739 333888 206539 -522869 -1318675 -1633030 -1416548
34533 -1416548 -1001801 -736809 -764597 -932774 -916595 -637453 -471261 -751063 -1173661 -1112134
34523 -1112134 -487775 134116 377089 490523 777279 1044777 927399 429867 -144956
34514 -144956 -559058 -682344 -436995 19129 275056 121054 -153296 -164360 58915 240554
34504 240554 315570 386438 387687 176861 -117864 -211548 -108955 -100088 -291117 -456816 -419097
34493 -419097 -289442 -244473 -288565 -320068 -241357 34756 471104 772848 642103 243409
34483 243409 113914 451348 782714 592819 47919 -240684 -48741 233095 208702 -28423
34473 -28423 -140921 -38088 83269 58695 -88092 -273385 -466148 -644665 -755866 -763230
$$ packed form
34543c97997j83290m2969J40787M15730M01627j27349p29408p95806l14355K16482
34533a416548M14747K64992k7788j68177J6179K79142J66192k79802m22598O1527
34523a112134O24359O21891K42973J13434K86756K67498j17378m97532n74823
34514a44956m14102j23286K45349M56124K55927j54002k74350j1064K23275J81639
34504B40554P5016P0868J249k10826k94725r3684J02593Q867j91029j65699L7719
34493d19097J29655M4969m4092l1503P8711K76113M36348L01744j30745l98694
34483B43409j29495L37434L31366j89895n44900k88603J91943K81836k4393k37125
34473b8423j12498J02833J21357k4574j46787j85293j92763j78517j11201p364
$$ plain form
34463 -763230 -666151 -456280 -148109 120530 155590 -25408 -122433 72571 316461 177026
34453 177026 -353112 -795575 -837635 -753155 -965537 -1441891 -1824731 -1983996 -2055204 -2010023
34443 -2010023 -1628096 -964629 -442818 -305649 -303280 -138243 78187 94384 1456 105178
34433 105178 446434 772195 907735 855413 589289 96953 -366925 -427971 -106525 111881
34423 111881 -114566 -538923 -675124 -394931 52024 474301 913811 1395024 1744325 1770480
34413 1770480 1514172 1210580 1031053 933592 778225 531576 297042 160677 98992 71163
34403 71163 97903 163235 137280 -58071 -259543 -201385 167863 655242 1086674 1407938
34393 1407938 1508636 1186507 429267 -410775 -884952 -856305 -571698 -378007 -407780 -493015
$$ packed form
34463g63230R7079K09871L08171K68639L5060j80998r7025J95004K43890j39435
34453A77026n30138m42463m2060Q4480k12382m76354l82840j59265p1208M5181
34443b010023L81927O63467N21811J37169K369J65037K16430J6197r2928J03722
34433A05178L41256L25761J35540n2322k66124m92336m63878o1046L21446K18406
34423A11881k26447m24357j36201K80193M46955M22277M39510M81213L49301K6155
34413A770480k56308l03592j79527r7461j55367k46649k34534j36365o1685k7829
34403G1163K6740O5332k5955j95351k01472N8158L69248M87379M31432L21264
34393A407938J00698l22129p57240q40042m74177K8647K84607J93691k9773q5235
$$ plain form
34383 -493015 -377214 -61249 125188 -73841 -445266 -539173 -265052 30067 112181 154515
34373 154515 344795 520541 430613 119993 -190407 -407062 -509263 -393487 -44516 300353
34363 300353 419695 382189 306732 67734 -427501 -870228 -876179 -556010 -333239 -289752
34353 -289752 -166562 30997 -27232 -370775 -567609 -378496 -119201 -131713 -291012 -310516
34343 -310516 -195592 -100852 -26798 49831 2100 -200424 -311232 -168158 -1453 -60186
34333 -60186 -155019 49416 458187 683155 663835 705900 881603 820670 259039 -504166
34323 -504166 -904372 -713787 -202195 205153 322240 303499 411868 688476 897930 840277
34313 840277 609305 417255 267445 11408 -297919 -357831 -14609 462179 651659 449899
$$ packed form
34383d93015J15801L15965J86437j99029l71425r3907K74121K95119Q2114M2334
34373A54515J90280J75746q9928l10620l10400k16655j02201J15776L48971L44869
34363C00353J19342l7506p5457k38998m95235m42727n951L20169K22771M3487
34353b89752J23190J97559n8229l43543j96834J89113K59295j2512j59299j9504
34343c10516J14924R4740P4054P6629m7731k02524j10808J43074J66705n8733
34333f0186r4833K04435M08771K24968j9320M2065J75703o0933n61631p63205
34323e04166m00206J90585N11592M07348J17087j8741J08369K76608K09454n7653
34313H40277k30972j92050j49810k56037l09327n9912L43222M76788J89480k01760
$$ plain form
34303 449899 126009 -69011 -194023 -430460 -711059 -736894 -405527 -23309 64200 -95013
34293 -95013 -214399 -248541 -431925 -867291 -1377961 -1803061 -2142193 -2343182 -2259762 -1936130
34283 -1936130 -1638916 -1477989 -1294192 -1052171 -992375 -1201823 -1399897 -1398277 -1400987 -1545997
34273 -1545997 -1544074 -1173435 -760506 -671412 -644457 -218047 402236 555200 105092 -425138
34263 -425138 -681353 -809744 -915984 -836481 -609379 -583055 -814293 -867562 -480517 21841
34253 21841 249790 262837 270695 220742 18275 -177394 -212893 -211358 -276025 -215567 101227
34242 101227 390894 330764 76478 26002 225408 376181 316734 139012 -100561 -437212
34232 -437212 -768509 -859104 -622464 -223342 97978 181733 9374 -242630 -299840 -90973
$$ packed form
34303D49899l23890j95020j25012k36437k80599k5835L31367L82218Q7509j59213
34293i5013j19386l4142j83384m35366n10670m25100l39132k00989Q3420L23632
34283a936130K97214J60927J83797K42021N9796k09448j98074J620k710j45010
34273a545997J923L70639M12929Q9094K6955M26410O20283J52964m50108n30230
34263d25138k56215j28391j06240P9503K27102K6324k31238n3269L87045N02358
34253B1841K27949J3047P858m9953k02467j95669l5499J535o4667O0458L16794
34242A01227K89667o0130k54286n0476J99406J50773n9447j77722k39573l36651
34232d37212l31297r0595K36640L99122L21320Q3755j72359k52004n7210K08867
$$ plain form
34222 -90973 143023 164587 16405 -153431 -328318 -471219 -373853 7356 232894 -178833
34212 -178833 -1012376 -1461193 -1076383 -290841 167889 140261 70068 293235 576558 479589
34202 479589 21738 -274633 -83122 242471 154184 -289190 -519015 -317321 -87026 -155493
34192 -155493 -342297 -478499 -801500 -1373855 -1586981 -890960 255539 841281 584869
34183 584869 116337 -60802 -97599 -217547 -295131 -257828 -340847 -637201 -855883 -827826
34173 -827826 -827674 -1074592 -1321657 -1313854 -1283621 -1544853 -1875140 -1791279 -1282810 -811873 -656426
34162 -656426 -666460 -650220 -627259 -666884 -774666 -957439 -1144205 -1082353 -623326 -82084
34152 -82084 63512 -130312 -95040 383755 744905 401713 -405061 -906567 -791319 -479621
$$ packed form
34222i0973K33996K1564j48182j69836j74887j42901R7366L81209K25538m11727
34212a78833q33543m48817L84810P85542M58730k7628p0193K23167K83323r6969
34202D79589m57851k96371J91511L25593q8287m43374k29825K01694K30295o8467
34192a55493j86804j36202l23001n72355k13126O96021J146499N85742k56412
34183E84869m68532j77139l6797j19948p7584L7303q3019k96354k18682K8057
34173h27826J52k46918k47065P803L0233k61232l30287Q3861N08469M70937J55447
34162f56426j0034J6240K2961l9625j07782j82773j86766O1852M59027N41242
34152h2084J45596j93824L5272M78795L61150l43192q06774n01506J15248L11698
$$ plain form
34142 -479621 -459727 -748792 -1088196 -1327069 -1428784 -1333724 -1041260 -720146 -568077 -619454
34132 -619454 -789257 -1012024 -1233659 -1373127 -1418104 -1466549 -1558595 -1581702 -1470995 -1354737
34122 -1354737 -1323435 -1227063 -964969 -819794 -1129988 -1691381 -1910153 -1608436 -1262011 -1286876
34112 -1286876 -1475175 -1375246 -916025 -382389 -22003 51972 -205707 -637693 -854647 -630063
34102 -630063 -206185 15378 -74556 -367038 -825749 -1379307 -1704952 -1497994 -887724 -294503
34092 -294503 30334 69980 -151879 -470429 -468974 81882 771224 975110 657216 292430
34082 292430 104674 -45364 -50812 465079 1389210 1983987 1835266 1406208 1287524 1382294
34072 1382294 1273829 988070 856483 877693 745506 397938 84078 -77304 -232262 -488340
$$ packed form
34142d79621J9894k89065l39404k38873j01715R5060K92464L21114J52069n1377
34132f19454j69803k22767k21635j39468m4977m8445r2046k3107J10707J16258
34122a354737L1302R6372K62094J45175l10194n61393k18772L01717L46425k4865
34112a286876j88299R9929M59221N33636L60386P3975k57679m31986k16954K24584
34102f30063M23878K21563q9934k92482m58711n53558l25645K06958O10270N93221
34092b94503L24837L9646k21859l18550J455N50856O89342K03886l17894l64786
34082B92430j87756j50038n448N15891R24131N94777j48721m29058j18684R4770
34072A382294j08465k85759j31587K1210j32187l47568l13860j61382j54958k56078
$$ plain form
34062 -488340 -771825 -984854 -1072738 -972888 -719609 -551118 -688261 -1041696 -1339323 -1492151
34052 -1492151 -1616258 -1726948 -1648196 -1264367 -694261 -169544 154474 253935 193523 51296
34042 51296 -139792 -357970 -528292 -596263 -646515 -780552 -872463 -674452 -223974 108184
34032 108184 83676 -149664 -399047 -711241 -1098435 -1295179 -1125076 -882185 -964719 -1266760
34022 -1266760 -1320816 -979544 -575539 -391505 -320617 -150540 74451 114544 -164148 -619554
34012 -619554 -917639 -829630 -516894 -416694 -734420 -1182942 -1373186 -1302446 -1241690 -1277359
34002 -1277359 -1233289 -986891 -626056 -317455 -191828 -297580 -508415 -568310 -381692 -136248
33992 -136248 2268 118468 286353 338652 170664 8971 24382 -62784 -544215 -1105141
$$ packed form
34062d88340k83485k13029q7884R9850K53279J68491j37143l53435k97627j52828
34052a492151j24107j10690P8752L83829N70106N24717L24018R9461o0412j42227
34042E1296j91088k18178j70322o7971n0252j34037r1911J98011M50478L32158
34032A08184k4508k33340k49383l12194l87194j96744J70103K42891q2534l02041
34022a266760n4056L41272M04005J84034P0888J70077K24991M0093k78692m55406
34012f19554k98085Q8009L12736J00200l17726m48522j90244P0740O0756l5669
34002a277359M4070K46398L60835L08601J25627j05752k10835n9895J86618K45444
33992a36248J38516J16200J67885N2299j67988j61693J5411q7166m81431n60926
$$ plain form
33982 -1105141 -1172016 -752648 -380127 -290804 -243441 -145730 -222544 -455945 -490893 -311084
33972 -311084 -416743 -1031001 -1663430 -1830874 -1745385 -1854499 -2072627 -1948076 -1365985 -664884
33962 -664884 -198558 -107402 -372569 -794222 -1040477 -967620 -768650 -631900 -472169 -213376
33952 -213376 -69594 -233212 -487342 -463217 -155372 107861 98885 -145722 -472635 -710538
33942 -710538 -769610 -820369 -1152531 -1665071 -1821114 -1417842 -1047249 -1324072 -1927281 -1985264
33932 -1985264 -1287894 -520912 -287822 -456573 -591063 -544554 -434172 -397428 -556781 -934654
33922 -934654 -1273997 -1225493 -819868 -466513 -382581 -330330 -47082 374114 700387 877614
33912 877614 944182 860060 614258 324388 78544 -164621 -430711 -680284 -960316 -1341640
$$ packed form
33982a105141o6875M19368L72521Q9323M7363R7711p6814k33401l4948J79809
33972c11084j05659o14258o32429j67444Q5489j09114k18128J24551N82091P01101
33962f64884M66326R1156k65167m21653k46255P2857J98970J36750J59731K58793
33952b13376J43782j63618k54130K4125L07845K63233q976k44607l26913k37903
33942g10538n9072n0759l32162n12540j56043M03272L70593k76823o03209n7983
33932a985264O97370P66982K33090j68751j34490M6509J10382L6744j59353l77873
33922i34654l39343M8504M05625L53355Q3932N2251K83248M21196L26273J77227
33912H77614O6568q4122k45802k89870k45844k43165k66090k49573k80032l81324
$$ plain form
33902 -1341640 -1634632 -1503067 -1005734 -665086 -773359 -982188 -870483 -569495 -435307
33893 -435307 -404238 -170856 170224 188671 -219936 -710222 -1025299 -1197655 -1173318 -735021
33883 -735021 27514 598765 632451 343758 102431 -26436 -95240 2945 262045 314490
33873 314490 -95731 -586676 -576857 -154048 26197 -258786 -450555 -66856 572293 825169
33863 825169 595883 307389 207519 137752 -58755 -290012 -435030 -517630 -570120 -536986
33853 -536986 -390204 -169337 129484 516702 836571 867234 669079 586484 765413 899754
33843 899754 657031 173555 -119394 -56471 120306 144508 37321 18125 235099 582033
33833 582033 708447 305008 -490542 -1086095 -1029986 -530522 -158285 -107526 -54065 249393
$$ packed form
33902a341640k92992J31565M97333L40648j08273k08829J11705L00988J34188
33893d35307L1069K33382L41080J8447m08607m90286l15077j72356K4337M38297
33883g35021P62535N71251L3686k88693k41327j28867o8804R8185K59100N2445
33873C14490m10221m90945R819M22809J80245k84983j91769L83699O39149K52876
33863H25169k29286k88494r9870o9767j96507k31257j45018q2600n2490L3134
33853e36986J46782K20867K98821L87218L19869L0663j98155q2595J78929J34341
33843H99754k42723m83476k92949O2923J76777K4202j07187j9196K16974L46934
33833E82033J26414m03439p95550n95553N6109M99464L72237N0759N3461L03458
$$ plain form
33823 249393 577651 568771 190456 -313751 -744877 -1009874 -1012457 -721007 -298654 15180
33813 15180 143281 180811 217613 271101 345778 423220 415981 255719 17294 -153897 -227301
33802 -227301 -288689 -354498 -298776 -11873 423157 746754 718949 347037 -55504 -123673
33792 -123673 168265 451159 390656 70688 -196062 -328657 -510694 -802672 -1006807 -981178
33782 -981178 -824085 -622540 -274762 225386 530855 263818 -469638 -1137564 -1346163 -1150852
33772 -1150852 -828070 -559482 -377395 -231942 -46181 165851 225160 -2137 -316971 -347239
33762 -347239 -83792 -17377 -555030 -1460465 -2088631 -2091484 -1693647 -1314226 -1114520 -947670
33752 -947670 -617024 -121146 316848 455578 277281 -23155 -279705 -459497 -508101 -303184
$$ packed form
33823B49393L28258q880l78315n04207m31126k64997k583K91450M22353L13834
33813A5180J28101L7530L6802N3488P4677P7442p239j60262k38425j71191p3404
33802b27301o1388o5809N5722K86903M35030L23597k7805l71912m02541o8169
33792a23673K91938K82894o0503l19968k66750j32595j82037k91978k04135K5629
33782i81178J57093K01545L47778N00148L05469k67037p33456o67926k08599J95311
33772a150852L22782K68588J82087J45453J85761K12032N9309k27297l14834l0268
33762c47239K63447O6415n37653r05435o28166k853L97837L79421J99706J66850
33752i47670L30646M95878M37994J38730j78297l00436k56550j79792m8604K04917
$$ plain form
33742 -303184 103903 400552 386607 289184 445779 785559 940371 823465 731238 797895
33732 797895 700296 110074 -788318 -1459905 -1583548 -1279429 -865887 -569937 -457569 -502311
33722 -502311 -650785 -824530 -887763 -709519 -346859 -89513 -172555 -479297 -682471 -640045
33712 -640045 -468455 -272291 -57179 77211 -57458 -445613 -817844 -994868 -1057230 -1077907
33702 -1077907 -952237 -660858 -461670 -588838 -905766 -1056388 -863231 -434176 16693
33693 16693 327576 456910 462355 324762 -150574 -1015843 -1814635 -1934461 -1408862 -939403
33683 -939403 -955980 -1120606 -1013090 -784427 -706296 -553115 -21425 566680 621320 157906
33673 157906 -294386 -520642 -737453 -954053 -861229 -417841 4889 153363 97005 -120778
$$ packed form
33742c03184M07087K96649j3945r7423J56595L39780J54812j16906r2227O6657
33732G97895r7599n90222q98392o71587j23643L04119M13542K95950J12368m4742
33722e02311j48474j73745o3233J78244L62660K57346q3042l06742k03174M2426
33712f40045J71590J96164K15112J34390j34669l88155l72231j77024o2362k0677
33702a077907J25670K91379J99188j27168l16928j50622J93157M29055M50869
33693A6693L10883J29334N445j37593m75336q65269p98792j19826N25599M69459
33683i39403j6577j64626J07516K28663P8131J53181N31690N88105N4640m63414
33673A57906m52292k26256k16811k16600R2824M43388M22730J48474n6358k17783
$$ plain form
33663 -120778 -535894 -944102 -1067327 -1090673 -1465221 -2088251 -2284838 -1760437 -971309 -368193
33653 -368193 77084 340154 64782 -730413 -1283941 -994389 -236990 243712 322333 319478
33643 319478 256911 -50808 -427404 -511725 -359009 -298618 -327219 -198305 1252 -56691
33633 -56691 -318974 -376232 -122309 122375 181309 224168 327117 293264 26406 -312598
33623 -312598 -621647 -956276 -1230829 -1208237 -900581 -613626 -473027 -272139 69565 276699
33613 276699 156414 -61549 -74454 58315 85334 -21999 -78068 -1890 74921 -14631 -281502
33602 -281502 -525973 -477348 -98882 283991 338235 162159 123979 289910 342466 123977
33592 123977 -95863 -49752 149060 268237 320283 413606 462679 325955 76459 -137161
$$ packed form
33663a20778m15116m08208j23225k3346l74548o23030j96587N24401P89128O03116
33653c68193M45277K63070k75372p95195n53528K89552P57399M80702P8621k855
33643C19478o2567l07719l76596q4321J52716O0391k8601J28914J99557n7943
33633e6691k62283n7258K53923K44684N8934M2859J02949l3853k66858l39004
33623c12598l09049l34629k74553K2592L07656K86955J40599K00888L41704K07134
33613B76699j20285k17963j2905J32769K7019j07333n6069P6178P6811q9552k66871
33602b81502k44471M8625L78466L82873N4244j76076l8180J65931N2556k18489
33592A23977k19840M6111J98812J19177N2046R3323M9073j36724k49496k13620
$$ plain form
33582 -137161 -379798 -795750 -1248363 -1386010 -1104438 -717527 -579240 -684415 -753459 -631823
33572 -631823 -470697 -481017 -610770 -611966 -436213 -369716 -631130 -997565 -1074276 -841353
33562 -841353 -627647 -561999 -403413 -7194 380294 479351 350486 178098 -84859 -563472
33552 -563472 -1097720 -1348278 -1241760 -1067096 -1107406 -1354697 -1616201 -1750129 -1729911 -1564114
33542 -1564114 -1247039 -821530 -463569 -385688 -547835 -571979 -167628 398390 557745 223553
33532 223553 -23590 279982 827339 984259 658435 324967 271565 243927 -71450 -550884
33522 -550884 -817024 -727840 -479458 -299827 -214650 -130947 -33016 -1719 -47401 -18482 235347
33511 235347 640818 949348 1006292 856568 581550 200971 -193545 -374716 -190652 244027
$$ packed form
33582a37161k42637m15952m52613j37647K81572L86911J38287j05175o9044J21636
33572f31823J61126j0320j29753j196J75753O6497k61414l66435p6711K32923
33562h41353K13706O5648J58586L96219L87488R9057j28865j72388k62957m78613
33552e63472n34248k50558J06518J74664m0310k47291k61504j33928K0218J65797
33542a564114L17075M25509L57961P7881j62147k4144M04351N66018J59355l34192
33532B23553k47143L03572N47357J56920l25824l33468n3402k7638l15377m79434
33522e50884k66140Q9184K48382J79631Q5177Q3703R7931L1297m5682K8919K53829
33511B35347M05471L08530N6944j49724k75018l80579l94516j81171J84064M34679
$$ plain form
33501 244027 668816 912693 947186 836529 746143 882867 1287232 1751720 2033281 2050148
33491 2050148 1800704 1265347 545717 -58253 -331533 -418659 -612245 -933016 -1123785 -1020103
33481 -1020103 -730326 -466060 -371143 -502371 -803747 -1095278 -1232446 -1267036 -1318894 -1336368
33471 -1336368 -1158069 -781394 -373570 -19016 335778 649583 709571 395737 -111565 -496628
33461 -496628 -610569 -547424 -490375 -549566 -718199 -931378 -1133768 -1262547 -1211129 -946341
33451 -946341 -686686 -772611 -1228991 -1625929 -1569871 -1202499 -979978 -1054893 -1147132 -984601
33441 -984601 -593997 -149853 198473 319653 183047 495 25997 149522 -23487 -575932
33431 -575932 -1070221 -1137870 -998546 -1088308 -1363303 -1361317 -933337 -547564 -720744 -1372817
$$ packed form
33501B44027M24789K43877L4493j10657r0386J36724M04365M64488K81561J6867
33491B050148k49444n35357p19630o03970k73280q7126j93586l20771j90769J03682
33481a020103K89777K64266R4917j31228l01376k91531j37168l4590n1858j7474
33471a336368J78299L76675M07824L54554L54794L13805N9988l13834n07302l85063
33461d96628j13941O3145N7049n9191j68633k13179k02390j28779N1418K64788
33451i46341K59655q5925m56380l96938N6058L67372K22521p4915r2239J62531
33441i84601L90604M44144L48326J21180j36606j82552K5502J23525j73009n52445
33431e75932m94289o7649J39324q9762k74995J986M27980L85773j73180o52073
$$ plain form
33421 -1372817 -1937149 -2001803 -1652275 -1211734 -853230 -569395 -374282 -324000 -348444 -270774
33411 -270774 -79259 -10687 -223113 -513239 -538785 -252650 62984 165013 88245 20712
33401 20712 75766 196073 202707 -19415 -319334 -383988 -167243 -54665 -392369 -996120
33391 -996120 -1394782 -1434057 -1310152 -1106356 -719791 -254378 -38971 -132811 -206921 -73051
33381 -73051 55469 28389 79478 376775 599770 364704 -158153 -468495 -443583 -409598
33371 -409598 -544157 -597362 -289485 294124 827504 1099931 1153602 1155861 1193334 1177329 979900
33360 979900 665533 476075 533521 681701 688645 470548 62983 -435162 -801811 -814085
33350 -814085 -580115 -511483 -783809 -1081490 -1104410 -1031033 -1136429 -1213886 -839370 -82190
$$ packed form
33421a372817n64332o4654L49528M40541L58504K83835J95113N0282k4444P7670
33411b70774J91515O8572k12426k90126k5546K86135L15634J02029p6768o7533
33401B0712N5054J20307O634k22122k99919o4654K16745J12578l37704o03751
33391i96120l98662l9275J23905K03796L86565M65413K15407r3840p4110J33870
33381g3051J28520k7080N1089K97297K22995k35066n22857l10342K4912L3985
33371d09598j34559n3205L07877N83609N33380K72427N3671K259L7473j6005j97429
33360I79900l14367j89458N7446J48180O944k18097m07565m98145l66649j2274
33350h14085K33970O8632k72326k97681k2920P3377j05396p7457L74516P57180
$$ plain form
33340 -82190 520220 671711 576638 483993 393747 278594 201533 106091 -160955 -513964 -658867
33329 -658867 -567111 -556894 -757119 -870796 -690090 -484439 -573929 -807499 -816255 -588596
33319 -588596 -441246 -530942 -709274 -796984 -729266 -479326 -94853 214947 260591 129908
33309 129908 65030 110792 96912 -53108 -230540 -367550 -506927 -590570 -432952 -39422
33299 -39422 260455 191399 -94092 -234293 -164932 -154929 -327425 -408796 -98482 488588
33289 488588 952547 1091244 1033193 925612 751032 514866 358385 330177 250046 -5312
33279 -5312 -261214 -328078 -363120 -638946 -1056613 -1257311 -1193606 -1185457 -1339981 -1338988 -995016
33268 -995016 -633805 -620709 -798660 -759756 -485131 -326921 -436026 -576798 -524591 -341921
$$ packed form
33340h2190O02410J51491r5073r2645r0246j15153p7061r5442k67046l53009j44903
33329f58867R1756J0217k00225j13677J80706K05651q9490k33570q756K27659
33319e88596J47350q9696j78332q7710O7718K49940L84473L09800M5644j30683
33309A29908o4878M5762j3880j50020j77432j37010j39377q3643J57618L93530
33299c9422K99877o9056k85491j40201O9361J0003j72496q1371L10314N87070
33289D88588M63959J38697n8051j07581j74580k36166j56481k8208q0131k55358
33279e312k55902o6864l5042k75826m17667k00698O3705Q149j54524R93L43972
33268i95016L61211J3096j77951L8904K74625J58210j09105j40772N2207J82670
$$ plain form
33258 -341921 -196449 -143174 -166650 -259802 -385608 -480154 -518752 -472199 -238305 204189 590381
33247 590381 547510 51215 -476903 -625877 -417173 -183840 -152663 -259773 -312964 -235684
33237 -235684 -151749 -244601 -520885 -774657 -870915 -979867 -1351032 -1898420 -2258685 -2299589
33227 -2299589 -2290225 -2422704 -2434602 -1982161 -1230699 -740718 -777518 -1016745 -993924 -607305
33217 -607305 -77686 359904 539194 307823 -331760 -1031993 -1291009 -951092 -392192 -126272
33207 -126272 -277932 -566675 -714102 -686434 -535269 -215545 290959 787225 991111 852176
33197 852176 591876 408394 286720 149367 26992 -51888 -206930 -536541 -855782 -843474
33187 -843474 -497145 -212327 -269609 -423591 -214657 410434 1030458 1276208 1177783 946673
$$ packed form
33258c41921J45472N3275k3476r3152j25806r4546l8598M6553K33894M42494L86192
33247E90381m2871m96295n28118j48974K08704K33333L1177j07110n3191P7280
33237b35684Q3935r2852k76284k53772r6258j08952l71165n47388l60265m0904
33227b299589R364j32479j1898M52441P51462M89981l6800k39227K2821L86619
33217f07305N29619M37590J79290k31371o39583p00233k59016L39917N58900K65920
33207a26272j51660k88743j47427K7668J51165L19724N06504M96266K03886j38935
33197H52176k60300j83482j21674j37353j22375p8880j55042l29611l19241J2308
33187h43474L46329K84818n7282j53982K08934O25091O20024K45750r8425k31110
$$ plain form
33177 946673 668926 358249 117594 40605 45453 -15784 -136507 -187523 -112775 39843 215368
33166 215368 342453 318417 176845 172287 465078 783551 673033 76566 -602998 -1033474
33156 -1033474 -1247882 -1360525 -1328383 -1137467 -921326 -709900 -342515 159872 425302 209897
33146 209897 -205197 -411918 -448341 -610119 -872486 -930195 -729183 -525978 -422185 -249758
33136 -249758 26611 174761 68069 -130974 -267270 -376175 -474516 -475404 -421514 -487081 -619261
33125 -619261 -522124 -178649 -23660 -321480 -703022 -686000 -395604 -332664 -579255 -712548
33115 -712548 -499416 -226931 -216499 -367661 -396698 -286777 -245429 -318511 -284506 34662
33105 34662 490297 713333 478936 -74173 -572054 -695960 -352894 301020 885239 966253
$$ packed form
33177I46673k77747l10677k40655p6989M848o1237j20723n1016P4748J52618J75525
33166B15368J27085k4036j41572m558K92791L18473j10518n96467o79564m30476
33156a033474k14408j12643L2142J90916K16141K11426L67385N02387K65430k15405
33146B09897m15094k06721l6423j61778k62367n7709K01012K03205J03793J72427
33136b49758K76369J48150j06692j99043j36296j08905r8341q88N3890o5567j32180
33125f19261R7137L43475J54989k97820l81542J7022K90396O2940k46591j33293
33115g12548K13132K72485J0432j51162k9037J09921M1348p3082L4005L19168
33105C4662M55635K23036k34397n53109m97881j23906L43066O53914N84219Q1014
$$ plain form
33095 966253 456123 -156419 -228837 303624 854718 938130 705448 555681 523561 396645
33085 396645 226299 284756 560823 705208 531597 224201 -42651 -347337 -713599 -870931
33075 -870931 -603889 -162463 -19682 -267746 -515682 -424129 -131807 -35696 -271668 -569821
33065 -569821 -603972 -337886 30335 337495 532186 565197 412124 219762 214419 371211
33055 371211 361233 -36199 -621467 -1016680 -1070762 -873118 -544206 -233086 -167325 -425173
33045 -425173 -744516 -827480 -762314 -859604 -1132088 -1264873 -1101626 -838050 -688207 -651466
33035 -651466 -659644 -670239 -567885 -267248 49519 125992 89906 300534 643527 484992
33025 484992 -405891 -1360140 -1634702 -1358769 -1179277 -1251005 -1149577 -673486 -167181 12698
$$ packed form
33095I66253n10130o12542p2418N32461N51094Q3412k32682j49767l2120j26916
33085C96645j70346N8457K76067J44385j73611l07396k66852l04686l66262j57332
33075h70931K67042M41426J42781k48064k47936R1553K92322R6111k35972k98153
33065e69821l4151K66086L68221L07160J94691L3011j53073j92362n343J56792
33055C71211r978l97432n85268l95213n4082J97644L28912L11120O5761k57848
33045d25173l19343q2964O5166r7290k72484j32785J63247K63576J49843L6741
33035f51466q178j0595J02354L00637L16767P6473l6086K10628L42993j58535
33025D84992q90883r54249k74562K75933J79492p1728J01428M76091N06305J79879
$$ plain form
33015 12698 -89131 -255021 -388268 -457407 -417512 -293547 -138602 120826 555491 930982
33005 930982 846584 293041 -197904 -134064 391431 880183 984965 729033 311917 -108601
32995 -108601 -476516 -806220 -1101436 -1285325 -1258291 -1026082 -693327 -342915 -34486 94138
32985 94138 -101427 -543291 -925265 -1029213 -946642 -905319 -963248 -965704 -766406 -430070 -208636
32974 -208636 -286763 -526124 -566742 -300803 -130518 -524357 -1351785 -1929126 -1781791 -1119006
32964 -1119006 -473480 -136190 -102375 -317548 -696661 -1015852 -1056583 -861136 -682631 -686936
32954 -686936 -819830 -934348 -927717 -780923 -582737 -501736 -628666 -845497 -929650 -787937
32944 -787937 -537184 -374722 -409332 -577657 -684862 -581395 -340405 -191449 -241974 -368743
$$ packed form
33015A2698j01829j65890j33247o9139L9895J23965J54945K59428M34665L75491
33005I30982q4398n53543m90945O3840N25495M88752J04782k55932m17116m20518
32995a08601l67915l29704k95216j83889K7034K32209L32755L50412L08429J28624
32985I4138j95565m41864l81974j03948Q2571M1323n7929k456J99298L36336K21434
32974b08636p8127k39361m0618K65939J70285l93839q27428n77341J47335O62785
32964a119006O45526L37290L3815k15173l79113l19191m0731J95447J78505m305
32954f86936j32894j14518O631J46794J98186Q1001j26930k16831q4153J41713
32944g87937K50753J62462l4610j68325j07205J03467K40990J48956n0525j26769
$$ plain form
32934 -368743 -444458 -530382 -716904 -900299 -909079 -786304 -737999 -812731 -843090 -746435 -674809
32923 -674809 -750484 -818461 -642599 -268466 5218 21450 -45627 35708 240539 372670
32913 372670 358215 285337 211868 135678 131750 260186 299933 -95468 -803921 -1140237 -698303
32902 -698303 -29755 -14172 -671662 -1126147 -772757 47960 682052 940317 952634 700672
32892 700672 135759 -495209 -853971 -907012 -819793 -626267 -306238 -13991 105525 184807
32882 184807 390766 565540 471089 256811 281283 559128 800850 933955 1124346 1290380
32872 1290380 1096896 539192 82331 45731 219202 255736 96004 -169531 -513224 -834599
32862 -834599 -922207 -778102 -717264 -931981 -1198804 -1208985 -947774 -575604 -206437 15755
$$ packed form
32934c68743p5715q5924j86522j83395q780J22775M8305p4732l0359R6655P1626
32923f74809p5675o7977J75862L74133K73684J6232o7077Q1335K04831J32131
32913C72670j4455p2878p3469p6190l928J28436L9747l95401p08453l36316M41934
32902f98303O68548J5583o57490m54485L53390Q20717O34092K58265J2317k51962
32892G00672n64913o30968l58762n3041Q7219J93526L20029K92247J19516P9282
32882A84807K05959J74774r4451k14278K4472K77845K41722J33105J90391J66034
32872A290380j93484n57704m56861l6600J73471L6534j59732k65535l43693l21375
32862h34599q7608J44105O0838k14717k66823j0181K61211L72170L69167K22192
$$ plain form
32852 15755 -69757 -324622 -319158 89589 503925 583668 528507 591845 501826 -89133 -841933
32841 -841933 -1050212 -632981 -210384 -180200 -287819 -210460 -35018 35261 8095 -73750
32831 -73750 -255653 -411973 -225925 331137 814628 848901 578238 341099 182970 -22887
32821 -22887 -230925 -337236 -451293 -715313 -982731 -1001008 -816800 -679010 -613161 -434650
32811 -434650 -171478 -129712 -462647 -943254 -1252694 -1272825 -1020418 -530469 61652 505844
32801 505844 662710 643733 625913 622879 518560 229366 -229641 -725992 -1003583 -855437
32791 -855437 -413102 -118657 -263325 -668195 -967179 -1072275 -1152698 -1263636 -1281468 -1199393
32781 -1199393 -1195447 -1316803 -1346243 -1138931 -901314 -934234 -1208565 -1390182 -1232213 -779657
$$ packed form
32852A5755q5512k54865N464M08747M14336P9743n5161O3338r0019n90959p52800
32841h41933k08279M17231M22597L0184j07619P7359J75442P0279k7166q1845
32831g3750j81903j56320J86048N57062M83491L4273k70663k37139j58129k05857
32821b2887k08038j06311j14057k64020k67418j8277J84208J37790O5849J78511
32811d34650K63172M1766l32935m80607l09440k0131K52407M89949N92121M44192
32801E05844J56866j8977j7820l034j04319k89194m59007m96351k77591J48146
32791h55437M42335K94445j44668m04870k98984j05096q0423j10938j7832Q2075
32781a199393L946j21356k9440K07312K37617l2920k74331j81617J57969M52556
$$ plain form
32771 -779657 -230755 235845 513631 616885 703695 925833 1230094 1401470 1298921 955537
32761 955537 487436 39940 -224828 -283837 -385434 -791141 -1342185 -1535070 -1133584 -462602
32751 -462602 51781 375820 675467 871362 733798 320348 -24847 -110278 -60698 -32800
32741 -32800 -34460 -62954 -161440 -263526 -215948 -44451 22223 -109016 -250972 -244987 -189852
32730 -189852 -206605 -190143 -7603 219035 261606 106766 -90693 -275474 -473279 -581757
32720 -581757 -463691 -255786 -314946 -770178 -1323451 -1587382 -1464700 -1117347 -729807 -424096
32710 -424096 -275552 -266563 -297360 -354467 -589792 -1104298 -1709327 -2042473 -1910071 -1420481
32700 -1420481 -828591 -387497 -309117 -642764 -1102262 -1195168 -704008 20635 386855 154420
$$ packed form
32771g79657N48902M66600K77786J03254Q6810K22138L04261J71376j02549l43384
32761I55537m68101m47496k64768n9009j01597m05707n51044j92885M01486O70982
32751d62602N14383L24039K99647J95895j37564m13450l45195q5431M9580K7898
32741c2800j660k8494r8486j02086M7578J71497O6674j31239j41956N985N5135
32730a89852j6753J6462J82540K26638M2571j54840j97459j84781j97805j08478
32720e81757J18066K07905n9160m55232n53273k63931J22682L47353L87540L05711
32710d24096J48544Q989l0797n7107k35325n14506o05029l33146J32402M89590
32700a420481N91890M41094P8380l33647m59498r2906M91160P24643L66220k32435
$$ plain form
32690 154420 -399454 -843190 -962029 -796720 -520333 -349164 -422402 -671626 -909198 -1091533
32680 -1091533 -1330003 -1557722 -1422604 -751207 35859 289684 -117713 -710947 -1095759
32671 -1095759 -1390730 -1842293 -2319142 -2462565 -2181197 -1724765 -1325067 -997548 -695616
32662 -695616 -455772 -324784 -269370 -234823 -240426 -361923 -607768 -809181 -688306 -155100
32652 -155100 455833 619088 195963 -363558 -537813 -319133 -96372 -78878 -118068 -77568
32642 -77568 -69797 -207691 -345664 -246800 94616 430657 503477 238007 -228640 -630827
32632 -630827 -763334 -673599 -610629 -716804 -845016 -768513 -497467 -258977 -190400 -192011 -120181
32621 -120181 -13616 -29771 -194582 -330810 -290158 -187114 -291129 -686536 -1161546 -1482610
$$ packed form
32690A54420n53874m43736j18839J65309K76387J71169p3238k49224k37572j82335
32680a091533k38470k27719J35118O71397P87066K53825m07397n93234l84812
32671a095759k94971m51563m76849j43423K81368M56432L99698L27519L01932
32662f95616K39844J30988N5414L4547n603j21497k45845k01413J20875N33206
32652a55100O10933J63255m23125n59521j74255K18680K22761J7494l9190M0500
32642g7568P771j37894j37973R8864L41416L36041P2820k65470m66647m02187
32632f30827j32507Q9735O2970j06175j28212P6503K71046K38490O8577j611P1830
32621a20181J06565j6155j64811j36228M0652J03044j04015l95407m75010l21064
$$ plain form
32611 -1482610 -1638356 -1695747 -1567395 -1165016 -727883 -687560 -1105272 -1494269 -1375171 -823456
32601 -823456 -268266 85256 356468 599188 649833 443979 216210 206323 318601 269037
32591 269037 9141 -189733 -107413 114790 146394 -92174 -285973 -89645 419942 765479
32581 765479 568475 -64364 -709046 -1082080 -1216040 -1243895 -1189140 -1019107 -777823 -569430
32571 -569430 -456206 -426425 -423197 -376653 -267404 -188731 -265559 -459051 -544771 -381777 -130097
32560 -130097 -68962 -233642 -383734 -346230 -237471 -272742 -477858 -702250 -842942 -924630
32550 -924630 -981000 -985611 -931905 -889335 -923393 -1006116 -1049718 -999824 -865008 -686552 -518693
32539 -518693 -418496 -409626 -451475 -471403 -436303 -374074 -308108 -181233 106545 525179 794488
$$ packed form
32611a482610j55746n7391J28352M02379M37133M0323m17712l88997J19098N51715
32601h23456N55190L53522K71212K42720N0645k05854k27769r887J12278m9564
32591B69037k59896j98874Q2320K22203L1604k38568j93799J96328N09587L45537
32581G65479j97004o32839o44682l73034j33960k7855N4755J70033K41284K08393
32571e69430J13224K9781L228M6544J09249P8673p6828j93492q5720J62994K51680
32560a30097O1135j64680j50092L7504J08759l5271k05116k24392j40692q1688
32550i24630n6370m611N3706M2570l4058q2723m3602M9894J34816J78456J67859
32539e18693J00197Q870m1849j9928L5100O2229O5966J26875K87778M18634K69309
$$ plain form
32528 794488 567104 -153147 -849526 -940351 -419554 134471 272882 183997 288541 524427
32518 524427 410509 -181053 -718294 -666194 -149050 324218 577562 840761 1198126 1383252
32508 1383252 1208946 858536 577476 340788 33295 -266776 -443804 -611680 -917684
32499 -917684 -1180533 -1069778 -644217 -366871 -489290 -731665 -748498 -647211 -781502 -1180918
32489 -1180918 -1465299 -1297037 -718079 -44313 421307 574879 534660 479681 413772 184712
32479 184712 -182671 -360634 -138108 198262 221238 6919 21041 347085 481150 73469
32469 73469 -535266 -814196 -748823 -676828 -675416 -572128 -439595 -580904 -984381 -1227884
32459 -1227884 -1057056 -703464 -464475 -290014 -11785 276832 339947 135411 -203469 -582228
$$ packed form
32528G94488k27384p20251o96379r0825N20797N54025J38411q8885J04544K35886
32518E24427j13918n91562n37241N2100N17144M73268K53344K63199L57365J85126
32508A383252j74306l50410k81060k36688l07493l00071j77028j67876l06004
32499i17684k62849J10755M25561K77346j22419k42375j6833J01287j34291l99416
32489a180918k84381J68262N78958O73766M65620J53572m0219n4979o5909k29060
32479A84712l67383j77963K22526L36370K2976k14319J4122L26044J34065m07681
32469G3469o08735k78930O5373P1995J412J03288J32533j41309m03477k43503
32459a227884J70828L53592K38989J74461K78229K88617O3115k04536l38880l78759
$$ plain form
32449 -582228 -909805 -988426 -725384 -386420 -346592 -598602 -793776 -802056 -914997 -1347795
32439 -1347795 -1811866 -1837619 -1380708 -846106 -565501 -510692 -545881 -691895 -979661 -1222850
32429 -1222850 -1186494 -952666 -886257 -1156865 -1469333 -1415317 -981301 -520778 -274034 -148792
32419 -148792 -22775 -15013 -268332 -618225 -737284 -571771 -373934 -253435 29983 643170
32409 643170 1249206 1302215 752406 184709 157870 603030 1020342 1107862 971993 787244
32399 787244 523886 98601 -401737 -800881 -1037486 -1148181 -1119348 -919550 -660224 -554561
32389 -554561 -669000 -844495 -931835 -989167 -1137846 -1303993 -1259126 -929732 -542500 -388426
32379 -388426 -497517 -623960 -546172 -317615 -190554 -323055 -600401 -739177 -534244 -10104
$$ packed form
32449e82228l27577p8621K63042L38964L9828k52010j95174q280j12941m32798
32439a347795m64071k5753M56911N34602K80605N4809l5189j46014k87766k43189
32429a222850L6356K33828O6409k70608l12468N4016M34016M60523K46744J25242
32419a48792J26017P762k53319l49893j19059J65513J97837J20499K83418O13187
32409F43170O06036N3009n49809n67697k6839M45160M17312Q7520j35869j84749
32399G87244k63358m25285n00338l99144k36605j10695K8833J99798K59326J05663
32389e54561j14439j75495q7340n7332j48679j66147M4867L29394L87232J54074
32379c88426j09091j26443P7788K28557J27061j32501k77346j38776K04933N24140
$$ plain form
32369 -10104 608577 1031736 1054351 672558 105382 -331975 -452427 -344049 -282543 -453222
32359 -453222 -749530 -891248 -762149 -563512 -572951 -821847 -1120431 -1342023 -1507816 -1597385
32349 -1597385 -1501667 -1257260 -1118606 -1229874 -1389352 -1346386 -1194968 -1205335 -1337586 -1234008
32339 -1234008 -733253 -124374 201421 136600 -192030 -631355 -1016216 -1164192 -1044695 -848395
32329 -848395 -739969 -638230 -382417 -18662 248177 334362 343559 360843 322680 140995
32319 140995 -111222 -206602 -4908 301202 297634 -151996 -614039 -547044 -33160 290812
32309 290812 111856 -155435 -81509 73544 -182934 -693136 -815606 -421719 -128746 -389711
32299 -389711 -858253 -939804 -585568 -185447 52709 210390 286046 136437 -178571 -318550
$$ packed form
32369a0104O18681M23159K2615l81793n67176m37357j20452J08378O1506j70679
32359d53222k96308j41718J29099J98637r439k48896k98584k21592j65793q9569
32349a597385R5718K44407J38654j11268j59478M2966J51418j0367j32251J03578
32339a234008N00755O08879L25795o4821l28630m39325l84861j47976J19497J96300
32329h48395J08426J01739K55813L63755K66839Q6185R197J7284l8163j81685
32319A40995k52217r5380K01694L06110l568m49630m62043O6995N13884L23972
32309B90812j78956k67291P3926J55053k56478n10202j22470L93887K92973k60965
32299c89711m68542q1551L54236M00121K38156J57681P5656j49609l15008j39979
$$ plain form
32289 -318550 -55292 453005 893635 1150638 1284073 1267427 952440 336187 -283173 -547825
32279 -547825 -402992 -105548 120792 296540 508435 687032 702050 568442 387541 159018
32269 159018 -158044 -450165 -543015 -487045 -509306 -631531 -577810 -168056 417271 913030
32259 913030 1309253 1711426 2013334 1976529 1611752 1257241 1214811 1430333 1593426 1489790
32249 1489790 1209439 1014823 1007723 957136 533634 -272418 -1060385 -1398366 -1221805 -810825
32239 -810825 -454693 -209091 64274 471911 888467 1019286 753825 392367 315343 425877
32229 425877 199216 -591329 -1462975 -1760518 -1415337 -915043 -655686 -605319 -529579 -255495
$$ packed form
32289c18550K63258N08297M40630K57003J33435j6646l14987o16253o19360k64652
32279e47825J44833K97444K26340J75748K11895J78597J5018j33608j80901k28523
32269A59018l17062k92121r2850N5970k2261j22225N3721M09754N85327M95759
32259I13030L96223M02173L01908l6805l64777l54511m2430K15522J63093j03636
32249A489790k80351j94616p100n0587m23502q06052p87967l37981J76561M10980
32239h10825L56132K45602K73365M07637M16556J30819k65461l61458p7024J10534
32229D25877k26661p90545q71646k97543L45181N00294K59357N0367P5740K74084
$$ [...]
##END NTUPLES=NMR SPECTRUM
##END=
