##TITLE=31P_DE-80H_X3
 64 sc D2O
 26.2.2025
##JCAMPDX= 6.0         $$ Bruker NMR JCAMP-DX V2.0
##DATA TYPE= NMR SPECTRUM
##DATA CLASS= NTUPLES
##ORIGIN= UXNMR, Bruker Analytische Messtechnik GmbH
##OWNER= root
$$ XWIN-NMR		Version 3.5
$$ Thu Apr  3 12:34:33 2025 Russian Standard Time (UT+4h)  Yarkov@DPX200
##.OBSERVE FREQUENCY= 81.013821
##.OBSERVE NUCLEUS= ^31P
##.ACQUISITION MODE= SIMULTANEOUS
##.ACQUISITION SCHEME= undefined
##.AVERAGES= 64
##.DIGITISER RES= 17
##SPECTROMETER/DATA SYSTEM= spect
##.PULSE SEQUENCE= zgpg30
##.SOLVENT NAME= CDCl3
##.SHIFT REFERENCE= (INTERNAL, CDCl3, 0, 198.062)
##AUDIT TRAIL= $$ (NUMBER, WHEN, WHO, WHERE, WHAT)
$$ ##TITLE= Audit trail, XWIN-NMR		Version 3.5
$$ ##JCAMPDX= 5.01
$$ ##ORIGIN= Bruker BioSpin GmbH
$$ ##OWNER= Yarkov
$$ C:/Bruker/XWIN-NMR/data/yarkov2/nmr/P31/2/pdata/1/auditp.txt
$$ ##AUDIT TRAIL=  $$ (NUMBER, WHEN, WHO, WHERE, WHAT)
(   1,<2025-04-03 12:33:29.09 +0400>,<Yarkov>,<DPX200>,
      <created by zg, POWCHK disabled, PULCHK disabled
       configuration hash MD5:
       00 E9 B6 7A A2 85 ED C7 34 08 36 98 17 FE 4E 26
       data hash MD5: 32K
       D1 A3 9F 64 89 C2 5A D0 A8 CC 4C E3 6C B4 F7 58>)
(   2,<2025-04-03 12:33:34.98 +0400>,<Yarkov>,<DPX200>,
      <Start of raw data processing
       efp BC_mod = 2 LB = 1.5 FT_mod = 6 PKNL = 1 PHC0 = 1777.449 PHC1 = 22.89542 SI = 64K 
       data hash MD5: 64K
       8D 54 C4 16 4A 65 AA E6 76 11 2B 50 68 DD FD 78>)
(   3,<2025-04-03 12:34:02.50 +0400>,<Yarkov>,<DPX200>,
      <pk PHC0 = 4.681388 PHC1 = -3.8 
       data hash MD5: 64K
       C7 CB B6 F6 91 80 ED 6A F0 0E AB CF CD D1 28 8F>)
$$ ##END=
$$ 
$$ hash MD5
$$ 99 12 CC 52 A6 37 DA 45 00 E1 DA F8 DA 90 F6 23
##$RELAX= 
##$RELAX= 
##$RELAX= 
##$RELAX= 
##$RELAX= 
##$RELAX= 
##$RELAX= 
##$RELAX= 
$$ Bruker specific parameters
$$ --------------------------
##$DU= <C:/Bruker/XWIN-NMR>
##$EXPNO= 2
##$NAME= <P31>
##$PROCNO= 1
##$TYPE= <nmr>
##$USER= <yarkov2>
##$AMP= (0..31)
100 100 100 100 100 100 100 100 100 100 100 100 100 100 100 100 100 100 
100 100 100 100 100 100 100 100 100 100 100 100 100 100 
##$AQSEQ= 0
##$AQ_mod= 1
##$AUNM= <au_zg>
##$AUTOPOS= <>
##$BF1= 81.014009
##$BF2= 200.13
##$BF3= 200.13
##$BF4= 200.13
##$BF5= 200.13
##$BF6= 200.13
##$BF7= 200.13
##$BF8= 200.13
##$BYTORDA= 1
##$CFDGTYP= 0
##$CFRGTYP= 5
##$CHEMSTR= <none>
##$CNST= (0..31)
1 1 145 1 1 1 1 1 1 1 1 1 1 1 1 1 1 1 1 1 1 1 1 1 1 1 1 1 1 1 1 1 
##$CPDPRG= <waltz16>
##$CPDPRG1= <>
##$CPDPRG2= <waltz16>
##$CPDPRG3= <>
##$CPDPRG4= <mlev>
##$CPDPRG5= <mlev>
##$CPDPRG6= <mlev>
##$CPDPRG7= <mlev>
##$CPDPRG8= <mlev>
##$CPDPRGB= <>
##$CPDPRGT= <>
##$D= (0..31)
0 1 0 0 0 0 0 0 0 0.06 0 0.03 2e-05 3e-06 0 0 0.0002 0 0 0 0 0 0 0 0 0 
0 0 0 0 0 0 
##$DATE= 1743669208
##$DBL= (0..7)
120 120 120 11 120 120 24 19 
##$DBP= (0..7)
150 150 150 150 150 150 150 150 
##$DBP07= 0
##$DBPNAM0= <>
##$DBPNAM1= <>
##$DBPNAM2= <>
##$DBPNAM3= <>
##$DBPNAM4= <>
##$DBPNAM5= <>
##$DBPNAM6= <>
##$DBPNAM7= <>
##$DBPOAL= (0..7)
$$ [...]
##$SUBNAM2= <"">
##$SUBNAM3= <"">
##$SUBNAM4= <"">
##$SUBNAM5= <"">
##$SUBNAM6= <"">
##$SUBNAM7= <"">
##$SUBNAM8= <"">
##$SUBNAM9= <"">
##$SW= 400.765351723535
##$SWIBOX= (0..15)
0 1 3 0 0 0 0 0 0 0 0 0 0 0 0 0 
##$SW_h= 32467.5324675325
##$TD= 32768
##$TD0= 1
##$TE= 0
##$TE2= 300
##$TE3= 300
##$TEG= 300
##$TL= (0..7)
0 120 53 12 22 120 120 120 
##$TP= (0..7)
150 150 150 150 150 150 150 150 
##$TP07= 0
##$TPNAME0= <>
##$TPNAME1= <>
##$TPNAME2= <>
##$TPNAME3= <>
##$TPNAME4= <>
##$TPNAME5= <>
##$TPNAME6= <>
##$TPNAME7= <>
##$TPOAL= (0..7)
0.5 0.5 0.5 0.5 0.5 0.5 0.5 0.5 
##$TPOFFS= (0..7)
0 0 0 0 0 0 0 0 
##$TUNHIN= 0
##$TUNHOUT= 0
##$TUNXOUT= 0
##$USERA1= <user>
##$USERA2= <user>
##$USERA3= <user>
##$USERA4= <user>
##$USERA5= <user>
##$V9= 5
##$VALIST= <valist>
##$VCLIST= <CCCCCCCCCCCCCCC>
##$VD= 0
##$VDLIST= <DDDDDDDDDDDDDDD>
##$VPLIST= <PPPPPPPPPPPPPPP>
##$VTLIST= <TTTTTTTTTTTTTTT>
##$WBST= 1024
##$WBSW= 4
##$XGAIN= (0..3)
0 0 0 0 
##$XL= 0
##$YL= 0
##$YMAX_a= 19770
##$YMIN_a= -19296
##$ZGOPTNS= <>
##$ZL1= 120
##$ZL2= 120
##$ZL3= 120
##$ZL4= 120
##$ABSF1= 0
##$ABSF2= 0
##$ABSG= 0
##$ABSL= 0
##$ALPHA= 0
##$AQORDER= 0
##$ASSFAC= 0
##$ASSFACI= 0
##$ASSFACX= 0
##$ASSWID= 0
##$AUNMP= <proc_1d>
##$AZFE= 0.1
##$AZFW= 0.5
##$BCFW= 0
##$BC_mod= 2
##$BYTORDP= 0
##$COROFFS= 0
##$CY= -3
##$DATMOD= 1
##$DC= 0
##$DFILT= <>
##$DTYPP= 0
##$F1P= 0
##$F2P= 0
##$FCOR= 1
##$FTSIZE= 65536
##$FT_mod= 6
##$GAMMA= 0
##$GB= 0
##$INTBC= 1
##$INTSCL= 9.790993e-09
##$ISEN= 30
##$LB= 1.5
##$LEV0= 0
##$LPBIN= 0
##$MAXI= 10000
##$MC2= 0
##$MEAN= 0
##$ME_mod= 0
##$MI= 50
##$NCOEF= 0
##$NC_proc= -5
##$NLEV= 6
##$NOISF1= 182.463
##$NOISF2= 159.3651
##$NSP= 0
##$NTH_PI= 0
##$NZP= 0
##$OFFSET= 198.0616
##$PC= 4
##$PHC0= 1782.13
##$PHC1= 19.09542
##$PH_mod= 1
##$PKNL= yes
##$PPARMOD= 0
##$PSCAL= 0
##$PSIGN= 0
##$REVERSE= no
##$SF= 81.0140089999434
##$SI= 65536
##$SIGF1= 159.3651
##$SIGF2= -187.1042
##$SINO= 113.3802
##$SIOLD= 16384
##$SREGLST= <1H.CDCl3>
##$SSB= 0
##$STSI= 65536
##$STSR= 0
##$SW_p= 32467.5324675325
##$SYMM= 0
##$S_DEV= 0
##$TDeff= 32768
##$TDoff= 0
##$TI= <>
##$TILT= no
##$TM1= 0
##$TM2= 0
##$TOPLEV= 0
##$USERP1= <user>
##$USERP2= <user>
##$USERP3= <user>
##$USERP4= <user>
##$USERP5= <user>
##$WDW= 1
##$XDIM= 65536
##$YMAX_p= 293985961
##$YMIN_p= -42290875
$$ End of Bruker specific parameters
$$ ---------------------------------
##NTUPLES= NMR SPECTRUM
##VAR_NAME=  FREQUENCY,     SPECTRUM/REAL,   SPECTRUM/IMAG
##SYMBOL=    X,             R,               I
##VAR_TYPE=  INDEPENDENT,   DEPENDENT,       DEPENDENT
##VAR_FORM=  AFFN,          ASDF,            ASDF
##VAR_DIM=   65536,         65536,           65536
##UNITS=     HZ,            ARBITRARY UNITS, ARBITRARY UNITS
##FACTOR=    0.49542278885378, 1,            1
##FIRST=     16045.7642231865, 0,            0
##LAST=      -16421.768244346, 0,            0
##MIN=       -16421.768244346, -42290875,    0
##MAX=       16045.7642231865, 293985961,    0
$$ Real data points
##PAGE= N=1
##DATA TABLE= (X++(R..R)), XYDATA
$$ [...]
40849 1005286 1055858 896515 729010 482691 -38677 -683806 -1009660 -871425 -638008 -677532
40839 -677532 -874435 -843722 -463853 -12852 151177 -62242 -383803 -413232 -60148 261051
40829 261051 99396 -363726 -451766 77123 621665 536008 -6811 -346220 -253121 -4267
40819 -4267 303504 886879 1644404 1970867 1497343 646075 143107 223259 573431 835562
40809 835562 875844 713173 475569 357006 387336 314138 -69263 -547401 -680491 -366981
40799 -366981 22108 103468 -124920 -405243 -543694 -508647 -355382 -199529 -193980 -398791
40789 -398791 -691002 -893367 -970423 -1004585 -1004653 -886742 -694315 -676323 -981809 -1355097 -1355566
40778 -1355566 -909625 -429901 -274928 -282500 -32706 556747 1141270 1402851 1345541 1132646
40768 1132646 874880 646978 498067 342967 25361 -403191 -646941 -541648 -298203
40759 -298203 -208391 -257453 -224956 -52874 111023 168629 143714 26251 -229653 -526654
40749 -526654 -635026 -440130 -51088 345429 589754 521000 78901 -472449 -626503 -121746
40739 -121746 728820 1319362 1317066 884696 430465 228030 213755 77235 -388002 -978975
40729 -978975 -1238711 -980192 -498722 -149381 87551 397597 666864 579964 146709 -237519
40719 -237519 -337680 -356835 -531974 -772536 -920424 -1080135 -1373424 -1570415 -1349956 -856070
40709 -856070 -626132 -926134 -1443692 -1702385 -1543011 -1132602 -713987 -425913 -212101 117089
40699 117089 577639 826325 546833 -15857 -261672 -14024 306469 393676 479893 802147
40689 802147 1100360 1050401 841125 835780 918803 723321 352433 280154 543481 605881 148995
40678 148995 -486078 -830121 -845468 -746197 -624448 -505734 -485015 -547036 -463672 -92769
40668 -92769 394911 755827 949341 1022925 951737 787137 752398 966352 1237857 1333311
40658 1333311 1274012 1163264 907899 372282 -316067 -855511 -1075907 -980499 -637693 -243582
40648 -243582 -112996 -320701 -479476 -179777 446839 920958 1085526 1203594 1395302 1397290
40638 1397290 1021245 505445 182876 34499 -175879 -458799 -546996 -270853 193851 498073
40628 498073 450403 138863 -221388 -495924 -672431 -754857 -712969 -554979 -356601 -162904
40618 -162904 60532 317488 506994 541393 464089 361840 233241 47362 -125659 -157813
40608 -157813 -24350 144197 161082 -65488 -408295 -564877 -365897 -44173 -4572 -291408
40598 -291408 -528877 -482493 -398140 -599759 -1001924 -1255382 -1171566 -778399 -177244 395094
40588 395094 582933 295471 -100738 -242880 -207197 -207954 -178135 -50849 -122076 -578895 -943304
40577 -943304 -666530 -97833 -74012 -591622 -768896 -279278 87671 -306366 -921193 -859168
40567 -859168 -114658 621131 954320 963134 725301 311792 50513 220229 586362 695351
40557 695351 499221 274161 99848 -113414 -221195 44982 628928 1220827 1679368 1986157
40547 1986157 1940808 1402327 738246 499224 670172 760407 618134 577604 738632 720319
40537 720319 332085 -70832 -183236 -206746 -378424 -492328 -306835 -71086 -165308 -440026
40527 -440026 -400229 40197 427765 414308 177215 97511 261609 406546 237806 -272736
40517 -272736 -840586 -1099883 -930721 -550197 -259695 -169174 -204241 -259131 -234074 -36549
40507 -36549 280749 440968 207927 -245799 -432155 -118430 340401 412223 51789 -272406
40497 -272406 -226000 -8347 44492 -23506 -1170 -57498 -582721 -1453326 -1973450 -1768974
40487 -1768974 -1288277 -1094593 -1090715 -899076 -635409 -685605 -920560 -816534 -329847 2632
40477 2632 -80516 -230915 -174100 -111983 -173536 -54381 392255 702851 442514 -66566 -186134
40466 -186134 113522 301962 121716 -149263 -246348 -258302 -326549 -360888 -210369 72809
40456 72809 239841 41648 -535090 -1123591 -1190204 -577536 253751 697694 604680 236417
40446 236417 -194392 -636653 -962322 -972549 -674140 -298477 -17362 167980 284792 353628
40436 353628 460212 624673 624470 208890 -494527 -1033135 -1128835 -917735 -672243 -501353
40426 -501353 -364952 -193264 42234 227262 120448 -321165 -702220 -569174 -18374 385874
40416 385874 312062 -59499 -484447 -946912 -1345090 -1329097 -791905 -222838 -185826 -607235
40406 -607235 -927456 -850971 -606661 -511369 -607251 -767149 -878704 -832951 -547947 -135813
40396 -135813 83409 -133681 -686521 -1198021 -1324413 -999416 -438734 56753 320827 369839
40386 369839 266254 6369 -418663 -909022 -1271464 -1338960 -1068335 -592028 -213658 -245661
40376 -245661 -716866 -1261051 -1417396 -1077523 -572877 -309337 -391042 -628420 -813001 -874450
40366 -874450 -807989 -605752 -331994 -147485 -121630 -88605 124637 340041 138862 -562432
40356 -562432 -1253675 -1340881 -795119 -110370 278361 327816 231172 193293 352869 687302
40346 687302 947556 865262 454750 -38948 -465741 -842051 -1118369 -1137578 -886185 -565985
40336 -565985 -345291 -231462 -224007 -353291 -503337 -458864 -241530 -156635 -376042 -706368
40326 -706368 -905381 -983188 -1023353 -950944 -697326 -404811 -251033 -213673 -172220 -78685 104571
40315 104571 413059 676807 589688 192808 -15585 261297 641522 584866 107858 -418407
40305 -418407 -895504 -1401176 -1676624 -1342295 -594890 -87946 -41145 -18946 276085 541745
40295 541745 447523 185523 122655 258591 362251 385505 430377 491198 490661 434299 343841
40284 343841 186662 7068 -64351 -60656 -211833 -590342 -973999 -1210866 -1426493 -1668249
40274 -1668249 -1661915 -1209438 -561395 -85182 188728 361070 276130 -219773 -808497 -972954
40264 -972954 -687701 -406082 -378694 -415361 -361319 -381534 -637172 -1013512 -1308973 -1425973
40254 -1425973 -1280649 -816063 -229969 86338 -12342 -269353 -410634 -417868 -299439 85919
40244 85919 742517 1334587 1543800 1438191 1228555 868275 237924 -412380 -616276 -304421
40234 -304421 73009 117868 -87558 -212491 -94883 193521 491559 618914 480318 250733
40224 250733 288168 671923 969586 706190 -10444 -593634 -690168 -510184 -388455 -312827
40214 -312827 -78407 304846 619142 743614 694851 425344 -124127 -739229 -993658 -746596
40204 -746596 -376736 -341108 -637205 -882947 -821134 -531932 -194765 126675 410742 570876
40194 570876 547794 442013 447722 636559 844590 815586 480011 57639 -178701 -206458
40184 -206458 -202881 -206490 -27661 412488 847453 951222 734344 461506 277546 139824
40174 139824 44970 47951 57723 -109486 -403991 -506710 -219324 306847 821520 1235831
40164 1235831 1497662 1433878 957890 324483 -54452 -29597 197655 363975 374242 280637
40154 280637 194438 229334 406000 590184 619273 500740 396010 396915 410428 297670 52198
40143 52198 -212887 -416440 -587377 -774122 -905353 -808917 -425201 40193 281070 214032
40133 214032 29831 -95016 -188721 -313502 -373000 -260152 -92517 -85903 -216523 -219296 31918
40122 31918 320435 355682 115740 -196356 -451837 -701241 -978240 -1128652 -941717 -447440
40112 -447440 13643 114104 -85839 -211795 -62877 124220 24342 -302487 -515511 -512829
40102 -512829 -557364 -827332 -1133711 -1254789 -1294713 -1431168 -1485096 -1119400 -441361 -16946
40092 -16946 -149372 -452835 -370268 96591 437349 288679 -226342 -758686 -1075692 -1140652
40082 -1140652 -1080975 -1116991 -1334422 -1504066 -1327971 -886038 -593593 -653950 -829709 -873729
40072 -873729 -870504 -923443 -810484 -320040 259322 411623 101394 -190493 -154375 13235
40062 13235 49414 27181 133107 323581 412770 315585 51422 -304536 -550004 -475548 -228293
40051 -228293 -306738 -949646 -1733760 -2053332 -1831580 -1455828 -1153884 -812710 -379501 -56039
40041 -56039 5087 -86765 -179309 -297150 -513893 -770492 -955042 -1050788 -1090551 -1049753 -893137
40030 -893137 -681451 -545923 -565072 -700102 -838203 -894203 -892351 -938268 -1086182 -1263660
40020 -1263660 -1361012 -1354269 -1304256 -1290873 -1382573 -1580926 -1741582 -1668747 -1373541 -1095593 -939579
40009 -939579 -665909 -74361 536541 620063 92500 -514135 -708447 -602148 -662248 -1068927
39999 -1068927 -1504232 -1529258 -1051114 -411702 -50635 -81910 -225785 -167727 108460 408617
39989 408617 611275 706630 663276 472893 279780 250854 335385 352741 290282 298288 414728
39978 414728 529358 598883 640826 539332 169505 -270456 -398967 -195367 -55938 -198780
39968 -198780 -377478 -342862 -206745 -117045 52070 372777 563136 401781 178953 297987
39958 297987 608888 607842 221475 -75514 40282 334269 423799 275749 137345 188310
39948 188310 412586 683478 858912 852542 666639 351675 -10625 -260993 -251067 -84644
39938 -84644 -93577 -393546 -639349 -471770 -62049 95967 -150625 -485507 -623097 -601552
39928 -601552 -555444 -523117 -564026 -784773 -1124934 -1327061 -1226484 -914671 -571375 -311866
39918 -311866 -223849 -347927 -576933 -761970 -928475 -1171891 -1355027 -1207529 -774538 -448097
39908 -448097 -441094 -534382 -491181 -405950 -421312 -386378 -102672 280060 441217 373651 391327
39897 391327 661880 976997 1039662 814371 519160 350440 274022 88760 -300984 -715504
39887 -715504 -877955 -738167 -507843 -389023 -408889 -513506 -634956 -627905 -337484 184948
39877 184948 687456 993402 1106182 1017548 664616 178413 -82271 77513 450484 731341
39867 731341 859923 894733 768330 422399 50257 -46339 204287 594043 838262 730080
39857 730080 261491 -260244 -396838 -61871 348069 475373 431844 475412 508762 262613
39847 262613 -170615 -380695 -176703 251841 676113 996573 1080850 789110 244328 -194991
39837 -194991 -315757 -198529 26078 310196 538358 522830 261195 -4952 -82793 -16009
39827 -16009 61625 65620 -88712 -451046 -863175 -1021378 -824704 -510117 -350049 -353269 -344189
39816 -344189 -207172 29899 259011 388825 446591 559789 735007 734498 356156 -225280
39806 -225280 -619174 -675810 -540576 -318181 -12267 212148 99097 -268130 -468132 -309214
39796 -309214 -45902 129772 417394 953742 1376240 1213666 501943 -324918 -981344 -1438946
39786 -1438946 -1652036 -1550929 -1253405 -976068 -773562 -607782 -565365 -702188 -771188 -473291
39776 -473291 48113 339147 285916 242613 412369 498468 192216 -315960 -615460 -655027
39766 -655027 -715498 -904006 -999652 -822442 -495160 -241614 -97631 51517 238850 347078
39756 347078 257736 -6715 -296558 -457508 -454156 -405499 -469888 -640720 -694225 -447427 -63390
39745 -63390 57195 -234376 -605069 -645991 -383967 -181836 -213211 -312238 -353516 -478605
39735 -478605 -811455 -1184371 -1343001 -1278196 -1160200 -1031967 -759992 -282247 221452 446135
39725 446135 249194 -150729 -329325 -139364 49499 -154570 -490142 -276383 571499 1243423
39715 1243423 1079969 501516 388440 814667 1042305 719285 407151 716797 1461927
39706 1461927 2017272 2143139 2050252 1866625 1473793 853703 264601 -34292 -67275 -62151
39696 -62151 -166175 -304761 -295583 -65032 258602 452769 366515 -9580 -534623 -914905
39686 -914905 -834569 -260334 414872 692385 446697 -21866 -376836 -532370 -569393 -568092
39676 -568092 -592836 -695816 -843994 -923420 -867558 -717974 -546540 -392137 -265164 -132008
39666 -132008 66993 272228 235020 -234187 -954892 -1475350 -1492252 -1047597 -362120 330331
39656 330331 812944 993954 1023646 1101310 1141569 850714 170586 -580521 -1062566 -1197278
39646 -1197278 -1074276 -832449 -677493 -726538 -762109 -457341 48383 157502 -411363 -1191559
39636 -1191559 -1554210 -1426540 -1161775 -993614 -952287 -1076918 -1342418 -1539742 -1553941 -1595692
39626 -1595692 -1841330 -2038615 -1837882 -1339504 -910895 -620869 -309958 -93511 -262574
39617 -262574 -701988 -929606 -769992 -499728 -260189 124199 576626 583954 -89983 -957658
39607 -957658 -1457883 -1693131 -2097308 -2643212 -2851380 -2468125 -1731555 -1005756 -472862 -158336
39597 -158336 29002 286849 714748 1111713 1164683 828811 362803 25311 -109349 -96963
39587 -96963 -59764 -122348 -253736 -264939 -144763 -254770 -890246 -1720915 -2037942 -1612213
39577 -1612213 -968088 -675913 -686357 -578312 -204500 212956 485421 626057 634768 419026
39567 419026 28704 -245606 -167330 159983 432771 495447 415346 282733 129180 45212
39557 45212 157189 383818 406442 61437 -371802 -491236 -285318 -74373 -12542 19856
39547 19856 22714 -217723 -674919 -929517 -761571 -562580 -759627 -1083566 -920015 -278693
39537 -278693 149281 -36168 -443453 -551272 -388833 -237695 -63097 293298 587222 370739
39527 370739 -276070 -647311 -207098 768575 1505882 1541242 1077531 614592 366783 107203
39517 107203 -417500 -1020494 -1209991 -832452 -340572 -218944 -331045 -149822 448331 989606
39507 989606 1049214 751025 485655 421220 489288 617269 727832 667945 389373 103068
39497 103068 31643 82606 -28591 -402803 -902095 -1375255 -1695558 -1655988 -1139537 -404622
39487 -404622 90484 197103 143345 66004 -168369 -542114 -667798 -288097 272053 507183
39477 507183 422722 451235 747695 956452 747100 273339 -46839 -19454 192505 324006
39467 324006 306964 344950 669010 1170185 1399015 1093584 579389 377343 495285 459566
39457 459566 56412 -367699 -484255 -463735 -606436 -806200 -744331 -433093 -191241 -149131
39447 -149131 -111080 87829 359404 534493 561330 508731 512189 684619 943283 1011180 762743
39436 762743 448916 358240 410624 404365 499921 969494 1504389 1382479 530159 -147886
39426 -147886 98876 829895 1015639 395881 -341670 -629426 -658378 -840578 -1154817 -1324730
39416 -1324730 -1332688 -1405975 -1592058 -1625759 -1270906 -670091 -261408 -314305 -586544 -580282 -198726
39405 -198726 55340 -247863 -760473 -692327 151770 1051301 1223897 684748 51721 -236897
39395 -236897 -231752 -179852 -237874 -424576 -608814 -553706 -162624 332723 594704 564017 456704
39384 456704 411281 337621 135147 -120762 -275516 -267999 -171576 -138406 -277579 -488605 -480367
39373 -480367 -115699 319553 402288 100935 -225687 -355273 -415938 -494214 -392576 -22006
39363 -22006 253984 31434 -514979 -792812 -547912 -124693 78345 97579 199711 428259
39353 428259 579183 525981 368050 263734 251163 262948 234526 144799 -25365 -313722
39343 -313722 -700378 -1014304 -1003721 -580139 40186 514454 674402 590905 402538 215889
39333 215889 159437 354978 745827 1071393 1132622 1025642 1000419 1118654 1183680 1046752
39323 1046752 863914 914429 1177371 1246735 783296 -33652 -670954 -832759 -689087 -496612
39313 -496612 -270293 7745 126422 -85048 -373516 -322569 34378 233242 49779 -235495
39303 -235495 -367373 -514259 -877678 -1225048 -1170883 -748107 -361708 -275821 -446248 -763736
39293 -763736 -1121733 -1270990 -965317 -340286 124904 139866 -99518 -234091 -163901 -26156
39283 -26156 83918 201039 358512 496625 523448 447358 433136 650756 1013073 1171205
39273 1171205 902647 422440 154272 270159 623596 1017691 1279061 1160298 529120
39264 529120 -319079 -874756 -1011402 -1051682 -1178568 -1183498 -961529 -822696 -998136 -1195008
39254 -1195008 -1042945 -715773 -654285 -841078 -845150 -544363 -322961 -465014 -751377 -824140
39244 -824140 -660599 -501161 -496916 -592056 -656357 -642289 -663511 -905893 -1373520 -1791070 -1893798
39233 -1893798 -1719089 -1440555 -1067337 -586830 -256746 -345707 -627404 -588010 -187255 59199
39223 59199 -113879 -331706 -245834 -110030 -303437 -662094 -754991 -564576 -405696 -339073
39213 -339073 -162458 99818 195599 139084 234125 507963 546488 83188 -565551 -871661
39203 -871661 -699576 -366726 -248903 -460542 -820825 -1042182 -1006287 -843897 -669173 -371995
39193 -371995 100649 394008 65475 -739265 -1343703 -1384898 -1195943 -1161571 -1124970 -787961
39183 -787961 -366808 -371105 -857159 -1334825 -1412139 -1184730 -946086 -811687 -728279 -642675
39173 -642675 -548477 -473507 -463486 -500813 -474463 -346737 -289957 -491362 -857359 -1090303 -1044465
39162 -1044465 -829789 -576716 -297797 -1920 249365 445192 613534 671038 475109 86177
39152 86177 -220270 -307740 -369841 -633200 -1010614 -1206766 -1080063 -755231 -435865 -238029
39142 -238029 -177414 -200064 -215964 -171663 -102722 -94925 -208555 -434680 -679988 -819169 -852933
39131 -852933 -987436 -1402850 -1923763 -2112174 -1786812 -1280292 -1035655 -1086476 -1109071 -873407
39121 -873407 -433801 47940 423492 519176 240652 -202940 -392157 -150012 235748 369238
39111 369238 205413 3089 -83555 -157347 -320172 -466175 -446481 -327393 -327178 -501583 -626790
39100 -626790 -473752 -134897 38558 -142705 -430202 -384253 96295 590755 591936 83266
39090 83266 -441374 -548693 -311072 -97124 -79826 -157773 -269877 -485804 -739025 -772165
39080 -772165 -508556 -233430 -197713 -260777 -180800 -42064 -45665 -49581 227252 604838 564071
39069 564071 56573 -310546 -111010 331913 512378 475969 596082 926426 1213502 1339651
39059 1339651 1320124 1036503 443033 -81750 -103238 174821 102483 -464485 -913122 -737838
39049 -737838 -192596 167767 196435 87253 -83262 -364910 -653682 -742302 -588974 -313253
39039 -313253 -8045 259405 377095 326264 290999 426279 603286 583028 355131 92594
39029 92594 -150424 -455506 -796287 -1029290 -1139440 -1253273 -1342484 -1137947 -492207 290820
39019 290820 659840 364500 -276029 -692199 -631754 -351963 -222026 -239223 -91950 342011
39009 342011 791822 950202 813610 552154 264784 43074 65000 365961 660078 663887
38999 663887 497371 488762 673450 798313 763427 709106 669195 513310 300709 317911 627132
38988 627132 920927 997037 1031578 1151404 1092451 629292 49751 -238938 -377396 -805656
38978 -805656 -1407823 -1485627 -755565 114819 298095 -183063 -613304 -562754 -296623 -245220
38968 -245220 -460500 -727974 -936459 -1118816 -1256028 -1243973 -1034733 -690819 -312114 4718
38958 4718 158353 91942 -138587 -402786 -600704 -697183 -701849 -685555 -755947 -899503 -890103
38947 -890103 -512526 121608 651554 897285 1026662 1212323 1328497 1173512 857190 729260
38937 729260 944073 1285987 1452915 1375540 1210518 1100952 991751 687457 137586 -349720
38927 -349720 -333495 240716 913789 1244052 1287534 1343128 1414830 1274570 972047 867601
38917 867601 1088570 1310259 1219421 902376 614694 439355 362544 424616 542578 392926
38907 392926 -225706 -1023894 -1490474 -1472606 -1251818 -1096272 -997485 -869431 -774861 -849961
38897 -849961 -1113423 -1415145 -1529141 -1307335 -809731 -276241 71854 179040 112425 -16658
38887 -16658 -61224 70301 251789 241410 54971 28775 334654 652993 593237 252971
38877 252971 16333 -79866 -365515 -925897 -1378181 -1371032 -984098 -497869 -58638 266606
38867 266606 375372 295843 286220 553373 981548 1290014 1340655 1160174 804749 371594
38857 371594 35704 -93768 -92512 -86070 -82197 -36889 17913 17212 -67550 -273244 -605736 -876086
38845 -876086 -801405 -431414 -238762 -536403 -1006226 -1114952 -838043 -603418 -615438 -657997
38835 -657997 -572532 -497091 -512142 -435256 -166116 74704 77937 -31953 -32718 54502 90333
38824 90333 80409 65291 -57249 -310737 -415049 -132142 276191 326327 17109 -149689
38814 -149689 90154 403730 398406 162651 26294 51864 51944 -62549 -231576 -433796 -675682
38803 -675682 -870710 -948952 -1005608 -1119900 -1122210 -813779 -359927 -152874 -269903 -378066
38793 -378066 -253326 -100018 -211133 -547549 -821933 -825075 -531777 -63269 311320 323455
38783 323455 32022 -158771 16735 349362 492169 444200 437045 495607 436005 226846
38773 226846 28457 -108496 -273101 -415635 -359501 -149916 -81583 -275940 -516331 -624630
38763 -624630 -701432 -807563 -700680 -179947 493516 832967 702895 400881 220555 189968
38753 189968 231057 316535 391822 333244 103175 -148388 -226498 -93243 114119 229843
38743 229843 201882 119686 116521 230623 367086 399575 277471 27172 -284604 -538543
38733 -538543 -568275 -268473 276040 795829 1014832 880955 635576 574913 691342 663731
38723 663731 304267 -148632 -398323 -582882 -1015211 -1481046 -1312571 -353514 613533 765507
38713 765507 234365 -205081 -176744 64513 285139 571270 910248 985790 619237 87611
38703 87611 -220941 -247673 -185769 -158772 -159224 -182105 -265241 -443474 -701302 -896337 -778251
38692 -778251 -265980 319431 538331 368723 203662 274493 381205 308317 191744 256835
38682 256835 433258 481769 352582 205192 190666 376599 739855 1066563 1032993 602749
38672 602749 203041 272196 729985 1111525 1133571 910510 692123 619358 694677 781638
38662 781638 657399 242696 -255753 -584659 -745232 -870840 -905597 -670936 -233749 57237
38652 57237 -25088 -312886 -428273 -137103 474973 1066135 1297972 1131049 823620 589182
38642 589182 408635 274908 354421 648388 750315 343611 -215808 -281077 181179 557210
38632 557210 466219 147499 -128078 -458643 -866960 -987573 -604954 -107033 49594 26062
38622 26062 274018 745039 955614 757594 540954 634907 931683 1190690 1343206 1359230
38612 1359230 1132261 698190 358800 381502 668356 853765 684310 248272 -120498 -157395
38602 -157395 58402 180982 22077 -200136 -184314 -3623 13110 -185420 -270045 -37525
38592 -37525 260867 265601 -7652 -224310 -171574 18185 48165 -227775 -635812 -802629
38582 -802629 -531773 -74865 109656 -95117 -335761 -291907 -96487 -67970 -194378 -162369
38572 -162369 150468 495713 626387 622707 721195 974844 1236827 1385926 1396330 1223001
38562 1223001 813584 290228 -42698 -2899 242575 385309 345310 272806 229276 101273
38552 101273 -116076 -189075 49720 444684 742487 917016 1054075 1058071 772838 339193
38542 339193 111971 180693 253154 96347 -165213 -311401 -354564 -435921 -553177 -559999 -355773
38531 -355773 15315 368797 461578 229936 -24493 98082 578444 972315 1005927 873541
38521 873541 789373 608879 202078 -114246 45387 507283 750178 663853 632409 849312
38511 849312 1001974 756455 185313 -430473 -903651 -1100338 -923571 -544599 -380550 -601483
38501 -601483 -855697 -706820 -182896 311651 477912 311291 -45680 -400367 -540213 -384189
38491 -384189 -83899 154822 282002 324680 234581 -598 -203689 -194043 -80801 -153224
38481 -153224 -478028 -786133 -777556 -403048 146850 590912 709659 505774 228255 114751
38471 114751 119921 32335 -169228 -272204 -181675 -120724 -351780 -804252 -1125005 -1089562 -859008
38460 -859008 -769013 -900876 -977460 -760111 -423586 -311278 -357448 -100315 590050 1153220
38450 1153220 1022440 398367 -76536 -230183 -426567 -771203 -846272 -404533 189585 501116
38440 501116 594064 726233 835367 738497 572408 579725 624932 385852 -60504 -305941
38430 -305941 -250670 -216814 -364187 -454884 -366227 -407181 -827673 -1324360 -1387923 -965711 -450960
38419 -450960 -129407 20397 12916 -283129 -836325 -1275077 -1250010 -864905 -538528 -468499
38409 -468499 -437037 -198815 142408 317752 326434 417667 635388 681430 394083 116460
38399 116460 300816 863511 1246359 1104376 639275 209884 -90425 -340889 -530546 -582766
38389 -582766 -492960 -278703 92087 586914 1030750 1264327 1281418 1126943 812122 434761
38379 434761 189004 93586 -92600 -474538 -738475 -541466 -21067 406342 624142 809609
38369 809609 932701 730839 246097 -68371 37566 268789 283837 195168 284291 506319
38359 506319 627987 659617 776433 916981 823257 461713 96292 -79795 -133384 -188817
38349 -188817 -260244 -315964 -314990 -160044 201791 619692 852883 833015 640828 291530 -193052
38338 -193052 -548408 -466445 -94608 32407 -287069 -619087 -537204 -233119 -150583 -266627
38328 -266627 -161563 302450 783080 940590 774205 434781 20384 -346070 -509501 -492001
38318 -492001 -510936 -671824 -823593 -825039 -759407 -741320 -693798 -507162 -280087 -179513 -138278
38307 -138278 67146 425950 586205 230288 -549623 -1332399 -1769952 -1848209 -1780647 -1719868
38297 -1719868 -1626949 -1421450 -1182666 -1108800 -1283081 -1573636 -1780870 -1786956 -1545715 -1081732
38287 -1081732 -598618 -444418 -781231 -1325033 -1569963 -1277895 -647043 -37547 321160
38278 321160 369484 168050 -99064 -202979 -79154 77409 -3100 -396464 -909313 -1225854
38268 -1225854 -1133164 -684964 -168770 157319 305680 460810 663849 751953 640732 466507
38258 466507 333728 117561 -285236 -673545 -794840 -796333 -1070996 -1606279 -1845925 -1400511
38248 -1400511 -624847 -206592 -351539 -693811 -913373 -1053838 -1178757 -1104237 -710854 -269667
38238 -269667 -150832 -317939 -407291 -280916 -201021 -382736 -643412 -673027 -474458 -311618
38228 -311618 -301899 -290845 -146320 16379 -7219 -237201 -490731 -592947 -541417 -481093 -556321
38217 -556321 -778853 -1026900 -1179392 -1226197 -1202206 -1046486 -632607 24694 670243 975255
38207 975255 780447 179418 -554861 -1108264 -1311477 -1267673 -1202922 -1117246 -728099 76463
38197 76463 856170 971792 335904 -456485 -849765 -931540 -1120887 -1462199 -1558860 -1183694
38187 -1183694 -641866 -401365 -557611 -817166 -886055 -706721 -383201 -63226 88602 -43906
38177 -43906 -410930 -816901 -1102393 -1231574 -1168397 -805321 -159110 442421 588856 259495
38167 259495 -100151 -84238 218263 413622 329858 131830 -47314 -307658 -712150 -1046971
38157 -1046971 -1058431 -809582 -589647 -524146 -484373 -374805 -288831 -307344 -325073 -214000
38147 -214000 -66166 -138088 -557780 -1140046 -1492029 -1328566 -762435 -264130 -202858 -414891
38137 -414891 -394939 34677 463143 439787 68438 -194911 -188837 -162993 -284589 -375033 -228630
38126 -228630 87035 386862 597199 683549 569262 311763 162359 228140 253717 16562
38116 16562 -209009 50386 734176 1192940 968342 318303 -188829 -334442 -295147 -246582
38106 -246582 -195114 -103382 55664 320059 618933 696494 384626 -74027 -225169 33061
38096 33061 311667 235868 -127147 -469213 -659786 -755090 -730425 -475318 -46637 300961
38086 300961 396077 299017 113473 -176883 -568942 -884553 -943351 -841866 -875012 -1154239
38076 -1154239 -1452359 -1488277 -1242958 -901817 -584729 -274297 16176 145511 -25549 -452847
38066 -452847 -886430 -1031404 -784825 -370215 -180606 -384777 -716828 -767730 -454258 -47815
38056 -47815 238871 461436 672101 696268 383842 -84507 -382429 -434133 -399088 -350352
38046 -350352 -239281 -133055 -167426 -224366 16990 572914 974215 786285 116109 -566929
38036 -566929 -917149 -836709 -346685 364134 883391 881793 468850 36258 -200020 -292834
38026 -292834 -296639 -207673 -150155 -303238 -576501 -631755 -329596 67089 220782 37340
38016 37340 -405888 -980735 -1429452 -1434209 -971503 -406234 -48462 186365 473980 669415
38006 669415 518425 151433 3659 226645 467792 317346 -221180 -784741 -1030821 -892931
37996 -892931 -560639 -288742 -218879 -372184 -741552 -1233977 -1528545 -1270576 -563884 -9525
37986 -9525 -1041 -212041 -114296 211130 235141 -164273 -539863 -586798 -476165 -358511 -100857
37975 -100857 216271 89527 -668188 -1390330 -1309399 -604550 -134374 -244637 -423518 -176433
37965 -176433 306874 559410 494529 372360 358855 386618 329155 116023 -249421 -644708
37955 -644708 -853810 -740531 -370072 74038 430205 602585 570788 411913 250651 159776
37945 159776 152804 235387 360010 370205 145170 -200174 -415323 -423319 -362931 -308747 -154511
37934 -154511 161282 518641 806144 1049725 1214727 1077289 509282 -223246 -669387 -665410
37924 -665410 -433791 -252420 -190710 -157959 -56962 129071 292845 246189 -87694 -524965
37914 -524965 -761273 -662088 -332717 72205 487958 882117 1176554 1276166 1119950 702692
37904 702692 120909 -409396 -687135 -715109 -681088 -723054 -787349 -749567 -591333 -395344
37894 -395344 -225974 -95709 -30573 -91014 -294130 -541030 -663409 -569443 -337467 -135834
37884 -135834 -53535 -57935 -116114 -251151 -409224 -383073 -32531 448455 671720 510562
37874 510562 248869 179122 217199 102899 -124446 -123373 243749 660387 763655 610820
37864 610820 510515 510104 362739 17488 -187800 10727 398723 584317 523891 453215
37854 453215 410405 192632 -205338 -476765 -442751 -286768 -180125 20223 445355 846770
37844 846770 896481 695936 622069 744824 772466 571864 359162 283776 182902 -68608
37834 -68608 -261866 -154624 139680 326284 351523 378425 417916 272689 -123513 -540966
37824 -540966 -710905 -591237 -297373 84679 478352 689886 488858 -111889 -745800 -984019
37814 -984019 -756367 -399523 -248348 -282149 -278458 -212591 -288671 -569689 -818263 -828987 -732461
37803 -732461 -780293 -946761 -968697 -744716 -475844 -373332 -407468 -428578 -403593 -416076 -491871
37792 -491871 -531043 -423436 -193148 -9610 -31827 -218827 -332742 -191453 107115 293303
37782 293303 249966 140008 203426 518739 979137 1391103 1545358 1305372 734948 89370
37772 89370 -404961 -726659 -957607 -1083617 -1016790 -780132 -529547 -374171 -289326 -232488
37762 -232488 -220736 -237669 -194245 -89642 -101296 -352778 -649031 -644801 -308182 -28663 -157542
37751 -157542 -578565 -877392 -838760 -594296 -323736 -38187 269981 454574 363013 80588
37741 80588 -138023 -181972 -196250 -336979 -517779 -491975 -157853 294774 555628 472822
37731 472822 156315 -147571 -249330 -120106 122289 299633 284824 80760 -198507 -436218
37721 -436218 -604191 -748757 -906746 -1051389 -1116667 -1077284 -1013872 -1063843 -1243763 -1343148
37711 -1343148 -1118162 -636609 -298988 -400904 -769321 -980279 -868089 -637977 -512959
37702 -512959 -497203 -529292 -643821 -858483 -1059308 -1127001 -1060489 -881084 -569354 -225011
37692 -225011 -110534 -329301 -598640 -593486 -416344 -424091 -627078 -625078 -238043 142940 66991
37681 66991 -348645 -593520 -450945 -211568 -209648 -420915 -618818 -727125 -839107 -963579
37671 -963579 -934366 -628666 -192022 47993 -87327 -428465 -637480 -577418 -448003 -538911
37661 -538911 -902039 -1302967 -1448331 -1211277 -684851 -113612 223271 172190 -161979 -474338
37651 -474338 -536128 -423828 -402148 -552186 -613480 -306299 239965 552626 358510 -96158
37641 -96158 -378360 -372621 -261903 -112001 229111 776873 1242982 1392670 1370302 1451813
37631 1451813 1605718 1558546 1247449 933938 817685 779051 639646 505418 652925 1119991
37621 1119991 1566185 1575944 1046878 277772 -294427 -465145 -408816 -447728 -673608 -852286
37611 -852286 -719904 -291418 178614 461249 499113 366978 207361 158959 212023 153139
37601 153139 -195207 -668691 -867333 -643493 -332956 -370938 -776924 -1161459 -1178956 -824361
37591 -824361 -322377 95520 273141 156021 -155510 -453456 -608129 -670202 -736350 -771165
37581 -771165 -651536 -376791 -147514 -184584 -486222 -797280 -830371 -511184 -11493 416221
37571 416221 594276 459300 73567 -354754 -566236 -463718 -189197 64579 231511 291844
37561 291844 166108 -132292 -356988 -299564 -156701 -336063 -872237 -1342920 -1451009 -1362423
37551 -1362423 -1301095 -1151273 -757712 -350214 -283983 -503942 -642085 -551168 -357638 -59303
37541 -59303 461188 977192 973731 389461 -93850 171081 983785 1577134 1526897 1057180
37531 1057180 565648 209901 -18558 -108835 -39088 172222 488277 836631 1068847 1060361
37521 1060361 876887 736611 762892 838699 742293 399953 -9369 -208950 -118051 32368
37511 32368 -23039 -196364 -106285 405635 1008844 1283165 1217077 1101334 1065182 995110 853992
37500 853992 769904 754857 599239 174918 -322617 -559784 -411582 -72688 104611 -99377
37490 -99377 -525238 -723398 -461325 -79570 -83028 -413149 -496490 -98580 295405 203320
37480 203320 -126559 -104109 339274 737131 814593 746244 685507 508109 166165 -84895
37470 -84895 -34042 163544 203180 -23288 -430639 -871280 -1128469 -1024577 -707761 -577327
37460 -577327 -716326 -679367 -143288 493107 567050 43646 -501963 -711465 -757719 -811041
37450 -811041 -720251 -417225 -192806 -277276 -471995 -497055 -436417 -526271 -731749 -873399
37440 -873399 -989503 -1200291 -1332736 -1080183 -516772 -91755 -61590 -218523 -241589 -62166
37430 -62166 180614 318750 229557 -63842 -327253 -356543 -299502 -490518 -927130 -1188554
37420 -1188554 -967817 -429723 62820 315289 273298 -72363 -533775 -713448 -401734 151273
37410 151273 551589 691062 678484 545391 291449 82729 104267 269611 335083 273386
37400 273386 297287 516971 786018 908597 832580 618263 347393 78049 -185908 -442602
37390 -442602 -563847 -353172 161618 655029 877374 931410 992938 971082 729712 456147
37380 456147 437812 585056 576499 419277 429117 643584 716861 504548 310165 360265 434787
37369 434787 277022 27774 -66090 -118756 -434419 -1009154 -1499631 -1618318 -1349855 -858639
37359 -858639 -364367 -26964 193029 464401 777417 887529 710868 546303 663125 867146
37349 867146 789128 477019 360140 666586 1187763 1611669 1783524 1615784 1075651 389015
37339 389015 -20109 7682 133344 -66813 -567935 -956803 -952144 -670550 -373370 -138435
37329 -138435 111600 367315 488168 407383 238343 105257 -19435 -202309 -377290 -445229
37319 -445229 -474586 -607273 -794619 -843026 -725802 -617017 -581643 -485087 -283876 -139737
37309 -139737 -124682 -76540 94331 215604 165873 122030 254396 410577 384398 296733 395372
37298 395372 628496 722439 553518 161364 -438022 -1123766 -1532690 -1456729 -1256310 -1437909
37288 -1437909 -1893070 -2033089 -1676310 -1309364 -1381838 -1794774 -2213311 -2451741 -2381166 -1874831
37278 -1874831 -1087105 -462347 -244453 -244385 -238852 -269939 -378209 -398488 -255844 -143900 -174228
37267 -174228 -168642 -38642 -19996 -241697 -420405 -333166 -244567 -439954 -645022 -409107
37257 -409107 162940 591216 775689 1019951 1376060 1525707 1347054 1098000 951178 787034
37247 787034 531707 271252 -57203 -629040 -1241897 -1330509 -721651 13427 239419 -37730
37237 -37730 -414937 -696866 -896253 -906507 -620786 -270008 -250909 -626799 -1084772 -1360103
37227 -1360103 -1429020 -1311187 -1003136 -674319 -633655 -928232 -1160101 -908099 -266010 213763
37217 213763 129982 -330835 -625077 -445792 13380 367103 462564 403948 275577 40335
37207 40335 -283169 -530882 -578332 -519353 -574369 -861155 -1285323 -1608757 -1632772 -1391184
37197 -1391184 -1140861 -1060659 -1016403 -802496 -570088 -723690 -1307842 -1788695 -1655608 -1045059
37187 -1045059 -536122 -461640 -658089 -806304 -771804 -626417 -533388 -618869 -815543 -858420
37177 -858420 -575721 -148471 62293 -90646 -454103 -812795 -1039281 -1065021 -917682 -784005
37167 -784005 -840096 -1005021 -1034760 -855756 -613176 -389850 -106230 248375 496448 469871
37157 469871 173169 -283815 -731816 -907565 -637716 -151755 43085 -259607 -736269 -1014704
37147 -1014704 -1111103 -1179731 -1113661 -736015 -217002 72581 64852 26457 113493 208117 210861
37136 210861 195288 215778 222010 222973 287871 330388 163896 -142039 -243728 948 306687
37125 306687 385740 341142 405761 514620 428328 136179 -161334 -386193 -616220 -836550
37115 -836550 -934094 -920705 -893931 -776760 -384503 195487 575168 540640 331500 312615
37105 312615 563967 934268 1294322 1536970 1492549 1102612 607149 319523 232014 65008
37095 65008 -274777 -516758 -412166 -118167 -15625 -211284 -410349 -329786 -100188 -120206
37085 -120206 -535979 -1011685 -1099749 -750574 -328114 -158759 -224400 -326041 -378044 -428687
37075 -428687 -506554 -594027 -703960 -851678 -963985 -920455 -688469 -348010 3913 314623
37065 314623 575394 821130 1077348 1238501 1091284 589142 24711 -251122 -243900 -251780
37055 -251780 -406117 -523996 -471631 -406214 -497568 -617438 -513025 -152965 296901 718397
37045 718397 1039424 1092224 746430 159624 -352892 -689749 -948063 -1047670 -726537 -42454
37035 -42454 459902 355064 -101981 -304362 -34392 417722 759686 968592 1069478 994909
37025 994909 767003 557266 453530 378379 311828 341745 392406 202150 -239987 -522924
37015 -522924 -346830 18871 137613 52919 125940 367615 421653 209843 103088 330118
37005 330118 656622 838071 979437 1189262 1256072 1007365 683615 574965 533024 260678
36995 260678 -105187 -164736 99534 325187 378612 466766 599683 462114 5134 -286314
36985 -286314 2536 672988 1236662 1488081 1484492 1253202 874845 646230 773239 1006977
36975 1006977 924492 495522 55964 -198017 -329798 -314975 13714 578959 966831 895350
36965 895350 529941 186012 -39999 -163346 -72611 318288 781568 913211 583920 86443
36955 86443 -197835 -160542 31494 174623 173179 -10399 -411732 -961907 -1379217 -1361033
36945 -1361033 -985425 -750256 -1007413 -1469649 -1549156 -1131901 -677380 -512406 -423192 -142026
36935 -142026 131487 44250 -318756 -566633 -608790 -711288 -963246 -1098427 -941116 -670674
36925 -670674 -480357 -278855 44889 296530 195580 -192017 -481936 -396780 -2415 427589
36915 427589 624971 446433 -43138 -571443 -840644 -752151 -450455 -197990 -218049 -536620
36905 -536620 -897306 -950708 -644649 -323125 -312971 -534907 -696842 -744772 -854351 -1019456
36895 -1019456 -968459 -593899 -216931 -225162 -555241 -721645 -372041 277140 613813 262458
36885 262458 -469418 -864404 -558676 88748 484842 486256 375253 299835 95613 -323612
36875 -323612 -747464 -962049 -989809 -910714 -703815 -413612 -219752 -170468 -97456 23051
36865 23051 -77136 -476431 -733399 -430679 157422 395094 180172 27962 252390 546516
36855 546516 523203 261419 73730 29773 -10183 -67041 -9953 216594 500293 651009
36845 651009 498579 -1967 -658209 -1111483 -1128653 -809706 -486268 -452860 -755182 -1134662
36835 -1134662 -1220851 -916111 -537170 -401833 -363015 -31332 586004 1041290 1101817 1049238
36825 1049238 1150892 1216414 965146 520832 189368 -26364 -311603 -595823 -615150 -348329
36815 -348329 -32808 221485 488704 694383 578341 81796 -500565 -858019 -946300 -879906
36805 -879906 -780992 -818970 -1151975 -1669954 -1974685 -1795541 -1326432 -997044 -958601 -916455
36795 -916455 -471636 424130 1353142 1773338 1507173 878636 347988 88602 -16062 -93304
36785 -93304 -174374 -284875 -421136 -448616 -234522 100143 267645 193820 102584 148617 180636
36774 180636 9087 -255987 -315843 -61467 301382 487721 413424 250708 236302 406589
36764 406589 540114 414408 71137 -277291 -549905 -837895 -1153153 -1329460 -1227673 -884272
36754 -884272 -405963 128569 606675 885595 944478 903977 830477 659022 375203 124578
36744 124578 55281 170768 390381 615935 700732 531444 199477 -91856 -329417 -660515
36734 -660515 -1012247 -1075331 -826517 -706975 -987574 -1266416 -1001927 -347561 -3959 -307457
36724 -307457 -880142 -1184018 -1040213 -564952 23919 429133 448557 285222 394873 857124
36714 857124 1172471 899147 257492 -161961 -127424 81978 162011 120246 104365 142567
36704 142567 166249 146139 81095 -77045 -359614 -641085 -680530 -395628 -48519 -19340
36694 -19340 -353927 -679622 -690643 -585223 -790535 -1291845 -1535521 -1133602 -431936 -125545
36684 -125545 -402507 -743674 -610471 -92640 280787 224153 -41739 -186415 -177599 -160830
36674 -160830 -116356 111496 480070 706122 643763 504461 565089 803374 967671 881560
36664 881560 522272 -72972 -768663 -1286311 -1432040 -1336820 -1260089 -1198319 -940862 -498520
36654 -498520 -168496 -95791 -63531 134430 375921 466462 481582 582621 650942 434070
36644 434070 17645 -166510 118523 606379 889934 913935 925662 1033164 1043116 786243
36634 786243 419077 231159 218480 69034 -360758 -762259 -755507 -418891 -165364 -121719
36624 -121719 45412 569515 1136621 1241040 832508 349767 167958 242434 296830 162052
36614 162052 -112819 -332767 -291342 41604 417913 505651 239750 -109359 -259752 -215035
36604 -215035 -179980 -277929 -454738 -613333 -729969 -829277 -928729 -1045632 -1204954 -1379784
36594 -1379784 -1436912 -1209713 -669836 -4095 522733 776295 794631 658769 412341 122170
36584 122170 -90169 -160546 -172468 -256217 -436036 -655638 -910525 -1233374 -1543801 -1642581
36574 -1642581 -1428141 -1046409 -746649 -621110 -549390 -376729 -86088 195529 303965 154325
36564 154325 -189658 -550314 -784633 -896288 -941473 -848098 -474394 87388 428334 233383
36554 233383 -290608 -611203 -499009 -243582 -191226 -309300 -351729 -241375 -68479 133389
36544 133389 342311 371673 39804 -481143 -753967 -566417 -114475 334309 702539 950018
36534 950018 944523 679200 427743 471425 778136 1104684 1291787 1295257 1061694 595906
36524 595906 89095 -220233 -287198 -213758 -34787 247860 466049 378303 22205 -234542
36514 -234542 -110714 256486 508889 489345 329629 180077 28949 -156905 -248166 -68221
36504 -68221 315372 574276 484921 195361 -2908 -58261 -107993 -120746 107210 554143
36494 554143 884409 907734 849755 944797 1003245 691462 96723 -314646 -260432 105534
36484 105534 483203 722612 825226 855586 869445 801623 500129 24529 -245255 -59566
36474 -59566 280687 292068 -4909 -170038 -59662 21947 -68344 -78224 87943 93920 -250743
36463 -250743 -589880 -589455 -522900 -809773 -1256608 -1301927 -860682 -370305 -47594 332552
36453 332552 832038 1058517 723594 107954 -308153 -405694 -356658 -229682 17184 271713
36443 271713 310771 122188 -27117 101288 452885 748508 749397 464072 155203 119267
36433 119267 395799 720083 821302 718968 630337 621088 495196 84173 -469481 -832512
36423 -832512 -844732 -646313 -437664 -246598 -19990 158614 112929 -163250 -441199 -518523
36413 -518523 -429748 -316762 -200864 -12018 222788 374793 397374 390668 452050 553972
36403 553972 614855 631148 686419 838713 1017209 1050303 843770 544955 453318 700342
36393 700342 1069205 1208081 986504 575531 229428 74150 58912 14603 -193158 -461994
36383 -461994 -470177 -50630 500515 688109 395267 -5327 -147310 -46858 107578 294396
36373 294396 583249 880995 997227 904900 735067 550270 316792 78001 -62034 -153050
36363 -153050 -373671 -702137 -816688 -489885 54959 376574 328231 129224 -41446 -262977
36353 -262977 -600480 -854223 -789850 -490049 -235316 -84141 159655 524480 705894 496668
36343 496668 165040 150549 497602 854667 973462 912733 743102 394907 -56312 -256664
36333 -256664 2617 402019 428637 21944 -394578 -514250 -490981 -600853 -816340 -900923
36323 -900923 -773626 -558920 -317687 62857 644302 1226896 1477013 1244795 687224 86295
36313 86295 -365750 -564247 -397609 163065 865626 1261457 1132399 735378 471642 389153
36303 389153 203837 -219667 -646135 -790805 -660572 -463940 -342048 -317429 -365276 -376527
36293 -376527 -166780 292360 724892 820930 611980 394853 319556 267304 153306 132403
36283 132403 407967 966178 1569513 1923125 1841651 1391337 890250 625077 550617 418108
36273 418108 175200 5482 -29367 -70047 -103092 106418 530099 700658 350291 -90598
36263 -90598 -55517 336447 518747 390067 424146 872794 1413252 1695995 1737288 1613024
36253 1613024 1272291 890395 901263 1325594 1503244 927577 -2192 -528998 -541551 -498789
36243 -498789 -571275 -482558 -170797 -742 -165622 -340059 -141624 380160 892001 1156801
36233 1156801 1116724 821261 424201 106282 -81078 -180288 -167257 -22939 92299 15048
36223 15048 -102519 17848 278360 289568 13736 -124408 73350 237525 49288 -213536
36213 -213536 -110776 309390 694205 958805 1245416 1501656 1547605 1459521 1468939 1542394
36203 1542394 1460988 1276095 1266882 1419306 1348447 832697 94079 -539031 -932546 -1027177
36193 -1027177 -762558 -277619 103787 261777 406132 657297 783538 587800 313088
36184 313088 357223 722459 1051285 1147948 1173775 1304454 1450463 1431034 1264162 1127721
36174 1127721 1079496 963251 658954 340214 327099 652426 946365 888069 622544 503393
36164 503393 529212 362260 -85757 -447035 -409065 -109986 188037 527938 1052345 1578518
36154 1578518 1754017 1561992 1328292 1235173 1146134 945414 731110 567953 340731 22589
36144 22589 -155922 -28593 197301 211393 64843 79850 333090 529998 449418 225915
36134 225915 43962 -184999 -579610 -903293 -778647 -258313 178878 293465 406216 847250
36124 847250 1376390 1483141 1107200 704902 643508 854624 1096500 1240245 1222890 1004238
36114 1004238 693433 498926 458910 436107 436263 638739 993952 1120095 813456 364894
36104 364894 108936 -50058 -325166 -527433 -310399 204660 521643 467070 357008 425011
36094 425011 508041 431653 337045 423613 631257 767432 753281 607398 384404 253492
36084 253492 430868 893224 1332728 1500595 1402685 1086063 525725 -111297 -394251 -104147
36074 -104147 418181 675675 609956 527718 588452 674830 677235 596482 408164 113804 -92042
36063 -92042 21835 399386 774873 1053588 1338775 1582879 1539634 1155902 729964 551233
36053 551233 615434 814090 1150742 1585970 1883880 1851343 1611135 1431008 1359487 1208029
36043 1208029 838305 321685 -129186 -265333 64535 707203 1190052 1115368 589455 112736
36033 112736 21166 167089 186658 -43696 -297757 -281162 59214 514834 870045 1117456
36023 1117456 1354839 1509387 1335776 772526 145466 -151959 -87524 87853 266331 567465
36013 567465 984678 1241458 1152071 915888 846033 935746 926643 754284 677731 904973 1268786
36002 1268786 1398738 1143712 729142 516371 659439 986637 1183315 1088815 824729 640163
35992 640163 661665 821701 992612 1117595 1210733 1300016 1393260 1446864 1354176 1034736 576268
35981 576268 234587 237983 600195 1115589 1473221 1390887 794961 -23794 -540123 -444431
35971 -444431 46560 431214 440572 205857 -24611 -139701 -123496 33311 276386 479504
35961 479504 601884 754127 1016248 1293938 1458148 1524537 1567814 1544472 1351876 1018937
35951 1018937 695636 468375 302842 160792 75482 116531 335959 689800 945198 781795
35941 781795 136566 -629104 -1065629 -1065776 -800559 -365582 207808 648989 556491 -56213
35931 -56213 -630863 -677155 -297426 80328 272219 397701 522063 515102 239262 -288266
35921 -288266 -878819 -1214192 -1035814 -455990 45112 127347 -19129 -919 198645 265130
35911 265130 106055 5178 178767 495613 757075 988323 1279141 1529749 1548478 1300041
35901 1300041 919056 563740 362101 398933 620980 815121 805833 660214 617918 818574
35891 818574 1133394 1267267 1047407 637785 401988 479314 602044 486666 284994 370947
35881 370947 734497 955281 839566 677513 679561 572693 110289 -354927 -301032 140823
35871 140823 336344 91714 -96051 153935 561486 706448 670744 786157 1030046 1100740
35861 1100740 950888 823096 781611 604386 223284 -66094 -8766 231161 302583 133351
35851 133351 -37525 -10488 189923 459220 757447 1060701 1293955 1390580 1364262 1276834
35841 1276834 1181226 1129594 1176202 1299835 1344312 1117068 590752 -9547 -354425 -271944
35831 -271944 123296 561638 877354 1116170 1380488 1634266 1752185 1748531 1830202 2148244
35821 2148244 2572709 2805831 2679161 2260222 1719100 1214161 896318 874160 1099758 1368750
35811 1368750 1504078 1500331 1453844 1413564 1354381 1247120 1089883 887073 630558 282364
35801 282364 -217174 -841709 -1354039 -1417242 -954036 -326374 -1952 -46201 -88694 181015
35791 181015 640132 940007 946258 809436 667595 493335 285320 221798 465946 900905
35781 900905 1221865 1273071 1146932 953380 678897 349149 148761 208696 374011 375342
35771 375342 202394 127826 345022 741426 1074301 1229384 1239699 1175776 1118396 1160350
35761 1160350 1332343 1558444 1750733 1920462 2143640 2438208 2722865 2907496 3018316
35752 3018316 3206429 3558940 3884787 3830179 3332255 2821687 2745413 2966148 2941005 2505132
35742 2505132 2115738 2172298 2440749 2434871 2117016 1860902 1852453 1908679 1877447 1865704 1981713
35731 1981713 2117382 2113438 1958461 1721548 1451401 1246517 1262890 1498638 1676624 1513892
35721 1513892 1077948 729364 698225 849846 937894 974526 1177414 1543217 1676513 1218880
35711 1218880 367414 -240556 -168002 467935 1275963 1978677 2437816 2554831 2364937 2098664
35701 2098664 1961028 1932080 1914123 1947364 2121986 2396205 2659964 2855636 2885576 2569724
35691 2569724 1904441 1214076 819687 697010 678765 797553 1132426 1508457 1718005 1885211
35681 1885211 2198737 2425022 2189115 1670684 1451293 1625089 1653774 1277012 997530 1354258
35671 1354258 2167620 2848897 3096144 2961169 2573802 2161749 2059875 2332790 2601490
35662 2601490 2549879 2366446 2378328 2519403 2536876 2490308 2620663 2887610 3066058 3196975
35652 3196975 3522301 4023696 4420743 4615510 4777233 4978196 5091257 5088968 5126099 5249450
35642 5249450 5295008 5170331 5036638 5120929 5474134 5945681 6301721 6402097 6359492 6449857
35632 6449857 6775857 7157402 7456345 7780196 8181107 8428143 8376783 8322136 8618448 9147968
35622 9147968 9572794 9932542 10519206 11284170 11899187 12376413 13093937 14143853 15145562
35613 15145562 15823201 16348236 17006978 17923965 19186128 20814797 22529473 23979654 25302208
35604 25302208 26984262 29091448 31195894 33247627 35902576 39646661 44127141 48752156
35596 48752156 53481289 58591770 64117217 70041118 76693196 84418410 93133788 102734004
35588 102734004 113669296 126548191 141351047 157592626 175085896 193908300 213664266
35581 213664266 233384738 252137625 269082667 282838796 291542402 293985961 290373191
35574 290373191 281729198 268990022 252984117 234877396 216058518 197590029 180038061
35567 180038061 163738818 148927178 135625897 123688189 113029781 103665882 95479248
35560 95479248 88117920 81245478 74825124 69033425 63900290 59176816 54659059 50541351
35552 50541351 47242020 44835536 42826954 40600435 37992559 35335774 33042799 31246944
35544 31246944 29743682 28168111 26320059 24422230 22955162 22122682 21596231 20916472
35536 20916472 20011775 19148683 18500395 17988072 17472095 16870181 16113444 15191677 14246827
35527 14246827 13464679 12881172 12414339 12023412 11685136 11291291 10766763 10247943 9948024
35518 9948024 9861583 9781154 9594636 9392127 9271145 9186840 9020857 8712811 8339977 8108212
35508 8108212 8159379 8323568 8230800 7776483 7260234 6906048 6525363 5928743 5386049 5264089
35498 5264089 5398761 5304988 4919470 4639131 4629802 4604357 4384296 4210271 4302034 4486814
35488 4486814 4494562 4358440 4329092 4570917 5034418 5442890 5398900 4769316 3974887 3597424
35478 3597424 3691952 3818896 3735836 3622716 3583025 3427404 3108937 2894515 2886112 2814239
35468 2814239 2546395 2369288 2505010 2775712 3021495 3383233 3833381 3919697 3429056 2867519
35458 2867519 2754232 2815936 2476037 1847572 1587654 1925094 2452708 2806087 2968640 2934505
35448 2934505 2634479 2250884 2127037 2291064 2454635 2483536 2471042 2379846 2069194 1689964
35438 1689964 1597866 1832337 2108386 2336457 2673787 3026322 3034775 2678058 2373200 2307410
35428 2307410 2183571 1845621 1635233 1817262 2118710 2203812 2191525 2288654 2278961 1873927
35418 1873927 1331458 1220417 1669514 2267898 2652142 2820095 2889657 2895060 2869084 2873523
35408 2873523 2891350 2841140 2688836 2426113 2026148 1584135 1397269 1685949 2277913 2752578
35398 2752578 2863382 2676316 2385519 2186856 2253444 2594098 2937512 2956297 2630049 2240066
35388 2240066 2010439 1911504 1827698 1761929 1810387 2011770 2258892 2345052 2141697 1761964
35378 1761964 1467480 1366107 1314243 1183595 1067345 1090959 1167580 1126700 984922 898381
35368 898381 914671 949750 958385 972693 1032031 1203307 1555519 1957197 2067422 1772361 1464233
35357 1464233 1541243 1742703 1429148 547551 -161141 -107093 408525 706335 662109 706176
35347 706176 1039986 1323358 1234695 994035 1085655 1605420 2133052 2261762 2047776 1804491
35337 1804491 1594913 1192671 568241 116839 191512 601363 860139 837568 850104 1126254
35327 1126254 1515901 1796350 1952353 2022936 1950538 1747030 1553389 1348117 862041 38892
35317 38892 -658856 -742944 -350737 -48989 -68903 -113150 76597 352636 488852 558805
35307 558805 776291 1143734 1448689 1505376 1271833 829247 359276 50122 -79192 -180480
35297 -180480 -321135 -337426 -65153 367463 628927 553295 313726 223016 428884 809404
35287 809404 1121455 1232776 1200531 1123468 996465 802897 667616 720349 814688 630157
35277 630157 142972 -245279 -216351 29521 64872 -193916 -450086 -443269 -139887 406240
35267 406240 1089111 1670286 1945960 2010799 2107596 2219684 2098189 1712599 1350007 1188262
35257 1188262 1096036 977662 978287 1158176 1286272 1210755 1152046 1333130 1566784 1545321 1330763
35246 1330763 1178898 1039146 663385 142804 -114572 13261 181540 115867 -7884 108254
35236 108254 423958 618767 485292 152800 -13963 252828 787352 1077888 885193 643238
35226 643238 921572 1575718 1869424 1477570 893832 673308 718505 604627 249357 -95710
35216 -95710 -267864 -266073 -92237 166824 267819 125253 35347 268152 586469 532259
35206 532259 102851 -226923 -133395 246129 642327 958701 1168349 1183979 967136 618813
35196 618813 297408 155834 337827 870212 1554867 2102717 2351044 2247697 1763452 1047944
35186 1047944 551527 662974 1221425 1665067 1683178 1462770 1285100 1183860 1077478 963096
35176 963096 864762 801081 880166 1209871 1650510 1891659 1844710 1711410 1589994 1309699
35166 1309699 805159 383010 407602 906891 1648508 2403240 2962981 3116724 2850983 2452386
35156 2452386 2224176 2205280 2293868 2474449 2752205 3031998 3256245 3505883 3762299 3737973
35146 3737973 3205229 2382127 1721989 1378573 1134835 836371 638245 764404 1195657
35137 1195657 1672760 1933383 1921486 1795750 1718882 1667003 1548854 1452000 1517662 1551561
35127 1551561 1120883 224706 -477124 -419850 137616 491292 388640 155543 96049 211389
35117 211389 435422 700702 784514 519091 176749 223772 641215 917532 799854 608599
35107 608599 661895 829813 877191 841966 798441 599042 165095 -245114 -354651 -213942
35097 -213942 13227 307170 548719 370322 -322691 -952634 -889967 -311391 63425 -17859
35087 -17859 -143226 -33260 64084 -61977 -160723 29027 289123 243061 -76797 -322237
35077 -322237 -338426 -273463 -263944 -280916 -254323 -129064 177206 658870 1066765 1089497 759573
35066 759573 501081 650902 1037219 1165443 774340 77454 -535296 -872257 -936964 -716220
35056 -716220 -211530 322381 435449 -57837 -828241 -1421242 -1771103 -2095447 -2370831 -2247662
35046 -2247662 -1559598 -635286 58316 382341 459173 322051 -97970 -674520 -1024521 -849737
35036 -849737 -261265 296530 440356 181136 -122491 -167611 -36212 -28899 -200994 -261527
35026 -261527 -2946 386994 612549 684794 803365 949411 906557 665353 493155 528451
35016 528451 576986 441116 228196 165372 280528 448151 617719 800447 922566 900702
35006 900702 824973 871798 1028972 1078778 898064 647468 604248 877994 1310439 1589293
34996 1589293 1473848 1008861 518015 282349 231187 89572 -165055 -207866 157515 629095
34986 629095 743440 478874 243930 274946 365441 320351 361267 767967 1303809 1424513
34976 1424513 1066654 793910 977146 1220772 955431 320869 -24470 132036 313839
34967 313839 144235 -147044 -251199 -353582 -764803 -1279580 -1397135 -1070629 -784430 -879082
34957 -879082 -1176660 -1326110 -1193219 -840868 -423184 -183221 -280309 -533091 -588999 -403016
34947 -403016 -252139 -228044 -111306 106854 24352 -548075 -1141172 -1206868 -871204 -680927
34937 -680927 -804991 -944590 -895475 -712718 -380691 176763 728176 855891 542543 201060
34927 201060 9221 -321324 -920839 -1372821 -1266920 -775376 -325679 -1278 341440 602743
34917 602743 538445 219400 -22171 -78120 -142853 -305803 -391626 -259046 -8046 149495
34907 149495 33784 -437375 -1067151 -1322169 -807559 168814 855946 954146 875767 992268
34897 992268 1077197 820546 517275 738300 1459815 2009480 1897770 1298414 629496 57407
34887 57407 -386930 -538075 -285716 101807 166209 -211977 -681530 -851531 -689661 -439809
34877 -439809 -291955 -240178 -190502 -96308 13184 87841 138096 269864 595512 1075402
34867 1075402 1489602 1622956 1464648 1190651 981216 900981 912086 920326 827017 627742
34857 627742 457868 444945 517118 484366 337651 310569 550109 869680 979709 860176
34847 860176 725339 692585 699245 710257 748789 687644 303970 -309482 -652219 -396795 104235
34836 104235 202096 -230139 -695851 -804339 -735294 -812515 -935778 -756239 -260996 167239
34826 167239 267569 181368 149956 197967 263615 428873 784436 1153540 1183043 737801
34816 737801 65994 -455935 -645982 -587924 -508589 -619194 -959107 -1323181 -1423422 -1196942
34806 -1196942 -894034 -791154 -878599 -927496 -821324 -686015 -664801 -684186 -541487 -184756
34796 -184756 185598 303959 76942 -357173 -723688 -745290 -300284 425131 981392 1002974
34786 1002974 560914 84110 -96528 -29437 45811 7340 -124164 -324255 -571286 -799632
34776 -799632 -992310 -1237821 -1544475 -1708264 -1575440 -1335005 -1270274 -1284519 -1034986 -561876
34766 -561876 -358509 -636358 -915927 -670157 -86120 207866 6215 -293583 -317475 -135365
34756 -135365 -19892 -108034 -379403 -704876 -834543 -583764 -135678 62202 -171862 -516877
34746 -516877 -579877 -393584 -302601 -450496 -573859 -328808 272230 807334 852116 432759
34736 432759 -9731 -143466 -80595 -60823 -4640 310660 734225 808309 410714 -41855
34726 -41855 -171637 -85316 -63711 -146009 -283667 -597038 -1120016 -1506987 -1399897 -984325
34716 -984325 -795630 -1002353 -1236678 -1154933 -833151 -531432 -354987 -267952 -225204 -173180
34706 -173180 -78677 -31708 -168631 -444601 -645115 -664369 -596660 -516813 -380836 -210685
34696 -210685 -149778 -220918 -242445 -127540 -60232 -193332 -363796 -337737 -179526 -98373 -34660
34685 -34660 261144 728031 911803 526865 -143893 -611050 -780740 -961149 -1339970 -1715247
34675 -1715247 -1804131 -1613003 -1351380 -1093473 -718263 -174991 374239 752992 983856 1189641
34665 1189641 1360425 1353028 1098076 688766 264451 -87768 -308556 -357054 -265326 -118141
34655 -118141 51353 259588 439394 423755 141962 -249400 -522462 -607858 -576357 -447773
34645 -447773 -164061 219040 440326 247828 -312586 -907798 -1232429 -1242680 -1052798 -723078
34635 -723078 -291500 57346 91315 -144260 -323497 -293283 -313173 -631418 -1026776 -1103070
34625 -1103070 -924648 -950231 -1315338 -1590745 -1389033 -848668 -324344 56614 264928 126704
34615 126704 -406441 -954158 -1083195 -878882 -765682 -849349 -856402 -699838 -639293 -779658
34605 -779658 -842657 -635555 -385593 -354583 -416829 -314678 -105301 -27444 -71713 -17157 165860
34594 165860 257805 152147 37882 167493 582336 1066120 1262028 922312 218231 -288410
34584 -288410 -213723 177058 332420 173225 111881 301085 343888 -20420 -369620 -146172
34574 -146172 508768 932872 841788 586362 505953 480690 270755 -77318 -391252 -658420
34564 -658420 -894818 -939746 -664019 -256974 -36294 -37737 -30731 111488 304950 498005
34554 498005 754292 1033844 1125443 925736 635508 543486 695171 880136 902295 785490
34544 785490 723359 854353 1083368 1156794 948210 604209 334728 153737 -39071 -223485
34534 -223485 -324315 -450418 -780222 -1181382 -1254789 -885085 -470138 -405824 -568845 -556281
34524 -556281 -277912 -40577 -117183 -461475 -818740 -945799 -762755 -434495 -245286 -269447
34514 -269447 -270967 -69402 150671 106596 -156131 -379668 -525947 -778243 -1168726 -1529265
34504 -1529265 -1788492 -1978690 -1949936 -1467437 -676651 -91826 30550 -29924 32577 117489
34494 117489 29409 -108405 -63779 127112 301689 474055 676742 711025 436264 152858
34484 152858 268340 649263 742129 356703 -93407 -224536 -161047 -207704 -387535 -553324
34474 -553324 -705752 -909489 -1027452 -811853 -237713 431570 911454 1127856 1206227 1304289
34464 1304289 1430862 1409952 1102906 674439 483894 641740 846241 796899 609488 610855
34454 610855 824214 923959 715630 428312 427568 770342 1139219 1148055 673120 -29858 -501611
34443 -501611 -480100 -184765 -96369 -391242 -733382 -746624 -536740 -512986 -771235 -964433
34433 -964433 -840350 -592903 -486822 -396287 -41911 443434 572164 165681 -371330 -573535
34423 -573535 -441108 -256290 -106538 134776 469567 703120 710621 568046 398663 256657
34413 256657 182408 212324 285844 267241 111421 -78476 -181693 -164995 -54910 96965
34403 96965 214549 261235 306130 425674 545551 500671 256806 -53075 -318466 -534341
34393 -534341 -677746 -665785 -494979 -282040 -108630 35950 110697 -144 -273213 -483573
34383 -483573 -485129 -397168 -367953 -321597 -143903 25310 -34455 -210363 -115024 374319 874792
34372 874792 937046 586820 282107 388118 815646 1186277 1275760 1220397 1261184 1362720
34362 1362720 1246265 841713 505928 599400 968979 1118913 867641 535224 413051 371318
34352 371318 201192 72872 297056 744571 907100 600747 258048 332450 683832 829575
34342 829575 623995 344002 169598 -24980 -278246 -323350 -14821 298087 167861 -318217
34332 -318217 -661631 -671338 -686765 -1004916 -1423522 -1541581 -1278255 -887045 -619465 -563284
34322 -563284 -671702 -761837 -607165 -223736 50215 -40802 -304937 -373830 -217361 -89254
34312 -89254 -35885 162431 513497 659848 387405 -9730 -124792 7376 34726 -151649
34302 -151649 -281015 -120291 225219 500525 618292 691173 846411 1094526 1338589 1466127
34292 1466127 1459473 1421725 1435158 1386697 1039188 361253 -285281 -438004 -49672 406089
34282 406089 439035 83014 -186654 -39295 366630 656121 691446 645727 736488 1020088
34272 1020088 1383426 1611469 1520697 1166514 875122 913703 1152900 1225727 1015630 789096
34262 789096 795107 926479 890122 578512 157816 -116637 -81572 236116 602150 741751
34252 741751 618691 468381 475244 533629 450560 268378 198122 281366 317393 155377 -92503
34241 -92503 -192512 -55416 183936 293780 135728 -202097 -437591 -325497 100105 540538
34231 540538 710741 585545 367855 246292 214606 138939 -20196 -126904 -70646 21891
34221 21891 -79326 -368579 -580330 -558515 -439862 -332112 -37326 621159 1324007 1476440
34211 1476440 944033 252634 -61700 -26424 7787 -90939 -213889 -353639 -609956 -874269
34201 -874269 -838990 -429254 3975 63328 -271019 -717070 -1050954 -1239927 -1315363 -1287174
34191 -1287174 -1158441 -906388 -494369 -25688 184450 -115901 -766363 -1301424 -1437456
34182 -1437456 -1281316 -1027997 -690676 -265773 45111 13152 -296963 -569154 -558205 -251987
34172 -251987 184587 467124 311153 -271374 -847022 -966019 -674737 -406003 -389855 -439642
34162 -439642 -337107 -135202 17353 105434 185855 299942 534838 955618 1394051 1547330
34152 1547330 1380040 1154401 955775 539874 -139870 -620503 -488268 22785 367031
34143 367031 406894 396171 424161 338600 151083 79548 190146 371963 633661 1018301
34133 1018301 1254617 978908 367286 48714 232317 400544 109957 -354176 -463814
34124 -463814 -223728 -54248 -137908 -285848 -321048 -239302 -63930 156758 255733 115949
34114 115949 -94138 -77922 211699 527650 630539 493185 270563 205875 468831 920606
34104 920606 1135255 839173 257956 -129889 -86960 282520 759280 1103345 1078483 702713
34094 702713 403354 589210 1071936 1235883 828598 265176 38708 122735 150459 -23486
34084 -23486 -180089 -78588 245256 540202 617172 534827 497960 576030 611693 479831 323473
34073 323473 375035 616061 803113 794852 660690 492758 325837 237567 290165 344037 178200
34062 178200 -133866 -214141 138216 666022 982343 985960 816589 600293 425105 404555
34052 404555 544586 641945 516669 292799 274683 572309 989953 1265829 1305028 1187123
34042 1187123 1029917 842328 496988 -73070 -641093 -820452 -532201 -175812 -180331 -524948
34032 -524948 -882077 -1084867 -1191504 -1179341 -910605 -450934 -132255 -158696 -347854 -415157
34022 -415157 -360802 -393854 -570349 -719198 -729118 -718978 -821859 -908141 -684936 -91147 536644
34011 536644 800084 683917 534715 611652 829047 1001635 1150365 1381724 1575237 1437581
34001 1437581 889646 210470 -270138 -478541 -525286 -474087 -320920 -123872 4238 38656
33991 38656 71590 174573 308693 399179 433013 446005 470105 533282 643729 709447 556453
33980 556453 159546 -193170 -160363 195954 423990 257467 -42874 -124733 -119141 -447512
33970 -447512 -1135760 -1702731 -1785373 -1522971 -1195256 -827228 -377702 -14909 116688 199035
33960 199035 460823 723637 599984 107199 -284545 -276523 -98309 -123631 -385616 -633305
33950 -633305 -693197 -614065 -554756 -643654 -876669 -1087129 -1095463 -924091 -756894 -656684 -472379
33939 -472379 -102221 298729 504721 521594 559954 728796 868746 731073 294757 -140411
33929 -140411 -245797 -69791 -33963 -409547 -911935 -1021046 -640874 -174324 60946 174359
33919 174359 350568 475225 361057 134775 98897 303619 527967 645517 745682 868632
33909 868632 859572 589876 172512 -157967 -305666 -361904 -422442 -432816 -257036 101645
33899 101645 407087 400485 96021 -236367 -396850 -434607 -462174 -463419 -406956 -404879 -581614
33888 -581614 -861273 -1042408 -1024354 -823129 -453790 19078 382320 443993 287292 153576
33878 153576 81022 -114197 -468106 -732483 -728985 -643824 -795157 -1208770 -1580984 -1624871
33868 -1624871 -1348486 -1016188 -913091 -1130399 -1515937 -1813013 -1849024 -1604003 -1171487 -722737
33858 -722737 -445001 -394439 -429041 -387428 -291545 -251645 -248537 -214185 -279829 -655558 -1209244
33847 -1209244 -1468737 -1210316 -803765 -755036 -1086679 -1404728 -1429299 -1190703 -803814 -355815
33837 -355815 -1721 123347 142935 338039 716064 909951 650244 154609 -137122 -96936
33827 -96936 22906 -1421 -98985 -76992 109468 347989 521267 569215 472926 292736 175882
33816 175882 185201 135316 -214683 -748538 -988201 -681083 -224816 -221782 -665378 -898021
33806 -898021 -459933 309470 688401 374970 -326137 -936227 -1157572 -890398 -200166 649691
33796 649691 1290167 1479192 1245697 833806 512888 346211 113162 -402060 -1001773 -1180322
33786 -1180322 -778265 -284829 -242874 -565272 -755735 -618565 -344354 -23210 419589 802504
33776 802504 747579 318759 101646 376597 645766 344896 -321319 -686224 -535740 -272407
33766 -272407 -280428 -537196 -823501 -967291 -874312 -615545 -490711 -733977 -1155797 -1335960
33756 -1335960 -1156669 -865487 -634345 -402804 -197148 -212933 -417795 -421438 -5552 461493
33746 461493 437332 -105615 -679745 -895996 -818693 -716391 -690636 -627523 -385909 43198
33736 43198 508335 790916 758067 444302 -2782 -411756 -626691 -570494 -359183 -284875
33726 -284875 -551804 -1007935 -1225968 -912055 -218979 382948 553241 371797 162943 88979
33716 88979 34405 -106976 -217390 -155802 -17202 28587 69170 343478 800184 1053723
33706 1053723 882328 519076 291407 185337 -21372 -343249 -549033 -490165 -271176 -93413
33696 -93413 -62603 -154607 -282192 -389348 -492895 -568602 -421596 134546 898716 1314257
33686 1314257 1060586 434161 -61235 -315362 -532028 -719591 -643609 -259933 163792 412437
33676 412437 512166 509886 387944 299650 558174 1194362 1783334 1931552 1729554 1495874
33666 1495874 1270139 857813 275698 -158941 -211781 -403 160939 60858 -264077 -571398
33656 -571398 -615983 -411248 -245261 -326062 -478465 -355901 83975 508592 635602 544251
33646 544251 486178 536101 562962 485193 421782 545545 819983 945238 644148 22215
33636 22215 -450719 -400484 75929 584592 890599 1035050 1060448 877737 492508 157027
33626 157027 117812 295004 364396 131415 -282877 -599111 -612725 -281995 287350 881311
33616 881311 1270256 1357531 1262421 1222878 1374806 1615471 1707148 1529020 1197548 919420
33606 919420 780962 741662 777472 910253 1092475 1180002 1067669 785146 449375 213617
33596 213617 251207 615083 1048695 1127133 734484 246711 54565 55046 -118686 -476699
33586 -476699 -660230 -574108 -611419 -1036588 -1492973 -1476868 -1087875 -884883 -1062368 -1215414
33576 -1215414 -1015905 -710537 -693327 -878168 -853391 -529608 -259195 -287889 -421522 -394791
33566 -394791 -326873 -546485 -1050776 -1416797 -1322411 -953662 -735781 -775605 -794074 -612216
33556 -612216 -456173 -619256 -974538 -1066980 -677009 -84266 271221 208004 -175666 -687039
33546 -687039 -1094590 -1168461 -884464 -512860 -310456 -188125 102839 508664 682861 497544
33536 497544 245336 182262 135291 -178427 -617605 -730895 -369288 124380 395676 468219
33526 468219 513458 479415 206613 -209464 -466781 -477442 -485478 -678368 -900332 -910230 -759784
33515 -759784 -700986 -807733 -926751 -980977 -1069979 -1215123 -1243217 -1049535 -783370 -609513
33505 -609513 -444843 -131214 246374 440954 382206 211583 9053 -280667 -629010 -856788
33495 -856788 -858608 -715848 -519202 -256601 39954 224504 253322 326832 646409 1101339
33485 1101339 1338295 1112277 491514 -219027 -672859 -680598 -338876 48551 235337 195579
33475 195579 29008 -176311 -336172 -367197 -302563 -302745 -432217 -524593 -402318 -141831 28517
33464 28517 27137 -35455 -58129 -45532 -40546 -102158 -309367 -630638 -814489 -577823 76510
33453 76510 843021 1397234 1583765 1390814 943548 531343 435232 647492 889647 948868
33443 948868 862779 750583 648196 587505 642787 740251 568142 -92792 -967882 -1422341
33433 -1422341 -1092781 -299552 264430 232199 -129607 -310409 -131624 168343 327937 323204
33423 323204 212484 -22441 -307983 -347324 64806 654093 857450 441660 -246617 -677221
33413 -677221 -630456 -285838 11973 28331 -192718 -388945 -367418 -180919 59321 382640
33403 382640 750885 813116 246496 -672898 -1225071 -1051587 -472107 64158 431998 591838
33393 591838 367283 -210267 -689774 -719718 -525099 -497650 -563935 -401371 -83905 9166
33383 9166 -141828 -146574 134366 355303 238106 -57383 -283941 -451901 -610725 -620725
33373 -620725 -409440 -192627 -157103 -136121 95201 363213 276036 -201189 -668216 -798107
33363 -798107 -652509 -444255 -245246 -43292 124631 266194 516463 925297 1230083 1059961
33353 1059961 402186 -302443 -609232 -492972 -237118 -36800 121338 261543 320927 276916
33343 276916 196705 107901 -13426 -59456 202712 782751 1279618 1264737 803041 400911
33333 400911 435181 780600 1014162 865898 442605 89747 54374 254316 408859 399541
33323 399541 379220 468410 524112 368297 90628 -97031 -191770 -321291 -405473 -206705
33313 -206705 256614 627465 622215 303471 -125550 -563354 -936205 -1097366 -969194 -669979
33303 -669979 -379829 -163413 16347 217816 495253 830605 1071520 1091379 1015876 1079554
33293 1079554 1230443 1149268 761087 432671 457613 587667 344440 -354119 -1136127 -1635186
33283 -1635186 -1755209 -1558387 -1172492 -825968 -742002 -909680 -1077830 -1026978 -778443 -526668
33273 -526668 -432175 -492238 -584161 -632257 -694511 -815061 -861494 -690612 -449351 -443663 -646308
33262 -646308 -641269 -222349 252470 361042 208598 181563 307543 269230 -26635 -306918
33252 -306918 -380980 -371544 -416615 -443609 -354541 -202183 -77544 -7784 -28847 -167849 -301361
33241 -301361 -231906 41635 334144 594124 962737 1427875 1691539 1554152 1213405 969396
33231 969396 789967 401363 -273628 -994015 -1508209 -1797621 -1956916 -1955008 -1637619 -974512
33221 -974512 -204162 380906 760325 1120681 1440341 1417831 997008 675659 932656 1533803
33211 1533803 1845100 1725592 1587163 1585229 1379166 876946 593727 893918 1383862 1515763
33201 1515763 1363764 1269581 1102157 544335 -109576 -193073 304916 639806 361210 -144408
33191 -144408 -346199 -223151 54114 547615 1228194 1630134 1332186 579896 10891 -95671
33181 -95671 62617 277954 502686 644492 625305 652342 1029595 1627704 1912851 1634670
33171 1634670 1149348 874185 729805 392473 -131420 -515268 -589546 -494258 -376307 -219044
33161 -219044 -15101 142033 237075 402469 680057 869344 762989 422224 66842 -214908
33151 -214908 -467184 -636440 -563513 -251414 34727 43613 -172544 -331372 -233507 66688
33141 66688 375749 582752 738674 907077 972240 712153 129674 -420354 -605126 -537458
33131 -537458 -608039 -928652 -1205485 -1187439 -935018 -551029 6438 625565 889277 576435
33121 576435 91046 -7648 239219 329033 104259 -66962 51746 220534 196761 123889
33111 123889 216657 414151 590002 770722 874372 584349 -150996 -794292 -830075 -471714
33101 -471714 -289700 -332894 -191483 158201 242112 -66169 -232427 108874 549777 546343
33091 546343 240281 146030 304836 304570 18374 -219777 -201304 -134987 -237530 -414867 -505922
33080 -505922 -522187 -467290 -207659 249894 581191 509066 202182 62918 212649 425479
33070 425479 512658 520446 529537 477141 270429 -38037 -261869 -228502 73447 429249 520037
33059 520037 215487 -269495 -597221 -642518 -499916 -239840 140202 540287 771921 809793
33049 809793 815846 817374 584790 -1403 -651474 -967941 -934005 -857799 -895810 -904414 -777971
33038 -777971 -657562 -683944 -749165 -668936 -480675 -378525 -394209 -335029 -94070 122593
33028 122593 19152 -376197 -680082 -607064 -320890 -170147 -156908 60085 578078 965283
33018 965283 783132 184806 -297116 -425731 -386922 -322240 -159030 24218 -107453 -641184
33008 -641184 -1103313 -943934 -171126 721508 1294161 1411118 1148732 751913 564667 711916
32998 711916 924899 934029 905129 1151682 1520698 1506826 1012637 565559 628406 1042226
32988 1042226 1330146 1248978 852067 302506 -142908 -219263 25983 209256 129584 66763
32978 66763 303820 628071 667713 491484 425547 421836 116065 -513107 -1046371 -1246959
32968 -1246959 -1293984 -1263020 -888408 -137335 407341 165164 -672936 -1382934 -1572980 -1453613
32958 -1453613 -1338948 -1258066 -1100568 -857892 -615921 -463394 -453373 -537579 -542130 -335326
32948 -335326 -5312 253668 394062 499740 549737 392987 -3055 -437355 -674787 -659463
32938 -659463 -494844 -313911 -209222 -209624 -288621 -435342 -687962 -1019929 -1248119 -1195513
32928 -1195513 -934694 -721160 -665601 -619153 -432831 -196575 -133130 -328288 -630883 -778830
32918 -778830 -607504 -194211 191719 338507 285411 216600 217748 239532 241726 221200 131972
32907 131972 -44633 -160830 -30133 288451 539635 641582 777074 1035399 1204419 1071952
32897 1071952 743486 485973 400236 414099 477355 600976 794216 1079277 1450274 1725333
32887 1725333 1629583 1172327 728088 538838 367609 -62334 -508243 -511668 -152468 -2594
32877 -2594 -265273 -434208 -31881 680754 1049870 859804 480470 278933 213636 69055
32867 69055 -151633 -243678 -135363 -23844 -91989 -191557 3341 503005 876636 766753
32857 766753 356689 106764 152639 242726 206000 162789 248390 423638 627150 847913
32847 847913 972266 833002 510092 310317 335004 354840 241970 185426 266276 176624
32837 176624 -305401 -853620 -1019606 -920921 -1048393 -1480288 -1751610 -1526125 -986442 -470102
32827 -470102 -80302 200452 305959 182253 -82134 -333203 -432923 -264606 133553 446692
32817 446692 376152 92099 73336 406644 612855 366176 25652 123975 589747 873122
32807 873122 709024 357968 114620 -52812 -287863 -548422 -669835 -583899 -371604 -156965
32797 -156965 29044 311832 824393 1413800 1639342 1254798 579591 137352 4153 -171600
32787 -171600 -530755 -777301 -691023 -476895 -372539 -233713 158537 603053 681838 367624
32777 367624 58341 8304 67957 58927 89769 329461 680761 870128 752165 390699
32767 390699 -65955 -468166 -699729 -742653 -669624 -522547 -280749 856 148373 70409
32757 70409 -93673 -146931 -87852 -80617 -228484 -464866 -601597 -419424 158702 869833
32747 869833 1245915 1132808 922479 1013600 1182975 866303 27482 -692740 -815592 -596298
32737 -596298 -514693 -559626 -396360 -3876 311410 463961 706210 1122898 1375080 1126447
32727 1126447 489273 -127665 -445542 -430339 -133947 368108 923017 1349784 1566272 1603410
32717 1603410 1517915 1353463 1150360 917724 620700 267707 -13747 -82360 19626 59723
32707 59723 -129835 -426849 -529997 -318641 -39491 -63995 -479864 -1008943 -1337512 -1415860
32697 -1415860 -1369932 -1239133 -954996 -539979 -165963 16946 5339 -117003 -249007 -264001
32687 -264001 -74495 219561 360903 210826 -83929 -285205 -333915 -313374 -232530 -26883
32677 -26883 235140 335680 176934 -59141 -128027 -22457 63250 28702 -11200 73778 228473
32666 228473 295028 229315 138112 128965 220477 398696 657525 945699 1158355 1240293 1243994
32655 1243994 1237647 1206415 1087264 846477 486733 57148 -289746 -352582 -92506 290049
32645 290049 597132 860296 1181918 1447308 1425367 1144985 927713 971825 1108781 1090379
32635 1090379 945586 888247 978598 1052393 949819 677468 355316 112676 30429 77817
32625 77817 79048 -170976 -687220 -1201542 -1336009 -910712 -105125 682579 1146321 1264029
32615 1264029 1236002 1289173 1498093 1682609 1499233 814638 26616 -230344 158457 578123
32605 578123 461977 14745 -197206 -128473 -186107 -386680 -256740 284249 590046 182396
32595 182396 -534952 -878711 -778956 -602028 -456664 -238670 -101939 -265171 -470173 -230713
32585 -230713 395684 826478 769362 507476 322507 159869 -9865 -4239 194404 308285
32575 308285 227047 220327 484950 852272 1148332 1448713 1724060 1628485 973219 98293
32565 98293 -547566 -912515 -1127116 -1107933 -760824 -327568 -128167 -134397 -137309 -123386 -126367
32554 -126367 49803 526164 973354 1014324 831114 854894 987967 727781 37657 -517856
32544 -517856 -597357 -483165 -515504 -655964 -800244 -1002988 -1138259 -838091 -103926 465560
32534 465560 448131 214931 336118 697943 726726 287532 -179341 -359816 -416378 -576934
32524 -576934 -749299 -665723 -190927 556303 1208410 1307555 688502 -286622 -1049747 -1350641
32514 -1350641 -1308316 -1076245 -740126 -474052 -457961 -604478 -641124 -492688 -321588 -189324
32504 -189324 -2774 155325 13154 -423281 -731125 -624946 -369128 -371780 -599471 -702264
32494 -702264 -551870 -317228 -89345 227573 638011 957001 1062359 1032047 953344 766923
32484 766923 385315 -155285 -719621 -1146825 -1278263 -1049727 -606183 -201935 64582 298652
32474 298652 557449 715074 667834 510591 367573 189634 -93670 -335813 -338955 -221303
32464 -221303 -339057 -777753 -1176729 -1199366 -961126 -788789 -728274 -569573 -283489 -122766
32454 -122766 -237303 -435750 -433686 -162852 247134 610513 720105 459607 33946 -125157
32444 -125157 101323 265240 -83146 -725048 -1021758 -764570 -378110 -245058 -251751 -168680
32434 -168680 -91975 -207008 -381234 -339904 -105786 50777 17511 -92060 -222020 -434584
32424 -434584 -685270 -799350 -715580 -547151 -378662 -211459 -124904 -238474 -429851 -322469
32414 -322469 297941 1190977 1885048 2074207 1750875 1138366 594947 395131 451573 394091
32404 394091 65019 -216842 -63594 441872 827998 784514 427822 64485 -99233 -11196
32394 -11196 262865 559153 709654 668886 506912 313457 185335 235967 473420 702238
32384 702238 703595 519270 420982 580895 885029 1075866 969775 552246 1971 -373086
32374 -373086 -369206 -90514 180372 292631 272913 118644 -213391 -582993 -691662 -454549
32364 -454549 -143659 -18541 4452 149591 412986 604211 651771 655390 681318 688920 641972
32353 641972 539725 345131 14161 -392596 -707690 -750864 -391242 369125 1256905 1789282
32343 1789282 1677004 1152538 747636 754738 1030167 1280896 1365588 1300606 1135268 896349
32333 896349 593299 264084 41893 92173 394078 689081 780566 767296 802543 767589
32323 767589 469681 76607 -4599 297123 609747 663007 595472 586823 541198 368591 274472
32312 274472 456752 721782 728671 495003 358682 503042 780749 964666 943051 704469
32302 704469 339443 21664 -191842 -465997 -895138 -1213165 -1065626 -512133 22911 266557
32292 266557 278896 162596 -48549 -178684 18299 429638 574047 236984 -166478 -110426
32282 -110426 382438 845779 935024 625547 37390 -599754 -903068 -614959 44156 560280
32272 560280 697644 668296 720336 820357 834254 783700 750528 671579 417070 24540 -292210
32261 -292210 -378065 -299122 -251599 -348818 -522117 -632762 -660661 -726942 -898903 -1033800 -891967
32250 -891967 -380165 370235 1107715 1562001 1534847 1069818 518569 251363 260253 211523
32240 211523 -72976 -397874 -549942 -621774 -756462 -763972 -337002 390292 852576 724195
32230 724195 302389 64192 80463 96000 6316 -54035 -35575 -70897 -191846 -204786 31378
32219 31378 378751 588822 553595 286456 -177453 -696583 -971176 -788386 -278086 231193
32209 231193 557454 713073 692347 445031 59655 -249933 -389835 -435775 -404313 -193908
32199 -193908 155646 366479 261415 55829 112928 471085 788540 749878 397494 38166
32189 38166 -95746 -47868 -15832 -67556 -65211 73645 162804 -23861 -377518 -557425 -471261
32178 -471261 -369078 -393719 -358860 -134712 62210 19172 -104213 -73946 -20881 -197713
32168 -197713 -451366 -379928 15739 260716 52054 -377880 -641200 -628833 -449417 -212983
32158 -212983 -28813 -16997 -190230 -455194 -757980 -1050421 -1146875 -912878 -621821 -762365
32148 -762365 -1355591 -1792405 -1536618 -703101 243354 1034758 1580680 1725484 1426788 1011458
32138 1011458 865583 927344 806195 368178 -101448 -327298 -360375 -399338 -495620 -528508
32128 -528508 -378466 -80245 173840 231677 198561 324541 626131 820569 755164 673008
32118 673008 850557 1178960 1359596 1340013 1272292 1191845 1054080 969535 1062906 1180956
32108 1180956 1085789 878366 872880 1090128 1252066 1264080 1297158 1364661 1252888 973884
32098 973884 862773 1053872 1235125 1114267 782255 424924 47644 -268758 -221609 255671
32088 255671 689689 598437 92083 -426559 -912662 -1548711 -2106091 -2002223 -1086827 54381
32078 54381 736281 803315 495644 17820 -517262 -932963 -1068417 -957184 -727624 -359110
32068 -359110 272371 1085274 1709929 1828136 1501624 1036942 590379 95485 -408442 -625598
32058 -625598 -354249 172823 522883 545891 396411 168493 -185249 -587987 -822939 -843397
32048 -843397 -797787 -684002 -324812 197423 468911 321668 112963 138099 119697 -323074
32038 -323074 -984154 -1326832 -1251236 -1101309 -990690 -653815 -19309 557485 794087 818934
32028 818934 814428 661328 200783 -376876 -678249 -543181 -150409 236395 478626 570462
32018 570462 571025 549865 563346 665411 882956 1127480 1210110 1053001 819063 702462 659920
32007 659920 508232 225316 -34613 -189980 -300329 -394396 -405937 -280000 -5026 406817
31997 406817 811719 904871 531998 -34751 -378764 -437063 -455833 -531709 -535686 -460586 -465492
31986 -465492 -536968 -472506 -271639 -189217 -317820 -473777 -575997 -737565 -873905 -678614
31976 -678614 -183964 117487 -16031 -188294 -25730 213785 131623 -94822 -24564 278582
31966 278582 363082 147591 23204 226975 570587 787286 746095 350598 -347621 -925477
31956 -925477 -909988 -401086 -9810 -113717 -527718 -956678 -1351239 -1669539 -1680795 -1253634
31946 -1253634 -585798 46086 545678 860189 844277 470682 -10520 -314745 -382494 -265462
31936 -265462 53260 542828 987079 1166362 1084231 862604 525143 62494 -367005 -499652
31926 -499652 -246345 192709 505200 515932 283173 -14360 -283595 -570465 -866287 -968073
31916 -968073 -693989 -177925 263438 541838 832093 1171263 1309910 1082496 672744 341895
31906 341895 110305 -94629 -177453 -29121 170017 76508 -395291 -971844 -1339646 -1412379
31896 -1412379 -1283074 -1054333 -747306 -301009 333407 1035373 1493684 1443387 931345 297706
31886 297706 -97016 -117320 97430 266397 198592 -52996 -281192 -346120 -234341 47153
31876 47153 455167 777645 743348 369258 10200 -64781 34016 85978 112887 243682 398848
31865 398848 387434 224562 79871 -32955 -237461 -486741 -560578 -401790 -189004 -16864
31855 -16864 222582 528725 633146 354657 -72432 -257914 -144943 -27912 -135892 -400724
31845 -400724 -624771 -677312 -488449 -46345 486501 804359 777155 664297 816771 1173089
31835 1173089 1265022 805988 76138 -435075 -593098 -576342 -399309 138120 959229 1536568
31825 1536568 1451942 914997 478058 398121 547475 809494 1187008 1509043 1403773 749845
31815 749845 -62177 -522635 -548728 -472865 -559555 -710215 -654934 -301006 174280 516479
31805 516479 616001 557051 506274 575260 751892 918050 945466 818221 656441 585158 609525
31794 609525 673259 778455 925253 977043 776267 417548 193985 186932 131093 -152695
31784 -152695 -398858 -224736 302181 704434 671061 335671 -42159 -421086 -890354 -1399468
31774 -1399468 -1717354 -1625194 -1104767 -376945 233404 521500 515300 373798 231772 158484
31764 158484 155222 120889 -68815 -355743 -491044 -341118 -74146 76673 79069 -11570 -228018
31753 -228018 -535089 -698871 -596637 -475364 -565070 -617345 -268354 260365 361827 -39135
31743 -39135 -314490 -19352 547599 878745 890496 744544 450329 375 -392003 -519753
31733 -519753 -431165 -224101 127098 507693 575925 256900 -17585 66523 185408 -61027
31723 -61027 -387707 -209296 404965 795246 689963 522013 698587 1087816 1370499 1448702
31713 1448702 1340046 1050811 712597 507153 332562 -102859 -726816 -1027849 -733329
31704 -733329 -224533 -41238 -244889 -490334 -482206 -153336 376614 814395 873129 619867
31694 619867 443239 538724 678750 635531 513752 454367 347963 134524 66543 303118
31684 303118 510229 292356 -171403 -370132 -206342 -32723 -12874 66400 310506 502852
31674 502852 501290 474327 583710 729474 761398 693182 576166 391734 187087 96226 117846
31663 117846 91287 -16365 -52951 -23680 -203539 -717155 -1255286 -1439283 -1268280 -975467
31653 -975467 -637457 -203920 236836 537160 761282 1079244 1419098 1518352 1345395 1186089
31643 1186089 1218396 1242138 988224 538146 254732 349497 654938 833246 739876 554967
31633 554967 564843 825366 1074464 1000284 555381 -28569 -472758 -630622 -517163 -296492
31623 -296492 -217581 -414453 -729894 -834844 -556364 -14948 549656 949739 1022552 633806
31613 633806 -116256 -788828 -941752 -618082 -329982 -445605 -725188 -660511 -222000 14150
31603 14150 -388147 -1097545 -1423565 -1231958 -1062130 -1274855 -1495635 -1173907 -399005 223755
31593 223755 365836 242346 119946 -31852 -295592 -551301 -648463 -603967 -473398 -232142
31583 -232142 57876 166775 -23622 -320199 -495932 -624246 -916629 -1326710 -1544999 -1359048
31573 -1359048 -859742 -334297 -80165 -230372 -599333 -782892 -576245 -211744 -30248
31564 -30248 -45330 -35834 71885 186122 299967 440773 448494 168265 -167487 -156962 138214
31553 138214 221697 -59901 -241812 13881 351306 284911 -23992 -43146 282906 481109
31543 481109 301673 45544 57075 267525 393634 321780 137049 -47161 -150583 -131335
31533 -131335 -21867 107901 238948 370733 433314 364748 249575 226128 269924 226309
31523 226309 47069 -163821 -322927 -423813 -455179 -441665 -507262 -670219 -644651 -165559
31513 -165559 492523 691172 219481 -429817 -706916 -583732 -316904 -17770 244093 237313
31503 237313 -132461 -516224 -498909 -160446 84520 86068 31969 20626 -25612 -43402 153108
31492 153108 470755 534375 208669 -189657 -321286 -177959 98871 431319 671470 564983
31482 564983 91522 -380314 -509993 -377537 -257484 -200733 -90299 44377 41102 -151101
31472 -151101 -456629 -808987 -1106050 -1154730 -891221 -541398 -314459 -65545 425633 946124
31462 946124 1026091 643557 344415 515692 880618 933202 614330 297312 265568 460403
31452 460403 672924 775802 778099 778509 845022 876507 664681 172008 -357813 -669750 -767633
31441 -767633 -790769 -741453 -522468 -187377 43556 35180 -122092 -231797 -159713 86291
31431 86291 333458 340231 57229 -223248 -136704 309109 702906 695387 374324 106384 109772
31420 109772 282667 400030 375880 316417 361513 508677 613687 567466 432739 366425
31410 366425 430259 521796 482636 250427 -75159 -311935 -393436 -482562 -773459 -1155148
31400 -1155148 -1248616 -890163 -396735 -159038 -130902 7389 291998 433104 322121 212464
31390 212464 293205 416429 419077 415289 527857 572536 312021 -120328 -356185 -295423 -205237
31379 -205237 -314867 -534273 -629124 -534432 -435109 -573588 -954818 -1242363 -1085340 -598173
31369 -598173 -300989 -442196 -629917 -401734 58805 165128 -217353 -604500 -619387 -457296
31359 -457296 -457648 -556879 -425940 46492 639759 1062644 1173000 1028134 827409 723169
31349 723169 640103 404397 64336 -117221 -27586 187855 447979 839488 1233388 1168318
31339 1168318 461644 -324728 -458676 43756 489223 442136 157926 43749 116379 161330
31329 161330 81595 -146179 -603360 -1243525 -1724448 -1682750 -1129924 -420838 95502 253984
31319 253984 20269 -510382 -1063630 -1314766 -1126019 -596175 84647 722203 1118264 1174755
31309 1174755 1044874 1031217 1240296 1430363 1300376 874660 496455 445183 640658 752892
31299 752892 558355 146193 -219771 -398887 -487756 -635740 -812206 -827385 -566289 -123918
31289 -123918 296152 531391 490587 156118 -352479 -797972 -1018959 -1055493 -992799 -780137
31279 -780137 -377794 -5204 25218 -250293 -447136 -375030 -292808 -431141 -554247 -331391
31269 -331391 58897 132796 -148929 -295750 -33723 299659 315227 156176 209058 488506
31259 488506 672399 616513 483446 402987 327311 255084 318586 547265 742896 708095 482192
31248 482192 269559 225972 372901 630090 858258 920660 764860 444892 74728 -211297
31238 -211297 -292863 -141775 125779 328866 372629 319015 335512 556895 908259 1071068
31228 1071068 788665 261590 27940 300656 640066 536600 129215 -33215 133113
31219 133113 73730 -585081 -1448330 -1838383 -1591006 -1076441 -628216 -296074 -86405 -86821
31209 -86821 -262132 -366288 -202512 143015 432046 559934 611047 671767 691550 549132
31199 549132 201834 -255117 -642831 -795914 -662285 -365785 -136163 -104070 -189923 -273445
31189 -273445 -408083 -693759 -960753 -849996 -321250 170611 213446 -45606 -165008 -11878
31179 -11878 202052 343710 447976 453111 247740 -12487 -40670 72816 -84445 -555013
31169 -555013 -821464 -549759 -122777 -102127 -473900 -795531 -843593 -724703 -526208 -266039
31159 -266039 -92053 -154694 -330079 -393271 -396808 -531174 -669201 -456351 102094 521921
31149 521921 433714 8476 -335814 -412472 -325563 -248443 -263011 -288500 -127527 272308 621166
31138 621166 568108 173494 -159144 -232562 -222992 -248441 -158230 66068 71758 -390417 -1015085
31127 -1015085 -1321984 -1321299 -1428317 -1788789 -2066135 -1947887 -1557359 -1240992 -1154199 -1186383
31117 -1186383 -1157394 -970789 -666867 -428549 -469169 -810386 -1199431 -1339823 -1205071 -1035109
31107 -1035109 -992816 -935803 -653843 -265051 -147428 -403313 -626884 -415609 52755 245451
31097 245451 -14082 -414650 -735054 -1134784 -1708823 -2137867 -2085275 -1682441 -1289311 -964899
31087 -964899 -535814 -56800 208102 243505 331025 575806 729743 598375 312727 50660
31077 50660 -212315 -471402 -493068 -143185 273676 337434 84702 -72636 24661 87642
31067 87642 -109981 -359948 -358955 -172934 -94328 -186911 -272092 -301662 -415125 -588406 -560702
31056 -560702 -278277 -131375 -470602 -1051047 -1275067 -934235 -402732 -74330 89927 344219
31046 344219 736782 1067346 1107460 750190 112232 -405143 -381501 108224 447278 187648
31036 187648 -367037 -583483 -358464 -174917 -338996 -582235 -533375 -230311 29944 85694
31026 85694 -45620 -291965 -479145 -357268 77336 436759 373335 37396 -161138 -137462
31016 -137462 -154078 -306863 -362567 -183081 28674 64528 9262 4792 -27177 -162107 -182595
31005 -182595 140728 584418 678218 398904 278686 671329 1233016 1392457 1113026 853673
30995 853673 864240 878045 569542 21426 -440568 -689651 -845311 -953310 -868304 -533389
30985 -533389 -208070 -236765 -598304 -838385 -552526 127668 660027 700771 439350 263131
30975 263131 260596 249944 207918 381874 888457 1422598 1552644 1208260 711875 387898
30965 387898 312513 423171 667433 964046 1166846 1200003 1157789 1144511 1059756 704530
30955 704530 134797 -254171 -139931 303604 569514 411786 99180 2888 112400 139596
30945 139596 -8858 -107755 38356 346301 620229 782874 849558 838533 826586 937229
30935 937229 1113209 1034263 473919 -326182 -851415 -871342 -616347 -411569 -357294 -416514
30925 -416514 -577753 -779910 -842596 -665463 -416823 -346176 -447146 -477190 -306563 -70060
30915 -70060 76169 179662 358308 563764 641602 578731 517478 507677 412602 144566 -136585
30904 -136585 -189395 17724 313703 580322 851423 1151348 1377612 1407195 1237632 973562
30894 973562 732073 587335 540651 510777 404094 210085 -18181 -255603 -489372 -633787
30884 -633787 -591070 -414775 -283953 -279153 -303377 -253586 -136327 13949 165452 190357 -67941
30873 -67941 -530158 -866165 -863122 -636981 -369509 -59075 296599 508204 444981 298480
30863 298480 315041 412106 365187 250253 346283 654708 867863 807253 563060 201740
30853 201740 -305448 -814570 -1030676 -912140 -757518 -792421 -954552 -1149603 -1362624 -1402204
30843 -1402204 -946019 -81953 547333 446055 -145218 -634132 -783413 -722711 -520010 -157856
30833 -157856 195708 293549 160035 36628 21822 32126 43720 76896 7585 -279497 -580033
30822 -580033 -551141 -219920 20132 -25685 -122297 -46255 57824 -50570 -314335 -475802
30812 -475802 -436282 -340088 -365622 -540943 -715324 -673476 -361948 -8327 115409 48309
30802 48309 73768 267132 345055 83415 -326577 -519338 -398334 -145041 93377 294890
30792 294890 396510 288632 34359 -85415 135658 568453 877208 883930 725306 638664
30782 638664 673351 695426 647774 667275 865294 1098567 1113727 894235 695420 683975 682642
30771 682642 389607 -206013 -747511 -879689 -644131 -447723 -612193 -994100 -1128046 -741112
30761 -741112 -19777 648271 1034969 1094442 832268 369984 10109 -40721 25256 -138598
30751 -138598 -493290 -630210 -402327 -212118 -464917 -984872 -1260482 -1135102 -936241 -921140
30741 -921140 -888167 -489220 232449 828347 964809 771925 563141 362040 -28531 -514197
30731 -514197 -641423 -242817 176800 69485 -354540 -423823 -7384 329076 227140 17083
30721 17083 53247 93796 -247202 -811214 -1138104 -1162991 -1202119 -1381297 -1521248 -1521024 -1443534
30710 -1443534 -1250311 -844017 -379722 -159602 -184337 -164203 -14441 43767 -34104 61174
30700 61174 483477 877534 802407 290688 -256149 -561154 -637164 -599925 -546381 -547530 -587479
30689 -587479 -560415 -434271 -315564 -249590 -111030 149964 313657 167589 -135359 -255760
30679 -255760 -146874 -72719 -141618 -128773 117836 362918 300650 24542 -89528 78222
30669 78222 240060 137236 -126819 -342045 -564688 -958608 -1359059 -1341106 -804986 -202786
30659 -202786 -2631 -147586 -269840 -247516 -232867 -229927 -23469 417022 783146 815763
30649 815763 615056 421419 294743 187260 166286 345377 668536 940942 1040069 974610
30639 974610 794575 579928 471860 559531 723874 709730 396026 -50962 -302797 -133236
30629 -133236 396171 964582 1237396 1131811 827125 515452 218902 -107337 -374432 -366414
30619 -366414 31711 635734 1034943 957851 616267 555265 1007179 1509613 1417570 742970
30609 742970 162555 150757 457095 582279 415645 152747 -102914 -313021 -314636 -53100
30599 -53100 129852 -162627 -806484 -1279124 -1322997 -1132000 -900278 -594801 -252236 -113631
30589 -113631 -293659 -599053 -820303 -943941 -951767 -707301 -233877 152312 211748 82900
30579 82900 6988 -43079 -209033 -387924 -321723 5673 292681 239739 -189343 -777663
30569 -777663 -1209248 -1281139 -1071358 -829265 -645396 -376404 33566 379845 488678 443391
30559 443391 322670 -17330 -600093 -1019397 -891771 -472316 -359556 -641583 -815345 -583636
30549 -583636 -233381 -83202 -35267 73159 94494 -101778 -239034 27555 556651 867231
30539 867231 739245 365453 2120 -225354 -245146 -95562 -39231 -306516 -710840 -836474
30529 -836474 -663019 -657196 -1081635 -1522227 -1382226 -660240 76686 418150 484428 539638
30519 539638 555903 375424 104867 26471 130833 57820 -349569 -688232 -469432 182364
30509 182364 641514 582819 324675 277511 397935 413219 301083 227550 189833 72167
30499 72167 -28572 124727 521049 878977 1017669 976578 773294 360787 -128107 -418141
30489 -418141 -473845 -546287 -726999 -772468 -534589 -245201 -140331 -86124 142471 453901
30479 453901 622042 674269 763862 822542 706353 565677 667301 893996 828079 369577
30469 369577 -93728 -207925 -18409 267170 550690 751327 753087 626753 659970 984698
30459 984698 1369289 1523568 1407018 1106699 658079 171976 -94585 -25937 168760 259365
30449 259365 287428 343660 291861 26130 -185786 978 455317 692534 536975 308825
30439 308825 314605 485499 608704 622514 562298 460219 415916 541657 724525 673060 338627
30428 338627 72825 199729 618194 996547 1177188 1192812 1055411 777378 496543 337965
30418 337965 211580 -37530 -336372 -469728 -420448 -377710 -403625 -349957 -168301 -57506
30408 -57506 -178827 -425848 -635486 -860819 -1225430 -1596906 -1634118 -1182481 -478043 76081
30398 76081 245980 81364 -188307 -334080 -296452 -230475 -333558 -608095 -863712 -975522
30388 -975522 -1040547 -1211235 -1459477 -1605183 -1524438 -1223185 -750214 -179363 315364 510464
30378 510464 330391 -72891 -465124 -679318 -627252 -316224 75051 283684 250850 214614
30368 214614 377248 585207 527522 186153 -141739 -279168 -391950 -679631 -1027004 -1124145
30358 -1124145 -858797 -463278 -288509 -486811 -876769 -1077664 -830197 -237650 333707
30349 333707 596124 529206 265408 -55066 -263805 -172002 236005 683615 836235 664387
30339 664387 472357 543840 822121 965796 697989 95581 -467061 -674130 -541400 -294393
30329 -294393 -52270 214850 446674 461993 276815 226722 557485 1040521 1250707 1147722
30319 1147722 1099461 1327699 1613336 1638035 1376438 1007033 630810 273766 41114 38141
30309 38141 160052 155300 -58731 -280554 -289571 -126295 -21632 -105531 -287410 -415145 -448137
30298 -448137 -427139 -354592 -203179 -22091 67223 9126 -125715 -250545 -359311 -460039
$$ [...]
##END NTUPLES=NMR SPECTRUM
##END=
