##TITLE=31P_DE-80H_X3
 64 sc D2O
 26.2.2025
##JCAMPDX= 6.0         $$ Bruker NMR JCAMP-DX V2.0
##DATA TYPE= NMR SPECTRUM
##DATA CLASS= NTUPLES
##ORIGIN= UXNMR, Bruker Analytische Messtechnik GmbH
##OWNER= root
$$ XWIN-NMR		Version 3.5
$$ Fri Mar 28 11:34:00 2025 Russian Standard Time (UT+4h)  Yarkov@DPX200
##.OBSERVE FREQUENCY= 81.013821
##.OBSERVE NUCLEUS= ^31P
##.ACQUISITION MODE= SIMULTANEOUS
##.ACQUISITION SCHEME= undefined
##.AVERAGES= 64
##.DIGITISER RES= 17
##SPECTROMETER/DATA SYSTEM= spect
##.PULSE SEQUENCE= zgpg30
##.SOLVENT NAME= CDCl3
##.SHIFT REFERENCE= (INTERNAL, CDCl3, 0, 198.062)
##AUDIT TRAIL= $$ (NUMBER, WHEN, WHO, WHERE, WHAT)
$$ ##TITLE= Audit trail, XWIN-NMR		Version 3.5
$$ ##JCAMPDX= 5.01
$$ ##ORIGIN= Bruker BioSpin GmbH
$$ ##OWNER= Yarkov
$$ C:/Bruker/XWIN-NMR/data/yarkov2/nmr/P31/2/pdata/1/auditp.txt
$$ ##AUDIT TRAIL=  $$ (NUMBER, WHEN, WHO, WHERE, WHAT)
(   1,<2025-03-28 11:32:57.34 +0400>,<Yarkov>,<DPX200>,
      <created by zg, POWCHK disabled, PULCHK disabled
       configuration hash MD5:
       00 E9 B6 7A A2 85 ED C7 34 08 36 98 17 FE 4E 26
       data hash MD5: 32K
       E8 05 B4 AE A1 EE C7 4F 2C 4D 07 CC F0 80 02 5C>)
(   2,<2025-03-28 11:33:04.95 +0400>,<Yarkov>,<DPX200>,
      <Start of raw data processing
       efp BC_mod = 2 LB = 1.5 FT_mod = 6 PKNL = 1 PHC0 = 1820.376 PHC1 = -1.904586 SI = 64K 
       data hash MD5: 64K
       10 F6 34 81 7A FC 7B E2 83 F9 1C 5E 70 BF 16 40>)
(   3,<2025-03-28 11:33:23.00 +0400>,<Yarkov>,<DPX200>,
      <pk PHC0 = -10.64329 PHC1 = -6.000001 
       data hash MD5: 64K
       04 A7 8D 19 55 F4 5D 87 34 E0 DC BD 67 F9 E9 08>)
(   4,<2025-03-28 11:33:27.29 +0400>,<Yarkov>,<DPX200>,
      <abs ABSG = 5 
       data hash MD5: 64K
       CC 41 92 8C FC DA A8 38 8D 26 C4 18 5D 04 42 D0>)
$$ ##END=
$$ 
$$ hash MD5
$$ F0 C8 BF 06 61 68 C2 4F 8E 6E 78 44 05 15 1A 74
##$RELAX= 
##$RELAX= 
##$RELAX= 
##$RELAX= 
##$RELAX= 
##$RELAX= 
##$RELAX= 
##$RELAX= 
$$ Bruker specific parameters
$$ --------------------------
##$DU= <C:/Bruker/XWIN-NMR>
##$EXPNO= 2
##$NAME= <P31>
##$PROCNO= 1
##$TYPE= <nmr>
##$USER= <yarkov2>
##$AMP= (0..31)
100 100 100 100 100 100 100 100 100 100 100 100 100 100 100 100 100 100 
100 100 100 100 100 100 100 100 100 100 100 100 100 100 
##$AQSEQ= 0
##$AQ_mod= 1
##$AUNM= <au_zg>
##$AUTOPOS= <>
##$BF1= 81.014009
##$BF2= 200.13
##$BF3= 200.13
##$BF4= 200.13
##$BF5= 200.13
##$BF6= 200.13
##$BF7= 200.13
##$BF8= 200.13
##$BYTORDA= 1
##$CFDGTYP= 0
##$CFRGTYP= 5
##$CHEMSTR= <none>
##$CNST= (0..31)
1 1 145 1 1 1 1 1 1 1 1 1 1 1 1 1 1 1 1 1 1 1 1 1 1 1 1 1 1 1 1 1 
##$CPDPRG= <waltz16>
##$CPDPRG1= <>
##$CPDPRG2= <waltz16>
##$CPDPRG3= <>
##$CPDPRG4= <mlev>
##$CPDPRG5= <mlev>
##$CPDPRG6= <mlev>
##$CPDPRG7= <mlev>
##$CPDPRG8= <mlev>
##$CPDPRGB= <>
##$CPDPRGT= <>
##$D= (0..31)
0 1 0 0 0 0 0 0 0 0.06 0 0.03 2e-05 3e-06 0 0 0.0002 0 0 0 0 0 0 0 0 0 
0 0 0 0 0 0 
##$DATE= 1743147176
##$DBL= (0..7)
120 120 120 11 120 120 24 19 
##$DBP= (0..7)
150 150 150 150 150 150 150 150 
$$ [...]
##$SUBNAM3= <"">
##$SUBNAM4= <"">
##$SUBNAM5= <"">
##$SUBNAM6= <"">
##$SUBNAM7= <"">
##$SUBNAM8= <"">
##$SUBNAM9= <"">
##$SW= 400.765351723535
##$SWIBOX= (0..15)
0 1 3 0 0 0 0 0 0 0 0 0 0 0 0 0 
##$SW_h= 32467.5324675325
##$TD= 32768
##$TD0= 1
##$TE= 0
##$TE2= 300
##$TE3= 300
##$TEG= 300
##$TL= (0..7)
0 120 53 12 22 120 120 120 
##$TP= (0..7)
150 150 150 150 150 150 150 150 
##$TP07= 0
##$TPNAME0= <>
##$TPNAME1= <>
##$TPNAME2= <>
##$TPNAME3= <>
##$TPNAME4= <>
##$TPNAME5= <>
##$TPNAME6= <>
##$TPNAME7= <>
##$TPOAL= (0..7)
0.5 0.5 0.5 0.5 0.5 0.5 0.5 0.5 
##$TPOFFS= (0..7)
0 0 0 0 0 0 0 0 
##$TUNHIN= 0
##$TUNHOUT= 0
##$TUNXOUT= 0
##$USERA1= <user>
##$USERA2= <user>
##$USERA3= <user>
##$USERA4= <user>
##$USERA5= <user>
##$V9= 5
##$VALIST= <valist>
##$VCLIST= <CCCCCCCCCCCCCCC>
##$VD= 0
##$VDLIST= <DDDDDDDDDDDDDDD>
##$VPLIST= <PPPPPPPPPPPPPPP>
##$VTLIST= <TTTTTTTTTTTTTTT>
##$WBST= 1024
##$WBSW= 4
##$XGAIN= (0..3)
0 0 0 0 
##$XL= 0
##$YL= 0
##$YMAX_a= 6166
##$YMIN_a= -25932
##$ZGOPTNS= <>
##$ZL1= 120
##$ZL2= 120
##$ZL3= 120
##$ZL4= 120
##$ABSF1= 198.0616
##$ABSF2= -202.7028
##$ABSG= 5
##$ABSL= 3
##$ALPHA= 0
##$AQORDER= 0
##$ASSFAC= 0
##$ASSFACI= 0
##$ASSFACX= 0
##$ASSWID= 0
##$AUNMP= <proc_1d>
##$AZFE= 0.1
##$AZFW= 0.5
##$BCFW= 0
##$BC_mod= 2
##$BYTORDP= 0
##$COROFFS= 0
##$CY= -3
##$DATMOD= 1
##$DC= 0
##$DFILT= <>
##$DTYPP= 0
##$F1P= 0
##$F2P= 0
##$FCOR= 1
##$FTSIZE= 65536
##$FT_mod= 6
##$GAMMA= 0
##$GB= 0
##$INTBC= 1
##$INTSCL= 9.790993e-09
##$ISEN= 30
##$LB= 1.5
##$LEV0= 0
##$LPBIN= 0
##$MAXI= 10000
##$MC2= 0
##$MEAN= 0
##$ME_mod= 0
##$MI= 50
##$NCOEF= 0
##$NC_proc= -7
##$NLEV= 6
##$NOISF1= 182.463
##$NOISF2= 159.3651
##$NSP= 0
##$NTH_PI= 0
##$NZP= 0
##$OFFSET= 198.0616
##$PC= 4
##$PHC0= 1809.733
##$PHC1= -7.904587
##$PH_mod= 1
##$PKNL= yes
##$PPARMOD= 0
##$PSCAL= 0
##$PSIGN= 0
##$REVERSE= no
##$SF= 81.0140089999434
##$SI= 65536
##$SIGF1= 159.3651
##$SIGF2= -187.1042
##$SINO= 113.3802
##$SIOLD= 16384
##$SREGLST= <1H.CDCl3>
##$SSB= 0
##$STSI= 65536
##$STSR= 0
##$SW_p= 32467.5324675325
##$SYMM= 0
##$S_DEV= 0
##$TDeff= 32768
##$TDoff= 0
##$TI= <>
##$TILT= no
##$TM1= 0
##$TM2= 0
##$TOPLEV= 0
##$USERP1= <user>
##$USERP2= <user>
##$USERP3= <user>
##$USERP4= <user>
##$USERP5= <user>
##$WDW= 1
##$XDIM= 65536
##$YMAX_p= 466416831
##$YMIN_p= -171475246
$$ End of Bruker specific parameters
$$ ---------------------------------
##NTUPLES= NMR SPECTRUM
##VAR_NAME=  FREQUENCY,     SPECTRUM/REAL,   SPECTRUM/IMAG
##SYMBOL=    X,             R,               I
##VAR_TYPE=  INDEPENDENT,   DEPENDENT,       DEPENDENT
##VAR_FORM=  AFFN,          ASDF,            ASDF
##VAR_DIM=   65536,         65536,           65536
##UNITS=     HZ,            ARBITRARY UNITS, ARBITRARY UNITS
##FACTOR=    0.49542278885378, 1,            1
##FIRST=     16045.7642231865, 0,            0
##LAST=      -16421.768244346, 0,            0
##MIN=       -16421.768244346, -171475246,   0
##MAX=       16045.7642231865, 466416831,    0
$$ Real data points
##PAGE= N=1
##DATA TABLE= (X++(R..R)), XYDATA
$$ [...]
39848F326903j8798j813305k061756l68057J384829R91367j189196k475075j264266
39839d87354J029244K031159J228284j69571j174155j591451j284457k31289Q21171
39830A71581R08490J49992l71141j16590L19495K85138l4056j36458n3954k23835
39820H98662p61804j221890j071795k85018N79016R42238Q27801P02213O78730
39811A288153K84797p10357j628689j554561n27641M47777O29600L37230L19440
39802a114251O31859N59044k73970j080203o91781Q05289J810453J030174q62348
39793H14266k028093j641786m95710L90898P52955N58121l64358j595167j911339
39784e520213o52030J160408J846857J049673R7535L95451J781018K569335J300498
$$ plain form
39848 6326903 6308105 4494800 2433044 2064987 3449816 4441183 3251987 776912 -487354
39839 -487354 541890 2573049 3801333 3631762 2457607 866156 -418301 -649590 171581
39830 171581 1080071 1230063 858922 742332 1061827 1346965 1312909 1176451 1122497 898662
39820 898662 136858 -1085032 -2156827 -2441845 -1862829 -920591 -92790 609423 1288153
39811 1288153 1572950 862593 -766096 -2320657 -2848298 -2400521 -1770921 -1433691 -1114251
39802 -1114251 -482392 76652 -197318 -1277521 -1969302 -1164013 646440 1676614 814266
39793 814266 -1213827 -2855613 -3351323 -2960425 -2207470 -1649349 -2013707 -3608874 -5520213
39784 -5520213 -6172243 -5011835 -3164978 -2115305 -2017770 -1622319 158699 2728034 4028532
39775D028532j435938l260693k584751n22034O45586M89062M84467J136994J005726
39766a3049o74058k266970k021100o25255J69265L00589Q08536J341981N86701
39757b393360r88881j178123O28453K166703J390000o92130j577690o63877L97196
39748b911709L38940j68441O6326Q21084Q33124j69297q26354k3446J356779J582921
39738H99927O00178Q394M10141M29001q71489k150711j690020K8879J137963R20324
39728b77413O4937p97372j233581n00543J293514K258268J012993p39842l62403
39719G18558J423393J306676j379578l367734k358983j96631M81849P5713L34225
39710b962512J017054P94007K212m1763M65550L54567j83458m0461N39110L33712
$$ plain form
39775 4028532 2592594 -668099 -3252850 -3774884 -3129298 -2640236 -2155769 -1018775 -13049
39766 -13049 -687107 -2954077 -4975177 -5600432 -5431167 -5130578 -4322042 -2980061 -2393360
39757 -2393360 -3382241 -4560364 -3931911 -1765208 -375208 -1067338 -2645028 -3308905 -2911709
39748 -2911709 -2572769 -2741210 -2674884 -1853800 -1020676 -1189973 -2016327 -2039773 -682994 899927
39738 899927 1500105 1508499 1918640 2347641 1476152 -674559 -2364579 -2335700 -1197737 -277413
39728 -277413 -212476 -1009848 -2243429 -2743972 -1450458 807810 1820803 1080961 718558
39719 718558 2141951 3448627 2069049 -1298685 -3657668 -3854299 -3372450 -3296737 -2962512
39710 -2962512 -1945458 -1151451 -1149239 -1191002 -725452 -370885 -554343 -594804 -55694 278018
39700B78018n00482o00466J40511L45387m53582j121448r48002n96523n76429
39691d033016l92992K10568N77535K84044k34584o04450q70319p12397K72111
39682e503500J242285P49444p93185j118030N53285K048943J422814j59251m35718
39673a992913N01784Q72793L41875J98523Q10104J099378O19435K01619K47795
39664B900393J15189l83724m71783Q2181M28327J89731J07806M84975M65763l02232
39654C616626p85498l88093j64015q66103j234904j0853J525844J171975p69115
39645B095864j971198j669654j335222j642796j295509L50199J755853J539819
39637b172644N10608j0099k64842q73334r96422L82030K251706K607072J227644
$$ plain form
39700 278018 -222464 -822930 -682419 -337032 -790614 -1912062 -2860064 -3456587 -4033016
39691 -4033016 -4426008 -4215440 -3637905 -3353861 -3588445 -4192895 -5063214 -5775611 -5503500
39682 -5503500 -4261215 -3511771 -4304956 -5422986 -4869701 -2820758 -1397944 -1557195 -1992913
39673 -1992913 -1491129 -618336 -276461 -77938 732166 1831544 2450979 2652598 2900393
39664 2900393 3015582 2631858 2160075 2242256 2670583 2860314 2968120 3453095 3918858 3616626
39654 3616626 2831128 2443035 2279020 1412917 178013 167160 1693004 2864979 2095864
39645 2095864 124666 -1544988 -2880210 -4523006 -5818515 -5468316 -3712463 -2172644
39637 -2172644 -1662036 -1672135 -1936977 -2810311 -3806733 -3424703 -1172997 1434075 2661719
39628B661719k82410q98969r78260q77107m50164L4924n984l20612j22070L86468
39618h52465K42454l60976K576J641824K803557J909322l65299k058027k110389
39609H52577r09226N67645J449242J389901Q10000L09952k18893j171763k038108
39600A041327j854444r58598p80296j436270j208619O94841K500464K306879P68406
39591A073690k42965m82152r35805j378307n14074J502720K653529J645536m66287
39582B855885j769193j585111o30268R2729J20576k34667k45236L01189O75552
39573d18544K17959n23919m33267N68854J370263J074068j54003j540975k299735
39564b139299j938334p66746N7077k05268p54121k82769J123707K195055K390962
$$ plain form
39628 2661719 2379309 1480340 502080 -375027 -825191 -790267 -796251 -1116863 -1238933 -852465
39618 -852465 -610011 -970987 -968411 673413 3476970 5386292 5020993 2962966 852577
39609 852577 -56649 510996 1960238 3350139 4160139 4470091 4251198 3079435 1041327
39600 1041327 -813117 -1771715 -2552011 -3988281 -5196900 -4502059 -2001595 305284 1073690
39591 1073690 830725 348573 -587232 -1965539 -2479613 -976893 1676636 3322172 2855885
39582 2855885 1086692 -498419 -1128687 -1035958 -915382 -1150049 -1395285 -1094096 -418544
39573 -418544 -200585 -724504 -1157771 -588917 781346 1855414 1701411 160436 -2139299
39564 -2139299 -4077633 -4844379 -4787302 -4992570 -5746691 -6029460 -4905753 -2710698 -319736
39555c19736K304315K112380J106158p36159k011586j576343j22634P12952K60178
39546A729525p39424j103772j98392J535266K683515K027453o2645j885140k231385
39537A755001j369220j91756O88304Q06696n4917j111045r67357N07747J642765
39528A706218J099352l26023r38396l61481N00953R77691R60578L54094n57431
39519C415555p02726M69917J666429J188889n42979j527514j177723r14604j400401
39510D74843j210195O37187K524773K258524J86320j433653j580206j239028j240558
39501f21993j099328l39161M87629P39359O00541M66429K77095n295r7850j11037
39491B96389o56121j584458j607524j30253J424565J360767J15874m98121l3344
$$ plain form
39555 -319736 1984579 4096959 5203117 4466958 2455372 879029 756395 1469347 1729525
39546 1729525 990101 -113671 -312063 1223203 3906718 5934171 5871526 3986386 1755001
39537 1755001 385781 194025 882329 1689025 1634108 523063 -444294 63453 1706218
39528 1706218 2805570 2479547 1541151 1179670 1680623 2658314 3618892 3972986 3415555
39519 3415555 2712829 3182746 4849175 6038064 5495085 3967571 2789848 1875244 474843
39510 474843 -735352 -98165 2426608 4685132 4871452 3437799 1857593 618565 -621993
39501 -621993 -1721321 -2060482 -1572853 -833494 -232953 233476 510571 505276 407426 296389
39491 296389 -359732 -1944190 -3551714 -3681967 -2257402 -896635 -780761 -1278882 -1312226
39482a312226K43858k96941o39491R5441J290564J937080J952355J679434J058964
39473F009038N0504r17911j541512j908652j758203n49425J139021J578061K26731
39464B327652j119842p49714N08661O96799l97442j480358k090166k726460l032703
39455h063573j920499L69915K131657K431221J981575J556496J068986N38215
39447I3993M45241O73814M78759j02190k15738Q9703k75384j349010j616306m07374
39437b184492Q81953R79596N12847L77462k0962j271601k119946j127465P41680
39428c230928J271513K75538k80875O26567J736433J600897N18210k29939m9071
39419B238345O07189R10511L90479n48630q35344L6509J133220J073568k56159
$$ plain form
39482 -1312226 -1068368 -1365309 -2004800 -1909359 -618795 1318285 3270640 4950074 6009038
39473 6009038 6059542 5141631 3600119 1691467 -66736 -616161 522860 2100921 2327652
39464 2327652 1207810 458096 966757 1663556 1266114 -214244 -2304410 -5030870 -8063573
39455 -8063573 -9984072 -9614157 -7482500 -5051279 -3069704 -1513208 -444222 93993
39447 93993 539234 1213048 1691807 1589617 1373879 1463582 1188198 -160812 -1777118 -2184492
39437 -2184492 -1302539 -322943 189904 567366 546404 -725197 -2845143 -3972608 -3230928
39428 -3230928 -1959415 -1683877 -1964752 -1338185 398248 1999145 2517355 2287416 2238345
39419 2238345 2845534 3756045 4146524 3597894 2762550 2799059 3932279 5005847 4749688
39410D749688j649812k071016j479624l76531O17220Q00818r3807j317110j750371
39401b570545j210495m41580J48443Q59315J638616J600117K12800j559344k020664
39392c343337o45105J191489J628501M31562o48094K5053J798586K449997J106340
39383C994992o05386q21462J81605P70595K81280n92329j175053j314448q00221
39374h0427M35679J546615J352193j16424j523653j787653r78969K54718J245633
39365C47712J305419J74563j342434k021420j629233r31149l32759M92410J511599
39356b425292J940697J311754R4054j048758j820296j889400q80154P84213J826212
39347b106970J449567K29437o44040n51074K17069P47861K21588r61455j085545
$$ plain form
39410 4749688 3099876 1028860 -450764 -827295 -210075 590743 496936 -820174 -2570545
39401 -2570545 -3781040 -4222620 -4074177 -3214862 -1576246 23871 236671 -1322673 -3343337
39392 -3343337 -3988442 -2796953 -1168452 -736890 -1384984 -1359931 438655 2888652 3994992
39383 3994992 3389606 2568144 2749749 3520344 3801624 3209295 2034242 719794 -80427
39374 -80427 355252 1901867 3254060 3137636 1613983 -173670 -1152639 -897921 347712
39365 347712 1653131 1827694 485260 -1536160 -3165393 -4096542 -4429301 -3936891 -2425292
39356 -2425292 -484595 827159 921213 -127545 -1947841 -3837241 -4717395 -3933182 -2106970
39347 -2106970 -657403 -427966 -1072006 -1623080 -1406011 -658150 -436562 -1398017 -2483562
39338b483562P14274K517127J596569j518301l080645j113236J724210J874326
39330B30762k37453j311160j06708J353775J380233Q57253J109466J513561O28847
39321E418576j391174k918265k968593k092322j201808m22824N43565J443588
39313c589257J487661M60135o29679n44857N70149J213992M40517q75985j245683
39304b713007n09399K39707L75160L66365O47954Q81107P39530N98034Q39728
39295A465179J089629Q08078J86065k64581o19172j179876j485910p82704M70400
39286c12892P75311k55396j082150m24966P50871O88404m56651r72266l64980
39277a654715K7840n44221j005941m07042M67807N84785M52711J007069J686140
$$ plain form
39338 -2483562 -1769288 747839 2344408 826107 -2254538 -3367774 -1643564 230762
39330 230762 -6691 -1317851 -1424559 -70784 1309449 2166702 3276168 4789729 5418576
39321 5418576 4027402 1109137 -1859456 -3951778 -5153586 -5576410 -5032845 -3589257
39313 -3589257 -2101596 -1641461 -2271140 -2815997 -2245848 -1031856 -591339 -1467324 -2713007
39304 -2713007 -3222406 -2982699 -2607539 -2241174 -1593220 -712113 27417 625451 1465179
39295 1465179 2554808 3362886 3548951 3284370 2665198 1485322 -588 -783292 -312892
39286 -312892 462419 207023 -875127 -1300093 -549222 139182 -317469 -1289735 -1654715
39277 -1654715 -1626875 -2171096 -3177037 -3584079 -3116272 -2531487 -2078776 -1071707 614433
39268F14433J246986o4800p83067m31373K1372j25973n18218p77080j060349j350980
39258c229049j261851p88073l34089J18694R24321J793589J930066J270942N93831
39249A018381K76501j8344l16315j13803N84056J061630R63174N80989k2004j046121
39239B968144j993978j932521r55011j54782O6576L62277R42150J194612J060434
39230A557901J167309J264049L39759j191828j453946o9196R39731L37392l92106
39221B499065J67466P50058l44846k073582k096975l39644J130521J077254J8326
39212G87643j174373j821850j233282L89730J519167J224685N37376L99741k39472
39203C89365k159665l269964j209333K429368L703639J785111l66458p57998m93587
$$ plain form
39268 614433 1861419 1796619 1013552 582179 603551 477578 -40640 -817720 -1878069 -3229049
39258 -3229049 -4490900 -5278973 -5613062 -5494368 -4570047 -2776458 -846392 424550 1018381
39249 1018381 1294882 1276538 960223 846420 1430476 2492106 3455280 4036269 4014265 2968144
39239 2968144 974166 -958355 -1913366 -2068148 -2001572 -1639295 -697145 497467 1557901
39230 1557901 2725210 3989259 4329018 3137190 1683244 1614048 2553779 2891171 2499065
39221 2499065 2666531 3416589 3071743 998161 -1098814 -1438458 -307937 769317 787643
39212 787643 -386730 -2208580 -3441862 -3052132 -1532965 -308280 229096 628837 389365
39203 389365 -1770300 -5040264 -6249597 -3820229 -116590 1668521 1302063 544065 50478
39194E0478o81400m94642N24910J021339J57127q07638o51531l8287o928l41803
39184a268375n57779q64080j136625n63798P39089J396824Q91950K84119R3534
39175i85141m84634j394589j113850N21184J327056K16445q31987k04795M74446
39166b475865n73575j738666p69248Q83879K76461j686532j285137J905141M080575
39157a382967K998315Q53596Q1823j71903j335247k135102q05231J400308J838185
39148A341777N72023O1204J153771K020492J349447K51705R5805L23753k27603
39139F942374j142748j198511o09516p54568j772841k144278j093921J36827K77133
39130a360049q1800J52846M53140l64203j688564j612336J32264J582688J284775
$$ plain form
39194 50478 -630922 -1125564 -600654 420685 577812 -229826 -881357 -919644 -926572 -1268375
39184 -1268375 -1826154 -2690234 -3826859 -4390657 -3651568 -2254744 -1362794 -1078675 -985141
39175 -985141 -1469775 -2864364 -3978214 -3457030 -2129974 -1913529 -2745516 -2950311 -2475865
39166 -2475865 -3049440 -4788106 -5557354 -4673475 -4397014 -6083546 -7368683 -5463542 -1382967
39157 -1382967 1615348 2468944 2550767 2378864 1043617 -1091485 -1896716 -496408 1341777
39148 1341777 1913800 1975004 3128775 5149267 6498714 6750419 6846224 7169977 6942374
39139 6942374 5799626 4601115 3991599 3237031 1464190 -680088 -1774009 -1637182 -1360049
39130 -1360049 -1441849 -1289003 -835863 -1200066 -2888630 -4500966 -4368702 -2786014 -1501239
39121a501239K9231o89716n22420M4885N53377N37210j38608m76436O44580K217924
39111F98788J765623q98916k659899j299154J253541J802548L43231o96512m27724
39102a18474j06039l97256n68033k81990l0162K29595R13826J325989K82838j664635
39092d14341k499571j445978K62477J402135J809374J378398j2306j278466q23374
39083a621652J013931K047085J339573L33494K16555J88172n79462j152105m79279
39074A306312O47361Q67328M01847L85322Q19254O81836l21680j351509j622275
39065A813796j158517n11502k48880m73838n82606K3512Q55222P55351l74130
39056I8408j246250r99423l17171j79693m79763n76923l89087k15019j25641q6536
$$ plain form
39121 -1501239 -1472008 -2161724 -2684144 -2639259 -2085882 -1548672 -1687280 -2163716 -1519136 698788
39111 698788 2464411 1565495 -1094404 -2393558 -1140017 662531 1005762 309250 -118474
39102 -118474 -224513 -621769 -1189802 -1471792 -1501954 -1272359 -358533 967456 1250294 -414341
39092 -414341 -2913912 -4359890 -4097413 -2695278 -885904 492494 480188 -798278 -1621652
39083 -1621652 -607721 1439364 2778937 3112431 3328986 3517158 2937696 1785591 1306312
39074 1306312 1953673 2821001 3222848 3608170 4427424 5109260 4787580 3436071 1813796
39065 1813796 655279 143777 -105103 -578941 -1161547 -1138035 -282813 472538 98408
39056 98408 -1147842 -2147265 -2464436 -2644129 -3123892 -3700815 -4089902 -4304921 -4430562 -4517098
39046d517098r6072R6714O94153J183697R55839N59817R70081J585281Q05376
39037B237788j060115j664393k49631R37328K56910o06642M40044K275298K382667
39028D949254Q51052j46932N2956J96584k70261p19370j136250j950882k304476
39019d78325r71692J036265J326577k23296j186655l55639P73238R62682J072504
39010A955659J772930J836328L49086j292453j391830n06643k73443q67309j317191
39001B65134j386164j465919j331028o05751P2479j09064n40975N6355J496670
38992c548263K211902J491091K91983l80794o53207q79738o44846N05489J886147
38983B79764K110627P45990j015626j637399r46726j31680m1305j28121M83250
$$ plain form
39046 -4517098 -4613170 -4516456 -3822303 -2638606 -1682767 -1122950 -152869 1432412 2237788
39037 2237788 1177673 -486720 -736351 200977 457887 -148755 291289 2566587 4949254
39028 4949254 5800306 5653374 5706330 5902914 5632653 4913283 3777033 1826151 -478325
39019 -478325 -1450017 -413752 912825 689529 -497126 -852765 -79527 883155 1955659
39010 1955659 3728589 5564917 5914003 4621550 3229720 2723077 2449634 1582325 265134
39001 265134 -1121030 -2586949 -3917977 -4523728 -4451249 -4560313 -5101288 -5044933 -3548263
38992 -3548263 -1336361 154730 446713 65919 -587288 -1467026 -2111872 -1606383 279764
38983 279764 2390391 3136381 2120755 483356 -463370 -595050 -636355 -764476 -281226
38974b81226J470746J704431Q57729l27713j226818j704083j395210Q035J518831
38965F24722J415896l08768j496506p34348O65733Q20531P8529j1310M76947J39011
38955A670437j039325j403782l02454Q50298P79920L1570l69828n56546j021504
38946a361214j251262n06148N97794O74429l12999p39475M75590K232426K523172
38937B332313R15215j008374j653503j097302m22280n1310M26492J027036J008325
38928A476612K6681j164289j670064j482825j028814l30952O47517J324143J042542
38919a159449P5756o64895p45226l76502K20715Q05762P60297k42233j305309
38910b631084j129932J40179R76653O12690K2200K81775R97459J100492M27577
$$ plain form
38974 -281226 1189520 2893951 3751680 3423967 2197149 493066 -902144 -894109 624722
38965 624722 2040618 1731850 235344 -499004 166729 987260 1065789 1054479 1531426 1670437
38955 1670437 631112 -772670 -1075124 -224826 555094 586664 216836 -339710 -1361214
38946 -1361214 -2612476 -3118624 -2520830 -1846401 -2159400 -2898875 -2423285 -190859 2332313
38937 2332313 3247528 2239154 585651 -511651 -933931 -985241 -558749 468287 1476612
38928 1476612 1503293 339004 -1331060 -2813885 -3842699 -4173651 -3526134 -2201991 -1159449
38919 -1159449 -1083693 -1748588 -2493814 -2870316 -2649601 -1843839 -1083542 -1325775 -2631084
38910 -2631084 -3761016 -3620837 -2644184 -2031494 -2009294 -1727519 -730060 370432 798009
38901G98009k91615m73996N31J021107K086114K327466J400089K9165r25042j517560
38891D454268k142080k408720j604407n3770J042571J170318R22219P13298J35298
38882B228995r35730j525674o86732J038360K056161J472945j22784j470739j755880
38873B98922j053225j46950J10458l81976q44695n98675K6606K25995k1618R9772
38863b285386R63072J829463J758734P08849n66266j298971j138977k92382M46333
38854A24469L05919m53785p17698j08769L76076l857m10142J10422P16755N6699
38844c911j056464m74132J643797K463030O58606j388042j155668L56754P32142
38835A776112J60895N20290J482678Q35557j401777k426941r37294R31310J126934
$$ plain form
38901 798009 506394 32398 32929 1054036 3140150 5467616 6867705 6896870 5971828 4454268
38891 4454268 2312188 -96532 -1700939 -1754709 -712138 458180 1380399 2093697 2228995
38882 2228995 1293265 -232409 -919141 119219 2175380 3648325 3525541 2054802 298922
38873 298922 -754303 -901253 -790795 -1172771 -2017466 -2616141 -2589535 -2363540 -2385158 -2285386
38863 -2285386 -1322314 507149 2265883 2974732 2408466 1109495 -29482 -321864 124469
38854 124469 430388 -23397 -741095 -849864 -473788 -477645 -887787 -777365 -60610 -3911
38844 -3911 -1060375 -1534507 109290 2572320 3230926 1842884 687216 1043970 1776112
38835 1776112 1937007 2457297 3939975 4775532 3373755 946814 9520 940830 2067764
38826B067764M81240L62945P180j529897k670409j349789J287931K002498j7496
38817F41967k161996k057823j58505J650907K240344J517346L118j277225j513444
38808a115311j011381n10346J62889J449372K407859J618697j83862n62674R52910
38799C208153J888847O12123j091902r09084M19196N94251n00035j029089m63552
38790B728908j09681n35332p83274m07545k14147m70158k81852N21641O58633
38781A107193m55476j369685o40828R89651J759539J266118L52888n68044j573456
38772H67900k110136j423483n8351M80583k20465r51258o79436K02085Q26906
38763c065655J026083R71780N52097j53957m81930q1259L43819O6007l75229J2433
$$ plain form
38826 2067764 2549004 2911949 2919129 1389232 -1281177 -2630966 -1343035 659463 641967
38817 641967 -1520029 -3577852 -3736357 -2085450 154894 1672240 1675358 398133 -1115311
38808 -1115311 -2126692 -2637038 -2474149 -1024777 1383082 3001779 2817917 2255243 3208153
38799 3208153 5097000 5709123 4617221 3708137 4127333 4721584 4221549 3192460 2728908
38790 2728908 2619227 2083895 1300621 893076 678929 208771 -73081 448560 1107193
38781 1107193 651717 -717968 -1358796 -369145 1390394 2656512 3009400 2441356 867900
38772 867900 -1242236 -2665719 -2724070 -2243487 -2463952 -3415210 -4094646 -3892561 -3065655
38763 -3065655 -2039572 -1067792 -515695 -669652 -1151582 -1232841 -889022 -823015 -1198244 -1185811
38753a185811Q55452P29612n39708j246567j80590J449438J562638L0716j280151
38744A95029j049672J51942J136703J487147J233160K56196j152843j899952j242086
38735h84376M4341N59140J30964j26309M45932J199676J302524Q86323N84906
38726D143121M80826J22220o23687j261740j276984p64140k85218j60688r7537
38717B76173K90773P31383N25609l47292r50850o39659l3591q4190o42693q47557
38707a721894o02554n50859o59458j00989J162762J880233J169646k94499j358214
38698a075826j715695j485266m56414J254287K545468K408701J208672L3563o63372
38689B054118r05888m42048O48174J228510M08514q64971j023955l25968l38848
$$ plain form
38753 -1185811 -330359 399253 -140455 -1387022 -1567612 -118174 1444464 1475180 195029
38744 195029 -854643 -702701 434002 1921149 3154309 3410505 2257662 357710 -884376
38735 -884376 -840035 -280895 -149931 -276240 169692 1369368 2671892 3558215 4143121
38726 4143121 4623947 4746167 4122480 2860740 1583756 819616 534398 373710 276173
38717 276173 566946 1298329 1823938 1476646 525796 -113863 -147454 -231644 -874337 -1721894
38707 -1721894 -2324448 -2875307 -3534765 -3635754 -2472992 -592759 576887 282388 -1075826
38698 -1075826 -2791521 -4276787 -4733201 -3478914 -933446 1475255 2683927 2717490 2054118
38689 2054118 1148230 706182 1354356 2582866 2991380 2126409 1102454 776486 437638
38680D37638j146859j136295J19181R24145K67799m60165J34017J120161R90965
38671A250587K54019K80107O82623J21876r49781q23166L37804M61868r09500
38662G06437j600866l62421Q89576J37671j309356q03014J337080K149911M82834
38653A627852j408584j305757O3769P15014L58744J11963K78231J21426n06429
38644E6229q27986m93064o7931L0247P7716K48293J84002k56747n79949l75577
38634b004767J84800Q41155J491126J679689Q11666o20350j066369J8019J125243
38625B460212P67684l14716l78686O06847J117905N79421o3640k53503m89990
38616D031534q15976m48938M72856N33411o64808j495262p86652K13401j35888
$$ plain form
38680 437638 -709221 -1845516 -1726335 -802190 -534391 -994556 -860539 259622 1250587
38671 1250587 1504606 1784713 2467336 2589212 1639431 816265 1154069 1615937 706437
38662 706437 -894429 -1256850 -367274 -229603 -1538959 -2341973 -1004893 1145018 1627852
38653 1627852 219268 -1086489 -1022720 -307706 51038 163001 441232 562658 56229
38644 56229 -771757 -1264821 -1332752 -1302505 -1224789 -976496 -792494 -1049241 -1629190 -2004767
38634 -2004767 -1819967 -978812 512314 2192003 3003669 2383319 1316950 1334969 2460212
38625 2460212 3227896 2913180 2534494 3141341 4259246 4838667 4775027 4521524 4031534
38616 4031534 3215558 2766620 3239476 3772887 3108079 1612817 826165 1039566 903678
38607I03678j173819j094307J12925Q57996N89811K56099K98884J55951j07012
38598H00206L87279J406707J362085j72484j336462n60932J050952J336489J16674
38589D390514r45590r97146q30678j058854j022124j19320Q99892Q99542L8560
38580A254796m58327n0234M81193L22179k29731m34525l35604n06683q65451p35414
38570a557801j36328O6198l14523k06529R97107K080158J497939l70865j693675
38561C61681j572579p41975o8807L39867M72346J31909l69017l11844K74090N08558
38551i75771K9345m71729m04955l9669K23758L82417L08848k48205p53762j43814
38541b093537J444699K385179J727299M83312j11786m00648j172301j800477j072036
$$ plain form
38607 903678 -270141 -1364448 -1251523 -393527 196284 452383 751267 907218 800206
38598 800206 1187485 2594192 3956277 3783793 2447331 1886399 2937351 4273840 4390514
38589 4390514 3444924 2447778 1617100 558246 -463878 -583198 316694 1216236 1254796
38580 1254796 796469 746235 1227428 1549607 1319876 885351 549747 43064 -822387 -1557801
38570 -1557801 -1694129 -1627931 -1942454 -2148983 -1151876 928282 2426221 2055356 361681
38561 361681 -1210898 -1952873 -2021680 -1681813 -1209467 -1077558 -1446575 -1758419 -1484329 -975771
38551 -975771 -946426 -1418155 -1823110 -1862779 -1639021 -1256604 -947756 -1195961 -1949723 -2093537
38541 -2093537 -648838 1736341 3463640 3946952 3835166 3434518 2262217 461740 -610296
38532f10296O49839J566811O86624j092012k089989j395969M20903J649865J025458
38523H11234n73644q74668P69209K303862J830819J74515p29233o11234k78673
38514B822187L96475J595950J733312o58321l685804l777890p59907J724038J423554
38505H13594J29449O7126O17226L73732r3523K32356M67005o34392k186510k468597
38495b682534j618944r37374n06020L37895J032844O02756j51996M03819J932987
38486a586567K534541J791957J082712P96153k87811k332852l520549k747649
38478d270065j261456n06376j12844P17964J432246J240427P86186J114036J828192
38469I68310J783058R76248L09338p9803p94152j684618j766191p67548L13254
$$ plain form
38532 -610296 39543 1606354 2292978 1200966 -889023 -2284992 -1864089 -214224 811234
38523 811234 237590 -637078 132131 2435993 4266812 4441327 3712094 3100860 2822187
38514 2822187 3218662 4814612 6547924 5889603 2203799 -1574091 -2333998 -609960 813594
38505 813594 943043 1010169 1627395 2001127 1907604 2139960 2606965 1972573 -213937 -2682534
38495 -2682534 -4301478 -5238852 -5744872 -5406977 -4374133 -3771377 -3923373 -3519554 -1586567
38486 -1586567 947974 2739931 3822643 4618796 4330985 1998133 -1522416 -4270065
38478 -4270065 -5531521 -6037897 -6150741 -5432777 -4000531 -2760104 -1973918 -859882 968310
38469 968310 2751368 3727616 4036954 3957151 3162999 1478381 -287810 -1055358 -742104
38460g42104M63503k72979j112895j311492o17760M35540P41136k34498j545277
38451d196826j683542m04912J058666J632892J456179J122771P08025M8629n59787
38442h17905n41124K41836J232924J541988O05794j098790k048835j089417R47483
38433a026046J851991P35424p19349n06626R59854J561025N06642q36392j228449
38424A298074j099646j159259q72280M60824K003122K206005J002103j38031k90469
38415C410443j5045o9960l41272m45567m44379m64015l70506k66231n46909r92778
38405e46219o32848Q16099K108195J886804M19875q72163j171138p52058j44858
38396A111689L07806L19670o7455k42411K25620Q20281P63918J50670l97286q13903
$$ plain form
38460 -742104 -278601 -551580 -1664475 -2975967 -3593727 -3158187 -2417051 -2651549 -4196826
38451 -4196826 -5880368 -6285280 -5226614 -3593722 -2137543 -1014772 -306747 -258118 -817905
38442 -817905 -1359029 -1117193 115731 1657719 2263513 1164723 -884112 -1973529 -1026046
38433 -1026046 825945 1561369 842020 335394 1295248 2856273 3362915 2526523 1298074
38424 1298074 198428 -960831 -1833111 -1372287 630835 2836840 3838943 3700912 3410443
38415 3410443 3395398 3325438 2984166 2538599 2094220 1630205 1259699 993468 446559 -546219
38405 -546219 -1179067 -362968 1745227 3632031 4051906 3179743 2008605 1256547 1111689
38396 1111689 1419495 1739165 1671710 1429299 1654919 2475200 3239118 3389788 2992502 2178599
38386B178599j338526j525596p29902N24834R44760L41784j26323J93594O17121
38377A080345N10183K58585K73158J41675n36283j388000j942037k163778j832025
38368e598177n09639J204332J658057L75146q59573l50410J115393J630039R93524
38359c41308M80757M09327j29459j223299j671593q85981K62657R31519J299300
38350h68080J562176J216259J08792p82722n05009N20448J004776K77080j190915
38341A342805k374759k484809j539960l90042J81279L98400J004065J877174J978291
38332g556Q84855m61253r36561m70325K77026P90304Q75015O16770N02098Q75700
38322B946073J041606r1351k042243k699029j127683P57280O73480q10825j230964
$$ plain form
38386 2178599 840073 -685523 -1415425 -890591 54169 395953 269630 463224 1080345
38377 1080345 1590528 1849113 2122271 2263946 1727663 339663 -1602374 -3766152 -5598177
38368 -5598177 -6107816 -4903484 -3245427 -2870281 -3729854 -4080264 -2964871 -1334832 -341308
38359 -341308 139449 548776 419317 -803982 -2475575 -3361556 -3098899 -2167380 -868080
38350 -868080 694096 1910355 2019147 1236425 731416 1251864 2256640 2533720 1342805
38341 1342805 -1031954 -3516763 -5056723 -5446765 -5265486 -4867086 -3863021 -1985847 -7556
38332 -7556 877299 416046 -520515 -990840 -713814 76490 951505 1568275 2070373 2946073
38322 2946073 3987679 3896328 1854085 -844944 -1972627 -1215347 -541867 -1352692 -2583656
38313b583656J24441J450303J364269O79525N68725N97477k15287j432686j678546
38304a125435o66014M30392N84662o871n74929p57774o32234k66115L36636R97496
38294a680186J376029J267247P83771K10599k45053m71405l01323L61905J125739
38285B427323J177298K32790p73238n99650O39933J441082Q41350l30405p30278
38276D326205l89980m04482j076186j520265j214934q15682r41114j100230n87693
38267c724361K61234O27021N47555O98480J078708R90373L47388n5809J57544
38258I28133L47598n319m26612k98469J35530K93858J95730J53836K7533m16140
38248I35678p44686k86548Q36576J760965J817186R25187n64002j809075j782310
$$ plain form
38313 -2583656 -2459215 -1008912 355357 1034882 1603607 2201084 1985797 553111 -1125435
38304 -1125435 -1791449 -1361057 -776395 -783266 -1358195 -2115969 -2748203 -3014318 -2677682 -1680186
38294 -1680186 -304157 963090 1746861 1957460 1712407 1241002 939679 1301584 2427323
38285 2427323 3604621 3837411 3064173 2464523 3104456 4545538 5386888 5056483 4326205
38276 4326205 3936225 3531743 2455557 935292 -279642 -1095324 -2036438 -3136668 -3724361
38267 -3724361 -3463127 -2836106 -2288551 -1590071 -511363 479010 826398 770589 928133
38258 928133 1275731 1270412 843800 545331 680861 974719 1170449 1324285 1351818 935678
38248 935678 190992 -95556 741020 2501985 4319171 5244358 4680356 2871281 1088971
38239A088971m97784N49734K18872m99602J01674J624400J929639L81526j252808
38230C644622j711156j985803k970706l273766j322850J592111K642299J322865
38222b062384j61457l15488k0452k93269l81004O96128K037061J823365j00680
38213A221820j873519j831877k17561J457623K079870J630551O38917m71905j363327
38204A270592j558946q31499J81747L88307m05700j108268p95224L5352M24669
38195b398970O16458J544330K799099K587601K83912k184204k513749q80446N05948
38186C59979L61609l73832l64686J17538j96481j490507k373872j641236J81147
38177e420341J566085J866010J714131J599852J001495m86903j867008j608704
$$ plain form
38239 1088971 591187 1140921 1359793 860191 961865 2586265 4515904 4897430 3644622
38230 3644622 1933466 -52337 -3023043 -6296809 -7619659 -6027548 -3385249 -2062384
38222 -2062384 -2223841 -2539329 -2559781 -2853050 -3234054 -2537926 -500865 1322500 1221820
38213 1221820 -651699 -2483576 -2701137 -1243514 836356 2466907 3105824 2633919 1270592
38204 1270592 -288354 -1119853 -938106 -549799 -955499 -2063767 -2858991 -2823639 -2398970
38195 -2398970 -1782512 -238182 2560917 5148518 5432430 3248226 734477 -145969 359979
38186 359979 721588 347756 -16930 100608 -95873 -1586380 -3960252 -5601488 -5420341
38177 -5420341 -3854256 -1988246 -274115 1325737 2327232 1840329 -26679 -1635383
38169a635383K70107J937733J862806N02617n58001n98948k40134j76111k10895
38160A153791J88759Q64095J015725K49333q60385j438773j230232n82803J31315
38151e09175N84427K90512q55337j861459j411295L58236J754783J668599Q94294
38142I13585O72923Q88932O93368Q5155l49094o54335j142500j277973l60166
38133e30105R80529J451968J060108Q36022P99368P0334r37304o30479Q82535
38124C982976J263611n75641k497071k176214l73976O70612O56642Q57333J347754
38115C156026R92895j45856o34028l9148M00369j33666q24367o13955L43106J074570
38105C575946Q39590l32367j410570r20166J259648L014276K245108k59596j779670
$$ plain form
38169 -1635383 -1365276 572457 2435263 2937880 2379879 1780931 1540797 1364686 1153791
38160 1153791 1342550 2206645 3222370 3471703 2611318 1172545 -57687 -640490 -509175
38151 -509175 75252 365764 -489573 -2351032 -3762327 -3404091 -1649308 19291 913585
38142 913585 1586508 2475440 3168808 3253963 2904869 2250534 1108034 -169939 -530105
38133 -530105 450424 1902392 2962500 3798522 4597890 4668224 3730920 3100441 3982976
38124 3982976 5246587 4670946 2173875 -2339 -376315 294297 950939 1808272 3156026
38115 3156026 4148921 4003065 3369037 3329889 3730258 3596592 2772225 2158270 2501376 3575946
38105 3575946 4415536 4083169 2672599 1752433 3012081 6026357 8271465 8011869 6232199
38096F232199j360223o62486q85418r74556J57912J482609J367243M470j110382
38087D251368j299152j016767o65472k59093J19066M04427P08888P92526N4831
38078C090622j301192j971859j252907j22854L16662M37119R15430J110457K86953
38069A508431m77418K89168J654262J267024q65065k037502q35835Q83250J025694
38060B412009J26308k80202k72162o23898p17102M05024J735317J334178o21155
38051C498317j925690j523235o07777k53938Q8880J006643J727528J368248L38911
38042C717887m61787q05825o71862K01974J343372J362345m5045j107652m64973
38033C068434N16445k26682k063186k577757j327646j64824Q3315N14952J342181
$$ plain form
38096 6232199 4871976 4209490 3324072 2349516 2507428 3990037 5357280 5361750 4251368
38087 4251368 2952216 1935449 1269977 1010884 1129950 1534377 2243265 3035791 3090622
38078 3090622 1789430 -182429 -1435336 -1558190 -1241528 -804409 111021 1221478 1508431
38069 1508431 1031013 1320181 2974443 4241467 3376402 1338900 503065 1386315 2412009
38060 2412009 2538317 2258115 1985953 1362055 644953 1049977 2785294 4119472 3498317
38051 3498317 1572627 49392 -558385 -812323 -723443 283200 2010728 3378976 3717887
38042 3717887 3256100 2450275 1778413 1980387 3323759 4686104 4641059 3533407 3068434
38033 3068434 3584879 3358197 1295011 -1282746 -2610392 -2775216 -2691901 -2176949 -834768
38024h34768J091370l18295n63070J274280K526180R50801j374713j166898Q21865
38015B406752J204535m34318j229232j84302L55441q17972j581456l94289Q67219
38006A92378K25961r31707l55695J160957J248869r3509r22076p77052q05389
37997a057263r74314p7770J469282J623025j3765j368080j090719l42053m19790
37988b251447o68770o8073P86753P78872J11739l29281m44760m79052q8903Q08164
37978a844758J163234K69709o38887N3101J659134J918836L81237q15603o8583
37969B077420J397914J329303n83413k630148l301766k480269p77463J140157
37961c828265K430255K270380P97378o00236o03539M79172J052331K78730q20325
$$ plain form
38024 -834768 256602 -61693 -624763 649517 3175697 4126498 2751785 1584887 2406752
38015 2406752 3611287 3176969 1947737 1763435 2118876 1300904 -280552 -674841 192378
38006 192378 418339 -513368 -869063 291894 1540763 1447254 525178 -251874 -1057263
37997 -1057263 -2031577 -2109347 -640065 982960 969195 -398885 -1489604 -1831657 -2251447
37988 -2251447 -2920217 -2988290 -2201537 -1422665 -1310926 -1640207 -2084967 -2564019 -2652922 -1844758
37978 -1844758 -681524 -411815 -1050702 -997601 661533 2580369 2961606 2146003 2077420
37969 2077420 3475334 4804637 4221224 1591076 -1710690 -4190959 -4968422 -3828265
37961 -3828265 -1398010 872370 1669748 1069512 465973 945145 1997476 2276206 1455881
37952A455881q13664Q6844L65960m64616j046090k37009J031751J046029j70256
37943A254830r91048o90354k94154n43303n09420P00531J985809J565105k25480
37934B252516j181825m55044J87955q14081k193561j616240P15694K143253J282797
37925C21464j88719k47229N75744M21454p91336j308155l44589P98942P97758
37916C5334N4380k95295k1426L87304O94987P82628J95511j162737k279944j974603
37906c583861m31885J018889J519782J300921Q57373M16918K32280N14013R08446
37897B752876Q01345K92624J09684L87922L83893k86793r71433j012598o94434
37888A763086n71107n34848k73590j11669n52791j274142j364718m85753P89219
$$ plain form
37952 1455881 642217 729061 1095021 630405 -415685 -652694 379057 1425086 1254830
37943 1254830 263782 -426572 -720726 -1264029 -1773449 -1072918 912891 2477996 2252516
37934 2252516 1070691 615647 803602 -10479 -2204040 -3820280 -3104586 -961333 321464
37925 321464 132745 -114484 461260 882714 91378 -1216777 -1561366 -762424 35334
37916 35334 89714 -205581 -227007 160297 855284 1637912 1833423 670686 -1609258 -3583861
37906 -3583861 -4015746 -2996857 -1477075 -176154 681219 1098137 1330417 1844430 2752876
37897 2752876 3554221 3846845 3956529 4344451 4728344 4441551 3470118 2457520 1763086
37888 1763086 1191979 657131 383541 271872 -280919 -1555061 -2919779 -3405532 -2616313
37879b616313J691575J825168J205305K86961j84035Q6496M23415p3290j344995
37870A300287k445277k690294k166413j170347J43194J375560J745803P58652
37862c148835j113719k534396k140868K95616L199103M193778K535184K25438
37854A511301k09416J143605J820243M25119j526231j867091p36482j50807j166465
37845g56224k616318k722374j219491M54102Q91817L89676N32659J930832L055910
37836e9411K261780M24315n2828J119532J497753k87666k199481j876596k60686
37827E66712J57435n30700j21953J519665J827677l35887k614183k462959m29475
37818b423668J280624J743602J264536n5310j826578k560112j312368N28035R26894
$$ plain form
37879 -2616313 -924738 900430 2105735 2392696 2208661 2295157 2718572 2645282 1300287
37870 1300287 -1144990 -3835284 -6001697 -7172044 -7028850 -5653290 -3907487 -3148835
37862 -3148835 -4262554 -6796950 -8937818 -8642202 -5443099 -1249321 1285863 1511301
37854 1511301 1301885 2445490 4265733 4690852 3164621 1297530 561048 410241 -756224
37845 -756224 -3372542 -6094916 -7314407 -6860305 -5968488 -5578812 -5046153 -3115321 -59411
37836 -59411 2202369 2626684 2573856 3693388 5191141 4903475 2703994 827398 566712
37827 566712 724147 193447 71494 1591159 3418836 3082949 468766 -1994193 -2423668
37818 -2423668 -1143044 600558 1865094 1809784 -16794 -2576906 -3889274 -3361239 -2434345
37809b434345J46702R9852J110081J485380N21308k33511M35906J347072P58739
37800C237184r23028j752377r64673K64597O38060J91906k59107l41958l84744
37791b94140p74449j352402j477701p51194L33696P60225J97116m87515k90369
37782d136733N98371J065162O19127L7804J94141P65861P15100j38223p62797
37773a042187l64874M57844O07062J27673Q1774P66942J040370j9311j484898
37764A70395j540120J20235J742112J590636n2078j371420j139292J16208R62259
37755E98935O56428k72377p84727l43472Q17217K034969K559501J868900J75722
37746G311096j423188j812848r85986O8189N70896N30358J75648l72290o88150
$$ plain form
37809 -2434345 -2287643 -2187791 -1077710 407670 928978 695467 1131373 2478445 3237184
37800 3237184 2314156 561779 -402894 -138297 499763 691669 432562 90604 -294140
37791 -294140 -1068589 -2420991 -3898692 -4649886 -4316190 -3555965 -3358849 -3846364 -4136733
37782 -4136733 -3538362 -2473200 -1854073 -1816269 -1622128 -856267 -141167 -279390 -1042187
37773 -1042187 -1407061 -949217 -342155 -214482 -132708 634234 1674604 1655293 170395
37764 170395 -1369725 -1249490 492622 2083258 2031180 659760 -479532 -363324 598935
37755 598935 1255363 982986 198259 -145213 672004 2706973 5266474 7135374 7311096
37746 7311096 5887908 4075060 3089074 3157263 3728159 4258517 4434165 4061875 3373725
37737C373725k39412N55631M23391r18831j972154j504620n01421p01748j815380
37728c300819j901727m09507R14854N74019p10084j286134o83978L71360J183388
37719e248628J514566J409154J245495J462217J786734J377129J72052o88367
37711C030352l96769L42249M19367r6766l62090j62317M9662J08084J55438j1275
37701C075935o61727j348578j290328m82960L35384P31002Q24833O34978L9147
37692A857686o24208p76635m85446l28613l48808m0528N22507N68119o0778m89065
37682b05769k07567P2976l35365q58100n67593L12433Q21696P41662N90927M19028
37672G84328j99659r44233p53610N25317J540224J176986J13184k39712J66956
$$ plain form
37737 3373725 3134313 3689944 4113335 3194504 1222350 -282270 -783691 -1485439 -3300819
37728 -3300819 -5202546 -5612053 -4697199 -4123180 -4833264 -6119398 -6803376 -6432016 -5248628
37719 -5248628 -3734062 -2324908 -1079413 382804 2169538 3546667 3718719 3030352
37711 3030352 2633583 2975832 3395199 3298433 2936343 2774026 2823688 2931772 3087210 3075935
37701 3075935 2414208 1065630 -224698 -707658 -372274 358728 1183561 1818539 1857686
37692 1857686 1233478 456843 -28603 -357216 -706024 -746552 -224045 344074 283296 -205769
37682 -205769 -413336 -340360 -675725 -1533825 -2101418 -1788985 -967289 -225627 365300 784328
37672 784328 584669 -359564 -1113174 -587857 952367 2129353 2242537 2002825 2169781
37663B169781R454j385184k916000k936645j127897J155623K193903J438465q5181
37654a483681q71742m96636J22261J33445j41320o1000j0072p65613j751486j364351
37644f690195O13626K295492K118397Q15438L1454P9304K76897N26071J022477
37635A088961J090298K4097j280531j280524j80600M25763K11869L40456Q42988
37626A282777J86088j701292k381494m59351J846177J741397m6538n80389Q16732
37617G04107J919168J186394l36468j028375p25432j81617Q6333j23709o92100
37608H08301r01637j41352R64133J168730M02585k27970k84231m36527q61091
37599D90941p84139j36895m2734q26436j115431p9604R02740L39529q50679p99928
$$ plain form
37663 2169781 2179235 794051 -2121949 -5058594 -6186491 -5030868 -2836965 -1398500 -1483681
37654 -1483681 -2355423 -2852059 -2729798 -2596353 -2737673 -2798673 -2808745 -3574358 -5325844 -6690195
37644 -6690195 -6076569 -3781077 -1662680 -847242 -815788 -736484 -459587 66484 1088961
37635 1088961 2179259 2203356 922825 -357699 -538299 -112536 99333 439789 1282777
37626 1282777 1468865 -232427 -2613921 -3073272 -1227095 514302 467764 -112625 704107
37617 704107 2623275 3809669 3473201 2444826 1719394 1537777 1624110 1500401 808301
37608 808301 -93336 -234688 729445 1898175 2300760 2072790 1788559 1352032 490941
37599 490941 -293198 -430093 -472827 -1299263 -2414694 -2494298 -1591558 -1252029 -2102708 -2902636
37589b902636J72941J13153j123153j339672N33541K539813K440673P94239j96655
37580A032244J78829Q41211J121640J407871J664427J130367n7889n73119k5270
37571F720311J10517j131595k245510j334759P71468J498944K40478j034887r66126
37562B628841m22135l71339k41226N16469J049388O62805K07686M13203K72710
37553D716402j144200k517865j971436o8886R91829N86094n6514l24416p00220
37544d89212r27944p2378J356910J588710L84139m53910J0756N04147k2852n96520
37534A281846n0898R94088J297632Q48753L23749k29673j016752j638564j546929
37525B63252p35117M66590J470102J275823l88623j768695q52430J301762J414831
$$ plain form
37589 -2902636 -2729695 -2616542 -3739695 -5079367 -4545826 -2006013 434660 1228899 1032244
37580 1032244 1211073 2052284 3173924 4581795 6246222 7376589 7318700 6745581 6720311
37571 6720311 6830828 5699233 3453723 2118964 2890432 4389376 4629854 3594967 2628841
37562 2628841 2206706 1835367 1594141 2110610 3159998 3822803 4030489 4443692 4716402
37553 4716402 3572202 1054337 -917099 -985985 5844 591938 535424 211008 -489212
37544 -489212 -1417156 -1489534 -132624 1456086 1840225 1386315 1397071 1901218 1878366 1281846
37534 1281846 1230948 2225036 3522668 4371421 4695170 4465497 3448745 1810181 263252
37525 263252 -471865 -5275 1464827 2740650 2352027 583332 -269098 1032664 2447495
37516B447495j105826k849921j392066J198845J901980J131096Q48129O45112
37508B824844q63757k409033j641848N17677R31746n96895j008946P98023K133471
37499F85282R99522q46911r98664K4918K52241n53810j085028o50002M00358J541722
37489b30372K221261J898407P91694j41907n00677q21836j321123j409524r21558
37480d35635n96898p93898r09416n85324k66792q5622M85186J347980J543961
37471b96458Q55245K17494L1077l13818o86399L8962J601684J860127M1762j560337
37461A789339q77490Q35749J242211N30158L31874M48252m85613j858296j583685
37452C72499L62748J622422R72712k27224o12192o17076r36133j115645o77128
$$ plain form
37516 2447495 1341669 -1508252 -2900318 -1701473 200507 1331603 2179732 2824844
37508 2824844 1961087 -447946 -2089794 -1572117 -640371 -1237266 -2246212 -1448189 685282
37499 685282 1684804 837893 -160771 -135853 116388 -437422 -1522450 -2172452 -1772094 -230372
37489 -230372 1990889 3889296 4680990 4539083 4038406 3216570 1895447 485923 -435635
37480 -435635 -1032533 -1826431 -2735847 -3321171 -3587963 -3673585 -3188399 -1840419 -296458
37471 -296458 558787 776281 807358 493540 -192859 -153897 1447787 3307914 3349676 1789339
37461 1789339 911849 1747598 2989809 3519967 3851841 4300093 3814480 1956184 372499
37452 372499 735247 2357669 3330381 3103157 2490965 1873889 937756 -177889 -855017
37443h55017j25758R3477L60730P85902N99101m76667j359638j052089j5857P59917
37433a285899J151856J422848J207823J30838j096824j335102n55196K09772L26676
37424A76792J31141O2176M9151l0505O7198N00766Q18161L71357p22368j408111
37414A5758q10328N84891J327730P41778k58967n32661l57558q34993j848551
37405a972901j805963J14538K392896K759437J000049p32783m90360J277990K432053
37396D974956J613470m68458k081610k258236j341433k05507N24038N80276k121
37387A335375p95362j181409r27578l91486l8312K0357l4614Q7493P05457J804021
37377E83942K653272K359332J018585k60302p47786q39582j083555j292284j210399
$$ plain form
37443 -855017 -980775 -887298 -526568 259334 858435 381768 -977870 -2029959 -2045816 -1285899
37433 -1285899 -134043 1288805 2496628 2627466 1530642 195540 -359656 -149884 176792
37424 176792 307933 370109 419260 388755 455953 956719 1774880 2146237 1423869 15758
37414 15758 -794570 -209679 1118051 1859829 1600862 1068201 710643 -124350 -1972901
37405 -1972901 -3778864 -3664326 -1271430 1488007 2488056 1755273 1264913 2542903 4974956
37396 4974956 6588426 6119968 4038358 1780122 438689 233182 757220 1337496 1335375
37387 1335375 540013 -641396 -1568974 -1960460 -1998772 -1978415 -2013029 -1925536 -1220079 583942
37377 583942 3237214 5596546 6615131 6354829 5607043 4767461 3683906 2391622 1181223
37368A181223j223731j541166j380014m4342J633931K033233P07983j282526k686406
37359b601815k771612j221201J384046L235047K898455J289621O46581J425775
37351D284897J793527O07805q04401p91116J71725N31997J45640J26513O85640
37342F752227P12223l44480j421335j212180J04416J089003P38782m81620j352782
37333D584254j372910j180704j423691j657176r46281O03061J714472J585462
37325A906487R62997J053905J815558K001096Q20474j003204k037684j725674
37317C793955q49435l90167k95876J49170Q80031Q25767m77077j846880j841620
37308e2132o39449M14607P31035Q06800Q55279M54136k55597l16365N47647J186381
$$ plain form
37368 1181223 -42508 -1583674 -2963688 -3008030 -1374099 659134 1367117 84591 -2601815
37359 -2601815 -5373427 -6594628 -5210582 -1975535 922920 2212541 2859122 4284897
37351 4284897 6078424 6686229 5881828 5090712 5262437 5794434 5940074 6066587 6752227
37342 6752227 7464450 7119970 5698635 4486455 4590871 5679874 6418656 5937036 4584254
37333 4584254 3211344 2030640 606949 -1050227 -1996508 -1393447 321025 1906487
37325 1906487 2869484 3923389 5738947 7740043 8560517 7557313 5519629 3793955
37317 3793955 2944520 2554353 2258477 2407647 3287678 4113445 3636368 1789488 -52132
37308 -52132 -691581 -276974 454061 1260861 2116140 2570276 2314679 1998314 2545961 3732342
37298C732342M80550j114930k101245j607014j48401R57384Q00510j54432m44255
37289D00509N45485J522030R81953n02743j073401l83137J47151q7745r6291M00664
37279A854475R9227j356452k092678q65536O56744M74632m43788J37079J800288
37270B63991J981308L8769j812249j876894r65653l97493n7207N78331J046714
37261a200383O90978j39508o28189n56300j56938M44684J009991R45069o8456
37252C40948j447025k143547j641908m00389N98124Q16884P69371J309616K194729
37243C96803K105129O09611p86715n30329P97409J436256J001529N81693O05325
37234F216711L01755n95202j176709q04460L4406P04252J127520J213722P26217
$$ plain form
37298 3732342 4212892 3097962 996717 -610297 -758698 198686 999196 844764 400509
37289 400509 945994 2468024 3449977 2947234 1873833 1490696 1637847 1550102 1453811 1854475
37279 1854475 1953702 597250 -1495428 -2360964 -1704220 -1229588 -1673376 -1536297 263991
37270 263991 2245299 2284068 471819 -1405075 -2370728 -2768221 -2825428 -2247097 -1200383
37261 -1200383 -509405 -648913 -1277102 -1833402 -1990340 -1545656 -535665 409404 340948
37252 340948 -1106077 -3249624 -4891532 -5291921 -4693797 -3876913 -3107542 -1797926 396803
37243 396803 2501932 3111543 2324828 1794499 2591908 4028164 5029693 5611386 6216711
37234 6216711 6518466 5923264 4746555 3942095 3976501 4680753 5808273 7021995 7748212
37225G748212M0583p6740K68875J94323l91349o04002k33133j04807l81251j22649
37215F338062P80479R65046o5959o46229N21179J951832J379990p43335j785346
37206H695719o43884R70500J137548L9721q43088p09635Q1582Q59478J301384
37197A0889325J399451J164947N52847k73717q06638o70309j38140K80420O21060
37188A3019246J169100J542444J056136O2886k09008N53861J290424J312187J250383
37179B1047659J652563J954135J714779J633541K278241K910490K686616K000594
37171C7878618J551112J207142R76651J773686L688884M832696L872422K625317
37163E8406528L835285P126485R662295J0435399J1276207J3587333J6757754
$$ plain form
37225 7748212 7788795 7712055 7980930 8175253 7783904 7179902 6946769 6841962 6460711 6338062
37215 6338062 7118541 8083587 8017628 7371399 7892578 9844410 11224400 10481065 8695719
37206 8695719 8051835 9022335 10159883 10199604 9356516 8646881 8728463 9587941 10889325
37197 10889325 12288776 13453723 14006570 13732853 12926215 12255906 12117766 12398186 13019246
37188 13019246 14188346 15730790 16786926 16849812 16640804 17194665 18485089 19797276 21047659
37179 21047659 22700222 24654357 26369136 28002677 30280918 33191408 35878024 37878618
37171 37878618 39429730 40636872 41613523 43387209 47076093 51908789 55781211 58406528
37163 58406528 62241813 69368298 79030593 89465992 100742199 114329532 131087286
37156A31087286K0285160K4885731L0624394L6276192M1480244M6904513N0585029
37149C82128549M6661181L0880614O746487j6232828l0602986l6000594l6746581
37142C46833842l6577154l6354010l5319255l2948651k9449583k5269357k0823780
37135A30092052j6752921j3841322j2213420j1015804r490439p948912o941088
37128E1888146o020341m524072l171051l294269m501710m835256l619583k418217
37120A9503647k490635k998089k696546j813652j031271q3067J156108J473716
37112A1020211l6144k040700k466338j325134l44793k68806l23797j43987l63849
37103C706663j092863j415642q65840j35441J44798K80193P10761J191748J207736
$$ plain form
37156 131087286 151372446 176258177 206882571 243158763 284639007 331543520 382128549
37149 382128549 428789730 459670344 466416831 450184003 419581017 383580423 346833842
37142 346833842 310256688 273902678 238583423 205634772 176185189 150915832 130092052
37135 130092052 113339131 99497809 87284389 76268585 66778146 58829234 51888146
37128 51888146 45867805 41343733 38172682 34878413 30376703 25541447 21921864 19503647
37120 19503647 17013012 14014923 11318377 9504725 8473454 8390387 9546495 11020211
37112 11020211 10984067 8943367 6477029 5151895 4807102 4538296 4214499 4070512 3706663
37103 3706663 2613800 1198158 332318 196877 341675 621868 1332629 2524377 3732113
37094C732113O02765m07706j298553j317811j96520J230209J786346J252389K34643
37085E617875r30782k156824k784800k107101p46960j73243n89325o38414L78127
37076d131447J378636J299376P10621O19126P14272O6099j089186j556290r22445
37067b911238n221L87243K53250p0053l73889m02647J56672J194901K028174J997360
37057B254552J130561J19841l40784k22407j47605n93083j196061j160691l44381
37048e00058M70465N16023j22971p78334r63537o93720l44029l10777n09840k25550
37038c462328J029537K467452K561764R30225j008687j697180j103308k10999
37030d93524M13520P22695M63753n05631j373618j021392K85366Q78556j31616
$$ plain form
37094 3732113 4334878 3927172 2628619 1310808 1114288 2344497 4130843 5383232 5617875
37085 5617875 4687093 2530269 -254531 -2361632 -3108592 -3281835 -3871160 -4509574 -4131447
37076 -4131447 -2752811 -1453435 -742814 -123688 590584 656683 -432503 -1988793 -2911238
37067 -2911238 -2916459 -2529216 -2275966 -2346019 -2719908 -3122555 -2965883 -1770982 257192 2254552
37057 2254552 3385113 3504954 3164170 2941763 2794158 2201075 1005014 -155677 -500058
37048 -500058 -29593 486430 363459 -414875 -1378412 -2072132 -2416161 -2726938 -3236778 -3462328
37038 -3462328 -2432791 34661 2596425 3526650 2517963 820783 -282525 -493524
37030 -493524 -80004 642691 1106444 600813 -772805 -1794197 -1508831 -630275 -761891
37021g61891j449540j149495P35422K049024J090234j266445k533984j480415
37013d767090N92159J611459J132644L33504O1773k1509k73431k64463K08323
37004a386631L23762n08219j305766p18855P71383J268010J34475j105208r40345
36995c467394K63440J201684J369711J040408L97509l01465l57972M63175J096115
36986A705211L91867j068142j571945o52311L62935L63874k07799m92940n16328
36977a685578n98839m21641L69237J270026J553416J297426R34326L29064o99951
36968B347486j457789j164495l21250k798o0254M70001J283825R71660m07023
36959A659363q87533L63343J431408M77287j393533j862377q01694R0485K54612
$$ plain form
37021 -761891 -2211431 -3360926 -2625504 -576480 513754 -752691 -3286675 -4767090
37013 -4767090 -4174931 -2563472 -1430828 -1097324 -1035551 -1057060 -1330491 -1594954 -1386631
37004 -1386631 -1062869 -1571088 -2876854 -3595709 -2824326 -1556316 -1421841 -2527049 -3467394
36995 -3467394 -3203954 -2002270 -632559 407849 805358 503893 145921 609096 1705211
36986 1705211 2097078 1028936 -543009 -1195320 -832385 -468511 -676310 -1169250 -1685578
36977 -1685578 -2284417 -2706058 -2336821 -1066795 486621 1784047 2718373 3047437 2347486
36968 2347486 889697 -274798 -596048 -598846 -659100 -189099 1094726 2066386 1659363
36959 1659363 771830 1135173 2566581 3043868 1650335 -212042 -1013736 -923251 -668639
36950f68639O20042J300451J239073L93155J74144J094142J784674J174508P3708
36941G185258l58832l64100p33008j300760j366757q17403K1920Q73389J173065
36932D312772K48290j378538j939387o52546J008999J324499N37405j36843n60478
36923B764173j145447j256500q4866J432507J565679M40506k21646L9201r7828
36914C435779j109513j612001p48758L06061L63464J40811P67759J599975J139451
36905D283028n39894j798769j611134n11672N32794J103692J063773K36316j193818
36896A564316k348783k141413k58274K222896L385225K159239m44412k284948
36888A853846k371222j585221j035900o24689K21960J226716J537950R24817k9372
$$ plain form
36950 -668639 -48597 1251854 2490927 2884082 3058226 4152368 5937042 7111550 7185258
36941 7185258 6826426 6462326 5729318 4428558 3061801 2244398 2266318 3139707 4312772
36932 4312772 4561062 3182524 1243137 590591 1599590 2924089 3461494 3324651 2764173
36923 2764173 1618726 362226 277360 1709867 3275546 3716052 3494406 3533607 3435779
36914 3435779 2326266 714265 -34493 271568 635032 775843 1543602 3143577 4283028
36905 4283028 3743134 1944365 333231 -178441 354353 1458045 2521818 2758134 1564316
36896 1564316 -784467 -2925880 -3184154 -961258 2423967 4583206 4138794 1853846
36888 1853846 -517376 -2102597 -3138497 -3763186 -3541226 -2314510 -776560 148257 118885
36879A18885o68488o69645n7778O64601P88214L09366R3943N44115P02645m31385
36869A394473k143806k648194j372230M01363J242609J016531M30662k4251k76544
36860a979387l53750k76291q1400J71337L11828J60682n0157K59201J086192J451381
36850F99636O42486n85562r98090p20285q75714j495815j236123M61377K267004
36841a841086K721010K006493J159446M50015m85379j584134k384255k618747
36833b576637k003364p8412K741227M525514L519173L70240k379095l015744j983497
36824h80595o41701J73843K19032m03420j063065r32958J2791Q18415O57741k91877
36814b331794j200539j341169n18841O42747R29364j51240j359241j038698N42395
$$ plain form
36879 118885 -549603 -1219248 -1277026 -612425 175789 485155 579098 1123213 1825858 1394473
36869 1394473 -749333 -3397527 -4769757 -4368394 -3125785 -2109254 -1678592 -1702843 -1979387
36860 -1979387 -2333137 -2609428 -2690828 -2519491 -2207663 -2046981 -2097138 -1837937 -751745 699636
36850 699636 1342122 756560 -241530 -961815 -1837529 -3333344 -4569467 -4108090 -1841086
36841 -1841086 879924 2886417 4045863 4495878 4010499 2426365 42110 -2576637
36833 -2576637 -4580001 -4658413 -1917186 2608328 6127501 6497741 4118646 1102902 -880595
36824 -880595 -1522296 -1348453 -1129421 -1532841 -2595906 -3528864 -3516073 -2697658 -2039917 -2331794
36814 -2331794 -3532333 -4873502 -5392343 -4749596 -3820232 -3971472 -5330713 -6369411 -5827016
36805e827016J429331P88895o275K81739Q81931N61211l09870o11707k99987Q9683
36795c022065P44483J742827J904164M40088j055716n84847Q28063L88823j859403
36786d73583k721075p93379J342756J279526K93109O27786J660220J372935o0411
36777B527884r06322r11196j022630r74916P3523J103592L55760j334767j310425
36768b399497O17899J679452N81316n83784p4751O84609j53091j625022j644647
36759b917516k61692R00390J219263J061467K27233j525781l064865k903663j281106
36750h546270L09491J167460J500903J190974J75476m65947L19537J600912J525110
36741a222354J53882o61299j88242M15712M22438N11486Q86810M91777r15541
$$ plain form
36805 -5827016 -4397685 -3608790 -3615065 -3333326 -2451395 -1890184 -2200054 -2811761 -3111748 -3022065
36795 -3022065 -2277582 -534755 1369409 1809497 753781 168934 996997 1385820 -473583
36786 -473583 -3194658 -3988037 -2645281 -1365755 -1072646 -444860 1215360 2588295 2527884
36777 2527884 1621562 710366 -312264 -1287180 -1213657 -110065 245695 -1089072 -2399497
36768 -2399497 -1781598 -102146 479170 -104614 -179365 505244 352153 -1272869 -2917516
36759 -2917516 -3179208 -2278818 -1059555 1912 229145 -1296636 -4361501 -7265164 -8546270
36750 -8546270 -8236779 -7069319 -5568416 -4377442 -4201966 -4667913 -4348376 -2747464 -1222354
36741 -1222354 -1068472 -1729771 -1918013 -1502301 -1079863 -568377 318433 810210 -105331
36732a05331j708606o96990R04294J141555r8995j415265j876272j473071l98499
36723e727180Q55371J308104O35897O362N79105J643885J551590J72791r92934
36714C2991j095884q47924q65612n28251P28381K015459J965210O51131m50023
36705A605478l68772K75070L32124l09342p12256k57381N19890O59968J1316o35272
36695A120823n36026K33462R88345J106978M92583l16167n09166J35159P70943
36686C486934L90619p10643j040221K01505J975732K677149K010307R08100K1053
36677I920535p59717j372212j235317k52300N83174K61019q98285j620296j315540
36668C311061p12601o83363j011621q37417j9221O50903O51002M46542O18135
$$ plain form
36732 -105331 -1813937 -2510927 -1606633 -465078 -564073 -1979338 -3855610 -5328681 -5727180
36723 -5727180 -4871809 -3563705 -2927808 -2921446 -2342341 -698456 853134 1025925 32991
36714 32991 -1062893 -1910817 -2776429 -3304680 -2576299 -560840 1404370 2055501 1605478
36705 1605478 1236706 1511776 1843900 1534558 822302 564921 1084811 1744779 1756095 1120823
36695 1120823 584797 818259 1806604 2913582 3406165 3089998 2580832 2715991 3486934
36686 3486934 3877553 3166910 2126689 2328194 4303926 6981075 8991382 9899482 9920535
36677 9920535 9160818 7788606 6553289 6300989 6884163 7145182 6246897 4626601 3311061
36668 3311061 2598460 1915097 903476 66059 46838 697741 1348743 1795285 2413420
36659B413420Q40599L83716o59310j355767j098361j85480P47192J268279J106838
36650C461126K60119o67899q67932l39452M5434k45696p18031p35812n23059p53749
36640a084951j510355k143866j973753q35232Q08476K081227K352761J861779
36632d43914J307424P96892j15787j224721j520480p57145j13428l96822n72089
36623c040070O06979K218375K142456K70609j062893l55350R44101O27330j088825
36614A262712j986240j004634M73531P47781O4839l1843R57413J820605J386140
36605C690304O7868q57708q99620n08172Q962O89493J097782M56134j071857k233910
36595D39276k270239j656502q03327O92401K571308L038622R68352j875828k674381
$$ plain form
36659 2413420 3254019 3637735 2978425 1622658 524297 338817 1086009 2354288 3461126
36650 3461126 3721245 3053346 2185414 1845962 1891396 1645700 927669 191857 -331202 -1084951
36640 -1084951 -2595306 -4739172 -6712925 -7548157 -6739681 -4658454 -2305693 -443914
36632 -443914 863510 1660402 1544615 319894 -1200586 -1957731 -2071159 -2467981 -3040070
36623 -3040070 -2433091 -214716 1927740 2198349 1135456 780106 1724207 2351537 1262712
36614 1262712 -723528 -1728162 -1254631 -506850 -442011 -473854 483559 2304164 3690304
36605 3690304 3758172 2900464 2000844 1492672 1501634 2191127 3288909 3745043 2673186 439276
36595 439276 -1830963 -3487465 -4290792 -3598391 -1027083 2011539 2979891 1104063 -1570318
36586a570318j237835O535l35915r67146l67866Q81349J248268M44447o01872
36577b500353j118091q96337J3803J154306J634602R61981l49017j340679j412309
36568c852094m54534J091514K089666J524529r9409j024778l80096Q35093J382569
36559A112460J308866J104917N22805o32848j487884j206653m11338j30506J7107
36550A96926R85540K101657J630812l46246j528008n42575J080156J123528l21193
36541D380597j361147j092461m77444n23590q15664l68001P31685J270614M94012
36532B238601q02336j170930l04133O53633O86004J24474j50115q8482k56291
36523I30425o12394m88100K33458Q36071Q59902O71914O48012N14977m3047o90823
$$ plain form
36586 -1570318 -2808153 -2801618 -3137533 -4104679 -4472545 -3591196 -2342928 -1898481 -2500353
36577 -2500353 -3618444 -4514781 -4500978 -3346672 -1712070 -750089 -1099106 -2439785 -3852094
36568 -3852094 -4306628 -3215114 -1125448 399081 299672 -725106 -1105202 -270109 1112460
36559 1112460 2421326 3526243 4049048 3416200 1928316 721663 310325 179819 196926
36550 196926 1182466 3284123 4914935 4568689 3040681 2498106 3578262 4701790 4380597
36541 4380597 3019450 1926989 1449545 925955 110291 -257710 473975 1744589 2238601
36532 2238601 1436265 265335 -38798 614835 1300839 1425313 1275198 1186716 930425
36523 930425 318031 -170069 63389 899460 1759362 2431276 3079288 3594265 3551218 2860395
36513B860395q93287p26048p46649j184133j582331j254790m9233J271520J589925
36504g14631O77628l42318k90519M98239O33551l30333j251263j027993l3135
36495b180774N79176L50917k45019n61902k67459N20447J157714R30049m0982
36486B42167p60442n28900L44561J212357J734915J560460L79771j076667j225245
36477A882977J75096J095017j07762k049632k152926m78529M90746j97092o87423
36468b029528L52586J491361J027200j41847l6390J185850J529434J69382j603682
36459A944366k324739j808131o67860L86829P08036J75631m66403n55192n26944
36450c134407j022401j416366o13068R39907J649155J215378R35768J286672J124989
$$ plain form
36513 2860395 1967108 1241060 494411 -689722 -2272053 -3526843 -3576076 -2304556 -714631
36504 -714631 -37003 -379321 -669840 -171601 461950 131617 -1119646 -2147639 -2180774
36495 -2180774 -1601598 -1250681 -1495700 -2057602 -2325061 -1804614 -646900 283149 242167
36486 242167 -518275 -1047175 -702614 509743 2244658 3805118 4184889 3108222 1882977
36477 1882977 2058073 3153090 3045328 995696 -1157230 -1635759 -1145013 -1342105 -2029528
36468 -2029528 -1676942 -185581 841619 699772 663382 1849232 3378666 3548048 1944366
36459 1944366 -380373 -2188504 -2856364 -2469535 -1761499 -1585868 -2052271 -2607463 -3134407
36450 -3134407 -4156808 -5573174 -6186242 -5246335 -3597180 -2381802 -1446034 -159362 965627
36441I65627K1623n57048L59943J404988J042178J13737K41335Q32355O8142j685555
36431B807325k052011m06828R65838K82421j220959j388395j78121Q47438R68585
36422F25293P25015M89314M3300n72078q68377o34016j73671J43681J26738k14333
36412c09134m54919M5725J199028J883229J262359Q493n77882l17938r1102k47062
36402B400797k11301J88340J04956j060749k497551k750512j358738O77850J863727
36393b643181J442761j2184j026278n65512Q12548J465148N53364r39853j417733
36384b330920n51095N53250Q89503O33873N35806P58218Q13688M83254J98126
36375A983703K56923J46829p30564j818074j732435j42502J458871J540406N17533
$$ plain form
36441 965627 987250 430202 790145 2195133 3237311 3351048 3592383 4424738 4492880 2807325
36431 2807325 755314 348486 1314324 1596745 375786 -1012609 -1190730 -343292 625293
36422 625293 1350308 1839622 1882922 1310844 442467 -191549 -365220 -221539 -94801 -309134
36412 -309134 -764053 -718328 480700 2363929 3626288 3634781 3056899 2738961 2647859 2400797
36402 2400797 2189496 2377836 2482792 1422043 -1075508 -3826020 -5184758 -4506908 -2643181
36393 -2643181 -1200420 -1212604 -2238882 -2804394 -1991846 -526698 26666 -913187 -2330920
36384 -2330920 -2882015 -2328765 -1439262 -805389 -269583 488635 1302323 1785577 1983703
36375 1983703 2240626 2387455 1656891 -161183 -1893618 -2036120 -577249 963157 1480690
36366A480690K5226N58692J020468O38643K4980j66287l94789j115284j500454
36357E71885o02297P79322Q99769l59922j253648q13230k24845p57322j616646
36348c376934j181047M11104J429851J070839L38376K35317M00612R8748m82754
36339a055888o69497l13877L07730R81898J288817N61140r94012j746765l85935
36330b026389K066604L165615J945650j69608j397909j377223p14032J511K23234
36321A717453l81831j120339o58851R96373J945840Q57078r67041j300071m4131
36312A044480R93917R40125O50156O20909L1427j389635k153176r47322J187862
36303I78743K000984R06394n39867r49490o91966q04560j225084r48447K61293
$$ plain form
36366 1480690 1505916 2064608 3085076 3723719 3748699 3582412 3187623 2072339 571885
36357 571885 -30412 748910 1648679 1288757 35109 -778121 -1002966 -1760288 -3376934
36348 -3376934 -4557981 -4146877 -2717026 -1646187 -1307811 -1072494 -671882 -573134 -1055888
36339 -1055888 -1725385 -2039262 -1731532 -749634 539183 1100323 106311 -1640454 -2026389
36330 -2026389 40215 3205830 5151480 4981872 3583963 2206740 1492708 1494219 1717453
36321 1717453 1335622 215283 -443568 552805 2498645 3355723 2388682 1088611 1044480
36312 1044480 2038397 2978522 3628678 4249587 4281014 2891379 738203 -209119 978743
36303 978743 2979727 3886121 3346254 2396764 1704798 900238 -324846 -1273293 -1012000
36294a012000J130205L45378j503050k209314n57274J929425K625294R77801r10931
36285H15534j021068K73221J177676Q93759J37768k63474k40043j2251L08680
36276B069802M47845J2803q63093j427760j167712l69700M12835J020943J489537
36267A625500J602635J145087L82409j87522m54903o41684p31355m70537N1208
36258B320838L78453L91070M68525O85110M46667n48833j499265j415950n91033
36249F35582k69416q58473j382341j007018k54269j11516n62642p74508m33989
36240e018590j08168k45428m23746J41575J567004K958389L142912J836687M5530
36231C896165r10650p02590R920O76006J203189J220878J17175j652720k373302
$$ plain form
36294 -1012000 118205 463583 -1039467 -3248781 -3806055 -1876630 748664 1726465 815534
36285 815534 -205534 67687 1245363 2139122 2276890 2013416 1773373 1761122 2069802
36276 2069802 2517647 2530450 1667357 239597 -928115 -1297815 -884980 135963 1625500
36267 1625500 3228135 4373222 4755631 4568109 4113206 3471522 2740167 2269630 2320838
36258 2320838 2699291 3090361 3558886 4243996 4690663 4141830 2642565 1226615 635582
36249 635582 366166 -492307 -1874648 -2881666 -3135935 -3247451 -3810093 -4584601 -5018590
36240 -5018590 -5126758 -5372186 -5795932 -5654357 -4087353 -1128964 2013948 3850635 3896165
36231 3896165 2985515 2282925 2292845 2968851 4172040 5392918 5510093 3857373 1484071
36222A484071j161730N65093R11182J59337J44722J268799J819585N65368j448051
36213D308376k380368j821543q01110l49025p22983j460969j601957l89077J663494
36204c555162K852821K015230j10276j671772j594329l63348P64247R58972L67975
36195c35642l16258p79682j279007j690736j078368Q68400K533737K021350K0501
36186c5705p30699P07440J993613R02040j434879k243073r16902O77399J079777
36177i89O36584J89100m5580p8022J71992N00190N22063K62542K5319j85106m78102
36166A519991o31602n37743o11385r06499n10970R50425J899386O21120j826023
36157c3300k543514q36707P32623N3533j672644j961289m21157J330477K054521
$$ plain form
36222 1484071 322341 887434 1798616 1957953 2102675 3371474 5191059 5756427 4308376
36213 4308376 1928008 106465 -694645 -1043670 -1766653 -3227622 -4829579 -5218656 -3555162
36204 -3555162 -702341 1312889 1202613 -469159 -2063488 -2426836 -1662589 -703617 -335642
36195 -335642 -651900 -1431582 -2710589 -4401325 -5479693 -4611293 -2077556 -56206 -35705
36186 -35705 -766404 -58964 1934649 2836689 1401810 -841263 -1758165 -1080766 -989
36177 -989 635595 824695 779115 701093 873085 1373275 1895338 2157880 2183199 1998093 1519991
36166 1519991 888389 350646 -260739 -1167238 -1678208 -727783 1171603 1792723 -33300
36157 -33300 -2576814 -3413521 -2680898 -2627365 -4300009 -6261298 -6682455 -5351978 -3297457
36148c297457J728583P25841m36897r48940n00358Q8799J5342k22790K02089P47481
36138a898307K28210j025933j377642l79853N51142M17091M491J58241K35250
36129c087310l92235n75369R95688L103870L095762O98889j376731j270086l44982
36120H47496n07347j073801l71894Q82979N10714j259593j740340r8594J101750
36111a708630J7873j333191k44449K237502K817705R25952p71891o78129j51120
36102A111622m57033n47548O40826J733630P89366j491507k416509q29481J563009
36093I6375K413007J147084r45895k168520j764048l94110N66362M73650Q298
36084e67797N2935M02283K08447n69762r71472l55259P48641J362783J190463
$$ plain form
36148 -3297457 -1568874 -843033 -1279930 -2228870 -2729228 -2640429 -2625087 -2847877 -2645788 -1898307
36138 -1898307 -1670097 -2696030 -4073672 -4453525 -3902383 -3485292 -3480801 -3322560 -3087310
36129 -3087310 -3479545 -4054914 -3059226 44644 3140406 3839295 2462564 1192478 847496
36120 847496 340149 -733652 -1105546 -222567 288147 -971446 -2711786 -2810380 -1708630
36111 -1708630 -1690757 -3023948 -3268397 -1030895 1786810 2712762 1940871 1262742 1111622
36102 1111622 654589 107041 747867 2481497 3270863 1779356 -637153 -1466634 96375
36093 96375 2509382 3656466 2710571 542051 -1221997 -1616107 -1049745 -576095 -567797
36084 -567797 -514862 -112579 95868 -473894 -1445366 -1800625 -1051984 310799 1501262
36075A501262P04171L62973J01984l58571r07468j009720l98098M04191N60336
36066I61060j38571j123503j763107j793604j089104L16923J728054J972449O74895
36057b54508j003796j460241l52983J154161J671080P64945q72872j962858j496937
36048c814009L68900K189323K416075R13342r04903j542970q54235N3516J15874
36039a059087o83878j507520j581691q00527L85744J364824J643681J095534J33088
36030a009832n79821p62817o62801m85975r6242M90729Q01242N06076j00693o62112
36020b562246j263399j794165j465171Q3322J666603J716813L67412p62579p65907
36011d779317k47365L7994N2479j47723n87516o89455K26745J452698J402426
$$ plain form
36075 1501262 2205433 2568406 2670390 2311819 1404351 394631 -3467 400724 961060
36066 961060 822489 -301014 -2064121 -3857725 -4946829 -4629906 -2901852 -929403 -254508
36057 -254508 -1258304 -2718545 -3071528 -1917367 -246287 518658 -354214 -2317072 -3814009
36048 -3814009 -3445109 -1255786 1160289 2073631 1168728 -374242 -1228477 -1174961 -1059087
36039 -1059087 -1742965 -3250485 -4832176 -5632703 -5246959 -3882135 -2238454 -1142920 -1009832
36030 -1009832 -1589653 -2352470 -3015271 -3501246 -3597488 -3106759 -2305517 -1799441 -1900134 -2562246
36020 -2562246 -3825645 -5619810 -7084981 -7001659 -5335056 -3618243 -3250831 -4013410 -4779317
36011 -4779317 -5026682 -4988688 -4936209 -5083932 -5671448 -6360903 -6134158 -4681460 -3279034
36002c279034J20499l56527R98685K443251J929171m2231j476434j679869j411635
35993b754124j087989n25072j0284o2988l08883J10776J125973J799768J625981
35984h6842Q76039o3m73448j457J038464J165908l02485j893832j845365n81538
35974b104619K30294L56144Q00892J439372J079571j18752n08483L81268J064342
35965B620029N19171n11767j266684k061824k774205k160883K9597J872660J646606
35956b087300J55926p05108n75782l29571j17603N85679J453280J395292J55108
35947g0079j281800j882539j429809l61974O13554R89772J030719J459991K178696
35938A246531K034287N28064j047580j128377N8313R34178O19605l99285j245443
$$ plain form
36002 -3279034 -3158535 -3515062 -2516377 -73126 1856045 1813814 337380 -1342489 -2754124
35993 -2754124 -3842113 -4367185 -4377469 -4440457 -4749340 -4638564 -3512591 -1712823 -86842
35984 -86842 789197 789134 315686 314229 1352693 2518601 2216116 322284 -1523081 -2104619
35974 -2104619 -1874325 -1518181 -717289 722083 1801654 1682902 1174419 1555687 2620029
35965 2620029 3139200 2627433 1360749 -701075 -3475280 -5636163 -5606566 -3733906 -2087300
35956 -2087300 -1931374 -2636482 -3212264 -3541835 -3659438 -3073759 -1620479 -225187 -70079
35947 -70079 -1351879 -3234418 -4664227 -5026201 -4412647 -3422875 -2392156 -932165 1246531
35938 1246531 3280818 3808882 2761302 1632925 1691238 2625416 3245021 2845736 1600293
35929A600293j371962o91807J21788j04764j538940k569568j638123N69808J991429
35920c631846J917524J455088J403599J260761O11541p063k24624n24968j071835
35911A188177j022851K6662R19018M59132o33830o78178L82826Q26184k31634
35902A235506j453238j231108M4120P70435N74298N72025J188025J174400m00704
35893B473759k217814k052022K50452K385588K365030O71670p67172r23327l36421
35884A849743K9269j41650m68738m27013Q6646N93003N35345n0344o08760p41524
35874F55977m41490J94655Q84353R21822j02715j298988j240896j104P49621J87354
35864E08589m21462J79677J181249J127089L71248L69375J089048J060282m3746
$$ plain form
35929 1600293 228331 -463476 -341688 -446452 -1985392 -4554960 -6193083 -5623275 -3631846
35920 -3631846 -1714322 -259234 1144365 2405126 3016667 3009604 2784980 2260012 1188177
35911 1188177 165326 191988 1111006 1570138 936308 258130 640956 1467140 1235506
35902 1235506 -217732 -1448840 -1404720 -634285 -59987 512038 1700063 2874463 2473759
35893 2473759 255945 -1796077 -1545625 839963 3204993 3876663 3109491 2186164 1849743
35884 1849743 1879012 1737362 1268624 841611 928257 1521260 2056605 2006261 1397501 655977
35874 655977 214487 409142 1293495 2215317 2112602 813614 -427282 -428386 321235 508589
35864 508589 87127 266804 1448053 2575142 2946390 3315765 4404813 5465095 5421349
35855E421349p90445l97626n0604r26794k213750k238895p84541Q10052J406028
35846B34774R53452j37449j543178k770959l052689k001641k46600R70393J034264
35837f559633O35541Q65344J688453J926983J025010Q9420M39239J637217J979800
35828C727374P87042q27920j573644j396237r76137o54557l60579o0675J66116
35819a169217K00641j19881p05503r62076m49876K56014K13766l12144j9463J324516
35809a743223K148533J242992l98550j022622n90295m30719q88811q93084O9720
35800b506059J022249J028964M86493K04619J59486j192L157M91418P77455n8057
35790A608533j492951j934836j018547k94532r42578j869272j221995Q44926K296130
$$ plain form
35855 5421349 4630904 4233278 4182674 3255880 1042130 -1196765 -1981306 -1171254 234774
35846 234774 1188226 1050777 -492401 -3263360 -6316049 -8317690 -8564290 -7593897 -6559633
35837 -6559633 -5924092 -5058748 -3370295 -1443312 -418302 -328882 110357 1747574 3727374
35828 3727374 4514416 3686496 2112852 716615 -259522 -914079 -1274658 -1335333 -1169217
35819 -1169217 -968576 -1088457 -1793960 -2756036 -3205912 -2949898 -2736132 -3048276 -3067739 -1743223
35809 -1743223 405310 1648302 1249752 227130 -363165 -793884 -1682695 -2575779 -2506059
35800 -2506059 -1483810 -454846 31647 236266 395752 394560 397717 889135 1666590 1608533
35790 1608533 115582 -1819254 -2837801 -3132333 -4074911 -5944183 -7166178 -6321252 -4025122
35781d025122J978852Q99383M50124O20598O58418M99330N46512O25522J97022
35772B450639o25082j141757j066234p33808l98882k0390K88892K92194J46312
35763h08116K36912M26047J37699o30483j046137n44863L15806N49470j2481o03724
35753a979870n56781r3697M3370l90502p57159l68920M60594O78616r1696r33773
35743c989818p68929L41331J433469J777774J326302M30009l59423n20903p6400
35734d06588M30837P76191J279633J800803J415043j42810j657029k108827k203747
35725h16494k827799k969526j171242J529318K475898J245506K42370R28976J787033
35716D24040J061064n21729j188175o89291L0543M89068O18374J43109o97220
$$ plain form
35781 -4025122 -2046270 -1146887 -696763 -76165 582253 1081583 1628095 2253617 2450639
35772 2450639 1825557 683800 -382434 -1116242 -1515124 -1535514 -1246622 -954428 -808116
35763 -808116 -571204 -145157 -7458 -637941 -1684078 -2228941 -1913135 -1363665 -1376146 -1979870
35753 -1979870 -2536651 -2630348 -2586978 -2977480 -3734639 -4103559 -3642965 -2964349 -3056045 -3989818
35743 -3989818 -4758747 -4417416 -2983947 -1206173 120129 550138 190715 -330188 -406588
35734 -406588 24249 800440 2080073 3880876 5295919 5153109 3496080 1387253 -816494
35725 -816494 -3644293 -6613819 -7785061 -6255743 -3779845 -2534339 -2291969 -1362993 424040
35716 424040 1485104 963375 -224800 -914091 -883548 -394480 223894 367003 -330217
35707c30217p99210K08642J023036N26429m72865o40946j24866K86278Q22536
35698D98817J800163K081941N43211j615649k160436j024361j25364k63250m10670
35689f75598q4977j31632p46789q48192q1453M41653J68565Q9472Q02936J269576
35679B03561N89101m10117n24787O9776N26386O90424O60237M6661j121712j681247
35669i51717q12160M86438O65779k04019p68497m34636J49365L88502L82475L76295
35659g22175M62769P04045Q63512L73414p11398j286855o61709J76353j4571n90681
35649a407296Q3390J791401K363267Q16290j105242j396583m26690M2762n11360
35640B49939j027755o24759N00227J717534K457394K132366N98906j120828j463430
$$ plain form
35707 -330217 -1129427 -920785 102251 628680 155815 -485131 -609997 -323719 498817
35698 498817 2298980 4380921 4924132 3308483 1148047 123686 -1678 -264928 -675598
35689 -675598 -760575 -892207 -1638996 -2487188 -2568641 -2126988 -1958423 -1868951 -1066015 203561
35679 203561 792662 382545 -142242 -72466 453920 1144344 1804581 1851242 729530 -951717
35669 -951717 -1763877 -1277439 -611660 -815679 -1584176 -2018812 -1869447 -1480945 -1098470 -722175
35659 -722175 -259406 444639 1308151 1681565 970167 -316688 -978397 -802044 -816615 -1407296
35649 -1407296 -1323906 467495 2830762 3647052 2541810 1145227 718537 761299 249939
35640 249939 -777816 -1402575 -902348 815186 3272580 5404946 6003852 4883024 3419594
35631C419594q7830J561055J843804O49230q22274j555215j486634j050406n98211
35622A873113l71334n88805j248925j944089k067127j295033M9916J110043J162838
35613c319403L68534k98280j00763O23209R77337O60001R1635m83267j236281
35604b717278j900280j564439J0668J522853J511484L15963l32991L47285J260176
35595a546559J113920J33956m94100k82836J73045K14387j10662k92796K2394
35586a069251P21832J308403J289478O30483j85338o11733m94638p4516K98074
35577A812794L95558K35968N7811N0115Q4479j35850o61562j190558j337144q55964
35567a544353K39222J490954K112304J705396P48253n6946o78998j370471j685747
$$ plain form
35631 3419594 3331764 4892819 6736623 7385853 6563579 5008364 3521730 2471324 1873113
35622 1873113 1501779 912974 -335951 -2280040 -4347167 -5642200 -5592284 -4482241 -3319403
35613 -3319403 -2950869 -3249149 -3349912 -2726703 -1749366 -1089365 -997730 -1480997 -2717278
35604 -2717278 -4617558 -6181997 -6171329 -4648476 -3136992 -2821029 -3154020 -2806735 -1546559
35595 -1546559 -432639 -298683 -792783 -1075619 -902574 -688187 -798849 -1091645 -1069251
35586 -1069251 -347419 960984 2250462 2880945 2695607 2083874 1589236 1514720 1812794
35577 1812794 2208352 2444320 2502131 2552246 2636725 2500875 1839313 648755 -688389 -1544353
35567 -1544353 -1305131 185823 2298127 4003523 4751776 4694830 4015832 2645361 959614
35558I59614r47359K75501M30860p78590j635662p39439R68955J663002J244116
35549A440998J039116J407999J321933L01917q21783j425323j921603k488357
35541a145103k286403q35729Q60622J571325J416028J172944P66079k79724j366321
35532a26282j285642j16216P39008O52225N57636J092214J262140K2105j716486
35523A080702k004127m78043J154496J324848K85945o69210q16633l70790J69599
35514c23213N19307O85854Q27049Q91281M86067m55365j049276l73981Q90131
35505B097854Q70566q84637k372560j778451j69952O238j406630j981167k41232
35496e859971K273307L188633K144036N05732o57358j177448j134389p81548p17031
$$ plain form
35558 959614 12255 287756 718616 -59974 -1695636 -2435075 -1466120 196882 1440998
35549 1440998 2480114 3888113 5210046 5511963 4690180 3264857 1343254 -1145103
35541 -1145103 -3431506 -4267235 -3406613 -1835288 -419260 753684 1519763 1240039 -126282
35532 -126282 -1411924 -1528140 -789132 -136907 420729 1512943 2775083 2797188 1080702
35523 1080702 -923425 -1401468 -246972 1077876 1363821 694611 -122022 -492812 -323213
35514 -323213 196094 881948 1708997 2600278 3086345 2630980 1581704 1207723 2097854
35505 2097854 2968420 2083783 -288777 -2067228 -2237180 -2230942 -3637572 -5618739 -5859971
35496 -5859971 -3586664 -398031 1746005 2251737 1594379 416931 -717458 -1499006 -2216037
35487b216037j149820j341421o58009K50591L46414q6362J56818J208010J833908
35478a655908J333593N05573K50818K70215j60094r15245j288381j004809l06480
35469b970718N41470J207257J157406K50439p73442j010943m46660K20264N70196
35460a254731O95772O17006J43229o42680j284206j388306q07307M23032J782445
35451a715746K171374J013893n56060o78166P35394J589534M12548j436976j535916
35442a21K71769J753952J371889O316p62041p57569p53387q71141n78260J17493
35432b01100N43998M46036L61751O94423R84212M69053q44106j933573j673531
35423a152837p5514J440986J359624k20466j571515j268380L06929J707468K097284
$$ plain form
35487 -2216037 -3365857 -4707278 -5365287 -5114696 -4768282 -4854644 -4697826 -3489816 -1655908
35478 -1655908 -322315 183258 434076 704291 544197 -371048 -1659429 -2664238 -2970718
35469 -2970718 -2429248 -1221991 -64585 185854 -587588 -1598531 -2045191 -1824927 -1254731
35460 -1254731 -558959 58047 201276 -441404 -1725610 -3113916 -3921223 -3498191 -1715746
35451 -1715746 455628 1469521 913461 235295 970689 2560223 2972771 1535795 -121
35442 -121 271648 2025600 3397489 3403805 2641764 1884195 1130808 259667 -318593 -201100
35432 -201100 342898 788934 1150685 1845108 2829320 3298373 2454267 520694 -1152837
35423 -1152837 -1228351 212635 1572259 1351793 -219722 -1488102 -1181173 526295 2623579
35414B623579J612859O06273n72489j286645j042406k14136M00638O54927Q65869
35405C648469P35219l87706k039645k698610j796856n59324j65229j35913N23310
35396b876285J485513J611039P74149l0149k07039j12897j09578m4534J57220
35387F47439J65622k06059o22044n90604P7138J117666J799858J311312k82505
35378C417823j655628j498223j50905P39704K85366o43152p53799l3331M06629
35369A14484j15563r61351r07408M34471K098367K732978J956098M88025r09910
35360D930191k012186k561141k034863o12269L87326l057r34810q52181K28091
35351c464899P96833K19910l21161K84136J393320J606771P04461k46348l23991
$$ plain form
35414 2623579 4236438 4842711 4270222 2983577 1941171 1727035 2127673 2782600 3648469
35405 3648469 4383688 3995982 1956337 -742273 -2539129 -3098453 -3263682 -3399595 -2876285
35396 -2876285 -1390772 220267 994416 964267 757228 644331 534753 490219 647439
35387 647439 813061 607002 -15042 -605646 -528508 589158 2389016 3700328 3417823
35378 3417823 1762195 263972 113067 852771 1138137 494985 -258814 -292145 114484
35369 114484 -1079 -962430 -1869838 -1435367 663000 3395978 5352076 5840101 4930191
35360 4930191 2918005 356864 -1677999 -2290268 -1902942 -1905999 -2840809 -3692990 -3464899
35351 -3464899 -2668066 -2448156 -2769317 -2485181 -1091861 514910 1219371 973023 649032
35342F49032M02340J239294J509642R24183k27461j213090j423260q61024m6798
35333I52858M92786O43570O78024P53796N16426l78424j289546r50067O42227
35324B061650J569762L28950j803582k203316m47647J239180J267367O46701R62879
35315C621944J946756K188813J190519m16109j858057k419280j493596M31020
35307C192010J551918P13506r55702j536547r32181o80026j478824k301232k000776
35298d427854o19268J059539K284246K525539J752634O59638m7889m96057j062906
35289A627622j308987n84401N08847O22355k64067o76782O4959Q01571M69579
35280A260696k16598p8271N28385L46157o67951j206354n84361K51953O5727r96562
$$ plain form
35342 649032 1051372 2290666 3800308 4724491 4497030 3283940 1860680 999656 952858
35333 952858 1445644 2089214 2767238 3521034 4037460 3659036 2369490 1419423 2061650
35324 2061650 3631412 3960362 2156780 -46536 -494183 744997 2012364 2659065 3621944
35315 3621944 5568700 7757513 8948032 8531923 6673866 4254586 2760990 3192010
35307 3192010 4743928 5457434 4501732 2965185 2033004 1352978 -125846 -2427078 -4427854
35298 -4427854 -5047122 -3987583 -1703337 822202 2574836 3234474 3186585 2690528 1627622
35289 1627622 318635 -265766 243081 865436 601369 -75413 -10454 791117 1260696
35280 1260696 1044098 965827 1494212 1840369 1172418 -33936 -618297 -366344 -300617 -1297179
35270a297179j600250r13267L24676O77253j40067p94332j00811J231727J475125
35261a137125L20666o78207l40362O43614J103310J188724J657085K079296J198111
35252F035112r78078k699628k515463j004460K4662l56615j300249j264305K09082
35243c849942J855754J999686N36979q63841q79294k23136m09902j287771j104162
35234d225629Q02944K690285K567832P75763o35878o09432M185J66812R1937M39309
35224B068128R04408N17929q31557j957289j710582l38127Q38150R20310K67076
35215F78446j73169j8497K99707K87717K9722n1215J46237K40965j17946p40163
35205E81804j000718m69884N49272J144454O20251o68229j460309q50367O22335
$$ plain form
35270 -1297179 -2897429 -3810696 -3486020 -2808767 -2948834 -3743166 -3843977 -2612250 -1137125
35261 -1137125 -816459 -1494666 -1835028 -1191414 -88104 1100620 2757705 4837001 6035112
35252 6035112 5057034 2357406 -158057 -1162517 -1137855 -1494470 -2794719 -4059024 -3849942
35243 -3849942 -1994188 5498 542477 -321364 -1200658 -1423794 -1833696 -3121467 -4225629
35234 -4225629 -3422685 -732400 1835432 2611195 1975317 1365885 1370070 1536882 1628819 2068128
35224 2068128 2972536 3490465 2658908 701619 -1008963 -1347090 -508940 411370 678446
35215 678446 505277 486780 786487 1074204 1103926 1052711 1198948 1439913 1321967 581804
35205 581804 -418914 -888798 -339526 804928 1425179 756950 -703359 -1553726 -931391
35196i31391J478960R93434K1826j11980P51551J495913J093651l45374j838139
35187B608451k416022j741300k97988Q88336J083833N50255J25121Q1940j07404
35178G75222p43624j239962q87980J69374J174242J594279J299735L24694r62600
35169A503380j755061j510389o04226K34431Q73896J539911J914824J344861n6750
35160C484877j305250j678440j346850q53775o12001q59873j334362j055569N57918
35151e003325K304498K180198J37270j437804p53134J086209J836653J084508
35143A435073Q4913n22190j116285j558014j066991J18024N38778m08252j433267
35134c928211j136794J56937J172880J459714J415043J129757L34654o90746j201229
$$ plain form
35196 -931391 547569 1541003 1562829 1450849 2202400 3698313 4791964 4446590 2608451
35187 2608451 192429 -1548871 -1846859 -958523 125310 675565 800686 882626 775222
35178 775222 31598 -1208364 -2096344 -1926970 -752728 841551 2141286 2465980 1503380
35169 1503380 -251681 -1762070 -2366296 -2131865 -1257969 281942 2196766 3541627 3484877
35160 3484877 2179627 501187 -845663 -1699438 -2311439 -3171312 -4505674 -5561243 -5003325
35151 -5003325 -2698827 -518629 -381359 -1819163 -2572297 -1486088 350565 1435073
35143 1435073 1519986 997796 -118489 -1676503 -2743494 -2625470 -2086692 -2494944 -3928211
35134 -3928211 -5065005 -4908068 -3735188 -2275474 -860431 269326 603980 -86766 -1287995
35125a287995j083971r96291j145204p63906O29321K094720K268513J250823N11902
35116A477912P68653R93132J71973q71348o10876O80972J073326k32521j744232
35107A706991j933304j260027q90810o09784M40348J686743J613516J82489r03639
35098C2523n71289M31658J006400R47536K98269j046729k374453k220710m48086
35089c944881R62534M55706p72312m64848J394977K638326K004071N53894j75765
35080B651702m2812J56442k5087m47654p94356p65802k93192K04354J89517k44508
35070E88604m47476j15533L65673N64244M82625K72049o1246m94080q59636r54905
35060f59681n69923L72854J366513J438061L70536o28883m13824L06342j09159
$$ plain form
35125 -1287995 -2371966 -3368257 -4513461 -5277367 -4648046 -2553326 -284813 966010 1477912
35116 1477912 2246565 3239697 3411670 2540322 1929446 2610418 3683744 3451223 1706991
35107 1706991 -226313 -1486340 -2377150 -2986934 -2546586 -859843 753673 936162 32523
35098 32523 -538766 -107108 899292 1846828 2145097 1098368 -1276085 -3496795 -3944881
35089 -3944881 -2982347 -2526641 -3298953 -3763801 -2368824 269502 2273573 2827467 2651702
35080 2651702 2608890 2765332 2740245 2292591 1498235 732433 439241 643595 833112 588604
35070 588604 141128 25595 391268 955512 1438137 1710186 1648940 1154860 295224 -659681
35060 -659681 -1229604 -856750 509763 1947824 2318360 1689477 1275653 1581995 1472836
35051A472836j641557k429144j456179O3568O27069L96270L14353M73890M75294
35042a703600M38411M74428j9769j281260k118865j321805L93532J268543R40100
35033b930285N13814M97499L18509j12289p0367M41117M32061k87701n94105K2755
35023a768992N37841K61177Q7481O83549R24742j78742j221331k65123J675740
35014G36342J552451j103966k987049j534819J416631K289641O88555n93406K9827
35005D94207R83917M96309o22989n60029N41201R98984L32288k83741k27148k58139
34995A894860p20755o80363K31934P00514j94974j110346m08574R79756Q00590
34986A492642q95870j716740o12151P52376R03668N65167O95377O48679j93078
$$ plain form
35051 1472836 -168721 -2597865 -4054044 -3990476 -3363407 -2967137 -2652784 -2178894 -1703600
35042 -1703600 -1265189 -790761 -810530 -2091790 -4210655 -5532460 -5138928 -3870385 -2930285
35033 -2930285 -2416471 -1918972 -1600463 -1712752 -1783119 -1342002 -909941 -1197642 -1791747 -1768992
35023 -1768992 -1231151 -969974 -882493 -198944 725798 547056 -674275 -939398 736342
35014 736342 2288793 1184827 -1802222 -3337041 -1920410 369231 1057786 464380 494207
35005 494207 1478124 1974433 1351444 791415 1332616 2331600 2663888 2380147 2152999 1894860
34995 1894860 1174105 493742 725676 1426190 1231216 120870 -287704 692052 1492642
34986 1492642 596772 -1119968 -1732119 -979743 -76075 489092 1184469 1833148 1640070
34977A640070p93064k83653J61321o46420j404222l06991J520162J461400k34683
34968A113920p17772O78463J245020m78250k052357j017092J194338J723086P28253
34959B417609M58391J071474N58351j380135k403285j158258N93278O43785o56297
34950A44913j419842r94504k70817P7684K97223O39004P44639J79233q20162j313418
34940b736047n00665J174793K070882J185223k71014k44353J159444J530656l43450
34931C025469k390125k021869J91483J458192P36635l03551k74476Q2476k94621
34922B09613r23577q63717l90352l13046m85424k31368L41132N96049M54805J47583
34912a458302n81066j741185k035254j83026K658735L530092J352681j430655
$$ plain form
34977 1640070 847006 563353 724674 78254 -1325968 -1632959 -112797 1348603 1113920
34968 1113920 396148 1074611 2319631 1841381 -210976 -1228068 -33730 1689356 2417609
34959 2417609 2876000 3947474 4505825 3125690 722405 -435853 157425 801210 144913
34950 144913 -1274929 -2269433 -2540250 -2462566 -2165343 -1526339 -781700 -602467 -1422629 -2736047
34940 -2736047 -3236712 -2061919 8963 1194186 923172 678819 1838263 3368919 3025469
34931 3025469 635344 -1386525 -1195042 263150 999785 696234 421758 504234 209613
34922 209613 -713964 -1577681 -1968033 -2281079 -2766503 -2997871 -2656739 -2060690 -1605885 -1458302
34912 -1458302 -2039368 -3780553 -5815807 -5998833 -3340098 189994 1542675 112020
34904A12020j861282n1271J417718J024753j22408k44182P14241J214293K21238
34895B425120j419801j907067o18939J082383J444324L70637o57137m88758N70574
34886H01336J503664J659574R42693l13614j381300j668424j420208j287775j188188
34877b352242m77419O81618J283287J085060R41143J055840M12200j201376k156244
34868g28133j283273J61460M15584r7543J56465J028170J075611J62237m68401
34859D22177l85953j74449K62047J374406K140245J054473r39999j202979M28745
34850B978713J070170o08303k121097j190729O38802P11739n62200r15110p2848
34841g0863M09789K13138L79461Q27212L65048q29087j113450n7573Q42178N74812
$$ plain form
34904 112020 -1749262 -1800533 -382815 641938 519530 275348 989589 2203882 2425120
34895 2425120 1005319 -901748 -1520687 -438304 1006020 1376657 719520 230762 801336
34886 801336 2305000 3964574 4907267 4593653 3212353 1543929 123721 -1164054 -2352242
34877 -2352242 -2829661 -2148043 -864756 220304 1161447 2217287 2629487 1428111 -728133
34868 -728133 -2011406 -1849946 -1434362 -1531905 -1375440 -347270 728341 890578 422177
34859 422177 36224 -138225 123822 1498228 3638473 4692946 3752947 2549968 2978713
34850 2978713 4048883 3440580 1319483 128754 767556 1479295 917095 1985 -70863
34841 -70863 338926 552064 931525 1758737 2123785 1294698 181248 123675 965853 1540665
34831A540665l2775P2397O99860J128815J076518N04283m88384j275854j197479
34822B028046n67440j97038p892O08036J163957M72448j104393j584680k28251
34813E82793J159402P88851o09910j073139j78891P97455R07374M43084J7655
34804B834674k59187n71413r42625j170939j083972q54584q87703j116811p83856
34795d836416M17355J358833P19370r23090j556227m87575P52880P78241K50364
34786c526265N48447J650823K427275K293510J543293N31767n77547j555194k208466
34777A127643k447277j991597o66093P63885J038644J80207k73710M93067J292954
34768d82277Q55796j79569n14336l64213p38760j308038q57108M55575J159990
$$ plain form
34831 1540665 1507890 1580287 2280147 3408962 4485480 4989763 4501379 3225525 2028046
34822 2028046 1460606 1263568 1255676 1863712 3027669 3500117 2395724 811044 582793
34813 582793 1742195 2531046 1921136 847997 669106 1466561 2373935 2817019 2834674
34804 2834674 2575487 2004074 1061449 -109490 -1193462 -2048046 -2935749 -4052560 -4836416
34795 -4836416 -4419061 -3060228 -2340858 -3263948 -4820175 -5307750 -4554870 -3776629 -3526265
34786 -3526265 -2977818 -1326995 1100280 3393790 4937083 5468850 4891303 3336109 1127643
34777 1127643 -1319634 -3311231 -3977324 -3213439 -2174795 -1994588 -2268298 -1775231 -482277
34768 -482277 373519 193950 -320386 -684599 -1423359 -2731397 -3588505 -3132930 -1972940
34759a972940Q30342O05326J017460J000445j63903j282584p82053R38159J820600
34750B010852P04734j215666j773573l92722J182353J035966m04968r31269L03264
34741E18971J517635R40880n93747j061353k38733M85410O37628R21951J161587
34732D290229K53193j441913j877448m09332Q64374J73892j166433p71081J218992
34723A134473K464242J784761L41839m85393p49800j037175j195363p68406m7430
34714A441748J33244m42682r86935p20374L1081K43299l05171o35581p8143N97460
34704g22054M33481l0991L20077J009216N01532j052250j652342o45467R076j111777
34694b941499k420469j785364R6229R92680O97522Q08382J522944J314124r7676
$$ plain form
34759 -1972940 -1142598 -537272 480188 1480633 1316730 34146 -747907 190252 2010852
34750 2010852 2715586 1499920 -273653 -666375 515978 1551944 1146976 215707 518971
34741 518971 2036606 2977486 2383739 1322386 1083653 1569063 2206691 3128642 4290229
34732 4290229 4543422 3101509 1224061 814729 1679103 1852995 686562 -84519 1134473
34723 1134473 3598715 5383476 5725315 5239922 4490122 3452947 2257584 1489178 1441748
34714 1441748 1574992 1132310 145375 -574999 -543918 -300619 -605790 -1241371 -1319514 -722054
34704 -722054 -288573 -319564 513 1009729 1511261 459011 -1193331 -1838798 -1829722 -2941499
34694 -2941499 -5361968 -7147332 -7051103 -6058423 -5360901 -4552519 -3029575 -1715451 -1813127
34685a813127r63097l30918N26405M48110K21835Q56760J612546J228912K3079
34676A810505o83130n07435j23221Q395j04265n33851j195995j418392o79190
34667c426579N28721J340115J588909J472846P72648n57258j568457j345622n09941
34658a704618l58501p16671j84358J372219K215206J209253n12196j225379q10419
34649g15464k36569J86031P54550J138735N67142q19521j893446j929041j232937
34640d180520l45962N04899J015118Q03625K06849K43903J187837J845708J044984
34631B326441o23688j469545r17594o9694P1966o2674M04190J256466J474667
34622B390535P08067l83655j139268j441841j253021m99781K99202J84380q73896
$$ plain form
34685 -1813127 -2776224 -3107142 -2580737 -2132627 -1910792 -1054032 558514 1787426 1810505
34676 1810505 1127375 619940 496719 505114 400849 -133002 -1328997 -2747389 -3426579
34667 -3426579 -2897858 -1557743 31166 1504012 2276660 1719402 150945 -1194677 -1704618
34658 -1704618 -2063119 -2779790 -2964148 -1591929 623277 1832530 1320334 94955 -715464
34649 -715464 -952033 -766002 -11452 1127283 1694425 874904 -1018542 -2947583 -4180520
34640 -4180520 -4526482 -4021583 -3006465 -2202840 -1995991 -1752088 -564251 1281457 2326441
34631 2326441 1702753 233208 -684386 -754080 -682114 -744788 -340598 915868 2390535
34622 2390535 3098602 2714947 1575679 133838 -1119183 -1618964 -1319762 -1135382 -2009278
34613b009278j478421n02586J214100J848969J027428J76671L85702J041847J050195
34604B754627M26354j07430m22185q94427j329958r94950J67822J150571J035193
34595A785617K5680r78811j409203j248609n98556L88264J180049J047755r0730
34586A01456j259346j253727P4808J582583J945266Q83787o80374j464010q33754
34577i03311O73102J734762J501313N80492L14583R37847J203346L11772o92089
34568E661817m42592N63955P44802L8k55789K86525J48911j285327k334809j539204
34558A548327n9108J30316p31814r17360j78894J66693j66631P199R07790R84226
34548A690744o22402k418809k434651p14213R92554J294415K23348j124236j487183
$$ plain form
34613 -2009278 -3487699 -3990285 -2776185 -927216 100212 276883 662585 1704432 2754627
34604 2754627 3180981 3073551 2651366 1756939 426981 -567969 -400147 750424 1785617
34595 1785617 1811297 832486 -576717 -1825326 -2423882 -2035618 -855569 192186 101456
34586 101456 -1157890 -2411617 -2336809 -754226 1191040 2074827 1394453 -69557 -903311
34577 -903311 -230209 1504553 3005866 3586358 3900941 4838788 6042134 6353906 5661817
34568 5661817 5219225 5783180 6527982 6528020 6272231 6558756 6707667 5422340 3087531 1548327
34558 1548327 1489219 1619535 887721 -29639 -208533 -41840 -208471 -201272 706518 1690744
34548 1690744 1068342 -1350467 -3785118 -4499331 -3506777 -2212362 -1989014 -3113250 -4600433
34539d600433n64870M60174K12635r59312j362209m18790N56714N11414J60116
34530f004561M93044J087809J064842P00053Q21367J330571J503954J179347O05699
34521B782125k70681j340674j799877j159202j80237K37596L89946Q56400J098531
34512F13927L99996n15719m40379K78030L53403k14430l70452j43663n24830j275149
34502a839266j012168K74889R52057M57586J19209N50234M85583o83058j410987
34493b105921n64244M96982K44473l45277L84931J695431J688951O79121O28575
34484B803022J612161J585288r4767j498973j230806m25001m82338p49018l5255
34475A484313R74413O82514p79600j642638j063558q6046J71089L1221L81877
$$ plain form
34539 -4600433 -5165303 -4705129 -4492494 -5451806 -6814015 -7232805 -6676091 -6164677 -6004561
34530 -6004561 -5511517 -4423708 -3358866 -2658813 -1837446 -506875 997079 2176426 2782125
34521 2782125 2511444 1170770 -629107 -1788309 -1968546 -1730950 -1341004 -484604 613927
34512 613927 1013923 498204 57825 335855 689258 474828 104376 -39287 -564117 -1839266
34502 -1839266 -2851434 -2576545 -1624488 -1166902 -1047693 -497459 -11876 -694934 -2105921
34493 -2105921 -2670165 -2173183 -1928710 -2273987 -1889056 -193625 1495326 2174447 2803022
34484 2803022 4415183 6000471 5905704 4406731 3175925 2750924 2268586 1519568 1484313
34475 1484313 2458726 3141240 2361640 719002 -344556 -430602 -259513 -228292 153585
34466A53585J097061J146814R4899j120002j143290J97458J520597J328112k61145
34457C014089j576679j333419j03118N32818j5383q22582q76378k86239K39595
34448a227296M60723N22606K66867m84549j067175m11705J337188K540890K022064
$$ plain form
34466 153585 1250646 2397460 2492359 1372357 229067 426525 1947122 3275234 3014089
34457 3014089 1437410 103991 873 533691 518308 -304274 -1180652 -1466891 -1227296
34448 -1227296 -766573 -243967 22900 -461649 -1528824 -1940529 -603341 1937549 3959613
$$ [...]
##END NTUPLES=NMR SPECTRUM
##END=
