##TITLE=31P_DE-80H_X3
 64 sc D2O
 26.2.2025
##JCAMPDX= 6.0         $$ Bruker NMR JCAMP-DX V2.0
##DATA TYPE= NMR SPECTRUM
##DATA CLASS= NTUPLES
##ORIGIN= UXNMR, Bruker Analytische Messtechnik GmbH
##OWNER= root
$$ XWIN-NMR		Version 3.5
$$ Fri Mar 28 11:47:25 2025 Russian Standard Time (UT+4h)  Yarkov@DPX200
##.OBSERVE FREQUENCY= 81.013821
##.OBSERVE NUCLEUS= ^31P
##.ACQUISITION MODE= SIMULTANEOUS
##.ACQUISITION SCHEME= undefined
##.AVERAGES= 64
##.DIGITISER RES= 17
##SPECTROMETER/DATA SYSTEM= spect
##.PULSE SEQUENCE= zgpg30
##.SOLVENT NAME= CDCl3
##.SHIFT REFERENCE= (INTERNAL, CDCl3, 0, 198.062)
##AUDIT TRAIL= $$ (NUMBER, WHEN, WHO, WHERE, WHAT)
$$ ##TITLE= Audit trail, XWIN-NMR		Version 3.5
$$ ##JCAMPDX= 5.01
$$ ##ORIGIN= Bruker BioSpin GmbH
$$ ##OWNER= Yarkov
$$ C:/Bruker/XWIN-NMR/data/yarkov2/nmr/P31/2/pdata/1/auditp.txt
$$ ##AUDIT TRAIL=  $$ (NUMBER, WHEN, WHO, WHERE, WHAT)
(   1,<2025-03-28 11:46:03.15 +0400>,<Yarkov>,<DPX200>,
      <created by zg, POWCHK disabled, PULCHK disabled
       configuration hash MD5:
       00 E9 B6 7A A2 85 ED C7 34 08 36 98 17 FE 4E 26
       data hash MD5: 32K
       57 D2 2D EB 54 8B EB BB 36 AF E7 CC 5A 27 B0 51>)
(   2,<2025-03-28 11:46:09.59 +0400>,<Yarkov>,<DPX200>,
      <Start of raw data processing
       efp BC_mod = 2 LB = 1.5 FT_mod = 6 PKNL = 1 PHC0 = 1809.733 PHC1 = -7.904587 SI = 64K 
       data hash MD5: 64K
       D9 E9 61 DD 90 97 4D B8 66 3F 8C EF 45 AB D0 8B>)
(   3,<2025-03-28 11:46:56.81 +0400>,<Yarkov>,<DPX200>,
      <pk PHC0 = -12.05641 PHC1 = 27.8 
       data hash MD5: 64K
       9E D4 DC 3F 81 C3 C6 F1 7E 82 22 66 69 45 F7 06>)
$$ ##END=
$$ 
$$ hash MD5
$$ BC 48 D8 21 C4 7B 16 8B B0 9E C8 14 76 DB 8B 6F
##$RELAX= 
##$RELAX= 
##$RELAX= 
##$RELAX= 
##$RELAX= 
##$RELAX= 
##$RELAX= 
##$RELAX= 
$$ Bruker specific parameters
$$ --------------------------
##$DU= <C:/Bruker/XWIN-NMR>
##$EXPNO= 2
##$NAME= <P31>
##$PROCNO= 1
##$TYPE= <nmr>
##$USER= <yarkov2>
##$AMP= (0..31)
100 100 100 100 100 100 100 100 100 100 100 100 100 100 100 100 100 100 
100 100 100 100 100 100 100 100 100 100 100 100 100 100 
##$AQSEQ= 0
##$AQ_mod= 1
##$AUNM= <au_zg>
##$AUTOPOS= <>
##$BF1= 81.014009
##$BF2= 200.13
##$BF3= 200.13
##$BF4= 200.13
##$BF5= 200.13
##$BF6= 200.13
##$BF7= 200.13
##$BF8= 200.13
##$BYTORDA= 1
##$CFDGTYP= 0
##$CFRGTYP= 5
##$CHEMSTR= <none>
##$CNST= (0..31)
1 1 145 1 1 1 1 1 1 1 1 1 1 1 1 1 1 1 1 1 1 1 1 1 1 1 1 1 1 1 1 1 
##$CPDPRG= <waltz16>
##$CPDPRG1= <>
##$CPDPRG2= <waltz16>
##$CPDPRG3= <>
##$CPDPRG4= <mlev>
##$CPDPRG5= <mlev>
##$CPDPRG6= <mlev>
##$CPDPRG7= <mlev>
##$CPDPRG8= <mlev>
##$CPDPRGB= <>
##$CPDPRGT= <>
##$D= (0..31)
0 1 0 0 0 0 0 0 0 0.06 0 0.03 2e-05 3e-06 0 0 0.0002 0 0 0 0 0 0 0 0 0 
0 0 0 0 0 0 
##$DATE= 1743147962
##$DBL= (0..7)
120 120 120 11 120 120 24 19 
##$DBP= (0..7)
150 150 150 150 150 150 150 150 
##$DBP07= 0
##$DBPNAM0= <>
##$DBPNAM1= <>
##$DBPNAM2= <>
##$DBPNAM3= <>
##$DBPNAM4= <>
##$DBPNAM5= <>
##$DBPNAM6= <>
##$DBPNAM7= <>
##$DBPOAL= (0..7)
$$ [...]
##$SUBNAM3= <"">
##$SUBNAM4= <"">
##$SUBNAM5= <"">
##$SUBNAM6= <"">
##$SUBNAM7= <"">
##$SUBNAM8= <"">
##$SUBNAM9= <"">
##$SW= 400.765351723535
##$SWIBOX= (0..15)
0 1 3 0 0 0 0 0 0 0 0 0 0 0 0 0 
##$SW_h= 32467.5324675325
##$TD= 32768
##$TD0= 1
##$TE= 0
##$TE2= 300
##$TE3= 300
##$TEG= 300
##$TL= (0..7)
0 120 53 12 22 120 120 120 
##$TP= (0..7)
150 150 150 150 150 150 150 150 
##$TP07= 0
##$TPNAME0= <>
##$TPNAME1= <>
##$TPNAME2= <>
##$TPNAME3= <>
##$TPNAME4= <>
##$TPNAME5= <>
##$TPNAME6= <>
##$TPNAME7= <>
##$TPOAL= (0..7)
0.5 0.5 0.5 0.5 0.5 0.5 0.5 0.5 
##$TPOFFS= (0..7)
0 0 0 0 0 0 0 0 
##$TUNHIN= 0
##$TUNHOUT= 0
##$TUNXOUT= 0
##$USERA1= <user>
##$USERA2= <user>
##$USERA3= <user>
##$USERA4= <user>
##$USERA5= <user>
##$V9= 5
##$VALIST= <valist>
##$VCLIST= <CCCCCCCCCCCCCCC>
##$VD= 0
##$VDLIST= <DDDDDDDDDDDDDDD>
##$VPLIST= <PPPPPPPPPPPPPPP>
##$VTLIST= <TTTTTTTTTTTTTTT>
##$WBST= 1024
##$WBSW= 4
##$XGAIN= (0..3)
0 0 0 0 
##$XL= 0
##$YL= 0
##$YMAX_a= 43328
##$YMIN_a= -48501
##$ZGOPTNS= <>
##$ZL1= 120
##$ZL2= 120
##$ZL3= 120
##$ZL4= 120
##$ABSF1= 0
##$ABSF2= 0
##$ABSG= 0
##$ABSL= 0
##$ALPHA= 0
##$AQORDER= 0
##$ASSFAC= 0
##$ASSFACI= 0
##$ASSFACX= 0
##$ASSWID= 0
##$AUNMP= <proc_1d>
##$AZFE= 0.1
##$AZFW= 0.5
##$BCFW= 0
##$BC_mod= 2
##$BYTORDP= 0
##$COROFFS= 0
##$CY= -3
##$DATMOD= 1
##$DC= 0
##$DFILT= <>
##$DTYPP= 0
##$F1P= 0
##$F2P= 0
##$FCOR= 1
##$FTSIZE= 65536
##$FT_mod= 6
##$GAMMA= 0
##$GB= 0
##$INTBC= 1
##$INTSCL= 9.790993e-09
##$ISEN= 30
##$LB= 1.5
##$LEV0= 0
##$LPBIN= 0
##$MAXI= 10000
##$MC2= 0
##$MEAN= 0
##$ME_mod= 0
##$MI= 50
##$NCOEF= 0
##$NC_proc= -4
##$NLEV= 6
##$NOISF1= 182.463
##$NOISF2= 159.3651
##$NSP= 0
##$NTH_PI= 0
##$NZP= 0
##$OFFSET= 198.0616
##$PC= 4
##$PHC0= 1797.677
##$PHC1= 19.89541
##$PH_mod= 1
##$PKNL= yes
##$PPARMOD= 0
##$PSCAL= 0
##$PSIGN= 0
##$REVERSE= no
##$SF= 81.0140089999434
##$SI= 65536
##$SIGF1= 159.3651
##$SIGF2= -187.1042
##$SINO= 113.3802
##$SIOLD= 16384
##$SREGLST= <1H.CDCl3>
##$SSB= 0
##$STSI= 65536
##$STSR= 0
##$SW_p= 32467.5324675325
##$SYMM= 0
##$S_DEV= 0
##$TDeff= 32768
##$TDoff= 0
##$TI= <>
##$TILT= no
##$TM1= 0
##$TM2= 0
##$TOPLEV= 0
##$USERP1= <user>
##$USERP2= <user>
##$USERP3= <user>
##$USERP4= <user>
##$USERP5= <user>
##$WDW= 1
##$XDIM= 65536
##$YMAX_p= 369336695
##$YMIN_p= -19039737
$$ End of Bruker specific parameters
$$ ---------------------------------
##NTUPLES= NMR SPECTRUM
##VAR_NAME=  FREQUENCY,     SPECTRUM/REAL,   SPECTRUM/IMAG
##SYMBOL=    X,             R,               I
##VAR_TYPE=  INDEPENDENT,   DEPENDENT,       DEPENDENT
##VAR_FORM=  AFFN,          ASDF,            ASDF
##VAR_DIM=   65536,         65536,           65536
##UNITS=     HZ,            ARBITRARY UNITS, ARBITRARY UNITS
##FACTOR=    0.49542278885378, 1,            1
##FIRST=     16045.7642231865, 0,            0
##LAST=      -16421.768244346, 0,            0
##MIN=       -16421.768244346, -19039737,    0
##MAX=       16045.7642231865, 369336695,    0
$$ Real data points
##PAGE= N=1
##DATA TABLE= (X++(R..R)), XYDATA
$$ [...]
41070 -438033 -474924 -441439 -322480 -185743 -98649 -76365 -102020 -151909 -184123 -153754 -84628
41059 -84628 -83740 -220507 -419225 -538135 -527287 -433483 -290724 -121630 -26182 -118870 -348001
41048 -348001 -516178 -527406 -472978 -412476 -244923 70067 317972 258880 -25451 -220705
41038 -220705 -190256 -95555 -97774 -150661 -166153 -201198 -341519 -513103 -555477 -426089 -210250
41027 -210250 26230 261816 413409 351939 73988 -239741 -403015 -402919 -350069 -315890 -298941
41016 -298941 -309154 -375407 -455963 -437940 -281815 -105579 -55338 -125246 -183493 -169856 -179602
41005 -179602 -310904 -493752 -549642 -413037 -220713 -145951 -189489 -195738 -66938 108177
40995 108177 168294 65091 -116443 -275152 -354293 -320731 -197483 -125497 -267514 -587452
40985 -587452 -821821 -753389 -445810 -135309 29345 47787 -37859 -164164 -208743 -90875
40975 -90875 87743 136217 19924 -108573 -132351 -91260 -55417 -14568 51493 103323 99246
40964 99246 36503 -88247 -250835 -318879 -150509 178889 407870 415280 343201 302160 161451
40953 161451 -190022 -551442 -626047 -434570 -262361 -236348 -206591 -61233 82012 73794
40943 73794 -63971 -223686 -356470 -443529 -446662 -383451 -360972 -445132 -558344 -573122 -453161
40932 -453161 -257061 -67911 36677 17292 -67566 -93466 -14460 76705 77044 4804 -45724
40921 -45724 -24490 54178 161221 258391 284501 193960 617 -240124 -464270 -597505 -575055
40910 -575055 -410425 -209606 -70079 12685 102218 207680 251485 142356 -135871 -490719
40900 -490719 -766915 -856900 -785869 -668282 -576742 -482913 -323007 -75126 226505 492748
40890 492748 589569 430263 100330 -173864 -235334 -135831 -31687 1234 -5209 -18035 -60906
40879 -60906 -171758 -340679 -477796 -435398 -124864 338196 659528 616383 273512 -95280
40869 -95280 -276546 -263219 -175657 -123714 -147641 -220130 -273981 -261305 -207338 -194401 -291119
40858 -291119 -499789 -746531 -904604 -867299 -647150 -389992 -254275 -286882 -432331 -612060
40848 -612060 -742752 -732356 -557494 -335254 -222368 -228298 -215581 -111687 -26850 -101817 -312946
40837 -312946 -509280 -594916 -585096 -510600 -375797 -227767 -165292 -217410 -274831 -214312 -59706
40826 -59706 50412 39707 -35182 -95042 -144061 -234019 -381544 -564777 -757116 -913574 -960470
40815 -960470 -864023 -697160 -577352 -533565 -487013 -381194 -288976 -351429 -607785 -902643
40805 -902643 -992176 -777270 -424191 -203100 -200981 -263486 -240865 -185931 -226732 -336085 -365419
40794 -365419 -271260 -165260 -132024 -123058 -62627 44131 147653 220732 263958 309463 411712
40783 411712 545816 540047 251011 -185046 -437652 -367514 -172315 -86490 -109738 -138973 -191186
40772 -191186 -319886 -432675 -390928 -232350 -120956 -115192 -145918 -189965 -292920 -421474
40762 -421474 -457172 -370051 -272950 -270266 -351432 -450577 -515992 -511311 -444649 -402627 -454817 -517787
40750 -517787 -424761 -155882 101254 158451 19110 -161113 -239931 -202236 -168885 -288389
40740 -288389 -561519 -802886 -849610 -753578 -662064 -583797 -443767 -317682 -379931 -596973
40730 -596973 -708624 -596130 -455412 -489817 -629302 -701689 -699559 -691844 -624688 -431436 -234248
40719 -234248 -201587 -267718 -233174 -118475 -164400 -443198 -708563 -732745 -599874 -525685 -527945
40708 -527945 -444317 -210514 34257 115042 -6013 -225935 -395888 -417989 -310123 -188437
40698 -188437 -153854 -202989 -277456 -361546 -462046 -515834 -424131 -209324 -40078 -30127 -88790
40687 -88790 -68780 -92 -34140 -172345 -227097 -111726 -2054 -83030 -263394 -313246 -203931
40676 -203931 -112756 -120579 -119941 -54293 -42237 -176911 -370546 -507222 -605123 -700157 -698585 -508536
40664 -508536 -237893 -98637 -154976 -305961 -479733 -695227 -941982 -1142816 -1254435 -1291313
40654 -1291313 -1237859 -1052121 -781699 -568858 -501184 -540607 -624671 -741177 -860878 -894472
40644 -894472 -796686 -662654 -646820 -794634 -988052 -1052321 -914354 -675078 -513363 -491098
40634 -491098 -490257 -398294 -298432 -357460 -548879 -649157 -550527 -416559 -424845 -487662 -379906
40623 -379906 -69149 246203 403600 424549 385621 295654 162844 59462 20667 -43980
40613 -43980 -227896 -451195 -517449 -357647 -129790 -34731 -90218 -142481 -74514 58941 113856
40602 113856 27583 -131741 -271406 -377193 -480931 -563044 -558616 -472098 -409607 -436792 -460514
40591 -460514 -348388 -143704 -39008 -109099 -196336 -139621 -10642 -2174 -150751 -311177
40581 -311177 -375790 -373365 -350456 -300936 -243353 -231803 -243459 -188376 -90330 -111485 -298580
40570 -298580 -446426 -363185 -165692 -127800 -290818 -424538 -378684 -275509 -279895 -334628 -252481
40559 -252481 4758 268746 380059 366001 364063 419369 432234 326060 197867 209896 345266
40548 345266 392689 224560 -20398 -124963 -75041 -32697 -91844 -203242 -308689 -392314
40538 -392314 -394358 -232299 43954 245708 256119 148745 48574 -15639 -56153 -36473 58936
40527 58936 137214 87547 -73207 -224530 -278899 -224643 -77700 113664 236243 190338 23153
40516 23153 -98472 -90134 -63628 -181611 -436455 -649418 -691639 -628563 -599844 -619500 -585602
40505 -585602 -464378 -347912 -298828 -250840 -139486 -41470 -78267 -236646 -393212 -481075
40495 -481075 -526400 -549275 -541055 -524130 -525623 -506585 -425888 -348643 -359946 -393316 -306735 -131640
40483 -131640 -63336 -162420 -248332 -164533 19614 160234 219698 179872 -50795 -472977 -866687
40472 -866687 -1008214 -927822 -782708 -573397 -206334 209509 377997 181301 -149576 -307880
40462 -307880 -233260 -93555 -42849 -75123 -70527 63652 280966 421454 376950 208643 55894
40451 55894 -34544 -121197 -250003 -417363 -629441 -892011 -1130976 -1213268 -1076505 -790983
40441 -790983 -498381 -336054 -379951 -569348 -707817 -639501 -420493 -227076 -122291 -41865
40431 -41865 2598 -113880 -399804 -638564 -636236 -486488 -457137 -655445 -924698 -1062173
40421 -1062173 -1030875 -928445 -830709 -731968 -615179 -518845 -506903 -592567 -720605 -817797 -831321
40410 -831321 -730983 -533944 -337969 -255991 -279049 -278789 -204530 -195903 -401678 -744268 -980298
40399 -980298 -968134 -770576 -524671 -334626 -275977 -360973 -478367 -492022 -423054 -412804 -487339
40388 -487339 -506585 -392538 -247386 -158978 -45019 176524 390487 431785 354798 367357
40378 367357 512206 595871 476691 271744 184478 221718 199717 7675 -238478 -340851
40368 -340851 -258967 -141353 -130118 -203747 -246922 -217906 -175642 -167055 -172099 -166346 -159210 -145569
40356 -145569 -89233 8627 81174 75074 12442 -57722 -119396 -164189 -158409 -87408 -540 33378
40344 33378 -4418 -83306 -161823 -199967 -169684 -85308 1133 49326 41289 -53682 -251166 -467539
40332 -467539 -554495 -478525 -392064 -447131 -596667 -673030 -620695 -541004 -517018 -509422 -459198
40321 -459198 -398394 -386011 -378618 -247834 54438 390214 537062 403389 121024 -92057
40311 -92057 -139576 -87206 -18001 82965 266510 484500 578514 426808 94070 -187950
40301 -187950 -219233 -20650 199825 275761 230855 180763 162112 127756 55676 -26588 -92654
40290 -92654 -112654 -46968 55701 14969 -279009 -651316 -800256 -670613 -493413 -434282
40280 -434282 -399593 -254309 -36830 144458 255426 264942 102449 -176101 -345370 -297801
40270 -297801 -222794 -313249 -439874 -354221 -113001 -27482 -217217 -470535 -573996 -553526
40260 -553526 -527949 -518299 -495943 -478683 -482335 -463279 -374280 -217088 -15776 192490 332248
40249 332248 335431 223457 80709 -37819 -106737 -92464 -24524 -51598 -279706 -580850 -719690
40238 -719690 -660079 -579841 -580558 -571969 -483508 -402116 -418913 -494807 -567533 -654818 -755545 -769684
40226 -769684 -622211 -380190 -167701 -50633 -64040 -235720 -491599 -642059 -573966 -392945
40216 -392945 -291069 -335564 -456170 -565576 -613985 -587994 -526843 -492392 -490450 -495452 -559114
40205 -559114 -754870 -973662 -956777 -642857 -314640 -245970 -350462 -370983 -286512 -279736 -365480
40194 -365480 -334799 -107097 101497 61698 -182086 -409120 -481371 -409332 -262537 -119125
40184 -119125 -40302 -9359 54847 157044 158896 -59600 -410467 -662801 -689602 -571873 -458144
40173 -458144 -406826 -397570 -417689 -462499 -484635 -424478 -298114 -196096 -180333 -232613 -316064
40162 -316064 -419934 -511469 -517002 -412856 -277994 -186298 -99496 50358 221602 307050 282643
40151 282643 206413 100520 -45530 -177001 -217290 -205887 -250642 -336212 -336847 -244412 -211749
40140 -211749 -310097 -407010 -366664 -223557 -76468 32453 40323 -151425 -466614 -592412
40130 -592412 -323272 139204 418916 413575 319765 280901 229695 74490 -150373 -354698
40120 -354698 -477649 -483733 -390244 -311245 -372113 -570948 -798726 -967230 -1029230 -927361 -657718
40109 -657718 -363200 -229515 -280037 -373109 -395072 -363364 -358091 -443074 -626027 -810549 -838100
40098 -838100 -673336 -478342 -393762 -344000 -208114 -70112 -85398 -184876 -176529 -106043 -221451
40087 -221451 -546678 -784093 -739898 -584969 -552219 -600502 -555746 -413188 -308524 -297565
40077 -297565 -326918 -347588 -333398 -262526 -184649 -220094 -387888 -521884 -470459 -308381 -242744
40066 -242744 -363598 -578265 -740677 -766669 -667575 -531232 -430358 -332245 -177306 -46823
40056 -46823 -110678 -364329 -572858 -557038 -390648 -226867 -93312 12453 -15284 -246780
40046 -246780 -528765 -614875 -436901 -125782 162678 322116 289657 115968 -25347 -33300
40036 -33300 -13965 -93961 -200265 -191234 -118547 -162028 -352345 -547686 -654195 -688527 -652176
40025 -652176 -535611 -431211 -442046 -473518 -319832 9519 248254 221987 63222 -3855
40015 -3855 58560 138228 169874 187712 240917 324635 361891 249550 -12113 -254637 -309999
40004 -309999 -228900 -200408 -262437 -260251 -124656 -10247 -70071 -243465 -379641 -455586 -550909
39993 -550909 -688302 -813150 -881857 -883943 -819254 -717686 -634846 -579575 -503326 -398596 -326922
39982 -326922 -302377 -244746 -119001 -24786 -54902 -149859 -201899 -233448 -344312 -519958 -625605
39971 -625605 -595889 -522852 -526167 -609012 -680323 -685426 -685007 -794692 -1028140 -1216124 -1153305 -851861
39959 -851861 -570732 -534501 -690176 -812559 -779036 -636612 -452058 -241689 -59826 -19850
39949 -19850 -154176 -329008 -375893 -275762 -153265 -110774 -134818 -173574 -238510 -371197 -533099
39938 -533099 -601426 -500105 -284992 -64331 114167 241075 260682 104956 -191383 -491772
39928 -491772 -683861 -741796 -678112 -532438 -412822 -427181 -528613 -540004 -399226 -275400
39918 -275400 -347986 -555778 -680737 -627430 -497064 -404106 -336857 -220120 -34777 157660
39908 157660 270176 257614 153362 34699 -61502 -161483 -279271 -369431 -386423 -334519 -218700
39897 -218700 -16774 235438 400580 369040 182948 -48445 -292696 -551158 -744899 -798367
39887 -798367 -806470 -940931 -1164708 -1207067 -897677 -400080 -31385 46371 -122964 -428639
39877 -428639 -751350 -951700 -949356 -815619 -689093 -600235 -468956 -275712 -129791 -128525
39867 -128525 -230324 -323917 -365003 -380250 -380215 -349455 -307807 -296456 -291038 -212987 -67899 7495
39855 7495 -86374 -252530 -308284 -230987 -177158 -247978 -360040 -397647 -374299 -354524 -315919
39844 -315919 -214564 -123893 -160216 -284405 -322111 -207873 -83444 -99463 -223721 -321538
39834 -321538 -347162 -361073 -397610 -410130 -349611 -229287 -89134 63834 250663 468083
39824 468083 666656 794810 853860 878216 854314 710566 436370 169635 78198 153820
39814 153820 216415 157207 88870 178235 388503 495065 361480 112656 -8882 91535
39804 91535 295504 454721 573248 768839 1081578 1381615 1490380 1361743 1116039 918722
39794 918722 855049 899373 962310 972594 944913 958335 1042429 1115573 1084284 970893 870361
39783 870361 805189 721630 625896 599097 634292 582798 355301 86651 -14484 71988 178182
39772 178182 175258 79286 -53239 -198529 -306325 -293363 -164551 -53568 -66141 -141591 -140784
39761 -140784 -22731 138670 268676 333524 295336 134073 -64340 -132796 5657 232564
39751 232564 346050 257559 52631 -111589 -132946 -16834 140123 208608 108946 -126367
39741 -126367 -362215 -448379 -331366 -104457 67312 99467 51841 12620 -38446 -169657
39731 -169657 -327057 -362917 -272965 -251201 -396513 -504601 -341245 -38219 29164 -235643
39721 -235643 -506762 -507472 -390298 -464316 -712140 -821556 -636098 -341391 -181710 -173325 -163071
39710 -163071 -47923 135705 270277 254776 87738 -125081 -275033 -346830 -372215 -342350
39700 -342350 -253384 -189572 -236920 -338168 -370385 -353590 -417327 -542304 -525052 -277538 7096
39689 7096 99825 5416 -133111 -256223 -355060 -342107 -162770 28418 16629 -166529 -290474
39678 -290474 -286821 -340632 -554089 -734090 -659287 -406024 -229278 -206776 -195025 -121114 -126019
39667 -126019 -341124 -640159 -731884 -484167 -80561 172955 169429 91385 168762 385835
39657 385835 494862 328660 18227 -164865 -127914 -23273 -14144 -90697 -158540 -210678 -323126
39646 -323126 -522414 -739505 -881879 -889613 -740333 -478487 -244600 -195461 -356933 -596407
39636 -596407 -758538 -787256 -713360 -595045 -500750 -480411 -501794 -464475 -323076 -151727 -50371
39625 -50371 -47400 -133986 -306272 -496809 -553430 -407783 -213674 -191770 -364061 -558320 -643901
39614 -643901 -633101 -578370 -524458 -551753 -691212 -781167 -604705 -226438 7390 -93036
39604 -93036 -309228 -339009 -200661 -125759 -180562 -221919 -172211 -118459 -135714 -191584 -249806
39593 -249806 -318097 -359257 -287486 -108863 26894 -28071 -264440 -523132 -632340 -560000
39583 -560000 -459041 -505689 -658907 -687216 -509571 -362134 -471123 -700100 -755475 -645949
39573 -645949 -641114 -794395 -837695 -627695 -384339 -326219 -331202 -172952 99605 248532 180074
39562 180074 -16069 -246038 -423998 -410674 -171995 61129 16760 -262552 -489132 -517755
39552 -517755 -440893 -320516 -94970 190927 320995 204219 42451 51206 162421 165787
39542 165787 27440 -114872 -204113 -316418 -464592 -524282 -418009 -254888 -195757 -235299
39532 -235299 -212629 -39375 162272 205180 85728 -1262 80018 224649 246615 156036 141077
39521 141077 273283 376137 257561 -28363 -249060 -270719 -181444 -162297 -302762 -528549
39511 -528549 -662299 -576936 -334985 -150573 -166642 -300202 -362223 -296631 -224360 -262339 -379726
39500 -379726 -452065 -398680 -238174 -45760 112978 212532 241473 162193 -57312 -351437
39490 -351437 -561364 -599035 -562835 -602529 -698404 -686675 -506145 -296324 -208924 -233925 -279826
39479 -279826 -323029 -377304 -393043 -314680 -207257 -204614 -331783 -482158 -577718 -645775 -711808
39468 -711808 -726804 -663109 -595064 -600707 -641026 -628112 -579940 -606663 -738903 -861272 -856470
39457 -856470 -752973 -672037 -658730 -631298 -508338 -336730 -252584 -328375 -498981 -646043
39447 -646043 -715662 -724964 -687262 -586664 -427089 -262727 -167495 -193488 -339483 -513017 -548337
39436 -548337 -354353 -63437 60962 -85869 -335741 -482376 -532714 -620465 -755230 -815470
39426 -815470 -763453 -700456 -685951 -657086 -582831 -549900 -599821 -606821 -452325 -238338 -175210
39415 -175210 -293269 -418157 -436536 -436158 -525011 -633149 -601787 -416733 -242280 -208983 -243672
39404 -243672 -165610 70053 287804 283079 60879 -178375 -285221 -316619 -415368 -608362
39394 -608362 -789209 -852211 -772060 -587999 -386995 -272741 -264784 -251290 -137302 -16088
39384 -16088 -65905 -273655 -412965 -348973 -217953 -212292 -321444 -416617 -478516 -569176 -651218
39373 -651218 -634245 -576418 -628039 -749087 -701519 -410451 -130654 -108196 -246264 -301660 -282398
39362 -282398 -398707 -674080 -884385 -921915 -953970 -1098796 -1174394 -970604 -618178 -445783
39352 -445783 -532174 -635422 -570912 -440471 -420519 -505376 -573416 -582513 -576485 -576041 -574797 -586356
39340 -586356 -591642 -489995 -219699 96976 248077 179648 50294 19930 75179 97124 19777
39329 19777 -128370 -275821 -343765 -280298 -125553 -16786 -64737 -228438 -360151 -374227
39319 -374227 -328048 -329732 -410696 -516758 -597984 -666718 -760915 -875272 -950480 -929378 -809267
39308 -809267 -635986 -465061 -345283 -323205 -419169 -573572 -642764 -502891 -188492 92842
39298 92842 130161 -85688 -347156 -442468 -369688 -316841 -446908 -738636 -1027602 -1152908
39288 -1152908 -1060880 -827375 -608707 -520520 -525386 -479372 -324067 -178528 -184134 -309852 -395829
39277 -395829 -362803 -283644 -248874 -253689 -236877 -149258 42007 331554 612641 715037 578144
39266 578144 341163 198396 202458 269301 330391 386248 419573 357879 170282 -52529 -171217
39255 -171217 -138830 -33806 45119 82999 128471 191673 208615 126853 -8926 -99624 -103786
39244 -103786 -59982 -7865 50481 100895 97400 29848 -39930 -57736 -60376 -133130 -300930 -496122
39232 -496122 -622417 -632374 -562593 -504524 -510528 -523878 -450419 -305391 -214442 -243504 -319187
39221 -319187 -370146 -443879 -588829 -712797 -692267 -565749 -473822 -441720 -380566 -294073 -300963
39210 -300963 -406065 -419360 -200865 131659 338598 315313 130621 -99593 -275255 -319319
39200 -319319 -234497 -123258 -74351 -62763 -17815 67714 158598 232904 240973 99104 -168351
39189 -168351 -369971 -371638 -304774 -377507 -532948 -511466 -251553 8769 98368 153682 356053
39178 356053 611881 684126 534368 345120 259449 272114 347349 469382 564448 523817 343965
39167 343965 132837 -49725 -245888 -460660 -584400 -519656 -307062 -74229 67299 37992
39157 37992 -192327 -525598 -758036 -774441 -660126 -539606 -389776 -140576 108580 157462
39147 157462 -3887 -150703 -132098 -70362 -151453 -347668 -496436 -572209 -697945 -891335
39137 -891335 -970143 -778595 -402444 -78746 50164 27516 -28320 -53794 -69209 -128479 -252563
39126 -252563 -402070 -516149 -565540 -541634 -417729 -190833 32858 82220 -97106 -362945
39116 -362945 -531339 -562758 -545299 -551581 -582232 -603933 -565904 -417804 -192114 -28069 -17674
39105 -17674 -61651 8749 186890 296828 246153 130788 48502 -56869 -287662 -623815
39095 -623815 -935296 -1093250 -1026398 -763876 -480706 -396565 -547084 -741655 -817341 -822758
39085 -822758 -858785 -875243 -786210 -685033 -741655 -922579 -1006007 -877542 -640007 -419178
39075 -419178 -236322 -110023 -108984 -224927 -331365 -352805 -359195 -413088 -439931 -352605 -213645
39064 -213645 -162615 -237840 -360855 -452137 -485703 -471119 -446894 -451002 -451426 -370165 -229666 -188822
39052 -188822 -343271 -562030 -636306 -548058 -471786 -521320 -605998 -560394 -341824 -72292 74952
39041 74952 22328 -150120 -292814 -344891 -367095 -406138 -406014 -311604 -185604 -132447 -154719
39030 -154719 -178681 -184572 -209096 -237659 -197744 -67236 85239 168451 122278 -61951 -292990
39019 -292990 -390317 -258440 -39866 26624 -89746 -173811 -67114 112950 133325 -58478
39009 -58478 -290045 -383305 -344432 -327053 -433963 -574840 -553116 -314768 -58411 -29504 -237608
38998 -237608 -462573 -522297 -439093 -348128 -347810 -453705 -594878 -627738 -452043 -149814 76892
38987 76892 131361 90106 30527 -71877 -214790 -282387 -205952 -110911 -167090 -350012 -483711
38976 -483711 -491684 -473965 -524817 -582616 -507559 -258854 36785 182187 87057 -133258 -266082
38965 -266082 -234213 -175217 -246104 -406070 -475581 -384635 -265492 -278081 -413687 -516661 -469302
38954 -469302 -310266 -167997 -112842 -113719 -134185 -200771 -321236 -391995 -294378 -80370 44955
38943 44955 -41706 -252114 -423296 -488022 -459131 -346152 -177513 -42110 -19654 -100692 -227142
38932 -227142 -357498 -438323 -388200 -200949 -13966 20907 -91497 -219909 -271129 -245890
38922 -245890 -164228 -28118 138241 268630 282323 123473 -180552 -484024 -624970 -600250
38912 -600250 -547994 -516874 -393199 -150806 -11162 -170935 -475128 -577869 -381898 -104736
38902 -104736 72456 189111 304383 341321 237986 89571 20021 21006 13338 -29678 -109308
38891 -109308 -258753 -472712 -644832 -670338 -572737 -458434 -381479 -312476 -209531 -69760
38881 -69760 64685 118527 32214 -170241 -381364 -483766 -402045 -120520 265812 534252
38871 534252 494530 216076 2640 75970 349873 572027 618896 571922 545498 532224 436061
38860 436061 214689 -47348 -221095 -272740 -272226 -255452 -165048 12631 148468 124323 12121
38849 12121 -47788 -90213 -258528 -508343 -590106 -380638 -53461 149267 153859 3282 -245446
38838 -245446 -468043 -492073 -313110 -160313 -207422 -337758 -340753 -228612 -191371 -319765
38828 -319765 -540010 -766894 -960098 -1062110 -1030051 -921307 -834776 -785210 -729991 -678887
38818 -678887 -668282 -659811 -570766 -382395 -136759 127981 356631 457590 403872 286915
38808 286915 170983 -14716 -311000 -558828 -573201 -416876 -301558 -256156 -109566 192899
38798 192899 470148 553511 478475 366718 268628 191656 154763 140421 90838 5275 -48417
38787 -48417 -52819 -73999 -145772 -221474 -269622 -314494 -352637 -334550 -262859 -209062 -203319 -202163
38775 -202163 -178311 -134674 -29158 172594 353363 320977 83373 -115929 -116508 -38980 -63033
38764 -63033 -159245 -185278 -139761 -159256 -308774 -500520 -601827 -547388 -377592 -219815 -184491
38753 -184491 -245451 -296726 -347670 -533282 -873191 -1171175 -1260635 -1208006 -1135017 -981453 -642451
38742 -642451 -248592 -78166 -204221 -425542 -560124 -626495 -698975 -753481 -732416 -641202
38732 -641202 -508576 -344641 -197849 -166044 -284385 -465757 -603767 -674681 -694528 -646619
38722 -646619 -515270 -340699 -180083 -56156 76 -90742 -361802 -680485 -821116 -692293
38712 -692293 -432618 -245444 -194706 -216628 -273735 -387236 -517102 -535521 -393246 -226809
38702 -226809 -195360 -258125 -232403 -59250 111204 119059 -31233 -230387 -390763 -459552 -406483
38691 -406483 -279341 -202737 -244003 -328956 -347355 -280878 -169388 -29470 107278 143490 13402
38680 13402 -202765 -357879 -404698 -394708 -345093 -222559 -60334 20369 -54904 -227103 -384864
38669 -384864 -478393 -517337 -496459 -380920 -185810 -46458 -140157 -474370 -793677 -812648
38659 -812648 -552267 -318469 -304574 -363968 -275280 -85537 -21611 -152633 -332970 -446642
38649 -446642 -525820 -622513 -722535 -809338 -879171 -877904 -756209 -601320 -569453 -657503 -686979
38638 -686979 -559469 -384769 -296460 -284623 -293275 -345328 -456717 -532661 -474325 -320122 -175539
38627 -175539 -67045 28797 70180 -14892 -200302 -365803 -420998 -361596 -234422 -115189
38617 -115189 -80126 -118705 -113110 5446 118993 55466 -157066 -299196 -248353 -137731 -165338
38606 -165338 -337171 -486857 -496011 -400440 -292117 -204382 -123265 -57953 -50563 -124031 -249732
38595 -249732 -371868 -449214 -467952 -427150 -327217 -176241 -4448 130834 164983 70744 -105886
38584 -105886 -265506 -328196 -292498 -222642 -178029 -146811 -43258 204457 534391 748332
38574 748332 696702 462581 277320 230977 166369 -76716 -409831 -598406 -556955 -417857
38564 -417857 -332113 -326786 -358219 -380612 -335085 -184854 -11761 11337 -196354 -524637 -792073
38553 -792073 -906151 -877770 -750027 -563975 -351733 -129232 73839 180618 128353 -34988
38543 -34988 -195698 -322664 -473605 -637507 -696813 -609115 -515239 -571446 -742706 -845255
38533 -845255 -744928 -458847 -129412 46036 -54217 -334647 -541872 -539932 -447184 -424499
38523 -424499 -438776 -362450 -210518 -110447 -90438 -76597 -81626 -208228 -435710 -577910 -529056
38512 -529056 -418386 -427814 -551289 -630541 -564450 -388813 -186122 -9527 103634 118790
38502 118790 45225 -35684 -28846 68781 147929 114450 20106 -5089 46116 31543 -112510
38491 -112510 -230971 -153655 38920 101824 -52510 -266699 -372096 -363936 -313373 -240266 -135667
38480 -135667 -14281 110539 227180 272069 176893 14097 -17269 167399 396524 434008
38470 434008 257475 62181 26888 148706 282061 279549 112967 -100918 -210586 -183531
38460 -183531 -118003 -105521 -154026 -249450 -377826 -446358 -321888 -46561 108525 -50961
38450 -50961 -367556 -521038 -433466 -308204 -293527 -310601 -251091 -155698 -104704 -75861 -23971
38439 -23971 3631 -47633 -107931 -54493 120626 309530 424395 444522 357568 160130 -79561
38428 -79561 -250602 -312354 -313392 -291108 -233280 -166518 -197277 -392443 -656349 -795789 -706907
38417 -706907 -459468 -201973 -25419 68238 100396 63508 -53880 -218826 -371210 -488097
38407 -488097 -580109 -605007 -459053 -128883 204720 335026 286980 266519 332826 297056 44959
38396 44959 -212048 -197731 21252 119528 -27688 -215469 -272600 -299453 -421900 -527491
38386 -527491 -444665 -246404 -159216 -238960 -338271 -362089 -359735 -364022 -329520 -268073 -275539 -359767
38374 -359767 -388628 -291959 -193885 -249814 -444497 -641616 -751319 -753633 -630431 -394634 -158358
38363 -158358 -63809 -135140 -261144 -329182 -332589 -346139 -427092 -543893 -602639 -565089 -521266
38352 -521266 -579860 -694159 -701954 -570028 -476706 -567701 -737391 -778297 -676794 -613414 -694465
38341 -694465 -823946 -851322 -726542 -485595 -193167 54268 154953 93805 -31501 -109521
38331 -109521 -112427 -88223 -93251 -135903 -160809 -110262 -31013 -60578 -239019 -408922 -421550
38320 -421550 -375744 -476713 -687264 -744046 -561972 -383666 -407074 -488282 -413955 -293294
38310 -293294 -405120 -729675 -922527 -788191 -536363 -465539 -570333 -603014 -426907 -170637
38300 -170637 -49030 -113816 -202889 -131492 68292 153405 -23470 -279338 -308311 -101606
38290 -101606 15519 -184587 -529975 -684821 -560789 -359445 -285287 -355516 -459158 -486004
38280 -486004 -405049 -297081 -294891 -432602 -594388 -672003 -705208 -778569 -855293 -841481 -762042
38269 -762042 -721977 -712928 -611556 -378435 -118550 68566 157573 106954 -124556 -418975
38259 -418975 -536051 -409427 -251549 -243035 -268051 -126236 111670 178446 2735 -181168
38249 -181168 -143344 84820 312305 411797 372954 239062 82712 -6205 14883 94701 132607
38238 132607 59254 -118599 -309498 -374141 -230775 52953 313706 449828 480592 444255
38228 444255 311809 51983 -267011 -513397 -629931 -684851 -759545 -814150 -719782 -450645
38218 -450645 -193884 -175554 -362700 -445522 -202031 189874 326892 47365 -398379 -655777
38208 -655777 -619116 -430135 -247612 -128090 -74881 -81927 -114096 -111946 -40088 94676 267073
38197 267073 436480 523617 427202 102186 -369161 -791196 -959062 -782429 -341331 156528
38187 156528 475706 460505 125982 -319831 -595734 -559001 -302666 -23153 175493 311195
38177 311195 414147 470038 452279 335439 97874 -204695 -397568 -344640 -156700 -107818
38167 -107818 -296278 -510505 -499928 -264296 12620 201117 271599 196916 -21535 -255926
38157 -255926 -337207 -259223 -180597 -201663 -250189 -221480 -123214 -24592 45598 75504 18328
38146 18328 -142732 -315872 -378945 -328926 -278777 -305014 -371424 -417517 -445828 -480579 -503122
38135 -503122 -488145 -457767 -431746 -366997 -238266 -143875 -194354 -286446 -160845 219449 501475
38124 501475 325916 -203723 -628952 -684285 -534830 -449428 -456307 -424583 -310509 -168491
38114 -168491 -23115 119138 192803 140181 13462 -101696 -216666 -373582 -496277 -461695
38104 -461695 -318506 -278306 -434180 -604731 -541976 -234002 73080 133185 -66638 -323127
38094 -323127 -433882 -379427 -284479 -227650 -156617 -9572 165327 281428 332952 339785 225899
38083 225899 -100379 -534779 -788794 -687228 -373029 -146399 -153604 -293412 -382176 -338517
38073 -338517 -221945 -151797 -199267 -330203 -446563 -491890 -504311 -552532 -637767 -689632 -660819
38062 -660819 -594495 -567344 -572507 -504548 -293485 -23309 140022 135838 68814 75205 184307
38051 184307 321698 385721 306346 104668 -81291 -117598 -55673 -86270 -258504 -378721
38041 -378721 -292851 -128779 -86844 -101381 51104 343061 460636 238904 -95250 -235502
38031 -235502 -172947 -107911 -119992 -117552 -61166 -51230 -165140 -328533 -400251 -325703 -174484
38020 -174484 -65688 -75865 -185693 -288887 -268215 -92783 144923 296734 284182 161986
38010 161986 41424 -41347 -138431 -273356 -387983 -441797 -477405 -513645 -459282 -249997 -8098
37999 -8098 85313 53607 96355 283685 445318 420507 265119 114979 -33202 -278934 -623137
37988 -623137 -928086 -1045457 -917135 -589738 -197176 102580 233418 229936 145561 -7455
37978 -7455 -192465 -304728 -274010 -168564 -121558 -174638 -253854 -285257 -278965 -293429 -344841
37967 -344841 -365478 -268352 -71305 75761 39815 -143902 -330588 -435522 -452439 -354057
37957 -354057 -131652 72452 60927 -133650 -236523 -95333 106833 123828 -20728 -129643
37947 -129643 -136644 -129447 -147776 -148465 -138204 -171485 -226778 -229065 -186426 -170674 -176029 -138401 -91106
37934 -91106 -149447 -314890 -436542 -421293 -369895 -440079 -653195 -888741 -1007993 -943253 -723868
37923 -723868 -456960 -245580 -102820 22084 136495 183239 141288 86830 111551 202689
37913 202689 238274 114706 -115996 -256576 -159737 86222 237496 186486 91815 163801
37903 163801 401997 626300 701874 639769 524818 439677 424827 429741 341175 131968 -79647
37892 -79647 -201583 -309245 -488102 -621456 -519160 -226631 -13925 -40194 -199161 -329138
37882 -329138 -402477 -436933 -377227 -183688 51763 186464 180969 102480 11559 -95586 -246031
37871 -246031 -420820 -525302 -449116 -190380 107078 287847 319920 244499 67374 -185221
37861 -185221 -359679 -289929 -33318 149072 90077 -110000 -239677 -210220 -101868 -56857
37851 -56857 -144108 -260229 -181928 181318 603003 733658 482788 86634 -195346 -299817
37841 -299817 -272071 -151987 -22670 -14443 -147905 -265718 -207511 6087 201916 201683 -53085
37830 -53085 -415939 -588269 -405168 -73186 44151 -112969 -258788 -213388 -142625 -235898
37820 -235898 -392087 -417600 -350544 -364974 -470913 -522927 -459239 -353986 -283012 -286213 -406613
37809 -406613 -626363 -816436 -875909 -861600 -862238 -824855 -647595 -375624 -151601 -16634 98647
37798 98647 222776 314612 353070 338445 241089 58485 -116364 -183315 -146092 -56112 71841
37787 71841 195804 209456 94421 -1899 16153 20685 -117315 -259871 -183118 67774 259165
37776 259165 341758 461310 612682 584196 306514 -10888 -193680 -325861 -536665 -759733
37766 -759733 -853933 -823033 -768216 -715708 -619090 -475346 -340433 -259892 -238113 -248684 -258332
37755 -258332 -275173 -351635 -480167 -539097 -447798 -319681 -312767 -372014 -309427 -128377 -47985
37744 -47985 -162627 -295944 -285733 -219826 -259577 -381005 -435494 -366402 -241532 -145614 -137375
37733 -137375 -242383 -405573 -513503 -523598 -504289 -511586 -519958 -512258 -523192 -541181 -486593
37722 -486593 -353180 -257808 -281648 -370012 -448120 -515988 -570623 -574794 -578485 -719524 -1000077
37711 -1000077 -1205390 -1165183 -968144 -795712 -674083 -531138 -378964 -282066 -235689 -220646
37701 -220646 -291999 -473868 -653965 -720700 -714000 -704839 -638469 -463103 -304794 -316648 -431976
37690 -431976 -461784 -368189 -247514 -122960 20196 62397 -123721 -401299 -494545 -390880
37680 -390880 -338620 -409097 -367895 -91404 178209 175803 -17884 -162135 -235982 -395236 -653468
37669 -653468 -837799 -835568 -708912 -567781 -459956 -387006 -335901 -303586 -342045 -516456 -752529
37658 -752529 -828303 -639188 -381236 -315307 -419009 -459220 -366027 -305134 -359655 -387584 -301218
37647 -301218 -268060 -450106 -695253 -711850 -476313 -241709 -159493 -120555 -13524 79080
37637 79080 53073 -25311 -48889 -60148 -142267 -217604 -155167 -33164 -81131 -344363 -598211
37626 -598211 -647851 -543288 -427518 -337228 -257279 -225584 -248245 -220083 -72823 78556 79274
37615 79274 -38584 -115139 -98740 -72500 -73202 -41832 34977 72126 8617 -119195 -252711
37604 -252711 -372144 -465716 -518160 -539413 -533444 -455080 -292785 -172280 -245537 -465027 -604771
37593 -604771 -545828 -414311 -379205 -432986 -451197 -369609 -213652 -31808 108108 115659 -40246
37582 -40246 -280773 -507226 -691994 -824618 -839238 -687111 -439150 -228242 -113723 -71527
37572 -71527 -78911 -123810 -162006 -163273 -188873 -326978 -548471 -719583 -770297 -757601 -739450
37561 -739450 -688984 -586947 -502375 -489282 -463888 -293229 9498 269694 332746 184182
37551 184182 -103689 -438783 -693309 -735162 -564572 -357079 -284814 -341972 -428317 -538328
37541 -538328 -730744 -937132 -970000 -769488 -506745 -366769 -334715 -278736 -148721 1729
37531 1729 108972 113855 -39823 -301257 -465705 -366328 -87891 128725 170241 116975 48734
37520 48734 -65295 -256989 -462660 -579861 -541333 -329043 -19656 178848 71686 -286689
37510 -286689 -599251 -616345 -337646 85228 509920 811529 878134 722012 513846 397229
37500 397229 329723 201528 40483 -23715 38577 117568 130804 132755 238134 499883 872691
37489 872691 1240064 1465588 1469611 1288637 1052795 898941 890127 975306 1010826 871581 582010
37478 582010 304533 165169 130938 97528 43940 30682 76982 122400 113463 66051 29294
37467 29294 36231 106249 251198 440692 575136 535859 294872 -26829 -245959 -285393 -227845
37456 -227845 -174855 -106244 43345 206116 204829 -18432 -308011 -488795 -565136 -650572 -775813
37445 -775813 -868840 -887921 -871183 -853838 -816938 -738635 -642094 -562232 -487555 -361198 -149341
37434 -149341 93721 252604 265146 184290 91409 -9613 -142362 -245676 -229026 -134788
37424 -134788 -114426 -217116 -332613 -383207 -423401 -477326 -439083 -262103 -111691 -165571 -357436
37413 -357436 -489033 -523319 -578093 -669463 -664260 -501108 -284312 -122859 -26904 -3154 -101334
37402 -101334 -295646 -443721 -446495 -360042 -282005 -216692 -129297 -52878 -44915 -84772 -106911
37391 -106911 -115829 -186954 -352309 -551860 -716610 -847214 -970733 -1050757 -1006127 -835340
37381 -835340 -659701 -584826 -566216 -505104 -448986 -554101 -814019 -976755 -836349 -500500
37371 -500500 -246733 -190288 -220218 -201640 -106467 15459 69910 -35176 -250404 -344511 -156098
37360 -156098 150156 245863 43204 -227863 -333790 -247116 -44952 188008 311025 196655
37350 196655 -58856 -175926 -44551 130326 143422 71306 90552 170118 139224 -30402
37340 -30402 -198775 -269631 -271590 -259891 -278785 -397069 -639182 -878390 -922228 -731606 -472265
37329 -472265 -330943 -345693 -429299 -499886 -555327 -629754 -691818 -628129 -388536 -124241 -72369
37318 -72369 -278666 -539671 -654899 -618828 -514502 -360433 -160153 21361 147085 264973
37308 264973 359643 271314 -80150 -491746 -678938 -616789 -510254 -490210 -530443 -616435 -771022
37297 -771022 -903344 -842059 -570220 -263468 -52675 96829 232676 309191 297798 256009
37287 256009 215126 133811 34485 44860 202563 333378 240232 -58078 -367782 -536250
37277 -536250 -550686 -485547 -432761 -443837 -486162 -494304 -482683 -527321 -606889 -571477 -339604
37266 -339604 -33398 164297 207081 154699 27735 -194600 -473815 -709748 -825333 -799620
37256 -799620 -661999 -511397 -474271 -557847 -602753 -481308 -295390 -258990 -404816 -532331
37246 -532331 -465190 -256092 -93450 -77305 -139973 -153445 -73243 21418 19668 -93678 -221318
37235 -221318 -270045 -250164 -236546 -266110 -308596 -316545 -279754 -253806 -341352 -591632 -894950
37224 -894950 -1039908 -920962 -643142 -388882 -240112 -163062 -87285 53164 273757 473410
37214 473410 506148 387159 311961 374585 407697 257220 73051 90166 210825 104100
37204 104100 -269617 -532818 -387845 9116 306357 372831 289645 118045 -104188 -256747
37194 -256747 -254013 -209565 -286888 -427788 -424550 -246577 -100299 -143594 -319092 -515850 -726041
37183 -726041 -954491 -1107876 -1091413 -946125 -799124 -723281 -709092 -718727 -692855 -550114 -273055
37172 -273055 11534 119261 6537 -158100 -158527 40294 259185 315447 233857 187717 235182
37161 235182 221031 15175 -244347 -295343 -115130 25852 -82587 -332334 -480792 -469365
37151 -469365 -431062 -460154 -517802 -534531 -473316 -299605 -21458 218916 221469 -36020 -317838
37140 -317838 -357336 -127958 149586 227560 28569 -319306 -590202 -637126 -510589 -384927
37130 -384927 -345549 -293536 -98193 210308 470151 580176 585805 578762 588268 594837 591776 586477
37118 586477 561888 477596 326706 190810 213073 464644 819658 1024095 947994 726665
37108 726665 578852 530632 436950 263185 186585 349699 640667 831207 851725 809236
37098 809236 790964 789495 801422 856233 928110 946865 937121 1027724 1255075 1457565 1459738 1300237
37086 1300237 1185111 1248593 1437073 1604869 1654298 1597554 1541905 1601550 1776010 1941042
37076 1941042 2010378 2064135 2238753 2523342 2768683 2894482 2980437 3127678 3329544 3527037
37066 3527037 3707803 3883732 4028897 4109964 4145816 4179064 4208263 4191970 4103902 3956037
37056 3956037 3791489 3673810 3640560 3638890 3560596 3386672 3243160 3250241 3362025 3433854 3413642
37045 3413642 3373071 3361882 3332512 3229162 3067716 2894943 2737548 2626226 2600614 2634647
37035 2634647 2607098 2416968 2118322 1891351 1869725 2009074 2120586 2037332 1776485 1539637
37025 1539637 1510190 1641292 1702914 1563908 1350849 1264495 1314622 1352066 1325784 1352537 1494817
37014 1494817 1618888 1584063 1474426 1490991 1648492 1742704 1647858 1495795 1474600 1565992
37004 1565992 1604723 1521732 1381934 1216007 982278 722173 596706 684240 851549 922685
36994 922685 894819 885035 932836 981268 1018790 1103610 1233633 1303627 1230825 1048785 845221
36983 845221 668000 518238 380340 235363 94016 28883 114221 315977 503254 589068
36973 589068 593879 550660 440258 282333 209365 346278 637774 880151 931868 838007 740207
36962 740207 711095 698452 610468 434710 261505 179502 162698 100365 -56460 -226080 -296368
36951 -296368 -250424 -157216 -71796 9936 110970 224877 312943 346254 361714 457980 684008
36940 684008 932072 1017043 899070 761416 805990 1013819 1172929 1121550 907737 720226
36930 720226 706868 852848 1000495 991651 811626 588943 457500 447516 496882 504870 377476
36919 377476 113888 -127109 -152939 21257 169712 163941 150155 300717 521545 592912
36909 592912 517209 502638 618198 690677 588063 404874 283820 223159 166637 142842 188189
36898 188189 232871 188462 77715 -30534 -142759 -275534 -328434 -171720 137852 352711
36888 352711 285819 -4020 -303673 -460175 -468335 -392827 -270077 -107989 50298 123647
36878 123647 83719 3645 -38221 -63483 -123952 -166354 -93816 38365 43592 -120972 -243796
36867 -243796 -123902 169593 418279 525334 518539 378075 67140 -280802 -406820 -219748
36857 -219748 89142 282074 311080 259249 165505 21112 -114497 -114268 69965 303572 351802
36846 351802 101168 -285489 -482572 -331254 -22606 129236 65553 13197 135919 312852
36836 312852 341737 231612 161454 218537 319235 370908 383483 397456 400357 362721 300339
36825 300339 258986 268175 335819 463711 643767 844800 1008285 1058966 946036 699849
36815 699849 426891 215377 64032 -65135 -161627 -195641 -204154 -261662 -364704 -432279 -437344
36804 -437344 -447277 -498454 -521563 -449588 -320659 -206467 -116486 -53630 -79124 -203115 -276876
36793 -276876 -145082 120299 293452 300616 289060 367322 458447 483265 507928 580062 570567
36782 570567 352701 37899 -153068 -190971 -217177 -255729 -161169 113640 387264 464276
36772 464276 341570 132277 -80187 -226225 -219310 -69121 52834 -14906 -224651 -387624
36762 -387624 -403783 -331311 -259186 -214824 -199264 -224449 -285122 -340964 -350048 -303655 -233322 -198860
36750 -198860 -244400 -337079 -375600 -298281 -164444 -91920 -127632 -211204 -251448 -209497 -121724
36739 -121724 -68612 -108523 -220779 -325715 -367866 -352940 -300364 -209092 -91914 6914 61550
36728 61550 88877 93569 42020 -66158 -153758 -154404 -113324 -140303 -274857 -438491 -512564 -448774
36716 -448774 -327747 -307373 -458251 -649200 -680978 -550665 -471227 -579576 -750323 -785477
36706 -785477 -662958 -471798 -220509 110018 394211 445976 268473 48290 -103682 -239397
36696 -239397 -388107 -462046 -403635 -279957 -171337 -98964 -112431 -290319 -565267 -698666
36686 -698666 -557256 -303863 -181137 -199211 -185591 -76998 6886 -30915 -128386 -153909 -31444
36675 -31444 230098 531842 697829 601337 319505 76183 -13052 -53286 -167138 -272402
36665 -272402 -187708 68669 231205 96395 -217763 -416142 -379763 -265467 -263557 -377149
36655 -377149 -485272 -520926 -501863 -450088 -377174 -318446 -296909 -273364 -207635 -141955 -136258
36644 -136258 -146355 -75538 57007 117941 51583 -43484 -67598 -37805 3231 81435 202673
36633 202673 263675 176296 36398 46007 268983 558531 734281 746630 650876 510655 382519
36622 382519 333162 388140 470845 458524 318466 143588 29179 -36515 -111092 -172843 -142541
36611 -142541 -21017 91693 138661 175567 254415 327681 332356 288158 237530 166761 72389
36600 72389 26674 76126 150382 181785 233009 373793 514484 524380 446464 415055 423926 382388
36588 382388 346985 452312 633892 687231 608972 588467 625033 486748 153438 -47552
36578 -47552 65926 225059 144473 -28973 -9188 134018 141028 55983 156401 460814 682275
36567 682275 671940 583287 572252 627870 730836 895379 1006520 893618 637134 541299
36557 541299 713730 918007 944544 889027 935342 1075270 1185524 1205094 1109741 883353
36547 883353 634189 558564 661410 702063 559173 439048 531081 666120 581719 371096
36537 371096 353513 567924 715542 617516 433237 345336 289651 145745 2615 40649
36527 40649 238443 372310 297897 115848 39351 163412 383388 504223 416025 182869
36517 182869 -23249 -69524 50278 241849 385613 397594 275526 122074 92621 263698
36507 263698 536215 701147 633325 412151 226296 173972 200284 220182 222954 222465 188807
36496 188807 109056 55488 86583 110182 -32046 -335282 -603237 -685232 -638504 -600007 -590535
36485 -590535 -529207 -381750 -202172 -47079 77085 177435 235535 223951 145860 45981
36475 45981 -23767 -46899 -29383 56285 258848 544145 764186 797386 671911 482929 263291
36464 263291 45199 -37442 106415 308770 281201 -2657 -262949 -302715 -229657 -197692
36454 -197692 -147303 32963 256282 339970 245584 50744 -204558 -467055 -579571 -451162
36444 -451162 -238642 -146136 -111783 71180 366958 500276 364409 168035 114158 173029
36434 173029 264583 427888 661920 799366 730409 615243 679523 887987 1008726 949654
36424 949654 855209 887348 1064134 1314967 1559499 1718862 1768632 1803008 1945249 2178982
36414 2178982 2372545 2489715 2657909 2979106 3387316 3776930 4184564 4736597 5461727
36405 5461727 6255755 7010524 7686848 8271052 8754951 9172226 9568276 9900086 10030961
36396 10030961 9860457 9411696 8774636 8036395 7301582 6691799 6241205 5840674 5365691
36387 5365691 4829499 4341728 3954939 3636697 3363961 3145919 2956503 2733618 2456871
36378 2456871 2164161 1904809 1743195 1764237 1957683 2120735 2024097 1693097 1384768 1260496
36368 1260496 1234313 1186212 1142170 1145099 1119115 1004825 890579 850022 773789 552015 324434
36357 324434 323043 511279 613513 510231 376531 372133 409261 348234 257067 306817 486619
36346 486619 587417 473383 256610 155023 230236 330862 304391 202272 192606 286171
36336 286171 284006 65977 -195193 -245056 -90164 37735 18290 -43473 -41747 -12986 2464
36325 2464 66288 208698 317769 270700 86860 -135186 -342378 -502558 -549317 -458713 -314286
36314 -314286 -200967 -102403 3565 35689 -69751 -193589 -152727 34342 162155 131048
36304 131048 65214 90249 149115 138495 103587 157069 274552 323928 281053 268471 350694
36293 350694 421366 362686 219268 126134 132866 192033 266518 340552 361721 294810 220040
36282 220040 247316 326814 290503 120446 21302 140325 349798 422788 314857 141664
36272 141664 -23975 -171993 -238281 -147814 36092 157971 173307 178458 235802 296861 310502
36261 310502 285439 227149 125704 23395 -13971 -6367 -31699 -81587 -62687 46951 164382
36250 164382 236527 283762 304530 279254 274037 371446 483041 434848 286442 328205 650379
36239 650379 948968 933303 720988 606765 608815 518132 300376 155066 183715 252285 221349
36228 221349 110592 -6025 -84484 -44120 199891 560533 791967 771114 640324 581828
36218 581828 575635 495365 342250 242848 262130 342899 408777 418291 329168 127761 -79418
36207 -79418 -108572 100765 389993 554250 565056 539345 520390 413766 175985 -49746
36197 -49746 -87065 41054 138007 68303 -126652 -324173 -421689 -352905 -136877 60319 44013
36186 44013 -170382 -352759 -360341 -323655 -432881 -650461 -773066 -708157 -545097 -391004
36176 -391004 -278947 -227901 -256526 -315823 -317619 -258979 -225720 -238750 -181484 64065 452952
36165 452952 790654 893422 729350 433941 198478 118656 140365 151440 99935 7891
36155 7891 -88002 -168468 -235827 -325474 -476818 -644825 -679972 -467224 -77010 273779 408622
36144 408622 314377 114945 -24789 5991 196682 422834 536689 456208 195536 -131016
36134 -131016 -346151 -352690 -270657 -324780 -538821 -656105 -456172 -47038 276367 378954
36124 378954 352567 302360 228796 110962 -27540 -145241 -182915 -59763 223926 500488
36114 500488 565692 397049 159803 23367 55050 229835 410671 370309 3815 -484806
36104 -484806 -760824 -723378 -545031 -367844 -161965 81401 234830 223159 164221 188362
36094 188362 231591 143372 -72458 -252490 -281209 -208373 -162231 -201784 -262090 -233996 -101363
36083 -101363 27718 56887 15595 -28276 -97022 -222557 -297913 -186335 30689 108512 -17370
36072 -17370 -131842 -66093 50085 -9829 -238063 -407708 -360296 -166302 -21635 -46889
36062 -46889 -172106 -209082 -78016 68554 40261 -114608 -179811 -99522 -34642 -61093 -39837
36051 -39837 113382 237280 151221 -87320 -295558 -394620 -390667 -276969 -108924 -33802 -80137
36040 -80137 -60554 132358 284937 148669 -156977 -298910 -211763 -134636 -189982 -227675 -137814
36029 -137814 -38612 -35952 -19504 145753 375206 466793 359479 164943 1424 -96143 -132144
36018 -132144 -107917 -33306 55873 105012 81618 26979 28908 93242 87480 -101873 -381713
36007 -381713 -524678 -431189 -225318 -79910 -44912 -80822 -168478 -312894 -473225 -550193
35997 -550193 -464966 -255634 -78968 -64450 -154807 -165364 -36732 68876 -3191 -180238
35987 -180238 -292327 -331596 -415704 -540254 -555364 -399211 -188871 -41257 55117 147137
35977 147137 229723 307304 421612 549988 578134 447791 252520 124938 103002 162118
35967 162118 294624 479601 637059 697399 686022 673033 658683 565459 345842 71724
35957 71724 -89779 -5786 284091 568360 650636 541205 425222 450029 595122 742439
35947 742439 804941 771839 688510 623849 628687 708851 841293 987899 1075383 1023922 857981
35936 857981 735531 781874 928488 1001247 935318 812346 718972 673294 672145 712426 783849
35925 783849 925327 1235494 1709038 2123606 2255064 2178554 2181088 2385125 2646630 2831219
35915 2831219 2973349 3104017 3130679 2995732 2794720 2636387 2520779 2429084 2373955 2277158
35905 2277158 1980787 1505067 1125730 1049645 1170172 1297579 1453238 1714914 1919450 1815137
35895 1815137 1469640 1242672 1304963 1411993 1252606 860276 558112 581023 854038 1114551
35885 1114551 1184346 1106865 1034123 1020208 991496 916097 888358 982512 1129205 1241567 1376130
35874 1376130 1633402 1953334 2155255 2161106 2048509 1898543 1731416 1596988 1579320 1664958
35864 1664958 1729643 1718992 1739911 1891905 2083942 2119967 1942309 1703698 1582676 1587228
35854 1587228 1585709 1508621 1452069 1543999 1755207 1920816 1943308 1891994 1881691 1933419 1994979
35843 1994979 2029385 2033249 2021268 2030913 2088720 2149485 2143574 2104938 2148537 2282570 2367381 2326353
35831 2326353 2264830 2289530 2353596 2406462 2546717 2840277 3101264 3078968 2810307 2572801
35821 2572801 2514956 2545992 2582245 2670786 2825324 2953054 3028182 3163580 3413951 3650193
35811 3650193 3727162 3662393 3563976 3488488 3455984 3509654 3668309 3880923 4085284 4248021
35801 4248021 4325211 4293494 4259373 4399760 4713589 4966269 4996846 4965029 5143473 5540420
35791 5540420 5895827 6032978 6064049 6220327 6583045 7020325 7331045 7434539 7462245 7655707
35781 7655707 8122367 8705075 9154150 9412497 9646322 9991145 10378548 10681695 10951314
35772 10951314 11387616 12079842 12879398 13583103 14170439 14778873 15486188 16230933 16969061
35763 16969061 17805580 18892406 20238137 21688924 23091699 24444624 25902121 27645660
35755 27645660 29714789 31958436 34214785 36553454 39247181 42461237 46082306 49941073
35747 49941073 54098925 58789547 64158552 70213276 76988925 84617226 93249960 103049221
35739 103049221 114238359 127034730 141554245 157916441 176402887 197313471 220613066
35732 220613066 245816400 272151635 298580494 323573912 345076893 360908859 369308984
35725 369308984 369336695 361141798 346021177 326008948 303154172 279083138 255055106
35718 255055106 232056958 210656884 190969882 172971794 156754090 142379489 129686249
35711 129686249 118424494 108446533 99588081 91528160 84020183 77171005 71237609 66185100
35703 66185100 61673179 57453905 53546308 50006945 46768032 43777998 41105954 38788712
35695 38788712 36696578 34661309 32669088 30841809 29258981 27853935 26487164 25111985
35687 25111985 23847894 22834661 22012290 21154101 20167794 19226247 18488811 17835297 17060160
35678 17060160 16226005 15588518 15208582 14883074 14473012 14052881 13666803 13177372 12500446
35669 12500446 11812449 11347826 11093694 10847673 10513742 10181471 9931921 9714630 9455859
35660 9455859 9184995 8979830 8831319 8644333 8381435 8129312 7962200 7800593 7521939
35651 7521939 7188866 7002641 6989315 6921847 6670238 6439623 6458675 6580367 6468351 6115597
35641 6115597 5876712 5958369 6151549 6150995 5902808 5526538 5110671 4736175 4531378 4528547
35631 4528547 4566355 4473616 4273916 4106250 4030631 4011486 4009135 3992899 3939892 3896954 3955053
35620 3955053 4091581 4143614 4016205 3802022 3608153 3398532 3127881 2903360 2855724 2933989
35610 2933989 2976388 2925353 2847950 2806844 2825852 2913206 3011057 3006706 2900885 2854109 2941570
35599 2941570 3002500 2906778 2826010 2998783 3328698 3495129 3416939 3313373 3300269 3228502
35589 3228502 2997039 2749784 2629852 2556842 2396664 2185262 2044960 2016048 2090232 2272111
35579 2272111 2481296 2526638 2323376 2035774 1871999 1832759 1794897 1743801 1759424 1835884
35569 1835884 1885444 1902760 1977773 2137964 2293552 2353894 2309913 2195424 2050566 1938970
35559 1938970 1932433 2046601 2212623 2316000 2268877 2091472 1937009 1968362 2173218 2368105
35549 2368105 2418224 2360412 2262408 2096230 1868019 1754578 1932300 2320523 2667033 2869734
35539 2869734 3045006 3275380 3473024 3549763 3563264 3596635 3604025 3487038 3265193 3073611
35529 3073611 3009506 3037789 3036581 2909098 2673127 2453614 2354884 2335820 2256895 2054297 1807920
35518 1807920 1621786 1500866 1379878 1228051 1090151 1043908 1121797 1250908 1292531 1190731
35508 1190731 1052568 1012202 1057208 1098640 1176748 1427972 1819710 2094147 2067394 1847469
35498 1847469 1651798 1536678 1437276 1359839 1360383 1390570 1335919 1195880 1086575 1066806 1085365
35487 1085365 1102432 1142050 1206971 1245810 1228232 1172868 1096165 1012199 970174 997259 1020260
35476 1020260 956077 867868 899448 1052140 1174151 1191068 1179545 1161832 1017191 717435
35466 717435 489609 568014 871113 1092806 1068906 902796 758851 688937 672921 690764
35456 690764 707393 678818 617645 593513 648128 764833 925415 1122898 1299049 1345956 1221034
35445 1221034 1023716 913910 958564 1070423 1096736 979976 834364 824886 952663 1029528
35435 1029528 929246 794044 871977 1171882 1416239 1367429 1086292 814086 698260 710481
35425 710481 756824 772303 743279 716569 763868 874163 915887 785772 570658 463026 513213
35414 513213 572181 517563 428373 445678 538460 546214 442053 403233 555482 762614 784700
35403 784700 586208 364094 291022 352287 438055 466010 380487 165149 -71845 -143579 -8765
35392 -8765 151694 182673 163329 226665 287870 169793 -53885 -96012 128633 362123 371615
35381 371615 249640 206558 241858 213135 116222 89866 194842 372442 587222 821782
35371 821782 941581 781329 428711 234698 421131 802088 1021612 976870 865070 868179
35361 868179 956326 1016052 1025478 1024550 999869 899753 740855 620883 613827 695582 777289 772653
35349 772653 634671 389262 162725 114900 277147 481590 520959 374829 212600 172602
35339 172602 220616 255015 263702 303371 380156 446817 503216 603019 732756 758054 554306
35328 554306 175931 -148922 -208723 8589 319182 523136 576010 579188 618368 655652 603947
35317 603947 467152 347077 313473 323958 297297 223777 161337 144208 146198 138908 139430 172073
35305 172073 215450 233977 252341 344258 526050 700884 745583 637391 468314 347829
35295 347829 314573 327063 313336 241416 164695 183653 341410 576493 795859 957385 1052667
35284 1052667 1063718 997882 926382 920059 975191 1057232 1156884 1216891 1084716 694704 260476
35273 260476 98802 245570 429981 469278 485119 637657 849863 951699 937206 897370
35263 897370 824113 677244 546645 533907 539543 393662 165963 110209 286090 461687
35253 461687 447968 331103 289806 350510 420803 430586 347595 168755 -19033 -75370 18148
35242 18148 117551 117359 83640 120034 221220 338930 466920 562953 515783 313655 132717
35231 132717 126431 235022 339303 470402 673986 782845 587044 196459 -32083 38099
35221 38099 168390 119982 -49147 -171188 -233159 -285312 -253653 -52628 209478 336812
35211 336812 308544 257439 223220 118738 -55348 -153561 -96079 21400 97154 161653 261360
35200 261360 338510 344087 361070 470708 570011 482050 216195 -34848 -150163 -181511 -186632
35189 -186632 -122984 32541 194117 283254 335602 413583 502155 566425 620636 658788 614910
35178 614910 487938 402020 422697 418018 256537 49803 3743 91726 103906 7619 10108
35167 10108 211686 432724 492404 456136 462704 473275 366754 170525 19755 -45658 -87671
35156 -87671 -119206 -88190 9780 115459 182782 187784 108300 -10873 -29337 136751 372603
35145 372603 486688 440098 345100 276015 208950 126362 51659 -16098 -88654 -119747 -62039
35134 -62039 24060 41965 24408 88433 225316 282989 178211 -15541 -215693 -410957 -548654
35123 -548654 -505712 -265232 1818 126193 111762 37323 -100025 -330848 -580361 -703878
35113 -703878 -624851 -379444 -80483 115114 89035 -114500 -317578 -419847 -492909 -605136
35103 -605136 -677214 -620849 -508436 -462331 -459759 -401706 -311287 -296687 -353376 -370011 -317290
35092 -317290 -270901 -249042 -189385 -102024 -81367 -129135 -123684 -21932 58133 31031 -21544
35081 -21544 -5550 23672 -23160 -90051 -51653 83014 167336 95543 -106962 -339101 -479464
35070 -479464 -425746 -192827 38370 80406 -37103 -94778 46868 294407 468941 515077
35060 515077 501250 484327 465535 452734 470886 493420 438928 283529 128296 90161 146696
35049 146696 166764 106378 89285 236786 483308 652726 691190 722321 859453 1054568
35039 1054568 1171890 1141432 994341 802207 631194 515192 428425 313560 166731 57292
35029 57292 35618 65963 81784 61668 22148 -10637 5218 91752 172939 117589 -82016
35018 -82016 -259859 -271273 -145515 28088 237109 446271 498867 313822 89826 86039
35008 86039 249711 304967 184160 85864 78971 -28020 -305252 -498335 -409128 -225602 -225812
34997 -225812 -359342 -399779 -345127 -351749 -385145 -279428 -93797 -57991 -152072 -93113 184477
34986 184477 376676 278786 96423 89225 173264 132489 17028 33724 163337 184471 32333
34975 32333 -129214 -183896 -174146 -126304 1104 145090 134550 -45288 -168161 -71569 98283
34964 98283 94174 -78982 -181011 -62954 177310 369649 462971 487462 430158 254956 23773
34953 23773 -101226 -22035 170218 283072 218168 35280 -157886 -306678 -392316 -401232 -366604
34942 -366604 -381070 -500622 -670384 -799589 -864710 -870936 -763796 -485682 -107855 198364
34932 198364 338034 356861 318063 213277 41120 -105988 -105877 69909 333688 553299
34922 553299 623827 515526 299357 109023 42858 98887 201659 270147 265677 214131 192253
34911 192253 263012 418670 605890 782592 905678 898301 719937 470005 325876 347599
34901 347599 425391 451831 451452 480417 489163 385837 194385 55169 73987 229265 416145
34890 416145 531382 529370 444835 356926 302928 246590 154898 67064 46593 99752 187390
34879 187390 286396 389912 469337 481437 403033 246265 78363 25793 166204 379476
34869 379476 422503 235725 56587 99721 238831 196647 -23285 -134126 7786 221391
34859 221391 309047 309932 321106 276164 94406 -89286 -60331 168588 369916 395931 309265
34848 309265 236865 233968 287168 328687 254432 42572 -161795 -198367 -101652 -24839 9804
34837 9804 104091 237020 246183 109931 25689 97004 152001 37483 -91834 -5553 203162
34826 203162 215415 -49688 -319394 -349163 -205665 -89871 -52637 -4469 103711 236293
34816 236293 365966 519046 728389 973306 1162722 1191518 1047239 832523 629353 392260
34806 392260 68399 -236195 -363027 -350339 -387576 -495710 -463057 -192047 89997 125018
34796 125018 -23150 -102873 -59407 -70365 -232655 -420112 -481652 -423655 -341154 -276576 -204794
34785 -204794 -98304 28219 113744 102784 26200 -19889 -16221 -57177 -171165 -212672 -67265
34774 -67265 130238 167260 89083 148127 416307 663371 673672 492812 284022 119983
34764 119983 26444 77961 305075 591257 774203 791231 664958 445808 244472 205505
34754 205505 336808 453330 401475 262787 223947 318915 425220 459573 442414 393694 290642
34743 290642 137018 -14285 -119774 -176323 -205992 -246207 -320413 -388450 -386874 -351282 -402266
34732 -402266 -544700 -591103 -392801 -56037 200046 327419 450698 639074 825329 926721
34722 926721 915214 791513 612510 509370 541797 569238 421628 172064 61888 153292
34712 153292 245212 171451 -289 -132327 -206528 -249789 -214340 -60310 132273 248501
34702 248501 282493 316594 405428 536620 652010 669270 557140 429839 475604 733103
34692 733103 1025466 1176233 1194267 1169561 1094180 909821 667736 510807 514878 641356
34682 641356 822792 1002324 1105052 1069437 924953 775190 687728 638862 566626 441571
34672 441571 283634 132615 2970 -128347 -263647 -330719 -255339 -93236 -1 -33367
34662 -33367 -78573 -30854 41509 7777 -126874 -243605 -279595 -258573 -183020 -23540 177663
34651 177663 304173 299377 227896 178898 172345 181392 187304 186414 186364 208885 254872 266835 185524
34638 185524 57586 25265 175155 437928 667658 784327 805976 774217 699392 579621
34628 579621 437678 318996 260850 272459 335698 406143 417005 320024 148100 4947 -50747
34617 -50747 -85416 -198422 -371181 -485400 -485328 -428887 -364463 -264437 -126512 -36139 -50812
34606 -50812 -102463 -97673 -47646 -15601 -1485 27036 46939 23434 -8402 -5151 -3252 -31808
34594 -31808 4872 208644 478065 581072 453752 281118 243221 309549 335230 250831 101385
34583 101385 -15682 -12220 106579 198526 127059 -34387 -71633 55189 113800 -99806 -496761
34572 -496761 -838026 -1020812 -1088190 -1049679 -857959 -533043 -176751 128489 346360 447369
34562 447369 437342 387768 346498 268361 131098 41214 78705 106483 -65577 -347385 -426572
34551 -426572 -204470 45831 57188 -94631 -179739 -170400 -204767 -294094 -287111 -106869 158147
34540 158147 402851 584449 641532 506575 256311 100373 130285 191578 101466 -99314
34530 -99314 -221947 -188020 -89235 -21722 14413 41035 31257 -47588 -183079 -343873 -511331
34519 -511331 -654446 -709551 -623694 -411612 -152553 69101 221618 332121 430035 480278
34509 480278 394116 127529 -242535 -554435 -664832 -528030 -231082 28053 66715 -116589
34499 -116589 -342390 -462016 -505629 -553700 -551797 -387811 -103888 129617 244768 318508
34489 318508 371523 308979 125119 -12352 6677 68648 32069 -44840 -31064 33599 11150
34478 11150 -86198 -118503 -63686 -50327 -139610 -251910 -335827 -438553 -558072 -586410 -478063
34467 -478063 -343567 -294204 -308685 -332417 -388533 -488234 -538197 -463028 -344639 -313711 -359304
34456 -359304 -375258 -352770 -382108 -471293 -508889 -442257 -373820 -420458 -560464 -677175 -686780
34445 -686780 -567926 -333834 -54348 138920 161213 81670 49699 114825 187796 181524 105987
34434 105987 -1414 -145227 -306862 -390876 -336806 -237133 -227736 -278570 -220829 -281 223174
34423 223174 283532 210517 150341 169420 217151 216316 111699 -109644 -366351 -507668 -469931
34412 -469931 -354683 -284001 -258491 -240846 -267257 -337609 -302612 -59657 201027 179267 -108857
34401 -108857 -325238 -276793 -151357 -181664 -291012 -248608 -35836 131851 84344 -146298
34391 -146298 -402551 -520340 -418577 -177314 7711 29251 -23061 -28319 -19749 -90478 -193535
34380 -193535 -194215 -96977 -64572 -188670 -364789 -436837 -370954 -233202 -62943 162680 449585
34369 449585 711508 801353 644325 340887 94115 13738 33948 44401 39144 89091 220882
34358 220882 381834 491558 487898 366050 212197 146318 187932 231085 186129 74500 -50399
34347 -50399 -170273 -226464 -101414 212347 526601 669970 694789 728275 716180 517052
34337 517052 206258 61547 216593 509227 714851 764228 677080 451349 124703 -170594
34327 -170594 -326461 -372416 -401908 -448675 -495710 -542344 -592763 -616265 -575074 -475149 -364332
34316 -364332 -295478 -289619 -312576 -312428 -311556 -401449 -578770 -669941 -548609 -363432 -368710 -547196
34304 -547196 -608288 -399696 -117529 -19014 -104540 -201965 -213139 -137023 27528 245156 392893
34293 392893 389448 314172 271819 207588 323 -306679 -518273 -519910 -371700 -175195 32919
34282 32919 238948 406605 508306 545786 530724 486504 447111 399474 261614 -7280 -303799
34271 -303799 -471465 -476652 -411873 -347627 -283047 -237584 -273919 -391504 -486359 -471186 -383459
34260 -383459 -334214 -387280 -513653 -627443 -647985 -565270 -461197 -426226 -438482 -373612 -168221
34249 -168221 67544 156378 66074 -36805 26888 236929 394272 353840 177559 18142
34239 18142 -84479 -194412 -295361 -255611 -34159 187822 186972 -36507 -262552 -300813 -169196
34228 -169196 -41707 -76833 -279109 -477960 -464790 -202304 122788 297207 294381 241434
34218 241434 227086 229075 208383 184227 203930 290386 415560 491146 423146 231475 70077
34207 70077 54503 116149 117743 62170 61752 130434 159950 117100 111526 209254 306857 273950
34195 273950 127255 -20007 -107798 -147873 -157140 -159261 -208188 -325210 -438527 -460737 -410159
34184 -410159 -385670 -428829 -481442 -493886 -514819 -626903 -809095 -910672 -799490 -530008
34174 -530008 -310676 -270344 -310947 -267767 -175200 -241470 -529186 -793726 -746582 -414153 -118447
34163 -118447 -114516 -344254 -561742 -616283 -564605 -552690 -648120 -789733 -866181 -820143 -678696
34152 -678696 -504352 -340799 -208136 -127468 -126912 -215209 -348425 -433871 -399108 -278441 -203356
34141 -203356 -265251 -399412 -451939 -358894 -205781 -100748 -50763 1943 73752 129342 152089
34130 152089 158816 141409 58197 -81095 -172397 -130964 -35833 -68138 -263473 -414674 -319698
34119 -319698 -67958 63250 -11213 -75830 64458 326011 519354 625453 731643 804833
34109 804833 737410 570862 469359 479530 504357 514936 587125 700190 703130 541189 328181
34098 328181 131488 -109600 -362230 -422395 -214059 21922 17521 -199241 -446198 -676141
34088 -676141 -889021 -909680 -568612 -57283 200338 59963 -207517 -325528 -307993 -281347
34078 -281347 -260393 -229986 -251531 -335440 -354496 -232419 -99644 -114166 -223798 -255292 -166333
34067 -166333 -60683 -5950 12091 -20010 -145765 -317420 -399563 -333319 -206867 -129688 -119831
34056 -119831 -154628 -245756 -385968 -474099 -395784 -186482 -30735 -54905 -179204 -241501 -223608
34045 -223608 -250744 -373225 -484347 -511731 -551775 -686183 -771965 -604958 -256640 -40567
34035 -40567 -111656 -289459 -347593 -288439 -209656 -73907 195732 493242 613185 529899 416201
34024 416201 387522 393564 381057 393860 447632 446715 319544 137372 3209 -100594 -253781
34013 -253781 -443358 -576539 -623567 -640629 -644265 -559609 -332421 -28578 221629 336703
34003 336703 308544 166007 -25268 -156944 -150268 -45275 38634 46155 36951 76025 140363
33992 140363 177048 188287 188716 131293 -29801 -230189 -352847 -386956 -418251 -451215 -370171
33981 -370171 -131229 124380 236249 215237 170070 117833 -11299 -217287 -399903 -487930
33971 -487930 -507662 -512332 -510349 -468693 -341240 -115176 120355 202062 75459 -96024 -119552
33960 -119552 -35782 -46528 -187135 -254182 -120955 49190 30147 -153035 -295526 -323008
33950 -323008 -353937 -460500 -532386 -438598 -219079 -34096 29257 29663 60505 119650 119601 20237
33938 20237 -85122 -59965 100386 240101 218751 66940 -76945 -133534 -116158 -39071 104177
33927 104177 266628 353007 338544 302963 293412 228484 23215 -235549 -341814 -199875 81108
33916 81108 332132 480201 534776 516583 471427 481251 563723 604901 498732 323615 248570
33905 248570 265454 176171 -93514 -324017 -268882 18249 268337 332091 273615 185790 100533
33894 100533 77432 186828 352140 374271 192482 -15831 -81541 -60154 -94911 -180504 -205054
33883 -205054 -157303 -144895 -224324 -326872 -356763 -288007 -169814 -90033 -110983 -193875 -221337
33872 -221337 -137855 -16082 62459 120173 210566 308415 355461 346849 291588 173259 47619
33861 47619 72580 295014 495371 421687 123161 -129030 -202299 -178215 -107406 50127 203926
33850 203926 118326 -254001 -617037 -655060 -380898 -46586 166828 252182 280957 327891
33840 327891 411955 426888 228021 -130815 -369156 -297704 -51674 112948 143818 168756
33830 168756 243638 295638 275804 218842 166635 145539 197325 332668 476777 543378 532017
33819 532017 489961 433951 369199 306734 202168 -12048 -261303 -346067 -238573 -192069 -384731
33808 -384731 -619323 -596167 -339478 -94658 66383 222998 284322 68820 -296169 -435551
33798 -435551 -264178 -113218 -207437 -367162 -399973 -440163 -636274 -789630 -637035 -308811
33788 -308811 -165175 -275200 -377726 -323521 -257880 -332510 -483154 -572537 -581487 -571941 -565981
33777 -565981 -528476 -420610 -253524 -114376 -97407 -168906 -183392 -106133 -109184 -318445 -563261
33766 -563261 -552889 -251622 100322 316142 426943 507042 524328 437754 309315 228535
33756 228535 197844 154183 58620 -64359 -135133 -62423 168892 451892 645730 699358 648479
33745 648479 529006 357754 164974 -18824 -173835 -244014 -161197 8207 50079 -133729
33735 -133729 -345979 -341562 -166446 -47171 -12269 118285 371067 520505 421803 204082
33725 204082 31562 -111741 -275994 -387489 -397151 -423575 -570572 -722517 -696393 -512585
33715 -512585 -356573 -337877 -426683 -565427 -706194 -788596 -801386 -812799 -835436 -744733 -464104
33704 -464104 -147846 -16812 -67464 -109715 -50458 37313 102444 183797 282434 341015 370598
33693 370598 425425 426813 211333 -173066 -416505 -325078 -94983 -44124 -178427 -219875 -28931
33682 -28931 195478 187249 -46831 -248026 -216709 -26350 80138 -30785 -241938 -324490
33672 -324490 -179027 97946 352147 503227 548328 526819 510344 549570 594245 543039 408434
33661 408434 328605 347474 304383 75427 -169577 -142006 156403 399418 354748 155347
33651 155347 60498 102268 113162 6373 -132440 -197209 -172687 -104592 -58656 -88800 -154431
33640 -154431 -113821 77471 204966 1987 -477904 -874856 -953206 -838812 -751054 -694044
33630 -694044 -566076 -418759 -396195 -488523 -543442 -497443 -426779 -385949 -362256 -385518 -506791
33619 -506791 -642508 -609287 -369835 -101501 37264 71272 77944 41715 -60050 -149092 -147068
33608 -147068 -102551 -107498 -152455 -162105 -110507 -6795 162703 367164 468982 361934 143634
33597 143634 24141 69670 154344 173727 186835 299641 494615 645441 668578 608140 567588
33586 567588 580167 571334 463867 291263 155050 88428 44982 17832 48589 84267 -25926
33575 -25926 -292734 -480232 -388046 -145524 -47015 -151229 -244252 -193566 -129793 -213410 -389207
33564 -389207 -476666 -400359 -235717 -92424 -28546 -37026 -63229 -62421 -55112 -79561 -89502 25768
33552 25768 298938 626465 864758 923088 777393 496927 260371 218292 306690 321751
33542 321751 216002 164786 262548 328925 171690 -91570 -179869 -51351 56716 -11634
33532 -11634 -139952 -172241 -163012 -274550 -524681 -760889 -846327 -777123 -632874 -491700 -399330
33521 -399330 -359775 -331710 -266034 -170509 -124061 -204864 -394404 -557866 -541803 -316878 -23242
33510 -23242 150834 143928 55110 185 -22695 -88653 -204618 -286021 -283158 -257383 -283901 -331310
33498 -331310 -308815 -208171 -118919 -101583 -121503 -122208 -86708 -166 160112 341295 399803
33487 399803 250576 -18197 -252964 -405237 -511412 -559778 -495612 -337922 -178274 -69998
33477 -69998 -23895 -95759 -333746 -615455 -689531 -458505 -111866 104742 162046 203074 311509
33466 311509 436118 502072 489801 409630 276937 122120 -17120 -114429 -152260 -130275 -89835
33455 -89835 -80271 -80448 -21253 80179 94154 -46885 -224872 -279670 -219683 -185262 -238100 -300706
33443 -300706 -302055 -280479 -316293 -429348 -562748 -621112 -523832 -271399 38685 301746 497208
33432 497208 645353 707273 613415 393348 195556 145858 228444 319703 301118 138218 -103843
33421 -103843 -311577 -420189 -454237 -447460 -364921 -173045 46489 155649 137392 111220 140991
33410 140991 129079 -30659 -271207 -415944 -391686 -292759 -235079 -222731 -189242 -118543 -66242
33399 -66242 -64191 -55862 38087 213814 390040 512085 592725 640790 621412 527964 426583
33388 426583 363255 278256 94342 -141527 -289521 -277039 -155673 -16029 79547 101454
33378 101454 78376 103328 220705 323438 273148 112095 19379 44318 43135 -64553 -143147
33367 -143147 -58845 81517 59690 -159174 -399936 -500680 -439856 -280418 -113659 -36470
33357 -36470 -63588 -73070 50776 239383 328924 308852 323178 407378 406242 234703 52830
33346 52830 37449 98353 6226 -247177 -412703 -333800 -163343 -142993 -283562 -388861 -344614
33335 -344614 -253130 -266487 -384641 -474576 -441257 -321589 -220288 -191713 -185832 -92279 148266
33324 148266 448796 610139 502947 223861 19582 30061 152946 200051 136662 90426
33314 90426 146707 238696 274544 281696 336742 395806 310764 41926 -238319 -332284 -264748
33303 -264748 -249194 -398655 -562539 -514613 -249370 1227 45919 -57400 -112129 -37590
33293 -37590 61414 61557 -20857 -70683 -30007 37686 41750 -14580 -42557 3657 48442 -15146
33281 -15146 -173118 -285961 -248725 -98734 64268 197527 292765 299046 179396 26483
33271 26483 -1427 112509 207971 162436 35373 -65058 -141154 -220489 -213112 -16482 280301
33260 280301 463531 460560 380966 289551 124308 -111780 -275798 -311313 -373015 -572181 -752286
33249 -752286 -719692 -580266 -594255 -744357 -724549 -399175 -20953 114734 26878 -81390
33239 -81390 -142796 -235466 -374521 -479640 -515676 -517260 -483086 -365003 -167473 26145 121338
33228 121338 47952 -224046 -608941 -882926 -858164 -584713 -289323 -120932 -53846 -29383
33218 -29383 -56737 -131617 -173223 -121968 -29324 21666 34878 73929 156899 250041 347879 486812
33206 486812 664571 798250 801943 694286 594793 598614 674649 714776 671453 602819 579341
33195 579341 601587 632999 655974 655635 604218 517049 474800 525129 604411 624661 592035 560091
33183 560091 517015 424477 328455 302663 298554 195846 17209 -55093 73132 275473 389237
33172 389237 413041 431474 446287 394635 266490 94235 -125398 -388560 -591930 -596007 -394127
33161 -394127 -147023 -37310 -130848 -362368 -595193 -702739 -657463 -553744 -500684 -486305
33151 -486305 -387020 -120176 243151 524749 579780 397723 94301 -186231 -370335 -461958
33141 -461958 -466392 -351866 -116735 135487 246343 151640 -35977 -118238 830 220818
33131 220818 354026 325229 229166 183378 185193 158641 80883 -18777 -141220 -294627 -409901
33120 -409901 -394370 -273459 -166601 -115065 -62409 -24798 -118562 -347157 -519389 -499692 -408568
33109 -408568 -424187 -490204 -405957 -152115 70995 131836 112466 119782 111077 -1571 -183344
33098 -183344 -324660 -403668 -495360 -623680 -692164 -608402 -442036 -390815 -558062 -805440
33088 -805440 -891871 -747521 -528489 -386796 -290262 -134380 60582 177272 183556 170034
33078 170034 204315 246407 239257 213884 254836 381965 501411 493017 352813 218453 205396
33067 205396 243083 164247 -41427 -185119 -137582 -3913 48988 23141 20552 33682 -40389
33056 -40389 -222001 -433727 -640130 -857494 -1024779 -1006952 -766977 -442851 -223419 -201790
33046 -201790 -335466 -479889 -489768 -371866 -304635 -415367 -584955 -590732 -403564 -211090
33036 -211090 -175158 -304334 -535656 -777549 -877921 -725343 -413538 -163787 -68308 -48602
33026 -48602 -52449 -102820 -140468 -36150 180710 309520 271402 217118 257834 298632 253158
33015 253158 209458 233385 213595 86153 24025 185779 436404 554158 571347 639654 672914
33004 672914 446592 20201 -260769 -230417 -94058 -77650 -141136 -164711 -198398 -342542
32994 -342542 -513779 -516966 -306032 -45986 68184 -22710 -234020 -430540 -530509 -542074
32984 -542074 -498127 -390114 -222293 -92735 -110567 -228822 -274072 -173032 -40992 308
32974 308 -18333 -8327 22224 9013 -37382 -45245 4636 69868 134749 224352 330709 398660
32962 398660 402137 380100 375153 377511 354557 305785 259591 234589 236704 284815 393534 514735
32950 514735 546283 454240 360383 428730 655595 854600 884447 803584 730757 639317 413098
32939 413098 69698 -210335 -295637 -232933 -128888 -10151 129762 224003 172804 -22743
32929 -22743 -232535 -315530 -247711 -138898 -127637 -239179 -349067 -323510 -193172 -126945 -213580
32918 -213580 -339919 -339896 -210867 -105847 -134698 -253578 -356549 -400542 -402157 -364530 -271039
32907 -271039 -145804 -71551 -122179 -286135 -463192 -530856 -421736 -166928 116490 300292
32897 300292 338371 284450 201558 75575 -138539 -395474 -552410 -515241 -346666 -187841
32887 -187841 -104473 -54331 17890 107278 166249 154096 69865 -30154 -53614 45098 194001
32876 194001 254327 162873 -2786 -122157 -168193 -207345 -273872 -303500 -230891 -112866 -78783
32865 -78783 -156017 -230552 -221574 -205418 -275500 -348415 -249385 18204 229655 204433 3012
32854 3012 -189426 -270688 -250481 -171716 -92754 -85005 -168119 -286427 -391660 -484305 -539323
32843 -539323 -496453 -392506 -387911 -554964 -741721 -778264 -730971 -790806 -962874 -1045624 -917220
32832 -917220 -683524 -505514 -398569 -254931 -4221 272044 367826 144457 -261681 -515809
32822 -515809 -453390 -262039 -178674 -152613 -14142 153005 109545 -107381 -179104 12293
32812 12293 203255 165399 23078 -7692 53323 92032 157363 324570 445758 305572 -39084
32801 -39084 -307830 -357185 -297963 -276063 -319780 -398375 -464863 -435405 -271310 -78817 12889
32790 12889 57496 212886 457996 573434 446774 220236 59036 -60952 -219301 -346181
32780 -346181 -313118 -153904 -30946 646 50251 192815 337751 356229 254418 144701
32770 144701 93069 72180 44323 14537 -4506 -19780 -36704 -62004 -135325 -293127 -482024
32759 -482024 -583803 -564408 -519019 -518106 -502655 -415382 -338179 -371264 -449535 -434891 -347327 -333441
32747 -333441 -420489 -480122 -447837 -400279 -387538 -375472 -400038 -572512 -840991 -948323 -763895
32736 -763895 -487675 -369419 -373878 -300917 -115564 39497 87300 90579 125768 231608 432525
32725 432525 669245 761601 596584 318828 189458 280162 430431 469574 360723 176036
32715 176036 54418 121998 322179 403324 229850 15268 52760 294763 432152 339612
32705 339612 183286 99009 39843 -18987 6757 108610 132692 24705 -84340 -123583 -188026
32694 -188026 -299117 -307792 -183304 -152054 -345518 -527881 -423123 -137954 23374 35686
32684 35686 123713 312497 345373 100396 -201986 -322873 -309651 -329698 -376061 -325978 -197329
32673 -197329 -155798 -275947 -441094 -514373 -504747 -501281 -506675 -421053 -186475 117480 342128
32662 342128 388018 241548 -32749 -280910 -316982 -107464 127503 126028 -86418 -200903
32652 -200903 1127 391802 674420 707232 565766 381812 238996 174259 169583 160565 126995
32641 126995 136666 227030 304223 263657 157974 111986 101890 -15330 -232338 -326666 -156645
32630 -156645 115919 234410 186364 166853 246583 282036 202719 182141 369452 595615 575638
32619 575638 351022 266671 456924 616013 432749 39028 -198841 -182344 -104027 -60698
32609 -60698 44100 212016 273079 174155 74115 42184 -78737 -356576 -570025 -539184
32599 -539184 -446781 -562666 -793125 -800963 -507510 -184078 -42557 23 92067 205814
32589 205814 226332 131786 -11150 -136507 -202774 -207956 -218206 -304836 -432607 -491232 -448215
32578 -448215 -382053 -355680 -352581 -350296 -359163 -371727 -368649 -386908 -480043 -596721 -610249 -492986
32566 -492986 -347871 -237844 -111922 44872 116243 1057 -233078 -429424 -508945 -488800
32556 -488800 -409675 -328962 -327580 -433568 -566162 -615231 -543590 -372296 -131733 105607 208975
32545 208975 103382 -125648 -318844 -411197 -441990 -430866 -344597 -190578 -50422 11352
32535 11352 6157 -41256 -145083 -289211 -355632 -217783 79144 309121 296636 117487 -6811
32524 -6811 822 -10554 -183025 -435045 -570105 -527047 -410906 -320155 -273992 -294642 -410258
32513 -410258 -541966 -530167 -350864 -196320 -244136 -424091 -516128 -428809 -280601 -230823
32503 -230823 -316763 -447114 -486470 -354819 -104320 106504 158561 75759 -52540 -203186
32493 -203186 -394331 -559533 -559082 -352105 -85782 37865 -44638 -225673 -361550 -412295
32483 -412295 -456149 -581658 -769639 -891283 -831881 -603251 -322668 -105594 -4994 -26472
32473 -26472 -146705 -311118 -456207 -554057 -615712 -645944 -620451 -517654 -350212 -151549
32463 -151549 49924 226544 338809 358641 311381 267520 265091 250589 138030 -59875 -204742
32452 -204742 -181280 -46786 26651 -47276 -188801 -280511 -308263 -341110 -425455 -544044 -642929
32441 -642929 -658500 -553433 -371721 -229508 -203198 -246438 -259966 -218901 -180380 -186602 -223353
32430 -223353 -271726 -339753 -428910 -519310 -611159 -741761 -927662 -1106532 -1167661 -1048424 -793825
32419 -793825 -513909 -282692 -93639 75743 189703 196321 127995 81461 81837 52155 -42080
32408 -42080 -113479 -91407 -45278 -57199 -56023 60715 188542 106828 -167666 -328948 -183396
32397 -183396 71609 117321 -70790 -255968 -301567 -292881 -319659 -343858 -332751 -356396 -464497
32386 -464497 -582896 -625911 -627849 -671089 -744556 -763679 -691017 -556949 -393106 -225401 -110093
32375 -110093 -91396 -125768 -126997 -98257 -144755 -320706 -521594 -586021 -487681 -375738 -408647
32364 -408647 -574855 -712950 -709607 -628370 -598850 -619338 -562575 -386191 -232681 -257794 -436050
32353 -436050 -616002 -708818 -729636 -699145 -618348 -529687 -497314 -514819 -514195 -471101 -424033 -391386
32341 -391386 -350382 -291007 -205239 -45412 192172 363334 309418 105138 -6 67575
32331 67575 101628 -47743 -226059 -215313 -67408 -3443 -79220 -149455 -110206 9923 171221
32320 171221 359005 505975 538600 505467 517152 558928 508653 348384 213189 209924 320000
32309 320000 493284 692962 824939 780385 604889 494343 564600 734869 871945 917845
32299 917845 837594 601672 301460 137370 186570 296032 303015 247356 257514 336819 391671
32288 391671 384561 326673 192258 -15247 -160930 -95739 127459 282415 234704 85574
32278 85574 27742 129482 291814 374239 328040 208861 72898 -100923 -342496 -576031
32268 -576031 -661371 -556127 -355362 -167472 -51409 -79799 -316801 -671731 -905261 -870819
32258 -870819 -657524 -435186 -277509 -204613 -245987 -343189 -327420 -134992 72246 141872
32248 141872 156376 252741 346410 260936 52969 -35517 75698 230837 309451 355072 405788
32237 405788 394923 273339 75425 -167874 -433188 -613882 -599481 -464341 -389810 -371396
32227 -371396 -218437 92363 297653 211912 12840 -5001 191105 418570 580112 710399
32217 710399 786612 703070 450950 175334 16931 -10011 33886 98596 149073 152087 107377
32206 107377 71272 114367 241784 362581 367680 255463 144274 127805 168176 187142 193329
32195 193329 215956 175325 -25641 -300216 -438514 -384977 -283874 -216345 -91343 116096
32185 116096 216556 48008 -275821 -519408 -620891 -677535 -733549 -759262 -777974 -831373
32175 -831373 -845590 -703224 -451630 -288371 -316687 -438985 -515280 -512056 -461832 -379275 -269414
32164 -269414 -153010 -44100 56118 130220 151397 118261 39879 -95625 -276213 -405936
32154 -405936 -370095 -175542 29802 93270 -16649 -205953 -334460 -321313 -222071 -177332
32144 -177332 -233262 -253755 -89601 198170 385009 343288 150552 -68696 -287638 -510833
32134 -510833 -665465 -656067 -492687 -286172 -115177 53360 294327 592928 806578 784925
32124 784925 539842 265443 153276 206820 277892 259515 175729 87462 -3908 -119140 -229712
32113 -229712 -288751 -311131 -361509 -454822 -516428 -472031 -351382 -259629 -250603 -278994 -291585
32102 -291585 -299018 -303888 -224697 -2290 238111 267790 42191 -206098 -243181 -121748 -96559
32091 -96559 -300373 -602275 -772130 -702334 -464203 -213061 -62513 -24361 -51587 -119380
32081 -119380 -229304 -349343 -424747 -463061 -526093 -609802 -630430 -579863 -582452 -708584 -833308
32070 -833308 -797417 -626772 -458733 -323592 -165736 -44208 -116423 -383425 -611783 -593343
32060 -593343 -383231 -196490 -130133 -73901 107507 356459 432784 177116 -254541 -503830
32050 -503830 -388002 -74746 168490 276394 334145 353943 282863 164417 96973 55005
32040 55005 -60578 -201443 -201904 -57325 27066 -68651 -214031 -245800 -189291 -152583 -135605
32029 -135605 -76728 23 9955 -64610 -156885 -191917 -134057 -8147 96094 100297 29684
32018 29684 -45454 -142683 -314889 -475507 -459428 -297477 -227472 -342126 -427997 -289072 -38191
32007 -38191 111681 174382 286163 405932 376083 217361 117513 149683 222531 290586 381881
31996 381881 413686 233953 -93330 -279495 -192273 -43689 -67904 -190204 -183294 -19104
31986 -19104 126731 150009 113929 89400 57619 -6958 -72308 -100529 -86578 -26074 86736
31975 86736 210364 267736 229753 139993 45413 -41663 -100019 -91644 -39046 -43058 -154084 -272824
31963 -272824 -268664 -175331 -161645 -288998 -405383 -343846 -142869 20544 60489 36111 2247
31952 2247 -68179 -184053 -259111 -197713 -8823 208185 355065 385336 307819 177983 62298
31941 62298 -13223 -66192 -113116 -150606 -168292 -137674 -11483 197423 356504 329758 158986
31930 158986 26483 14455 9113 -112373 -301580 -404797 -326818 -84498 207279 357223
31920 357223 224973 -96004 -334018 -361227 -340322 -452982 -629065 -700982 -692947 -739762 -797614
31909 -797614 -685549 -410011 -208637 -214506 -281247 -235108 -130004 -123199 -214657 -254005 -157868
31898 -157868 -4715 78586 48867 -42603 -127745 -186907 -233808 -252140 -202238 -121814 -149986
31887 -149986 -364043 -629919 -716670 -551456 -273942 -54367 38674 -1584 -161993 -370439
31877 -370439 -511492 -534339 -492702 -462483 -479861 -556010 -668375 -731613 -662554 -479456 -255551
31866 -255551 5596 328882 613826 682205 519169 318654 228185 189840 106999 15625
31856 15625 -25669 -82152 -227050 -366542 -340523 -157381 13231 66288 57394 74618 127152
31845 127152 186982 258446 364488 498377 610848 638076 552282 390236 207170 6845
31835 6845 -230273 -447415 -520436 -403251 -202980 -77301 -108347 -276898 -465468 -481067
31825 -481067 -218964 141243 255232 25944 -249886 -274515 -139961 -141006 -312287 -390799
31815 -390799 -210464 90874 288508 316242 250275 193866 224578 338108 414187 348206 221013
31804 221013 198414 251655 155237 -174953 -513655 -608892 -504091 -449660 -578902 -793004
31794 -793004 -912788 -841296 -615651 -381880 -284681 -322821 -363065 -341198 -354610 -472661 -562783
31783 -562783 -449152 -180528 23623 71636 77369 128576 152131 75460 -30842 -81572 -134042
31772 -134042 -279954 -451234 -488580 -384576 -304784 -339255 -378223 -310451 -217934 -240406 -322010
31761 -322010 -263836 -27610 181774 200499 126924 140812 209023 139015 -110691 -348331 -404871
31750 -404871 -320157 -206860 -63774 160001 402310 526827 494926 381601 233580 34240
31740 34240 -173863 -259455 -167296 -25182 9410 -33485 27062 268363 532557 589405 386287
31729 386287 97541 -52187 18187 210509 362168 385887 321086 270397 289444 337045 333388
31718 333388 259889 187606 201657 307175 419854 445719 360402 212626 67917 -38241
31708 -38241 -104609 -150202 -204331 -285504 -365401 -365658 -222480 39053 314581 506196 577825
31697 577825 532358 385052 191978 68024 114718 312538 507055 519110 279305 -122425
31687 -122425 -501859 -709933 -727677 -648949 -581007 -570122 -595241 -584119 -448900 -182668 69097
31676 69097 128696 16922 -44386 66466 187576 118108 -64692 -126517 -54807 -81243 -309387
31665 -309387 -558448 -666237 -732722 -910300 -1111684 -1111980 -856527 -507462 -238122 -110001
31655 -110001 -93124 -77811 76267 365701 567263 477574 185884 -40547 -99958 -107895 -128047
31644 -128047 -68304 101895 229820 192163 89599 89261 157200 96860 -159389 -416034 -416361
31633 -416361 -133079 186772 272688 100749 -122070 -225064 -236605 -248011 -233407 -122300
31623 -122300 27106 86781 67126 103158 216680 250180 94613 -143682 -274614 -230815
31613 -230815 -88518 30092 26768 -111526 -267536 -286842 -158943 -29495 -6183 -50369
31603 -50369 -92342 -134183 -181743 -193599 -172330 -196497 -281720 -321219 -255764 -187212 -207657 -224079
31591 -224079 -100430 99487 169349 32029 -178678 -296730 -277237 -183848 -117457 -147429
31581 -147429 -238000 -264214 -165917 -43708 -27798 -102457 -147031 -101327 1687 115271 189024
31570 189024 149964 -13725 -187116 -252218 -236140 -231474 -227068 -148392 -15593 88382 171924
31559 171924 296329 404243 360007 167217 -24059 -150919 -311344 -561187 -795090 -893927
31549 -893927 -861685 -761391 -639253 -559963 -583254 -643069 -573862 -321201 -13331 223506
31539 223506 387048 483318 449652 291512 157528 161500 238087 276950 284536 300528 269990
31528 269990 134655 -35512 -126979 -120365 -37285 144844 391534 529050 428327 199820
31518 199820 48121 2130 -43557 -88620 -28901 131314 265216 316547 321795 242857 -14840
31507 -14840 -379539 -610776 -600840 -512770 -526488 -593827 -553753 -373657 -161564 -21157 6527
31496 6527 -73166 -190780 -233394 -164663 -83646 -101605 -201710 -273556 -244987 -136529 -29755
31485 -29755 -17137 -135341 -320868 -480708 -608176 -745070 -832506 -741044 -500516 -345837
31475 -345837 -418316 -540327 -434477 -89787 248659 416744 495623 624242 779593 802894
31465 802894 588267 212782 -107145 -209983 -160472 -175798 -353612 -566169 -684289 -772011
31455 -772011 -916015 -978613 -747182 -298702 26099 59628 1847 85616 250168 307122
31445 307122 283671 391264 700378 1027531 1158536 1057424 835813 627127 531623 593746
31435 593746 756805 868691 795050 546628 280683 157613 185247 214871 108111 -108426
31425 -108426 -287363 -338936 -304746 -259184 -224079 -213781 -277067 -417661 -525036 -471480 -264952
31414 -264952 -41456 85739 114034 98059 69417 24645 -42750 -116683 -162648 -169729 -187521
31403 -187521 -279514 -422143 -504063 -464775 -380899 -360084 -399575 -420405 -397709 -368020 -333574
31392 -333574 -259538 -166047 -128942 -171261 -233355 -271132 -308470 -365259 -404261 -386030 -321731
31381 -321731 -242376 -168209 -131794 -171359 -270028 -356514 -392860 -400246 -373447 -256857 -65176
31370 -65176 54140 -24990 -235609 -398497 -452650 -502940 -632339 -770147 -798516 -721675 -653793
31359 -653793 -657671 -665859 -585729 -435355 -317600 -267657 -201618 -58977 74116 81451 21209
31348 21209 71696 239849 275564 -4721 -410544 -561550 -354380 -77145 -22209 -141037
31338 -141037 -185290 -76879 21577 -19707 -111775 -95154 29166 117491 89287 6648 -59208
31327 -59208 -134297 -252726 -338834 -284562 -126037 -35312 -104411 -219747 -209998 -68517 40517
31316 40517 -15566 -183411 -280658 -181953 60561 275904 347776 309831 248974 152351 -72323
31305 -72323 -419457 -719865 -809061 -706166 -566484 -499711 -500132 -521886 -540631 -540155 -504153 -438559
31293 -438559 -359790 -249985 -66224 179719 375434 382006 175818 -93450 -224957 -171217
31283 -171217 -86712 -130429 -260128 -298940 -177518 -1928 115624 161810 127835 -39976
31273 -39976 -307927 -498540 -485506 -359310 -288520 -299614 -311768 -304031 -305217 -284303 -202600
31262 -202600 -123644 -117026 -101806 41733 237652 279237 119357 -92058 -262099 -443302
31252 -443302 -642786 -756950 -757989 -742417 -717754 -553553 -254079 -60653 -113168 -193722 -20217
31241 -20217 328825 503888 330881 -31526 -339757 -481376 -456021 -318305 -171709 -96725
31231 -96725 -58364 30957 162831 236376 198954 95227 -10643 -76362 -64640 22726 103965
31220 103965 94130 13118 -54748 -84864 -117266 -162642 -184934 -156888 -64585 101060 277976
31209 277976 317065 143848 -105169 -222121 -167499 -57392 33261 102234 94027 -66870 -300334
31198 -300334 -408259 -338384 -251626 -262694 -269441 -138503 66406 163548 83887 -82653 -219544
31187 -219544 -270966 -230304 -120278 19818 161318 286447 360143 353409 307355 311208 388938
31176 388938 460960 445285 353539 272386 289493 430111 611297 677153 555247 360391 255464
31165 255464 235633 166685 15916 -106079 -140892 -151907 -158744 -73681 122784 301029 365585
31154 365585 365602 322549 119999 -277651 -637308 -684524 -444270 -183192 -75424 -99123 -209744
31143 -209744 -406526 -611737 -668509 -532152 -352925 -302101 -378728 -431200 -331932 -107455
31133 -107455 92257 160595 159009 212130 284185 193818 -85723 -291324 -172268 179066 453901
31122 453901 498795 393120 236174 67576 -32809 12230 110902 69457 -135297 -319535
31112 -319535 -365206 -355851 -386573 -411757 -364417 -277397 -193860 -85679 49633 130305 118981
31101 118981 97835 122519 108618 -34066 -245306 -392677 -429162 -387319 -300425 -219160 -225367
31090 -225367 -336299 -465723 -552739 -634234 -711341 -672499 -474457 -277436 -234977 -248488 -128965
31079 -128965 62268 65226 -184777 -436210 -456215 -306979 -198604 -209104 -260084 -270505 -216637
31068 -216637 -88314 112670 333716 485392 502305 386489 212191 81319 35167 19232
31058 19232 -18963 -25003 87543 270897 360432 280811 131486 26841 -44816 -139192 -230166
31047 -230166 -257141 -227944 -176982 -76197 101544 264643 275812 152608 80359 182504
31037 182504 367940 464946 430582 341816 228824 39187 -210756 -359523 -271364 -48177
31027 -48177 33004 -177365 -528573 -740062 -690105 -483472 -288615 -198615 -233109 -369147
31017 -369147 -533665 -636608 -654141 -632643 -588832 -473789 -276734 -91883 -9688 10914
31007 10914 80845 215615 307906 257975 70688 -165034 -332249 -341863 -214217 -99333 -125232
30996 -125232 -217205 -170248 65215 280305 265823 84207 -22948 53133 184595 197195
30986 197195 52316 -171639 -377410 -490847 -481991 -391758 -292529 -201754 -91270 8475 7473
30975 7473 -96969 -176517 -162715 -187409 -393173 -655735 -675095 -372442 -34151 29617 -148499
30964 -148499 -289276 -255146 -192849 -289920 -519517 -687769 -666534 -511882 -370970 -321438
30954 -321438 -317120 -276510 -197635 -154396 -178678 -198413 -135453 -24923 33631 27299 42757 111183
30942 111183 135087 31973 -121684 -183910 -148796 -147249 -243765 -343216 -345978 -296211 -285106
30931 -285106 -277572 -170713 -15376 -27587 -306671 -653320 -786706 -683443 -565167 -568808
30921 -568808 -590308 -506469 -398422 -421052 -534696 -534203 -346043 -151515 -155236 -326934 -452436
30910 -452436 -392515 -220221 -119944 -200873 -402159 -551862 -533245 -412752 -373598 -495658
30900 -495658 -643449 -622620 -413108 -180620 -77848 -112793 -207028 -285272 -275579 -120412 129185
30889 129185 286446 193808 -92328 -353768 -445257 -409308 -355807 -312959 -240322 -127886 -19597
30878 -19597 36336 13095 -96429 -253784 -355271 -296000 -79787 156651 248119 131534
30868 131534 -112645 -327216 -395662 -328084 -245337 -264622 -390495 -517296 -528522 -390084
30858 -390084 -174124 -18927 -41455 -241505 -492714 -667885 -773206 -913657 -1120154 -1268841
30848 -1268841 -1207740 -927938 -569550 -278817 -98566 8817 73855 81568 15526 -83573
30838 -83573 -137527 -122992 -108078 -155180 -218412 -209063 -152297 -181857 -346062 -509517 -514661 -374992
30826 -374992 -229417 -155697 -120785 -84223 -47161 -1080 70658 112986 6966 -288203 -647458
30815 -647458 -881427 -905723 -786968 -646895 -546780 -455919 -320495 -158519 -61205 -79840
30805 -79840 -150160 -179508 -174603 -208429 -284982 -336049 -348571 -375341 -392497 -283804 -43084
30794 -43084 141869 142642 128003 361729 792703 1050673 902872 539248 294565 225449 125594
30783 125594 -113667 -352745 -430693 -377581 -321859 -300139 -263224 -201107 -147971 -94638 -6129
30772 -6129 80345 80976 877 -59224 -57343 -61198 -97480 -71731 68173 193796 154581 6276
30760 6276 -69854 -40936 -52257 -182690 -340351 -445616 -555646 -718971 -839834 -802751 -636706
30749 -636706 -439200 -219576 45011 250928 224269 -51546 -383359 -575826 -608323 -580974
30739 -580974 -566721 -563141 -537846 -471151 -372276 -281768 -248486 -286362 -350468 -359175 -259694 -100070
30727 -100070 -16808 -85908 -184583 -96602 201337 461157 459054 279376 174736 206396 193507
30716 193507 16416 -207136 -313230 -317300 -341181 -402477 -400206 -285096 -138476 -57459 -26741
30705 -26741 42719 161240 209582 93846 -80486 -93535 100669 287783 279975 173085 171770
30694 171770 254015 225336 77666 42000 222678 412373 396212 246668 156283 138267 85952
30683 85952 11296 11815 67883 76649 46454 57665 56682 -92272 -335835 -435420 -311126 -184317
30671 -184317 -268679 -478417 -574748 -483154 -323803 -206768 -140721 -113934 -148003 -264583 -455423
30660 -455423 -667676 -789006 -711295 -468162 -243943 -172188 -186848 -153844 -78238 -67920 -145877
30649 -145877 -233283 -294994 -363725 -422154 -403253 -330097 -313716 -364524 -344938 -188521 -40763
30638 -40763 -69225 -224292 -313465 -256518 -146373 -93972 -130711 -242527 -382180 -451128 -381858
30627 -381858 -249246 -197864 -244522 -255776 -143461 21505 122517 122944 43324 -75889 -137123
30616 -137123 -27196 227386 448227 524650 533416 549367 475281 208982 -138990 -387191
30606 -387191 -559030 -796383 -1046603 -1089658 -890668 -670393 -559585 -429710 -178210 55392
30596 55392 124704 123875 192644 238027 95393 -139463 -203053 -51658 88353 64928 -23838
30585 -23838 -33499 43068 152123 265936 321858 227078 11512 -144738 -120853 3667 83340
30574 83340 85840 72795 94147 163273 248290 237466 22547 -315921 -523575 -468237 -320384
30563 -320384 -332629 -531202 -743237 -839904 -803630 -619183 -282591 74075 226757 90696
30553 90696 -181195 -377680 -445327 -493665 -636460 -863111 -1046704 -1064546 -910896 -674043
30543 -674043 -416045 -150172 46591 25715 -224292 -459019 -425395 -190640 -66167 -207412
30533 -207412 -448266 -558317 -502127 -376412 -237507 -100912 -8789 24009 70692 190627
30523 190627 306859 284820 108550 -110500 -281133 -399637 -478046 -498922 -462101 -405619
30513 -405619 -352587 -287971 -206558 -132631 -71142 7274 102690 161980 165735 189263 302352
30502 302352 432628 422122 236791 31037 -46276 -30858 -44181 -78848 -13214 168854 319177
30491 319177 337671 312726 353458 391057 288484 82575 -52571 -75219 -137649 -331011 -518993
30480 -518993 -520470 -351897 -176032 -77039 -5560 82195 149574 162706 164111 218847 323169
30469 323169 400243 379585 268962 145609 75237 52023 35593 22329 30155 30583 -20528 -76109
30457 -76109 -30667 85782 59214 -249668 -670428 -885749 -802733 -625097 -558845 -595720 -626651
30446 -626651 -618443 -581094 -473947 -279624 -116172 -136380 -313638 -438928 -362607 -162901
30436 -162901 -36797 -78328 -206131 -278766 -246069 -194051 -244891 -397202 -487634 -369528 -125323
30425 -125323 -12052 -154114 -376468 -424934 -284059 -156983 -162405 -201712 -157233 -78699 -83252
30414 -83252 -172107 -260760 -328204 -412395 -485309 -456240 -307614 -126275 16818 124723 189399
30403 189399 145276 -39290 -289245 -489868 -581708 -564540 -468993 -357902 -295035 -275473 -242308
30392 -242308 -194336 -193769 -227854 -169799 32648 213999 159346 -116537 -365497 -373233 -150360
30381 -150360 127470 290087 292166 233328 254662 369076 431108 331563 157453 63535 47115
30370 47115 -19292 -172868 -330551 -456817 -592762 -704853 -682272 -532906 -408900 -364346
30360 -364346 -263744 -41493 119247 31013 -200777 -309941 -217879 -66929 34599 100147
30350 100147 115911 11795 -176024 -284668 -238357 -153552 -161174 -238377 -295016 -324263 -367788
30339 -367788 -403082 -374715 -308353 -298980 -381247 -474078 -470751 -352741 -201020 -105040 -70807
30328 -70807 -32125 47822 127590 168230 204573 263386 262433 109764 -114752 -223782 -194748
$$ [...]
##END NTUPLES=NMR SPECTRUM
##END=
