##TITLE=31P_DE-80H_X3
 64 sc D2O
 26.2.2025
##JCAMPDX= 6.0         $$ Bruker NMR JCAMP-DX V2.0
##DATA TYPE= NMR SPECTRUM
##DATA CLASS= NTUPLES
##ORIGIN= UXNMR, Bruker Analytische Messtechnik GmbH
##OWNER= root
$$ XWIN-NMR		Version 3.5
$$ Tue Mar 25 10:44:59 2025 Russian Standard Time (UT+4h)  Yarkov@DPX200
##.OBSERVE FREQUENCY= 81.013821
##.OBSERVE NUCLEUS= ^31P
##.ACQUISITION MODE= SIMULTANEOUS
##.ACQUISITION SCHEME= undefined
##.AVERAGES= 64
##.DIGITISER RES= 17
##SPECTROMETER/DATA SYSTEM= spect
##.PULSE SEQUENCE= zgpg30
##.SOLVENT NAME= CDCl3
##.SHIFT REFERENCE= (INTERNAL, CDCl3, 0, 198.062)
##AUDIT TRAIL= $$ (NUMBER, WHEN, WHO, WHERE, WHAT)
$$ ##TITLE= Audit trail, XWIN-NMR		Version 3.5
$$ ##JCAMPDX= 5.01
$$ ##ORIGIN= Bruker BioSpin GmbH
$$ ##OWNER= Yarkov
$$ C:/Bruker/XWIN-NMR/data/yarkov2/nmr/P31/2/pdata/1/auditp.txt
$$ ##AUDIT TRAIL=  $$ (NUMBER, WHEN, WHO, WHERE, WHAT)
(   1,<2025-03-25 10:44:03.64 +0400>,<Yarkov>,<DPX200>,
      <created by zg, POWCHK disabled, PULCHK disabled
       configuration hash MD5:
       00 E9 B6 7A A2 85 ED C7 34 08 36 98 17 FE 4E 26
       data hash MD5: 32K
       07 99 6E 3C 1A D3 85 A8 B2 CF 0E 77 31 E9 55 4F>)
(   2,<2025-03-25 10:44:07.62 +0400>,<Yarkov>,<DPX200>,
      <Start of raw data processing
       efp BC_mod = 2 LB = 1.5 FT_mod = 6 PKNL = 1 PHC0 = 1816.433 PHC1 = -1.904586 SI = 64K 
       data hash MD5: 64K
       15 BA 79 4E 75 41 CC C2 1B 23 01 E3 EE C6 F3 D2>)
(   3,<2025-03-25 10:44:29.25 +0400>,<Yarkov>,<DPX200>,
      <pk PHC0 = 3.942925 PHC1 = 0 
       data hash MD5: 64K
       3C 48 4B 09 3A CA 11 49 B9 F0 A9 FE CC 50 ED 9E>)
$$ ##END=
$$ 
$$ hash MD5
$$ C9 30 16 58 70 62 7E 1E 2C 23 D7 7C D6 94 CD 60
##$RELAX= 
##$RELAX= 
##$RELAX= 
##$RELAX= 
##$RELAX= 
##$RELAX= 
##$RELAX= 
##$RELAX= 
$$ Bruker specific parameters
$$ --------------------------
##$DU= <C:/Bruker/XWIN-NMR>
##$EXPNO= 2
##$NAME= <P31>
##$PROCNO= 1
##$TYPE= <nmr>
##$USER= <yarkov2>
##$AMP= (0..31)
100 100 100 100 100 100 100 100 100 100 100 100 100 100 100 100 100 100 
100 100 100 100 100 100 100 100 100 100 100 100 100 100 
##$AQSEQ= 0
##$AQ_mod= 1
##$AUNM= <au_zg>
##$AUTOPOS= <>
##$BF1= 81.014009
##$BF2= 200.13
##$BF3= 200.13
##$BF4= 200.13
##$BF5= 200.13
##$BF6= 200.13
##$BF7= 200.13
##$BF8= 200.13
##$BYTORDA= 1
##$CFDGTYP= 0
##$CFRGTYP= 5
##$CHEMSTR= <none>
##$CNST= (0..31)
1 1 145 1 1 1 1 1 1 1 1 1 1 1 1 1 1 1 1 1 1 1 1 1 1 1 1 1 1 1 1 1 
##$CPDPRG= <waltz16>
##$CPDPRG1= <>
##$CPDPRG2= <waltz16>
##$CPDPRG3= <>
##$CPDPRG4= <mlev>
##$CPDPRG5= <mlev>
##$CPDPRG6= <mlev>
##$CPDPRG7= <mlev>
##$CPDPRG8= <mlev>
##$CPDPRGB= <>
##$CPDPRGT= <>
##$D= (0..31)
0 1 0 0 0 0 0 0 0 0.06 0 0.03 2e-05 3e-06 0 0 0.0002 0 0 0 0 0 0 0 0 0 
0 0 0 0 0 0 
##$DATE= 1742885042
##$DBL= (0..7)
120 120 120 11 120 120 24 19 
##$DBP= (0..7)
150 150 150 150 150 150 150 150 
##$DBP07= 0
##$DBPNAM0= <>
##$DBPNAM1= <>
##$DBPNAM2= <>
##$DBPNAM3= <>
##$DBPNAM4= <>
##$DBPNAM5= <>
##$DBPNAM6= <>
##$DBPNAM7= <>
##$DBPOAL= (0..7)
$$ [...]
##$SUBNAM3= <"">
##$SUBNAM4= <"">
##$SUBNAM5= <"">
##$SUBNAM6= <"">
##$SUBNAM7= <"">
##$SUBNAM8= <"">
##$SUBNAM9= <"">
##$SW= 400.765351723535
##$SWIBOX= (0..15)
0 1 3 0 0 0 0 0 0 0 0 0 0 0 0 0 
##$SW_h= 32467.5324675325
##$TD= 32768
##$TD0= 1
##$TE= 0
##$TE2= 300
##$TE3= 300
##$TEG= 300
##$TL= (0..7)
0 120 53 12 22 120 120 120 
##$TP= (0..7)
150 150 150 150 150 150 150 150 
##$TP07= 0
##$TPNAME0= <>
##$TPNAME1= <>
##$TPNAME2= <>
##$TPNAME3= <>
##$TPNAME4= <>
##$TPNAME5= <>
##$TPNAME6= <>
##$TPNAME7= <>
##$TPOAL= (0..7)
0.5 0.5 0.5 0.5 0.5 0.5 0.5 0.5 
##$TPOFFS= (0..7)
0 0 0 0 0 0 0 0 
##$TUNHIN= 0
##$TUNHOUT= 0
##$TUNXOUT= 0
##$USERA1= <user>
##$USERA2= <user>
##$USERA3= <user>
##$USERA4= <user>
##$USERA5= <user>
##$V9= 5
##$VALIST= <valist>
##$VCLIST= <CCCCCCCCCCCCCCC>
##$VD= 0
##$VDLIST= <DDDDDDDDDDDDDDD>
##$VPLIST= <PPPPPPPPPPPPPPP>
##$VTLIST= <TTTTTTTTTTTTTTT>
##$WBST= 1024
##$WBSW= 4
##$XGAIN= (0..3)
0 0 0 0 
##$XL= 0
##$YL= 0
##$YMAX_a= 21327
##$YMIN_a= -23664
##$ZGOPTNS= <>
##$ZL1= 120
##$ZL2= 120
##$ZL3= 120
##$ZL4= 120
##$ABSF1= 0
##$ABSF2= 0
##$ABSG= 0
##$ABSL= 0
##$ALPHA= 0
##$AQORDER= 0
##$ASSFAC= 0
##$ASSFACI= 0
##$ASSFACX= 0
##$ASSWID= 0
##$AUNMP= <proc_1d>
##$AZFE= 0.1
##$AZFW= 0.5
##$BCFW= 0
##$BC_mod= 2
##$BYTORDP= 0
##$COROFFS= 0
##$CY= -3
##$DATMOD= 1
##$DC= 0
##$DFILT= <>
##$DTYPP= 0
##$F1P= 0
##$F2P= 0
##$FCOR= 1
##$FTSIZE= 65536
##$FT_mod= 6
##$GAMMA= 0
##$GB= 0
##$INTBC= 1
##$INTSCL= 9.790993e-09
##$ISEN= 30
##$LB= 1.5
##$LEV0= 0
##$LPBIN= 0
##$MAXI= 10000
##$MC2= 0
##$MEAN= 0
##$ME_mod= 0
##$MI= 50
##$NCOEF= 0
##$NC_proc= -5
##$NLEV= 6
##$NOISF1= 182.463
##$NOISF2= 159.3651
##$NSP= 0
##$NTH_PI= 0
##$NZP= 0
##$OFFSET= 198.0616
##$PC= 4
##$PHC0= 1820.376
##$PHC1= -1.904586
##$PH_mod= 1
##$PKNL= yes
##$PPARMOD= 0
##$PSCAL= 0
##$PSIGN= 0
##$REVERSE= no
##$SF= 81.0140089999434
##$SI= 65536
##$SIGF1= 159.3651
##$SIGF2= -187.1042
##$SINO= 113.3802
##$SIOLD= 16384
##$SREGLST= <1H.CDCl3>
##$SSB= 0
##$STSI= 65536
##$STSR= 0
##$SW_p= 32467.5324675325
##$SYMM= 0
##$S_DEV= 0
##$TDeff= 32768
##$TDoff= 0
##$TI= <>
##$TILT= no
##$TM1= 0
##$TM2= 0
##$TOPLEV= 0
##$USERP1= <user>
##$USERP2= <user>
##$USERP3= <user>
##$USERP4= <user>
##$USERP5= <user>
##$WDW= 1
##$XDIM= 65536
##$YMAX_p= 315305681
##$YMIN_p= -32176047
$$ End of Bruker specific parameters
$$ ---------------------------------
##NTUPLES= NMR SPECTRUM
##VAR_NAME=  FREQUENCY,     SPECTRUM/REAL,   SPECTRUM/IMAG
##SYMBOL=    X,             R,               I
##VAR_TYPE=  INDEPENDENT,   DEPENDENT,       DEPENDENT
##VAR_FORM=  AFFN,          ASDF,            ASDF
##VAR_DIM=   65536,         65536,           65536
##UNITS=     HZ,            ARBITRARY UNITS, ARBITRARY UNITS
##FACTOR=    0.49542278885378, 1,            1
##FIRST=     16045.7642231865, 0,            0
##LAST=      -16421.768244346, 0,            0
##MIN=       -16421.768244346, -32176047,    0
##MAX=       16045.7642231865, 315305681,    0
$$ Real data points
##PAGE= N=1
##DATA TABLE= (X++(R..R)), XYDATA
$$ [...]
39143e25717k90179J81282L62135J19325j67128j71690j2203J4374j17195j51044
39133g58040N6720L07170L07352N6045j71977k08061j60056j40611n6737J48949
39123f19246K52313L9140k70866k51072Q2635K28209p8539m50233l96727j7505
39113a481891J78460M088k00306r3174K26704M07443K89748L3811j17029r1448
39103h43594j9101n6857k07783l28863l14485k10503j03457K7831K41926M48941
39093a365945M40492J56905j81915l01265j68698K1135J10245J06773O2234k8170
39083a148209j32531j19077P6937K91785K99234J24975L1938J56856L17089K64733
39073A63730J2774k04474k23657r7669J7579L9705K5563P9658J77374J31435j51040
$$ y = [-525717, -815896, -634614, -272479, -153154, -320282, -491972, -504175, -489801, -606996, -758040, -701320, -394150, -86798, -30753, -202730, -410791, -570847, -711458, -768195, -619246, -366933, -327793, -598659, -849731, -767096, -538887, -617426, -1067659, -1464386, -1481891, -1303431, -1299343, -1499649, -1592823, -1366119, -958676, -668928, -635117, -752146, -843594, -862695, -919552, -1127335, -1456198, -1770683, -1981186, -2084643, -2056812, -1814886, -1365945, -925453, -768548, -950463, -1251728, -1420426, -1399291, -1289046, -1182273, -1120039, -1148209, -1280740, -1399817, -1322880, -1031095, -731861, -606886, -574948, -418092, -101003, 163730, 176504, -27970, -251627, -349296, -331717, -292012, -266449, -186791, -9417, 122018, -29022]
39062b9022m27021l49211L1719K59957R1932j49838n9476K55387L68065J61337
39052A53829r2217j99982k36507k62515k02889o9306p850m3213m0019J2200l9230
39041a027699j70746j18418J80369L74589J70753k08814l15331p1386J99233K50109
39031g37341J43757K6435o8398j33972j09143J375M1546j24165l75822m01929
39021a737657p3393L21204L68815P0557j20298P6171L25984J42885l52988n28227
39011a506947j02745M65409O01959K93599o4633k22650k02821o4678J47610K85406
39001c70491J80956j23465l80559l94803k05361k8107m2674j88000j85024J26657
38991a610871N05642N47943K09906j37298k08093r1462K6065J13520J35933k9193
$$ y = [-29022, -456043, -805254, -773535, -513578, -421646, -571484, -630960, -375573, -7508, 153829, 61612, -138370, -374877, -637392, -840281, -909587, -917437, -960650, -1000669, -988469, -1027699, -1198445, -1316863, -1136494, -761905, -591152, -799966, -1115297, -1186683, -987450, -737341, -593584, -567149, -635547, -769519, -878662, -877287, -835741, -959906, -1335728, -1737657, -1811050, -1489846, -1121031, -1050474, -1170772, -1094601, -768617, -625732, -978720, -1506947, -1609692, -1144283, -542324, -248725, -313358, -536008, -738829, -803507, -655897, -370491, -189535, -313000, -693559, -1088362, -1293723, -1321830, -1364504, -1552504, -1737528, -1610871, -1105229, -557286, -347380, -484678, -692771, -784233, -758168, -644648, -508715, -537908]
38981e37908k95666k92069J27067N34577M21063j31902n73193n50128j80292K22032
38971a256419M18947L43836J60189J33977K76327K87626L4752j89726j54759j21248
38961f6498l86583o79003n18732o187L03244K28118J09719J49787J62902N8085
38951f45148L3180J52243K01692J15084R6681J74949Q8354k01225l35622j36236
38941d56048O9231l1700k67750l28634k37297j73991j29192l4222K5936J0134
38931a553533P3294K56580L02706O9051j51504m5663K33350L31250K20495J15888
38921a48086O6720n674l5416O2102J39111L9191p6021J2015J32045n6739m80525
38910c51277o91387m68344k2117L73838O05824N93678L09774m0011j72570j04631
$$ y = [-537908, -833574, -1125643, -998576, -463999, -42936, -174838, -748031, -1298159, -1478451, -1256419, -837472, -493636, -333447, -199470, 76857, 364483, 399235, 209509, 54750, -66498, -453081, -1132084, -1650816, -1657003, -1353759, -1125641, -1015922, -866135, -703233, -645148, -611968, -459725, -258033, -142949, -46268, 128681, 217035, 15810, -319812, -456048, -386817, -418517, -686267, -1014901, -1252198, -1426189, -1555381, -1589603, -1563667, -1553533, -1480239, -1223659, -920953, -851902, -1003406, -1049069, -815719, -484469, -263974, -148086, -81366, -87040, -122456, -60354, 78757, 117948, 41927, 53942, 185987, 129248, -351277, -1042664, -1511008, -1533125, -1159287, -553463, 40215, 349989, 309978, 137408, 32777]
38900C2777j00863k50860l88198m09503l51969j72973J81835M80210L77677l6865
38890f38732k74987j47167j2772j47704k82032o9513L19247M43891K20888n4423
38880f43304j77031j86366j23874M5664K66196L94746M03556L84793L36858J40888
38870H42126j93740m30515l62891q1556J22807R6450k8477m3941N2337Q0674l0178
38859B3096j19758m4104Q7712Q8733R498M5245J57143P1517k62189m89344l13715
38848g46166O4197K20997R5368J1355J46209K78824J75809j5039J7484K42255
38838D91293K66097j16655n62719n55892o5970L88191L76354O5766m4368K17769
38828D59866M86686L13919k86523q01345p18036p0884N41394N66053R6153k93777
$$ y = [32777, -68086, -318946, -707144, -1116647, -1468616, -1641589, -1459754, -979544, -601867, -638732, -913719, -1060886, -1073658, -1221362, -1503394, -1572907, -1253660, -809769, -588881, -643304, -820335, -1006701, -1130575, -1084911, -818715, -423969, -20413, 364380, 701238, 842126, 648386, 217871, -145020, -226576, -103769, -7319, -35796, -79737, -27400, 53274, 23096, -96662, -140766, -53054, 35679, 45177, 90422, 247565, 319082, 56893, -432451, -746166, -681969, -460972, -365604, -354249, -208040, 70784, 246593, 231554, 249038, 491293, 757390, 640735, 78016, -477876, -543846, -155655, 220699, 286465, 242097, 459866, 946552, 1260471, 973948, 172603, -545433, -616317, -74923, 491130, 587283, 293506]
38818B93506k93715j67123k22277l18575j81057O9337J06748l5141m3613Q2683
38808g09227P208l20510m89863k54816P7860J30783j9285q3196l6179l0353m9010
38797a776588J4359P8712M250r6441N033K45096K99900N0174k38716k69725n9719
38786a743665J47471J82480Q2950m972J1281J04493K00188K61928K49740P2118
38776d35988k61941m86416l15800J23277L66083K16409p689j223O5740j02303
38766h39851l74438l74096p5553J67020J46026J1110m9945l0038L0236J18094
38756a271435J46626K6176j20025n3059K18707M08498L45143J73779R1270J00947
38746F6627J24275J53794J75351R7855j17547l61001m82814m22061k21484k4365
$$ y = [293506, -209, -167332, -389609, -708184, -889241, -819904, -713156, -748297, -791910, -709227, -702019, -1022529, -1512392, -1767208, -1689348, -1558565, -1577850, -1661046, -1697225, -1727578, -1776588, -1762229, -1683517, -1679267, -1775708, -1770675, -1525579, -1225679, -1175505, -1414221, -1683946, -1743665, -1596194, -1413714, -1330764, -1335736, -1324455, -1219962, -1019774, -757846, -508106, -435988, -697929, -1184345, -1500145, -1376868, -1010785, -794376, -802065, -803288, -737548, -839851, -1214289, -1588385, -1663938, -1496918, -1350892, -1339782, -1389727, -1419765, -1389529, -1271435, -1124809, -1098633, -1218658, -1271717, -1053010, -644512, -299369, -125590, -34320, 66627, 190902, 344696, 520047, 617902, 500355, 139354, -343460, -765521, -987005, -1011370]
38736a011370k1624k35766l94546k33126J05937K37731R7925K0856J89528L53358
38726h91097K49407j3023j99549k96872l59367k68089M5614L27502K88132M6045
38716a071297l5805J24704K81573K83690K13702J07075j24983m09628m53955j31341
38706a216265K82835M21114K28971o1240k26503j98052k8753J41644J60766K5870
38696d69613q0871k2264Q9244L9728j73183l21748k55589q5712J1951O3626K23120
38685i81311M52592M49344P399o22433q98779n62367P0085M70210M69317L30632
38675h15311K97210K79934R5271j61254k12075l4810O0004j03377k49362l8270
38665h82040L67686M54677P8590l09870l02419q2079p4922k93094l82646k07930
$$ y = [-1011370, -1032994, -1268760, -1663306, -1896432, -1790495, -1552764, -1454839, -1433983, -1244455, -891097, -641690, -654713, -854262, -1151134, -1510501, -1778590, -1732976, -1405474, -1117342, -1071297, -1107102, -982398, -700825, -417135, -203433, -96358, -221341, -630969, -1084924, -1216265, -933430, -512316, -283345, -344585, -571088, -769140, -797893, -656249, -495483, -469613, -550484, -572748, -483504, -443776, -616959, -938707, -1194296, -1280008, -1268057, -1204431, -981311, -528719, -79375, -71976, -694409, -1593188, -2155555, -2085470, -1615260, -1145943, -815311, -518101, -238167, -142896, -304150, -516225, -551035, -491031, -594408, -843770, -882040, -514354, -59677, 18913, -290957, -593376, -675455, -750377, -1043471, -1426117, -1634047]
38655a634047K049R1144J84104L54599M10804J96827j20569k58069j55507L6803
38645h91862J63902J30816p8960l05773k86651J9448L17513L35602J47437k2202
38635d70730j31742k35805k26088L5319L87212M79086K32550n9798j50188j24134
38625b64318j74003k63756j75589J66141N34598O02823K99754q0788k02005q6034
38615C56823m2162j83757k56388o9690J55580J15313r9971j66344m3101J4803
38605b18894q8172j71897j44323j51005k72115l47464k22398M1979K91903M21419
38595h60967L38892K2487l16625l63958j00882J39907J21063j8220m5646L1670
38585a052279Q3124J03594J55304K05175J93903J56756J38951J00429J3743o7601
$$ y = [-1634047, -1631998, -1540854, -1356750, -1002151, -591347, -394520, -515089, -773158, -928665, -891862, -727960, -597144, -676104, -981877, -1268528, -1249080, -931567, -595965, -448528, -470730, -602472, -838277, -1064365, -1029046, -641834, -162748, 69802, 10004, -140184, -264318, -438321, -702077, -877666, -711525, -176927, 425896, 725650, 644862, 442857, 356823, 314661, 130904, -125484, -195174, -39594, 75719, -24252, -190596, -233697, -218894, -307066, -478963, -623286, -774291, -1046406, -1393870, -1616268, -1574289, -1282386, -860967, -522075, -499588, -816213, -1180171, -1281053, -1141146, -1020083, -1038303, -1083949, -1052279, -969155, -865561, -710257, -505082, -311179, -154423, -15472, 84957, 98700, 31099]
38575C1099j26517k12309k71125j53195R0788J59902o1260k43551m4445L73594
38565d57019N41888L00284o1856k27438j64902l1215K9940k5534j21136j26253
38555c43241j7595Q8675J13331Q3207k3493k61182m39845j99145L96661O90804
38545H8177K55214m17564n52194j96288n9070l40756m64097j08027K26834O2970
38535a504801k41645o7688M69086O93871L66783n6048j36710L6257J41533P2871
38525b26491m9508q9592N005J74125K51339J21395r9531j74103o1687J9376r7669
38514b27341k89349l06239q9521J73246K66472J40387r0643k61638k58102q5440
38504a028168R6344N7765k60840n77234m76739R7311O68033P05559K32003k39454
$$ y = [31099, -95418, -307727, -578852, -732047, -641259, -481357, -542617, -786168, -830613, -457019, 84869, 385153, 323297, 95859, -69043, -100258, -70318, -95852, -216988, -343241, -360836, -272161, -158830, -75623, -99116, -360298, -800143, -999288, -602627, 88177, 343391, -74173, -626367, -822655, -881725, -1222481, -1686578, -1794605, -1567771, -1504801, -1746446, -1814134, -1345048, -651177, -284394, -340442, -477152, -440895, -299362, -226491, -275999, -365591, -360586, -186461, 64878, 186273, 86742, -87361, -149048, -129672, -227341, -516690, -822929, -912450, -739204, -472732, -332345, -422988, -684626, -942728, -1028168, -931824, -874059, -1134899, -1712133, -2188872, -2091561, -1423528, -717969, -485966, -725420]
38494g25420l45713k15561j20027n8008J08877K99080K83178P8354m314K00878
38484d98676M23686K83069j73151m56202k25172K63928M58783J95730j37550j63828
38474b9383J1924O6048k8851n5337m663j04912l63307m40506j41984K39992K93416
38463e57563J7857k24293j76483P9496K91895K87708R1974r9866j06723L3905
38453c62093J21329O9392k394J5446Q4082J43355J83430J25005j41100m90915
38443b54463n95794l64230j04210o8859j12928k5442R0052P2336O1625K18094
38433a083819L15453P2852k68847k15746J95284M10610J97425n0931J0878J76672
38423b40169J02530j52612k93467k41226j46160j05454q0388L947J94930M43813
$$ y = [-725420, -1071133, -1286694, -1406721, -1464729, -1355852, -1056772, -773594, -695240, -699554, -498676, -74990, 208079, 34928, -421274, -646446, -382518, 76265, 271995, 134445, -29383, -17459, 48589, 19738, -35599, -40262, -145174, -508481, -948987, -1090971, -850979, -557563, -539706, -763999, -940482, -860986, -569091, -281383, -189409, -289275, -395998, -362093, -240764, -171372, -173766, -158320, -74238, 69117, 252547, 377552, 236452, -254463, -850257, -1214487, -1318697, -1387556, -1500484, -1525926, -1435874, -1363538, -1301913, -1083819, -768366, -695514, -964361, -1180107, -984823, -574213, -376788, -427719, -416841, -240169, -137639, -290251, -583718, -824944, -971104, -1076558, -1156946, -1152999, -958069, -514256]
38413e14256N62967M16235J62688Q6649J75226J49702n0558j60874n9859K3336
38403G91256p7283k11145k61190l60122n07918l82704J11390M81749K85294j65203
38393b95876k47057K7614Q4349k73717n74247l99258P9563M30860M50791J83975
38383e33003k04592m27786k43860K05296M57791K76052q0835k43032j66572n0776
38373a011317k4197p0624j22842j07542j3330L0821r5214k44312j24576K44611
38363a538522M67968L14568O4057R4192L32593L87138R5707l10186n21758m21642
38353a035885j00813J97982K19826k5840j99650m9419J94822J15961k45783l90207
38343a319006p7091K93832K38136j36513l19768j35721O3871k6215k19580j50773
$$ y = [-514256, 48711, 464946, 627634, 714283, 889509, 1039211, 988653, 827779, 767920, 791256, 713973, 502828, 241638, -118484, -626402, -1009106, -897716, -415967, -130673, -295876, -542933, -515319, -430970, -704687, -1278934, -1678192, -1598629, -1167769, -716978, -533003, -737595, -1165381, -1409241, -1203945, -746154, -470102, -550937, -793969, -960541, -1011317, -1035514, -1106138, -1228980, -1336522, -1349852, -1319031, -1414245, -1658557, -1783133, -1538522, -1070554, -755986, -691929, -597737, -265144, 121994, 217701, -92485, -614243, -1035885, -1136698, -938716, -718890, -744730, -944380, -993799, -798977, -683016, -928799, -1319006, -1396097, -1102265, -864129, -1000642, -1320410, -1456131, -1392260, -1418475, -1638055, -1788828]
38333a788828J68692L69119K49781L6222L1315J91463K12879l3066l22249l59947
38323a244619j21132J61258K85790K68688K31375J81437L702l14007n57752n09315
38313a614575k40539k5295M0256J29477L37105M73641L70830J83508J43136J72444
38303c0012N0294j50414j58357n445j7221k28022k41966J14729M04535J83097
38293g8782l02354m39494j13766J96606J55914k1684j065J75979K19304K5983
38283a83359k04845k27277r690K40371K86847J20131m5672q0643j25700l27717
38273e57554n14788l92170j5774K32614J87189J08089K19929L29791J39322k60547
38263e23899m86247l68786j19215o849o8849j51323r2585J43307M01619M22401
$$ y = [-1788828, -1620136, -1251017, -1001236, -965014, -933699, -742236, -529357, -562423, -884672, -1244619, -1365751, -1204493, -918703, -650015, -418640, -237203, -233501, -547508, -1105260, -1614575, -1855114, -1880409, -1840153, -1710676, -1373571, -899930, -529100, -345592, -202456, -30012, 20282, -130132, -288489, -293934, -311155, -539177, -781143, -666414, -261879, -78782, -381136, -820630, -934396, -737790, -581876, -603560, -604625, -428646, -209342, -183359, -388204, -615481, -625171, -384800, -97953, 22178, -23494, -104137, -229837, -557554, -1072342, -1464512, -1480286, -1247672, -1060483, -952394, -732465, -402674, -263352, -523899, -1010146, -1378932, -1498147, -1504996, -1573845, -1725168, -1817753, -1674446, -1272827, -850426]
38253h50426J13512k79294m06121k08624M8330J26012L1317j23978k85939l88688
38243b223899k88422P3402N13447P47093O57789L45763k4750l11436l87638k19715
38233a118366L0983J27218L0863n5130K2300J58682J80052J27684J86408L69888
38223F0582M65934L33704R3291o8395j48918k58610l87369m07878k93310j75616
38213g86585j47457j29285r898J60468K15303R2270o9744q4835N7689J72961J09136
38202d19977m4540p0059N2662P7420j44378l72998k70716P9473K29181p124k67627
38191a158683j56715J96003L49632J75532l2948k3570J31429K38734K20597R0798
38181C0809q9183j66197j7022K16912K39836L2979q2715M3107J07418j65068n12814
$$ y = [-850426, -736914, -1016208, -1422329, -1630953, -1582623, -1456611, -1425294, -1549272, -1835211, -2223899, -2512321, -2438919, -1925472, -1178379, -520590, -174827, -199577, -511013, -898651, -1118366, -1087383, -960165, -929302, -984432, -962132, -803450, -623398, -495714, -309306, 60582, 526516, 860220, 953511, 885116, 736198, 477588, 90219, -317659, -610969, -786585, -934042, -1063327, -1073225, -912757, -697454, -605184, -674928, -759763, -702074, -529113, -419977, -464517, -534576, -481914, -404494, -548872, -921870, -1192586, -1113113, -883932, -891056, -1158683, -1315398, -1119395, -769763, -594231, -627179, -650749, -519320, -280586, -59989, 30809, -58374, -224571, -241593, -24681, 215155, 248134, 165419, 208526, 315944, 150876, -361938]
38170c61938m74115q4624J71664O7027j33748j89422k03368k60783j46401K72634
38160a343074O70227O33939K51910l3396p1350j30421l69618n44454l79671J4497
38150a301411K75554K06819o1955k44185j55522J14065K65302J36261m0805P1488
38140g34389L74195L88554k6877l60315j35662L52684M06429j05254n97999o04497
38130a043131l02942p9845K0731J54902L04321L60738L69491L75481K07198k34314
38120A32630o06442m61329P4677L78163J55905k04802k58924q5501P237J9975
38110h48411J39684K92084K24982l5001j80291q7606L2786J658j03486j71116
38100g34717k37696l17684k79113n6420J81378K48117K00994K14736K91299K74561
$$ y = [-361938, -836053, -920677, -749013, -681986, -815734, -1005156, -1208524, -1469307, -1615708, -1343074, -672847, -38908, 213002, 179606, 108256, -22165, -391783, -936237, -1315908, -1301411, -1025857, -819038, -880993, -1125178, -1280700, -1166635, -901333, -765072, -805877, -734389, -360194, 28360, 1483, -358832, -494494, -141810, 264619, 159365, -438634, -1043131, -1346073, -1425918, -1405187, -1250285, -945964, -585226, -215735, 159746, 366944, 132630, -473812, -935141, -860464, -482301, -326396, -531198, -790122, -875623, -868386, -848411, -708727, -416643, -191661, -226662, -406953, -494559, -461773, -460115, -563601, -734717, -972413, -1290097, -1569210, -1625630, -1444252, -1196135, -995141, -780405, -489106, -214545]
38090b14545J12007o1796j14124p3720o5571j34679j64734K414L30637N24182
38080A40071L22134j45411m53392l79041j38332m4487j04747j00380O4886K64445
38070e74254L22604J63336j34625l32101k02180J67898L90117K39739n8443j91272
38060b09181j97174k59225k51798Q3102N66631O56929J90584l48764m75763k82807
38050e27466j60770k25538k87140k00890o41J99903K59060Q9608j63057j96156
38040a213087L2215J66993l9820l05500k09540J53624L02750Q9434j24936o7643
38030a215510O6958J2473j25663r7509L3950k959j90884j59220K83059P78803
38020f16502P87444K43289l45638m85645k21056L1343L7217n7066l8249Q6507
$$ y = [-214545, -102538, -164334, -278458, -352178, -417749, -552428, -717162, -714748, -384111, 140071, 462205, 316794, -136598, -515639, -653971, -698458, -803205, -903585, -838699, -574254, -251650, -88314, -222939, -555040, -757220, -589322, -199205, 40534, -17909, -209181, -406355, -665580, -917378, -834276, -267645, 389284, 579868, 231104, -244659, -527466, -688236, -913774, -1200914, -1401804, -1402445, -1202542, -943482, -853874, -1016931, -1213087, -1180872, -1013879, -1053699, -1359199, -1568739, -1415115, -1112365, -1022931, -1147867, -1215510, -1148552, -1136079, -1261742, -1359251, -1325301, -1328260, -1519144, -1678364, -1395305, -616502, 170942, 414231, 68593, -417052, -638108, -606765, -569548, -626614, -664863, -578356]
38010e78356J82669J89527J13402m8902k46853l25368j71097J31883L78413M22932
38000D8250K34216j19107m46070n14777k88201M496J44914J70468K18536K60159
37990b87116J79754K3243n3934l9486n2494j02306p1946M7937J06013J0972j51303
37979c90666k53875k48463j35079N3097K16495K55122J73248L6844j13456j99916
37969f06649p8626K34394M20857K10414j91920l31015j29791M7801p749p2591
37959e04875O1402K20192J66254O225l079J22908J45807j9464k12299k67622j76184
37948d60735l1382O2968N6446j2615q8692j99624l62486m14903j70299K21004
37938a400318L49535J07237j20344j7860J86858R9933k12123l30323j07063J71896
$$ y = [-578356, -395687, -206160, -92758, -141660, -388513, -713881, -884978, -753095, -374682, 48250, 282466, 163359, -282711, -797488, -1085689, -1081193, -936279, -765811, -547275, -287116, -107362, -84119, -138053, -177539, -230033, -332339, -404285, -356348, -250335, -239363, -390666, -644541, -893004, -1028083, -974986, -758491, -503369, -330121, -293277, -406733, -606649, -685275, -450881, -30024, 180390, -11530, -342545, -472336, -424535, -432284, -504875, -443473, -223281, -57027, -50802, -53881, 69027, 214834, 195370, -16929, -284551, -460735, -492117, -429149, -372703, -385318, -474010, -673634, -1036120, -1451023, -1621322, -1400318, -1050783, -943546, -1063890, -1081750, -894892, -794959, -1007082, -1337405, -1444468, -1272572]
37928a272572K38620J52405R6416Q8845O350j95625l51424j97537L06920P91612
37918c35990Q00542L57223m0499r4989o7545k53950m44859k84655P6807J54767
37908a33148j46806m21452l63515j06474P3178P2363n1350j49795n6810J70721
37898a113088J82644j96841n77200m76754n5019J34002L7727J40114N60021P85299
37888e79095N11998J13752m0205j39402l91848m82553j13701L43129L36824j6226
37878d57327j70733k4779N1726o1659r1819N9377J50036O6268j3390l78j4252
37867e06930l1718J55798M92763N60754J36623m46710p00854n25207j92073J7719
37857a039835K2374o9834p7767M4817J31265P6479Q2343L48769O18124M43094
$$ y = [-1272572, -1033952, -881547, -785131, -696286, -689936, -885561, -1236985, -1434522, -1127602, -335990, 464552, 821775, 781276, 686287, 618742, 364792, -80067, -364722, -287915, -133148, -279954, -701406, -1064921, -1171395, -1098217, -1025854, -1077204, -1226999, -1283809, -1113088, -930444, -1127285, -1704485, -2181239, -2236258, -2102256, -2064529, -1924415, -1364394, -579095, -67097, 46655, 6450, -132952, -524800, -1007353, -1121054, -777925, -441101, -457327, -628060, -652839, -601113, -662772, -754591, -695214, -545178, -478910, -492300, -492678, -506930, -538648, -382850, 109913, 670667, 807290, 360580, -340274, -865481, -1057554, -1039835, -1017461, -1087295, -1165062, -1120245, -988980, -912501, -830158, -481389, 136735, 579829]
37847E79829q6565l57945r3519K81753L40656K36995K57621K36157j14105n85389
37837F95488p07823m36577j44249l6974j9256n5415k00453k90308o5518L45576
37827i15509M98636K72469K1618j3068o045r4500q7881R5966J40319j40377l51392
37816e79764q3288L50161L14955j46912l67648j27096j23l74198p29871l97608
37806b141392L72409P20173L97746M1820J53163L96128K22717k38749l89224o6755
37796e31964K36208R6066k98266m93136l78394k02311j39821j21194n6269J4062
37786a875019M2015O8023J11028J06348N1564Q8999L04811N28158M92414J74629
37776I2970j65813k85852j71638L7669J87591J54495p2951k99795k81802n8871
$$ y = [579829, 493264, 135319, 41800, 323553, 664209, 901204, 1158825, 1394982, 1280877, 695488, -12335, -448912, -593161, -630135, -649391, -704806, -905259, -1195567, -1261085, -915509, -416873, -144404, -122786, -135854, -141899, -236399, -324280, -228314, -87995, -228372, -579764, -663052, -312891, 2064, -144848, -512496, -639592, -639715, -1013913, -1743784, -2141392, -1768983, -1048810, -651064, -609244, -456081, -59953, 162764, -75985, -465209, -531964, -295756, -199690, -497956, -991092, -1369486, -1571797, -1711618, -1832812, -1889081, -1875019, -1833004, -1764981, -1653953, -1547605, -1496041, -1407042, -1102231, -574073, -81659, 92970, -72843, -358695, -530333, -492664, -305073, -150578, -223529, -523324, -805126, -863997]
37766h63997N1894q7568k04213l9848K05101J68698p5852j22379J01476K13569
37756f53119K0268j57996k6754K05451K14767J14269K13037M29350L86374O083
37746G51730l99185n90512n75914l56541O8325M13348K90588j84006m06843j12481
37736a101491K39003J75887r6009j09239J03777J66761O4045J26254L57540L28649
37726B55177j32985n94429n81275j80523J48185J44047q3357k91969l20022j64636
37716a801787K373j5172j65476j48522J86036N69598O13717K90198p2511k23313
37706g64859k18738k07931j82441m1333K04135M09085M48164L13505P9202j55128
37696a16339k81767k30339m8963J09866J46356J20990J41203J90290J69470O5127
$$ y = [-863997, -812103, -899671, -1103884, -1143732, -938631, -769933, -845785, -968164, -866688, -653119, -632851, -790847, -817601, -612150, -397383, -283114, -70077, 359273, 745647, 751730, 352545, -237967, -813881, -1170422, -1102097, -688749, -398161, -582167, -989010, -1101491, -862488, -686601, -782610, -891849, -788072, -621311, -557266, -431012, -73472, 255177, 122192, -472237, -1053512, -1234035, -1085850, -941803, -1025160, -1317129, -1637151, -1801787, -1799414, -1814586, -1980062, -2128584, -1942548, -1372950, -759233, -469035, -541546, -764859, -983597, -1191528, -1373969, -1415302, -1211167, -802082, -353918, -40413, 38789, -116339, -398106, -628445, -677408, -567542, -421186, -300196, -158993, 31297, 200767, 265894]
37686B65894o5468k34286m46094m97988j54353L85552N38386R1258m07477l64408
37676h88984J3056O2072l01433m77158j38198K92737L35299J21485N2553J66174
37666g62397K13134J03028p2997k68817m24444l60204k7430K99327L63106K82149
37656f55545K80675K76387R5402j02056n5990O3524j36821n63565o53944k02354
37646a654287L00631L45618L6403j84677j35399L5015J53622J60312O3678o4284
37636i43368j24530r5355o605J72812M38864N81231L86031J6322j37301l6896
37626B51205n6994l56627o03216n24634l26100k63664j89264Q6417L02566J09367
37616a570944k76386k96324J25175M62740L48536M1324L637L07416O22190O22037
$$ y = [265894, 200426, -33860, -479954, -977942, -1132295, -746743, -208357, -117099, -524576, -888984, -875928, -813856, -1115289, -1592447, -1730645, -1437908, -1102609, -981124, -928571, -762397, -549263, -446235, -519232, -788049, -1212493, -1572697, -1600127, -1300800, -937694, -655545, -374870, -98483, -3081, -105137, -161127, -97603, -234424, -797989, -1451933, -1654287, -1353656, -1008038, -971635, -1156312, -1291711, -1256696, -1103074, -942762, -879084, -943368, -1067898, -1163253, -1169858, -997046, -558182, 23049, 409080, 425402, 288101, 251205, 194211, -162416, -765632, -1290266, -1616366, -1880030, -2069294, -1982877, -1680311, -1570944, -1847330, -2143654, -2018479, -1555739, -1207203, -1165879, -1162242, -854826, -232636, 389401]
37606C89401K86598j15226k99834k64889k47124l43109l54840j46192Q0615J08102
37596i06498Q2289K39337M36801L57598N8931j24737j55838k81930m57320l27128
37586a078495R1361K65832n1356l66882j55912L54870N39825K44444j36112k86648
37576e79073k52965j60606m5716J2704q4336k29546j54737K04436N64767O07576
37566a17496L24325j2892j52697q8818j0611m7539r8553M213J87237J67374j43204
37555A1339m51216m40135j59015J11398K35895K62159K05889O0750l2801R4231
37545a01506L33604L64913R4378j94013k28850r3125k8198o1368l7095O2838O3506
37534A75084j14535l04249l20821j97040o3552Q1933K89049M10341K21267j65880
$$ y = [389401, 675999, 560773, 260939, -3950, -251074, -594183, -949023, -1095215, -1014600, -906498, -824209, -584872, -148071, 209527, 268458, 143721, -12117, -294047, -751367, -1078495, -987134, -721302, -772658, -1139540, -1295452, -940582, -400757, -156313, -292425, -579073, -832038, -992644, -1038360, -1025656, -1109992, -1339538, -1494275, -1289839, -725072, -117496, 206829, 193937, 41240, -47578, -58189, -105728, -204281, -200068, -12831, 154543, 11339, -439877, -880012, -1039027, -927629, -691734, -429575, -223686, -162936, -195737, -101506, 232098, 597011, 691389, 497376, 268526, 175401, 147203, 85835, 48740, 111578, 175084, 60549, -243700, -564521, -761561, -825113, -743180, -454131, -43790, 177477, 11597]
37524A1597l03534n8L47258K77751q4001k59899j51085q7485j76743j21673J73815
37513c74057L15849L5888l06565k30643J39996K95118J09299n8070J9970J49617
37503I6402J04571m6676j29804j36823j69438k55071l20707k72590p1640K00458
37493a001318L66094L22432J53829Q055o2350o3050Q625Q2630K5087j21565r0010
37482c71541K08937M21034J76228l52397o38103m66234r5272J72819K43968J09198
37472e91363j57188k89391r8731J44030M259m04533m76061r367M39425L63192
37462a075728K0696k5522K46133L79064J66659j16361j79652p5329l7847j73494
37452h71381l64661l93846j73695J16555K19872J48202J62479L43880M20268J71082
$$ y = [11597, -291937, -291995, 55263, 333014, 249013, -10886, -161971, -249456, -426199, -547872, -374057, -58208, -22320, -328885, -559528, -419532, -124414, -15115, -73185, -53215, 96402, 200973, 154297, 24493, -112330, -281768, -536839, -857546, -1130136, -1201776, -1001318, -635224, -312792, -158963, -150908, -213258, -276308, -267683, -185053, -159966, -281531, -371541, -162604, 258430, 434658, 82261, -555842, -1022076, -1117348, -944529, -700561, -591363, -748551, -1037942, -1136673, -992643, -988384, -1392917, -1868978, -1878345, -1438920, -1075728, -1055032, -1080554, -834421, -455357, -288698, -405059, -584711, -660040, -697887, -871381, -1236042, -1629888, -1803583, -1687028, -1467156, -1318954, -1156475, -812595, -392327, -221245]
37442b21245k06045l35185j20232K14513M07078L31440M5652j83634q1884K52014
37432A02472L71607O8164l12419l72001k19892k09616l38836l07907m8305K04047
37422a062686K98798K70476J06636k04033m22285k58207J48274L25624J11805
37413f85598j61842j99813q2917L0611J61362K87758K24933l5893j69138K7394
37403f03143K60656J31837k75908n09235l51764m0786R5631k04j22537k9327L21358
37392a123422O69705O56707K28329k50021l90224j92223N2840J35622M4462j60521
37382c28746l67406l78308r0958K94065M52427L33595J89743J87506J97874N0353
37372E40145j86895l15765k84362k12605j90702j73673p7288R8036K55747K82343
$$ y = [-221245, -427290, -762475, -882707, -668194, -261116, 70324, 115976, -67658, -149542, 102472, 474079, 542243, 229824, -142177, -362069, -571685, -910521, -1218428, -1266733, -1062686, -763888, -493412, -386776, -590809, -1013094, -1271301, -1123027, -797403, -685598, -847440, -1047253, -1130170, -1099559, -938197, -650439, -425506, -461399, -630537, -603143, -342487, -210650, -486558, -995793, -1347557, -1388343, -1292712, -1292916, -1415453, -1444780, -1123422, -453717, 202990, 431319, 181298, -208926, -401149, -348309, -212687, -168225, -328746, -696152, -1074460, -1165418, -871353, -418926, -85331, 104412, 291918, 489792, 540145, 353250, 37485, -246877, -459482, -650184, -823857, -901145, -803109, -547362, -265019]
37362b65019J41713q0277k32191k28579j26613m8810l2500L384J16061K06541
37352e46290J12263j49898l25287j95711J33140L33505K43666L2289o0702j4868
37342d37893L9159P6002J97365M03555M99341L15625m4402k83807k47452j09347
37332D08146j64250m49980o64234n15179r6915J91810J04761j83570l08384j15396
37322a793191K43818N35521O45533N82820M00231J52646j12333l40924m41593
37313a27472l20801k1620K22615K00451j1109j31597o2520j9557j77231l58559
37303h07400k86543k6325J11669Q3871J84279M98107O36493K81035k71151m62943
37293e8908k16743P6503K11622L41363M67739K80903k77995p30665o61497k78465
$$ y = [-265019, -123306, -203583, -435774, -664353, -790966, -839776, -872276, -868892, -752831, -546290, -434027, -583925, -909212, -1104923, -971783, -638278, -394612, -362323, -423025, -437893, -398734, -322732, -125367, 278188, 777529, 1093154, 1048752, 764945, 517493, 408146, 243896, -206084, -870318, -1385497, -1482412, -1290602, -1185841, -1369411, -1677795, -1793191, -1549373, -1013852, -368319, 214501, 614732, 767378, 655045, 314121, -127472, -448273, -469893, -247278, -46827, -57936, -189533, -252053, -271610, -448841, -807400, -1093943, -1120268, -1008599, -924728, -740449, -242342, 394151, 675186, 404035, -58908, -275651, -199148, 12474, 353837, 821576, 1102479, 824484, 93819, -567678, -846143]
37283h46143m0861k3252l6376j12356l81018o18176m43044O0038L98954L78470
37273a663764K83860K98323K25177m6325k45341j32300J43299L25844L77075L11405
37263a22747N2127l01862m04836j48104R9856M1137q9582L3695K53743K40013
37253c46560R1539J11489J84066m5181m61257n43885j61703K40980L29984K44966
37243c55562J65821K4803j64533j64678N7273J71207N939j61724j07531m8001
37233e76986j92088k81077j005M29968N44857L11734R3171N1064K3352p5386j37894
37222A89710j29407j16724n9220R6923J74428r828k26976q4947K97758L62493
37212D94210l3795l41539j36368K48158K58219p6088k98337k40853j37823j54079
$$ y = [-846143, -887004, -910256, -946632, -1058988, -1440006, -2058182, -2501226, -2441188, -2042234, -1663764, -1379904, -1081581, -856404, -902729, -1148070, -1280370, -1137071, -811227, -434152, -122747, -70620, -372482, -777318, -925422, -825566, -784429, -874011, -840316, -586573, -346560, -255021, -143532, 40534, -4647, -465904, -1009789, -1171492, -930512, -600528, -355562, -189741, -164938, -329471, -494149, -436876, -265669, -259730, -421454, -528985, -576986, -769074, -1050151, -1051156, -621188, -76331, 235403, 328574, 379638, 402990, 327604, 189710, 60303, -56421, -115641, -18718, 155710, 145882, -81094, -166041, 131717, 494210, 460415, 118876, -17492, 230666, 488885, 412797, 114460, -126393, -264216, -418295]
37202d18295k16290k64453l04905k29247P5196M24550M87808K81495J71225K83684
37192B90768K73975j19319n89766o29825k06421K28395L20369J37120o0990j14415
37182d70109O768K33774L56008J30964m00486q09427o75603q6733M10394M10508
37172h93942Q0263j08463K7475K32670K33760P9820m1032j14376k06920j95532
37162i06277J00659N21677O26283K75091j21717j47926M4911q647l85105o57268
37152f58319m97569j01064J18357N1849o0241j5389R7343N9662j53660l03910
37142a462941j66985J70110L83608K87833K9822j20407m7825J89248M52488N35450
37132B50401K74204j85852m21419k48080j0815p5209k44869j02203K35772K61769
$$ y = [-418295, -634585, -899038, -1203943, -1433190, -1357994, -933444, -445636, -164141, 7084, 290768, 564743, 445424, -144342, -774167, -980588, -752193, -431824, -294704, -355694, -470109, -463341, -229567, 126441, 257405, -143081, -952508, -1628111, -1714844, -1304450, -893942, -813679, -922142, -894667, -661997, -428237, -348417, -389449, -503825, -710745, -906277, -805618, -283941, 342342, 617433, 495716, 347790, 392701, 384054, -1051, -658319, -1155888, -1256952, -1138595, -1086746, -1146987, -1162376, -1065033, -1005371, -1159031, -1462941, -1629926, -1459816, -1076208, -788375, -758553, -878960, -926785, -737537, -285049, 250401, 524605, 338753, -82666, -330746, -341561, -416770, -661639, -763842, -528070, -266301]
37122b66301m7298j42213J56293K85167j35386n92385m22840J77686M98798L58595
37112a29884J53115N9954j09822l10242k01178K01785M18121K19202o7528j58720
37102G4803k03962l26148k69715J44072O01999P03259M82623K32758J21964K75301
37092A836954Q37654J543185J601022N77986q21719j443401j055358m81699l95759
37083B198865n74087m86766j09826J43211M051l80759o14882l96923J38154M31609
37073C52647J03558m79267n75007l3556N01431M70076O5138j93112j71962r4756
37063e4810p2172l4352J4928L809j8895L6985Q5382m4375l20887n05116m35845
37052a345348j95300J0576P2389R2771K62925N40199N47854M0690n96702p02649
$$ y = [-266301, -313599, -455812, -299519, -14352, -149738, -742123, -1164963, -987277, -488479, -129884, 23231, 83185, -26637, -336879, -538057, -336272, 81849, 301051, 233523, 74803, -129159, -455307, -725022, -580950, 21049, 724308, 1206931, 1439689, 1561653, 1836954, 2674608, 4217793, 5818815, 6396801, 5575082, 4131681, 3076323, 2594624, 2198865, 1624778, 1138012, 1028186, 1171397, 1175448, 794689, 179807, -217116, -78962, 352647, 456205, -23062, -598069, -631625, -130194, 339882, 405020, 211908, 39946, -54810, -126982, -161334, -146406, -142597, -161492, -124507, -39125, -83500, -404387, -909503, -1345348, -1540648, -1530072, -1457683, -1364912, -1101987, -561788, -13934, 26756, -569946, -1272595]
37042a272595k28200J88586J79562J26069L67854N23266J59780l36171k95362
37033e87211J30539K16108j29747k72200L715J47258j32534l40443r6694J79341
37023h81868K5148k37787o3257L88890N37458K79312k2513k09882l72081l95528
37013i52108r9212K67402K66197r506l4219K96278M77242J77778k98420n06222
37003d14790l79555q6494K38370M32221L32205N0037r3029l7297m7186j90899
36993a96417j87270L7327J05774j89540m60305l21299l6080o6654k69474j25471
36983a709409L70709O56949M52667J06243l0330p2647k17074l02983j03642K11791
36973f37726K72391M0551j65136j41426j2449N5278R4406J82817K35800J22487
$$ y = [-1272595, -1500795, -1312209, -1132647, -1006578, -638724, -115458, 44322, -291849, -587211, -456672, -240564, -370311, -642511, -638796, -491538, -624072, -964515, -1061209, -881868, -856720, -1094507, -1157764, -768874, -231416, 47896, 25383, -184499, -556580, -952108, -1051320, -783918, -517721, -527227, -561446, -265168, 212074, 389852, 91432, -414790, -794345, -880839, -642469, -210248, 121957, 171994, 78965, 41668, -5518, -196417, -383687, -346360, -240586, -430126, -890431, -1211730, -1247810, -1314464, -1583938, -1709409, -1338700, -681751, -229084, -122841, -153171, -225818, -442892, -745875, -849517, -637726, -365335, -324784, -489920, -631346, -643795, -588517, -494111, -311294, -75494, 46993]
36963D6993j00657k41085k23849j38627m2548J00106K36437J87743p8705l18627
36953e72819l29084k37376k44908k42844j2928K82560K30856j74595m37090k67590
36943b005818J2489K5991p2858P6414L98880M86848K09724j61537l71487l79593
36933a780947j92094J59712M70620N08991L46085K55385K61478J01756k88119
36924a57133n66193m26333j9215K51137K04351N242q7882K7100K35106L20033
36914b13787J86792l0585j57584k20376l39549m29287k50988J79912M83888L56471
36904d35093m2239k84186j62204J36286K82401J46476q8212j35206M1277J52420
36894c88280k4247k81101k29851J30090L74342K25959j09901k79115j95505m019
$$ y = [46993, -53664, -294749, -518598, -657225, -699773, -599667, -363230, -175487, -254192, -572819, -901903, -1139279, -1384187, -1627031, -1639959, -1357399, -1126543, -1301138, -1738228, -2005818, -1993329, -1967338, -2040196, -1963782, -1564902, -1078054, -868330, -1029867, -1401354, -1780947, -1973041, -1813329, -1342709, -833718, -487633, -232248, 29230, 130986, -157133, -723326, -1149659, -1168874, -917737, -713386, -708144, -796026, -768926, -533820, -213787, -26995, -57580, -215164, -435540, -775089, -1204376, -1455364, -1275452, -791564, -435093, -477332, -761518, -923722, -787436, -505035, -358559, -446771, -581977, -540700, -388280, -412527, -693628, -923479, -793389, -419047, -193088, -302989, -582104, -777609, -781628]
36884g81628J38603J09703j29584l83291l37545J7585L08649K83573J40457J47913
36874d85565K18794J51491L9019O9234J10730q2528l64850l34809M5661L77434
36864b55389L95692K37335R6816l585l0048Q6027J79800l9378m60662n70233k00448
36853e64073J43909K7324k52506j76782J53303K32114j099j32051k8240j0645
36843f08746j88594k14549P5037K94878J20743j55141q5482K24413L19153J09345
36833a08943p3701n9539m2319j79904l50129l87034k88199j16864P6651J91269
36823a338712J49240O4679J21092K62659K47484L7648j22822p5937N8904J27479
36813d68286J20962N4070n7914m0014K89286P00215O70287J13373l91680l69641
$$ y = [-781628, -643025, -533322, -662906, -1046197, -1383742, -1366157, -1057508, -773935, -633478, -485565, -266771, -115280, -76261, -7027, 103703, 21175, -343675, -678484, -632823, -255389, 140303, 377638, 474454, 470869, 440821, 526848, 706648, 667270, 206608, -363625, -564073, -420164, -392840, -645346, -822128, -668825, -436711, -437810, -569861, -598101, -608746, -797340, -1011889, -936852, -641974, -521231, -676372, -761854, -537441, -218288, -108943, -182644, -242183, -284502, -464406, -814535, -1201569, -1489768, -1606632, -1529981, -1338712, -1189472, -1124793, -1003701, -741042, -493558, -455910, -578732, -654669, -595765, -468286, -347324, -293254, -351168, -391182, -101896, 598319, 1268606, 1381979, 990299, 620658]
36803F20658q0177l8135k40738l10063j60389m5814p9973j52678k36609l65973
36793a089891l88239j45941J56407J74799l6187j16262K4793J59304K18221L28264
36783g14732L87265J41599k54794l19225p826J63748l3506j62297J01063L72227
36773c26478J99106j59618j45730K02804L31195J5783l64183m02894j46142O3342
36763g32815o178k60822l81431j87539Q9607Q4673j44788j65851J39617L50443
36753a215084J81969n5202p353J26229k617k32954j74475Q2375R6611j88217l61668
36742a750386j82198J44384L25872K58079k8815l55724m00314p2198K25937J08626
36732a726737j56938j7182M60108O32421K70733j01176k5328K76221L71399K49311
$$ y = [620658, 540481, 502346, 261608, -48455, -208844, -254658, -334631, -487309, -723918, -1089891, -1478130, -1624071, -1467664, -1292865, -1329052, -1445314, -1420521, -1261217, -1042996, -714732, -327467, -185868, -440662, -759887, -767713, -603965, -637471, -799768, -698705, -326478, -127372, -286990, -432720, -229916, 101279, 117062, -247121, -650015, -796157, -732815, -738993, -999815, -1381246, -1568785, -1479178, -1394505, -1539293, -1705144, -1565527, -1215084, -1033115, -1088317, -1095670, -969441, -972058, -1205012, -1379487, -1297112, -1200501, -1388718, -1750386, -1932584, -1788200, -1462328, -1204249, -1233064, -1588788, -1989102, -2061300, -1835363, -1726737, -1883675, -1900857, -1440749, -808328, -537595, -638771, -664099, -387878, -16479, 232832]
36722B32832J56057J35490O3224q0500k35693l92185n01565m30672j69760P2738
36712a150034J20845K7609o6871r6054j9050J70476L11275J93442r2511j86277
36702g87150L0815K20365O8620k45837k96976K0604L81632M23127J11015k44757
36692c18542k86815K0988L38437L58123J76884P0544L1455j36766l38593k43528
36682c27813J23021L03377Q1005j96651j86612l0726J1715J7603J24988J46096
36672F6003j08368l67098k31845J74086L57710J90734L1526Q8339J04704j64931
36662A40860n08945n28725j72932K17213L28423J81157K0245R738Q7465Q5277
36652a40224p2390l04164m40657l27780L4101L75611L26628j32525n20176l94256
$$ y = [232832, 388889, 524379, 587603, 507103, 271410, -120775, -622340, -1053012, -1222772, -1150034, -1029189, -1001580, -1068451, -1164505, -1183555, -1013079, -701804, -508362, -600873, -787150, -756335, -535970, -467350, -713187, -1010163, -989559, -607927, -184800, -73785, -318542, -605357, -584369, -245932, 112191, 289075, 359619, 391074, 254308, -84285, -327813, -204792, 98585, 179590, -17061, -203673, -234399, -222684, -205081, -80093, 66003, -42365, -409463, -641308, -467222, -109512, 81222, 112748, 201087, 305791, 140860, -368085, -896810, -1069742, -852529, -524106, -342949, -322704, -312966, -225501, -140224, -212614, -516778, -957435, -1285215, -1251114, -875503, -548875, -681400, -1201576, -1595832]
36642a595832O2407L01450J72197L4736J15764K09078J39093P3609J48688J77656
36632a61154J8109j12018P52J79445J62279L0656m825K248q3281j28056M2109
36621e3736K49545K15473O0829J22970L62674L97945J08631k09640l18814k82249
36611F53628j90900j8871J57501J35940q4837k31580j42997L532k1761j89752
36601F9903l12267k91276j61096j1729N2709n577p3424j931J69965K45441J49347
36590a69935K7621K2306R1088J16692P4708J1598n9270j54394k46823k60747j57698
36579g04854j5042K7038o0165j30303o9366Q316m6841r4519J33419N21272N80535
36568A49490J25294m06265n39181l52826j89030p3013J80693M98744O12471M74691
$$ y = [-1595832, -1533425, -1231975, -1059778, -1025042, -909278, -700200, -561107, -487498, -338810, -161154, -143045, -255063, -254311, -74866, 87413, 118069, 113244, 115492, 32211, -95845, -53736, 195809, 411282, 472111, 595081, 957755, 1355700, 1464331, 1254691, 935877, 653628, 462728, 443857, 601358, 737298, 652461, 420881, 277884, 281416, 259655, 69903, -242364, -533640, -694736, -706465, -653756, -659333, -732757, -734688, -564723, -319282, -169935, -142314, -120008, -28920, 87772, 162480, 174078, 114808, -39586, -286409, -547156, -704854, -719896, -692858, -753023, -883326, -952692, -944376, -991217, -1085736, -952317, -431045, 149490, 274784, -131481, -670662, -1023488, -1212518, -1285531, -1104838, -606094, 6377, 481068]
36558D81068K41159m0810l49371m42563j49833J87388P1848l72047n06805j33615
36548a013581K05937N7821l18183m31574k49024m8355R4001K75161M21102L55022
36538f51673J36335J6558O8513J10618K3771o6086J069J64237K13234P7933o2243
36527C2266j0933J72173K55450J77905J20971J69895J28871j40366l94283l11977
36517A99972j1296P8164j55735l49229k17561M3676R3142m8571p5895J10861K45484
36506h6988Q7222j95932k07892J35061M52194M08979J86233J74458L29201K26954
36496A509490k28546n97607n39312k36388J0650J85261K93621J60975j51355j75756
36486B31033K61158N93057L08609k08964k82769l5184j12582n43135p11873m11202
$$ y = [481068, 722227, 681417, 332046, -110517, -260350, -72962, -1114, -373161, -879966, -1013581, -807644, -749823, -1068006, -1499580, -1748604, -1796959, -1702958, -1427797, -1006695, -651673, -515338, -498780, -430267, -319649, -295878, -361964, -360895, -196658, 16576, 94509, 32266, 21333, 193506, 448956, 626861, 747832, 917727, 1046598, 906232, 511949, 199972, 188676, 266840, 111105, -238124, -455685, -412009, -318867, -367438, -443333, -332472, -86988, 234, -195698, -403590, -268529, 183665, 592644, 778877, 953335, 1282536, 1509490, 1280944, 683337, 144025, -92363, -81713, 103548, 397169, 558144, 406789, 231033, 492191, 1085248, 1393857, 1184893, 902124, 866940, 754358, 211223, -500650, -911852]
36476i11852q6787J0999J19459K84898J83437j59328k19681J51995M02823J77363
36466d6674j01963K2781L05256K83983K8347j13230j25925j85521k00613J3011
36456a20548K97181L21544P5283j40515j23541O2284K32589K34049O1391r6296
36446H03421p6425l256q3812j98176o9017J81188J19977k83888n48271m09564
36436e67823j56818o4280j3604R8406R5864o4504j04055Q0914J98187Q9232n105
36425d13586M4131K547j99236k49157p3138p8846m20795o23896l48175P2405K86705
36414b001041M82449P90776Q08711L30272p5572R0444M07124K58898j31875j97792
36404G62394n6475j76305m18046l16198n075L7977p9787R5251L98152K54040k56649
$$ y = [-911852, -998639, -987640, -868181, -583283, -399846, -559174, -778855, -626860, -224037, -46674, -148637, -125856, 179400, 463383, 491730, 378500, 252575, 67054, -133559, -120548, 176633, 498177, 573460, 432945, 309404, 371688, 604277, 838326, 899717, 803421, 726996, 723740, 639928, 441752, 372735, 553923, 673900, 390012, -158259, -567823, -724641, -788921, -802525, -704119, -608255, -672759, -776814, -695900, -497713, -408481, -413586, -369455, -366908, -566144, -815301, -888439, -967285, -1388080, -2011976, -2360151, -2287746, -2001041, -1518592, -727816, 80895, 411167, 335595, 426039, 833163, 1092061, 960186, 762394, 705919, 529614, 111568, -204630, -209705, -171728, -251515, -156264, 241888, 495928, 239279]
36393B39279m61581j96635M1602O3303K22278N65743N81482L5075o10203q40309
36383c59966o22377j68207L02511M81418J94316k06734j71438K78588N83417M38321
36373G49849N2427l36444o45795o80609k79915K43832L71625J08237p7369q043
36363e02205P0584P4841J83703L47918L04091J10441R3103K41504K26113J5457
36353A165550j02371r4186j84635l20264k48466q7812j67981l41503j47638L47677
36343a81629N84088L99183J94276J89135K04315J95947L02678L61830R9634k20196
36333B129261r4061L17918L92611R7519l2041O6958p3514m42174m76972j04468
36323A781037J32698R2548J68459L10392J3075n47881n25547J75326O23477L41055
$$ y = [239279, -222302, -418937, -377335, -314032, -91754, 473989, 1055471, 1090546, 480343, -359966, -982343, -1150550, -848039, -366621, -172305, -379039, -550477, -271889, 311528, 749849, 802276, 465832, -179963, -860572, -1140487, -896655, -525030, -416793, -494162, -502205, -431621, -356780, -173077, 174841, 478932, 589373, 682476, 923980, 1150093, 1165550, 1063179, 968993, 784358, 464094, 215628, 127816, -40165, -381668, -529306, -181629, 402459, 801642, 995918, 1185053, 1389368, 1585315, 1887993, 2249823, 2349457, 2129261, 2035200, 2353118, 2745729, 2843248, 2811207, 2878165, 2804651, 2362477, 1885505, 1781037, 1913735, 2006283, 2174742, 2485134, 2498209, 1950328, 1424781, 1600107, 2223584, 2564639]
36313B564639o3259r2085m5001j09155P2458M63657M18038r9954k14944M14920
36303C309314R84968R05526O30451N88774M73451J70420K00004O38857Q01588
36294H703353N49219O36136J221008J444778J063370R52087J346853J291516O01051
36285A7809371N22980J497187K194370J900419J839757K817319L596391L094658
36277C5272452K156709J672490J154859O90728J715956M152181N786516O418321
36269E9020212Q907229J3809590J8119111K3066001L5970314N5893748O3237237
36262B78023442L7282239j4817206n8849621o8475030n0397150k9641060j9593834
36255G3531780j5734844j1654912q222752p246676o512507m275177k417474k403596
$$ y = [2564639, 2501380, 2409295, 2364294, 2255139, 2327597, 2791254, 3209292, 3109338, 2894394, 3309314, 4294282, 5199808, 5830259, 6419033, 6892484, 7062904, 7262908, 7901765, 8703353, 9252572, 9888708, 11109716, 12554494, 13617864, 14569951, 15916804, 17208320, 17809371, 18332351, 19829538, 22023908, 23924327, 25764084, 28581403, 32177794, 35272452, 37429161, 39101651, 40256510, 40947238, 42663194, 46815375, 52601891, 59020212, 67927441, 81737031, 99856142, 122922143, 158892457, 214786205, 278023442, 315305681, 300488475, 241638854, 173163824, 122766674, 93125614, 73531780, 57796936, 46142024, 37919272, 30672596, 24160089, 19884912, 17467438, 15063842]
36247A5063842k551575j477938n53591r90863j597333j207347o90490r13812j039651
36238D041242l72263J70177j50463m90519j49629L8173o24567j214801p49997
36229D97353J13389K71349q7012j78160n5246j49387k38246J9438K43290Q047
36219D44815k99906j79152P6731k1068k80228l25260l36692n19966m68923J15018
36209a794631O33148L83543k94497m99495n2748M55157O17754N02919K20619j39183
36199C2586k99933r6868J60491R2272j71167k44879j00617J9756P9966J89364
36189c39029K62173J69247N8958J25418K27178J20513j02373j89806j70214k22268
36179f0203k64122q8432J93130K45027J4779j97542j70588J5104J76389K19833
$$ y = [15063842, 12512267, 11034329, 10480738, 9489875, 7892542, 6685195, 5994705, 5080893, 4041242, 3668979, 3839156, 3688693, 3198174, 3048545, 3086718, 2462151, 1247350, 497353, 610742, 882091, 795079, 616919, 561673, 412286, 174040, 193478, 436768, 444815, 144909, -34243, 42488, 21420, -258808, -584068, -920760, -1440726, -1909649, -1794631, -1161483, -777940, -1072437, -1571932, -1624680, -1169523, -551769, -48850, 171769, 32586, -267347, -364215, -203724, -111452, -282619, -527498, -628115, -608359, -528393, -339029, -76856, 92391, 151349, 276767, 503945, 624458, 522085, 332279, 162065, -60203, -324325, -412757, -219627, 25400, 40179, -157363, -327951, -312847, -136458, 83375]
36169H3375J46231L7072K289K7535k2607j47408j39149Q0054K65815K05012M9046
36158E87265L2977N9600j06847l63552l60217n0801J89284P7391k09042l10231
36148d54173j51065K8918L4892n1070l1233J16900K30382K24581J98634K00095
36138C46861P8373k33847m59620k94099J03771K72534Q2480j46544j85696j55421
36128e91208j36804M7156M23494O12443L14607j98528m26149k91857j16547p1366
36118d34759k7186Q7713J35681M3526m9554l5755k3487j27147k11776l9758L58476
36107c24026O40858N50061K24887j5483j08403k57263n16689o47828n05811k98569
36097a258266k32085j35184K31774O51825O41920J48734l27228l73478j11579
$$ y = [83375, 229606, 266678, 268967, 296502, 273895, 126487, -12662, 67392, 333207, 538219, 587265, 620242, 679842, 572995, 209443, -150774, -201575, -12291, 65100, -143942, -454173, -605238, -576320, -541428, -592498, -623731, -506831, -276449, -51868, 146766, 346861, 425234, 191387, -268233, -562332, -458561, -186027, -103547, -250091, -435787, -591208, -728012, -680856, -257362, 355081, 669688, 471160, 45011, -246846, -363393, -434759, -461945, -374232, -238551, -195025, -244579, -280334, -303821, -430968, -642744, -682502, -324026, 316832, 866893, 1091780, 1076297, 967894, 710631, 193942, -453886, -959697, -1258266, -1490351, -1625535, -1393761, -741936, -100016, 48718, -278510, -651988, -763567]
36088g63567J00579J27136O5214J1327j2637k378N2653J60590K78564K54103k8394
36077B43190l45103k40598L16926O78734L11909l98339o62907m10712k44030l59253
36067a110183k93921J24720L75003J19634k10109j63351J976j19750l09995j48294
36057a734270J80478J80972r5050j62980M9104J31570l8211q9303J58768L58180
36047a060742K15095k1408L5062K94463L23500j6717l64815l32000J4024K70377
36037f43161K23410O1715K0917L4610o4222j70785o3488J40467O9075l22425o24213
36026a338100n32808k01003Q5792K34482K21696K8035j44289J0030L69511M06887
36016h59767j9636l64146j96646J76332K95853K65058L64369M02629Q7184k97070
$$ y = [-763567, -662988, -535852, -470638, -459311, -471948, -474326, -421673, -261083, 17481, 271584, 243190, -101913, -342511, -25585, 653149, 965058, 566719, -96188, -506900, -750930, -1110183, -1404104, -1279384, -904381, -784747, -994856, -1158207, -1156231, -1275981, -1585976, -1734270, -1553792, -1372820, -1467870, -1630850, -1581746, -1450176, -1488387, -1577690, -1418922, -1060742, -845647, -867055, -831993, -537530, -214030, -230747, -595562, -927562, -913538, -643161, -419751, -358036, -337119, -302509, -366731, -537516, -601004, -460537, -391462, -713887, -1338100, -1870908, -2071911, -1986119, -1751637, -1529941, -1501906, -1646195, -1636165, -1266654, -859767, -879403, -1243549, -1440195, -1263863, -968010, -702952, -338583, 64046, 151230, -145840]
36006a45840k60882P2255K00665J06506J68767L42806J98739k26303l84586j34479
35996f2352K9376j48285k77641p7114J15271l0915k43899j30907J59113K08566
35986d58787k2265k29283k39365j12745O0997J89000J46740n2131k06932k12493
35976a137264j90724j98440q1281J76614K57360l9207l89843l34945Q7315M24238
35966a426177M18551K15520K0940j30546k42692k51061j34785R347O7516J5368
35956a438019q3820j43817j42892j60534k53150k93317q0063L41128O39731N89578
35946a025175L51880K38535L10631L56749J96881j17712l71845l84938j84413
35937f29407J741n85q9620n2945R0519J32042M3207J7371R0166M6022j66220k63519
$$ y = [-145840, -406722, -334467, -133802, -27296, 141471, 484277, 683016, 456713, 72127, -62352, -32976, -181261, -458902, -536016, -420745, -451660, -695559, -826466, -667353, -458787, -481052, -710335, -949700, -1062445, -1001448, -812448, -665708, -717839, -924771, -1137264, -1327988, -1526428, -1607709, -1431095, -1173735, -1212942, -1602785, -1937730, -1850415, -1426177, -1007626, -792106, -771166, -901712, -1144404, -1395465, -1530250, -1520903, -1453387, -1438019, -1521839, -1665656, -1808548, -1969082, -2222232, -2515549, -2595612, -2254484, -1614753, -1025175, -673295, -434760, -124129, 232620, 429501, 311789, -60056, -444994, -629407, -627666, -628251, -717871, -770816, -680297, -548255, -505048, -487677, -397511, -351489, -517709, -781228]
35925g81228q7460Q9110J879j47563l6861K02950J85857q6624k27291p6222J12898
35914h50555J41634J24926J68470J42563l9834j91398j07616J20386K29065R8396
35904a63963j79118m23696m60137k17648J49930L58832L05739J62947Q6102J09
35894c80903j87599l38066k61019l2411J07334J15252J50404K17464Q9480k98138
35884h18202o11059m89511m7155K32329R5313j78048j49865K22544N43831M64733
35874g35090Q4766j92211j42003N4378R9638j5156l0003J80107L94003L38468
35864C6897P8400n4586R8432L21455L13539N4231k17875l16742k79460k35271
35854b00980k15102j54518l8363N0074N3264L5570O8851P6465n5910k16132j33097
$$ y = [-781228, -868688, -779578, -777699, -925262, -962123, -759173, -573316, -659940, -887231, -963453, -850555, -708921, -583995, -415525, -272962, -312796, -504194, -611810, -491424, -262359, -163963, -343081, -766777, -1226914, -1444562, -1294632, -935800, -630061, -467114, -381012, -380903, -568502, -906568, -1167587, -1199998, -1092664, -977412, -827008, -609544, -520064, -818202, -1429261, -1918772, -1965927, -1733598, -1638285, -1816333, -1966198, -1743654, -1199823, -735090, -650324, -842535, -984538, -930160, -830522, -845678, -875681, -695574, -301571, 36897, 115297, 60711, 159143, 480598, 794137, 848368, 630493, 313751, 34291, -200980, -416082, -570600, -608963, -558889, -505625, -470055, -401204, -324739, -380649, -596781, -729878]
35843g29878J84252L12208m1890n36072n76702j25889K70234K83289J93681L16992
35833d49775M69393L34547M8375m337J84935K48328K4506k36946k95748k28192
35823I5086k17737k81211l22027k91095j93145m2038J22802K46266L00317K58862
35813c23920P8577j92422l49296k22501Q8954L06038K68542M2035k09790l32318
35803h46101k33540J9758K16564K39341K01942K33610K73416K39103K07995K02336
35793G54424J1171m52488q12138o53077j55360J45416J36383J61679L17498K95964
35783b50528K5219j16599O2641K41720J58077J8213K6336k2293k88470m58684
35773f04368k35724Q1821K2699k95139l45690L009L55739L94017J85147p7392
$$ y = [-729878, -545626, -233418, -275308, -811380, -1388082, -1513971, -1243737, -960448, -766767, -449775, 19618, 354165, 402540, 398203, 583138, 831466, 855972, 619026, 323278, 95086, -122651, -403862, -725889, -1016984, -1210129, -1252167, -1129365, -883099, -582782, -323920, -245343, -437765, -787061, -1009562, -920608, -614570, -346028, -303993, -513783, -846101, -1079641, -1059883, -843319, -603978, -402036, -168426, 104990, 344093, 552088, 754424, 765595, 313107, -499031, -1152108, -1307468, -1162052, -1025669, -863990, -546492, -250528, -225309, -341908, -279267, -37547, 120530, 138743, 165079, 142786, -145684, -604368, -840092, -758271, -735572, -1030711, -1376401, -1373392, -1017653, -623636, -438489, -515881]
35763e15881k60604k43525k9985J15690l2029k73925k37000M2804J66518j3793
35753a281730k21710k33657j38643l9135J21664K92937K39532o1108k48805n4785
35743a625440K86130L59355J41114k1926Q4615L04956L64146J75109j22151l08262
35733c62354k58953n8508N6143o3887k86907l11127M020M49029O42828M04895
35723B15179p0088m18136m51666k64949n2068O8990O0190n7811j64499j00645
35713a235503J33156L32170L34724K20705J61572J72099J44734N1172m4788j30586
35703A39455k46773l57044l53950k10889k7803Q9201J15631P2064j8731j05632
35693i04471q8527J13660M33545O17888M37481N290k50218q8676J91642J46333
$$ y = [-515881, -776485, -1020010, -1049995, -934305, -966334, -1240259, -1477259, -1434455, -1267937, -1281730, -1503440, -1737097, -1875740, -1914875, -1793211, -1500274, -1260742, -1321850, -1570655, -1625440, -1339310, -979955, -838841, -860767, -776152, -471196, -107050, 68059, -54092, -362354, -621307, -679815, -623672, -687559, -974466, -1285593, -1281573, -832544, -189716, 215179, 145091, -273045, -724711, -989660, -1041728, -972738, -912548, -970359, -1134858, -1235503, -1102347, -770177, -435453, -214748, -53176, 118923, 263657, 314829, 270041, 139455, -107318, -464362, -818312, -1029201, -1057004, -967803, -852172, -780108, -798839, -904471, -992998, -879338, -445793, 172095, 609576, 614866, 364648, 275972, 467614, 613947]
35683F13947j81237l56386k32210j03068j29303r7493O4319L5180l12750n34670
35673a233671k55614J86005K42809l098p7764M2699j9039k49551j88220K57262
35663a298182N50704K88389k48133n19995l53091L9704L40631L01170n7537l22852
35653a279192r5130M11902N49771J12916l76757m20768j52821M0725J11603K34606
35643h63145L87012L72918J10418l08853o75860o77842j51753N30864O89424J68031
35633d18786m07782m61934j68314J1299P3921K66759M47882K58841j94477m08507
35623a001098k19161L2023J00829J24033K03934J72659l7521j67774j5802K35722
35613e72156L03793J91432O6473m7372k06996l13919k07696N3294K31850K30544
$$ y = [613947, 432710, 76324, -155886, -258954, -388257, -485750, -421431, -386251, -699001, -1233671, -1489285, -1303280, -1060471, -1063569, -1141333, -1098634, -1117673, -1367224, -1555444, -1298182, -747478, -459089, -707222, -1227217, -1580308, -1540604, -1199973, -898803, -956340, -1279192, -1374322, -962420, -412649, -299733, -676490, -1097258, -1250079, -1209354, -1097751, -863145, -476133, -103215, 7203, -301650, -977510, -1655352, -1807105, -1276241, -586817, -418786, -826568, -1288502, -1456816, -1445517, -1371596, -1104837, -656955, -398114, -592591, -1001098, -1220259, -1188236, -1087407, -963374, -759440, -586781, -624302, -792076, -807878, -572156, -268363, -76931, -10458, -57830, -264826, -578745, -786441, -733147, -501297, -270753]
35603b70753J73621J43963L9812j95122l54405j83531K18224M16771J48601l39534
35593b02353n90264m69374k22886o7941L1909J49691K00655J15643M6719J98900
35583h09301N03571O25264L29494k27140o10458n18264q5101K57991K62077J13140
35573a58727J12604K34812K22756M4637n9490j1495l3762k29958l59283k41656
35563d79562r0079j51307k63637j30236J40364J79156k7496r8801J12366K62370
35553e46862O4333k41990k48661K087R5980j12380k70162m4489L77882N27975
35543c96287K70611p7211k28229k37754k37102j50466Q0704K21073L6157k59008
35533i77512k32916J12513L24895J73815o8924j28193q5486n2971R7658L92132
$$ y = [-270753, -97132, 46831, 86643, -108479, -462884, -646415, -428191, -11420, 137181, -202353, -792617, -1261991, -1484877, -1552818, -1520909, -1371218, -1170563, -1054920, -1008201, -809301, -305730, 319534, 649028, 421888, -188570, -706834, -791935, -533944, -271867, -158727, -46123, 188689, 411445, 456082, 396592, 385097, 351335, 121377, -237906, -479562, -569641, -720948, -984585, -1114821, -974457, -795301, -822797, -921598, -809232, -546862, -482529, -724519, -973180, -971093, -875113, -987493, -1257655, -1302144, -924262, -396287, -125676, -202887, -431116, -668870, -905972, -1056438, -975734, -754661, -718504, -977512, -1210428, -1097915, -773020, -599205, -668129, -796322, -881808, -934779, -837121, -444989]
35523d44989M97115J69292l00231m55014k81366r4320o850R8162J97856J31148
35513d89197p6235k19941k11802r3982J42332M49150N54046K64920j44164k42695
35503f7568p8369p2389k99616l60141o3281K34791J84254n8506j41557j9750J24811
35492f17321K17937K63707J62049j45978m41826m07517l5801L26056L65685J19758
35482a93251j21103j39548R929J00643r10j98968k93988j82047Q6972L52313M02395
35471a77563J32556k62182m02073j66121J30675J60399q91r4423j12742j98127
35461i90492k66006j17667J46108K28592J38211J71067L55245L47041Q844l13080
35451b92137k87130l7514J30349J53300J25233M3449r8995j57141k5756J39333
$$ y = [-444989, 52126, 221418, -78813, -533827, -815193, -909513, -916363, -818201, -620345, -489197, -565432, -785373, -997175, -1091157, -948825, -499675, 54371, 319291, 175127, -67568, -145937, -218326, -517942, -878083, -941364, -706573, -522319, -580825, -722382, -742132, -617321, -399384, -135677, 26372, -119606, -561432, -968949, -1004750, -678694, -313009, -193251, -314354, -453902, -443973, -343330, -344240, -543208, -837196, -1019243, -932271, -579958, -177563, -45007, -307189, -709262, -875383, -744708, -584309, -585200, -679623, -792365, -990492, -1256498, -1374165, -1228057, -999465, -861254, -690187, -334942, 12099, 20943, -292137, -579267, -616781, -486432, -333132, -207899, -164450, -263445, -420586, -446342, -307009]
35441c07009J10339r1646k40811j99202k8967J19478J28400j0794j71749k11714
35431i03675j40693p9557o0840r187R5542J98597K86787L40828K32981p7088l03167
35420d19472j16439L34822N41651L06652o2064k74170l62354l72192k04363M8497
35410e79432M4990k79190n20310l89103r1293J23325L42214N95479N58965J04912
35400h9443k72058j17609K37620J85051j90900l09484q5755r208k43267l43816
35390a238869l4606L21001K84601m9638k87475k76332j64957j07399r6885j4341
35380a664900K13945M48520M19601J17845p0278J29927M28633L89336J30600J25055
35370F68284L71413L38874j71715o61584o53314l13975p1041M764Q6336J57450
$$ y = [-307009, -196670, -288316, -529127, -728329, -757296, -637818, -509418, -520212, -691961, -903675, -1044368, -1123925, -1184765, -1193952, -1098410, -899813, -613026, -272198, -39217, -116305, -419472, -535911, -201089, 340562, 647214, 585150, 310980, -51374, -423566, -627929, -579432, -534442, -813632, -1333942, -1723045, -1814338, -1691013, -1348799, -753320, -194355, -89443, -361501, -479110, -241490, -56439, -247339, -556823, -642578, -651786, -895053, -1238869, -1273475, -952474, -667873, -717511, -1004986, -1281318, -1446275, -1553674, -1650559, -1664900, -1450955, -1002435, -582834, -464989, -535267, -405340, 23293, 412629, 543229, 668284, 1039697, 1378571, 1206856, 545272, -108042, -422017, -493058, -488294, -401958, -244508]
35360b44508Q2114n5958l6550J34178K19945J00710q4602j51305p2322N8020J61248
35349A10970K27752K63980K33097R2886j17398l14706m99841o93678p15175k85623
35339a697736M86890J013103Q95981M48910J89892P9184k45011o63382o50145
35330a42314j49945K60409K26283M5077L6114N2947p8938j69220q5164r7171l68471
35319d70393n15611j81050K89464L01872p1014k06355J20254M45054L22467j12795
35309g8107m08737l30174k7210J54687M313l02779l55431k6659L22069L28841
35299g19187J09446q13M3044P5073J08787K46625L33831J36882j97417k88505
35289a52234j00132N0262M2681N3267P3323j53723n65584o48587j45938M90275
$$ y = [-244508, -162394, -218352, -254902, -120724, 99221, 199931, 115329, -35976, -108298, -50278, 110970, 338722, 602702, 835799, 928685, 811287, 496581, -3260, -696938, -1412113, -1697736, -1210846, -197743, 698238, 1147148, 1337040, 1416224, 1171213, 507831, -142314, -292259, -31850, 194433, 239510, 275624, 328571, 249633, 80413, -4751, -101922, -470393, -986004, -1167054, -877590, -575718, -646732, -853087, -732833, -287779, 34688, -78107, -486844, -817018, -844228, -689541, -685228, -988007, -1343438, -1370097, -1048028, -719187, -609741, -610554, -567510, -492437, -383650, -137025, 196806, 333688, 136271, -152234, -252366, -202104, -159423, -106156, -32833, -186556, -752140, -1400727, -1546665, -1056390]
35279a056390O61402L33108j08351m20667n75435m83305o0637M83148P53204N96335
35269A22412K24724p8142k10642k32512k39642k61405k12162o835K25798K01946
35259d66460j18317l66693k14471J51746K74485P1263q1293O6336K84532K42144
35249a56728p645j39172k7240J11476K7739k68122n36545n28729j82377K92321
35239a415022N18362K78474k01849m11943j03092L98130N53517K41374j45160
35230b87209k25187m7968J06798J44142J65579J82519Q1536j17902k09542r4711
35220c01945M7305O125j73100k88253k67770j98178j18710K5807K06392K56582
35210h05745R7075r6313q9895P8372J20256j05757l53013k73138J16622M20154
$$ y = [-1056390, -394988, -61880, -170231, -590898, -1166333, -1649638, -1710275, -1227127, -473923, 122412, 347136, 268994, 58352, -174160, -413802, -675207, -887369, -894204, -668406, -466460, -584777, -951470, -1165941, -1014195, -739710, -668447, -749740, -683404, -398872, -156728, -164373, -303545, -330785, -219309, -191570, -459692, -996237, -1524966, -1707343, -1415022, -896660, -618186, -820035, -1231978, -1335070, -936940, -383423, -142049, -287209, -512396, -560364, -453566, -309424, -143845, 38674, 120210, 2308, -207234, -301945, -254640, -248515, -421615, -709868, -977638, -1175816, -1294526, -1268719, -1062327, -805745, -708670, -804983, -894878, -816506, -696250, -802007, -1155020, -1428158, -1311536, -891382]
35200h91382L40791J5422k15106k30399j74422j62527j43180n7612L7046O8187
35190a413182N3095L9261L1751L6795Q7796J65258J78367J00087L5516O2893Q4390
35179e37973m1044k61620l70030k75376j04047J130N0941J07612J34334P9401
35169a216672L9304J59922L63923L63476N3354k50279j48661L13168O57989N39718
35159H75242J13052k30796l19242k53055j52470n0758J8095K4424L8725J59810
35149B23027L26150L42544J27431j89370m35484n29240m30910j41289J76817K50969
35139b79355R991k71913k77097o763K77136L79820L04274J38039j9288n9048L4633
35128B30429J02113j2140k12374k62225j39639o6442j41263j87128q3806n788
$$ y = [-891382, -550591, -535169, -750275, -980674, -1155096, -1317623, -1460803, -1518415, -1481369, -1413182, -1360087, -1320826, -1289075, -1252280, -1164484, -999226, -820859, -720772, -685256, -622363, -537973, -579017, -840637, -1210667, -1486043, -1590090, -1588960, -1538019, -1430407, -1296073, -1216672, -1177368, -1017446, -653523, -290047, -236693, -486972, -635633, -322465, 335524, 875242, 988294, 757498, 438256, 185201, 32731, -18027, 68, 24492, 63217, 223027, 549177, 891721, 1019152, 829782, 394298, -134942, -565852, -707141, -530324, -279355, -269364, -541277, -818374, -825137, -548001, -168181, 136093, 274132, 254844, 195796, 230429, 332542, 320402, 108028, -154197, -293836, -360278, -501541, -688669, -772475, -778263]
35118g78263j12929k07016r165L26705L50803n476k65705q6834K22294J50445
35108d15141k58865m63199j75860K83204M52185K59044l6815k10951k10038p0208
35098h46644J13883K03788J44776M4574L0466Q3245J06784R4422J06949J30888
35088B13131Q7183k9084j26421j44070j24022j44239k24651k95459k44038l8127
35078a069797J85502K38860J12741k8143j12451k43797m21473m04678o0433L41516
35068a462153M56228L47925L31202M32942L95809J88661Q0024J22291L31m10594
35058D82666p28698n92240j88657O5062J12100J65290K34420J60697J4673L4644
35048b40043J82404J61191o6225j50954J18258M77291N52445L24292L8055j54459
$$ y = [-778263, -891192, -1098208, -1107373, -780668, -429865, -435341, -701046, -787880, -565586, -415141, -674006, -1137205, -1313065, -1029861, -577676, -318632, -355447, -566398, -776436, -846644, -732761, -528973, -384197, -339623, -309157, -225912, -119128, -24706, 82243, 213131, 300314, 271230, 144809, 739, -123283, -267522, -492173, -787632, -1031670, -1069797, -884295, -645435, -532694, -560837, -673288, -917085, -1338558, -1743236, -1803669, -1462153, -1005925, -658000, -326798, 106144, 501953, 690614, 770638, 892929, 893260, 482666, -246032, -838272, -1026929, -961867, -849767, -684477, -450057, -289360, -274687, -240043, -57639, 103552, 37327, -113627, 4631, 481922, 1034367, 1358659, 1396714, 1242255]
35038A242255k55753k62831j63459l7925L75n7225j44915k43553l56141l98225
35028f77397k42503J04827M49513N65214L86221M9814k37629l85355m64574n51938
35018a003807n73631l95744n7193K10398K38153R6572l3149o5203j7347R2959
35008a507992K56393M15985M82084L93153J52824j30123k46930p4316K04600K43540
34998A89218n48j48654O3042L30151J79576k96085n11750k25754J20329P1053
34988b29422k18477l32407k62080k96178m05112k33118K59190N96996M23476o168
34978g03300k05158p8357J07190J81937J83212J09812q6290k59610j48800K07150
34968f92214M01374J68843k43027m09725k79435j44382j43162q0521J95825M80696
$$ y = [1242255, 986502, 723671, 560212, 522287, 522662, 465437, 320522, 76969, -279172, -677397, -919900, -815073, -365560, 199654, 585875, 635689, 398060, 12705, -451869, -1003807, -1577438, -1973182, -2030375, -1819977, -1581824, -1485252, -1518401, -1583604, -1600951, -1507992, -1251599, -835614, -353530, 39623, 192447, 62324, -184606, -258922, -54322, 189218, 188670, 40016, 103058, 433209, 612785, 316700, -195050, -420804, -300475, -229422, -447899, -780306, -1042386, -1338564, -1743676, -1976794, -1717604, -1120608, -697132, -703300, -908458, -986815, -879625, -697688, -514476, -404664, -490954, -750564, -899364, -692214, -290840, -121997, -365024, -774749, -1054184, -1198566, -1341728, -1422249, -1226424, -745728]
34958g45728M52287J13192k03900k52881j20893j8219N322J3207q281r1718j08893
34947i66505R3401L54831K86420j65114n04162k90145K39193M70960K32086o7615
34937c16650q6377N3929J18658J31246J92527K29736J73056J47936K26887J86643
34927A057591j86216o78210q46069n73370j65700O9397R5216L7519M2722K15728
34917i31392M73521N10031J61435k47527k37341J48233L47228L9855m35302n72151
34907g43410l03056P9038L44121M31036L18700M7728k16068l18572k52436o9846
34897f82765J89452L83139K91934o4100l30531k52650k4838L3209l5801K1998
34887d70953J66285R3651k34160m53916k86113J12200L86247L67847J33556j28915
$$ y = [-745728, -293441, -180249, -384149, -637030, -757923, -776142, -770820, -757613, -765894, -857612, -966505, -873104, -518273, -231853, -396967, -901129, -1191274, -952081, -481121, -249035, -316650, -403027, -349098, -230440, -99194, 93333, 323069, 496125, 644061, 870948, 1057591, 871375, 193165, -652904, -1226274, -1391974, -1322577, -1227361, -1189842, -1147120, -931392, -457871, 52160, 213595, -33932, -271273, -123040, 224188, 264043, -171259, -743410, -1046466, -967428, -623307, -192271, 126429, 174157, -41911, -360483, -612919, -682765, -493313, -110174, 181760, 117660, -212871, -465521, -490359, -457150, -492951, -470953, -304668, -211017, -445177, -899093, -1185206, -1073006, -686759, -318912, -185356, -314271]
34877c14271k16675l8807K52994L80918K47856J3188j51219k17002j90036n4329
34867b87383R7957Q3276j05639k17909o6853K00888K88734R0204k56899n23540
34857f97164m93926q7463M65287P23294N08618J54215O4992J57433K7431l78645
34847D44072o16499l73012N0470J12506k58050n78230m33723J9298K87201J70096
34837a175871k5762M6315K75125K67200m7933k84876j61387J02923J62459P0838
34827g70969J01312K08082R0921k27988l39703p8995J82754R1727j79550k59567
34817a181976j35851m5179j3248J04479K34092J47543r0480j29044J32578L49122
34807f27964K09575j52071l78892l09871l8139K46737L35093J19830j99342k34932
$$ y = [-314271, -530946, -569753, -316759, 64159, 312015, 325203, 173984, -43018, -233054, -287383, -189426, -106150, -211789, -429698, -496551, -295663, -6929, 83275, -173624, -697164, -1191090, -1278553, -813266, -89972, 418646, 572861, 637853, 795286, 822717, 444072, -172427, -545439, -494969, -382463, -640513, -1218743, -1652466, -1633168, -1345967, -1175871, -1201633, -1155318, -880193, -612993, -660926, -945802, -1107189, -1004266, -841807, -770969, -669657, -461575, -370654, -598642, -938345, -1017340, -834586, -742859, -922409, -1181976, -1317827, -1363006, -1376254, -1271775, -1037683, -890140, -980620, -1109664, -977086, -627964, -418389, -570460, -949352, -1259223, -1297362, -1050625, -715532, -595702, -795044, -1029976]
34797a029976Q9558L70444K67650p499m6889J06668O6910k29851m17283l03017
34787a133285j42083j43754j03657J85270M56143K85156k50176o02686m47328
34778a896400m1985J76123J21986N6165J80623L95154M48400K51530p096p9957
34768c95457L4564Q8076r1045l66812m67247l02971j6934K11756K98199K44892
34758g62979J36765J08897J92734K26849N4643k23704l56607k79247j58950r1428
34748a153027K9788K62381M44967M24579K92962K19812J76491L8381j15773o6137
34738E54424J62223K23578j02712n54455o65333l39230M6513J33422n92k8463
34728e70625J41828K61072J18983j48106k34347n0714J95900K77799J78306L1344
$$ y = [-1029976, -940418, -569974, -302324, -309823, -356712, -250044, -183134, -412985, -830268, -1133285, -1275368, -1419122, -1522779, -1337509, -881366, -596210, -846386, -1449072, -1896400, -1938385, -1762262, -1640276, -1584111, -1403488, -1008334, -559934, -308404, -315500, -395457, -360893, -272817, -363862, -730674, -1197921, -1500892, -1517826, -1306070, -1007871, -762979, -626214, -517317, -324583, -97734, -43091, -266795, -623402, -902649, -1061599, -1153027, -1123239, -860858, -415891, 8688, 301650, 521462, 697953, 736334, 620561, 554424, 716647, 940225, 837513, 283058, -382275, -721505, -674992, -541570, -542162, -570625, -428797, -167725, -48742, -196848, -431195, -481909, -286009, -8210, 170096, 201440]
34718B01440o9186j29984j63884j16971N0008K18649J57783j87346n19701m80604
34708a039796j11910J84211J92606J22017J62432J35524j07593k31289J52357
34699e41441P25914P20001M9o51884n72672n5254J89203N150k11175k12482j09650
34688g14241j6027N8374N191k68966n21382l62279J69280N70513N13374K01637
34678c64526k4391j27041k37564l45179l50774k72492j92438r4925P8876K81012
34668a649442L89449L50973K13588N7561o3968j57893k60963l22006j91664J30388
34658a503977L35454J45939k17661k24171K58565P62407Q43608N80371K66602
34649A247137m4906l94782n99280m74298k15570j59063k44705j13351K74667N13659
$$ y = [201440, 132254, 2270, -161614, -278585, -228577, -9928, 147855, -39491, -559192, -1039796, -1151706, -967495, -774889, -652872, -490440, -354916, -462509, -693798, -541441, 184473, 904474, 904523, 252639, -320033, -375287, -186084, -180934, -392109, -604591, -714241, -730268, -671894, -666703, -935669, -1457051, -1819330, -1650050, -1079537, -566163, -364526, -388917, -515958, -753522, -1098701, -1449475, -1721967, -1914405, -2009330, -1930454, -1649442, -1259993, -909020, -695432, -637871, -701839, -859732, -1120695, -1442701, -1634365, -1503977, -1168523, -1022584, -1240245, -1464416, -1205851, -443444, 400164, 980535, 1247137, 1202231, 807449, 208169, -266129, -481699, -640762, -885467, -998818, -724151, -210492]
34639b10492L29558n5196k74779k64943j88089j35903j03608j11231j58006j42493
34629a315182R572J92234K33441J30408M5449O9919J04590J7258j51487k20162
34619h83960j06253M6518O0332n250P2388L03736L82879J05711k69449l17176
34609f10524k0820K19929J56155j6996j4037J50136K69416K44364R8154j44199
34599C31578l99948m74438k74528n937M7676r4251j50672O678J90929J97196O5559
34588e60158n2080j23400j79737j34020J43388N59647P82142N83408J19692k40782
34578H98100l29227k95965l17262l39639k22732j7900Q8709Q3372J50984L26082
34568B4522L41718O594m27542n30637k60960Q512L6149j7712L6720R1842J4623
$$ y = [-210492, 119066, 63870, -210909, -475852, -663941, -799844, -903452, -1014683, -1172689, -1315182, -1305610, -1113376, -879935, -749527, -704078, -634159, -529569, -512311, -663798, -883960, -990213, -943695, -883363, -888613, -816225, -512489, -129610, -23899, -293348, -610524, -631344, -411415, -255260, -272256, -286293, -136157, 133259, 377623, 475777, 331578, -68370, -542808, -817336, -823273, -775597, -869848, -1020520, -1013842, -822913, -625717, -560158, -612238, -735638, -915375, -1049395, -906007, -346360, 435782, 1019190, 1138882, 898100, 568873, 272908, -44354, -383993, -606725, -624625, -535916, -452544, -301560, 24522, 366240, 372834, -54708, -585345, -846305, -837793, -801644, -819356, -782636, -690794, -676171]
34557f76171k5714J49496K84456j0975n45243o31114m6529N53783N02650K1364
34547d23997j75242R1652L58220L24111J92675J52655O4802j38681k08451j4385
34537B23359J52087L3094j59300j15734L8935j3131k25259l00454k11932j63702
34527g42037j28267J06064M48777N36939K99974N8612j5814j05065k99298m04169
34517b44284l63286m13043n72129m40499J36994O21339M56982j05903l75495j96804
34507a496128k0015q7499j24788Q8740L38213L44526J55353k5688j27833j64713
34497a119832j24140m8702k8699j4545J41590L67672L73704J15000n1434R8525
34487b90861K59836O2391l08701l75842j15035L5970r7366j92161m4856O2369
$$ y = [-676171, -701885, -552389, -267933, -278908, -824151, -1455265, -1501794, -948011, -445361, -423997, -599239, -507587, -149367, 174744, 367419, 520074, 584876, 446195, 237744, 223359, 375446, 408540, 249240, 133506, 172441, 159310, -65949, -366403, -578335, -742037, -870304, -764240, -315463, 221476, 521450, 580062, 564248, 459183, 159885, -244284, -607570, -1020613, -1592742, -2033241, -1896247, -1274908, -817926, -923829, -1299324, -1496128, -1516143, -1603642, -1728430, -1639690, -1301477, -956951, -801598, -827286, -955119, -1119832, -1243972, -1292674, -1321373, -1335918, -1194328, -826656, -452952, -337952, -389386, -290861, -31025, 31366, -277335, -653177, -768212, -732242, -829608, -1021769, -1066625, -1004256]
34477a004256j11331k83949r7845K53417L32208K03828L11122O37827O11886J3994
34467H66901n77783n81112j92249M1577N1320J23016K17677M1117k98196l36375
34457f44107k6259J25375j30096l70732j80794K21890L84236K71821J44489P5884
34447a28293p805m3351K0941j5282l00194n51603m00322J8259K53457K23085K29039
34436g02069L28413K22456j39882l65787k30815l6070p4794j38818O9983L37747
34426g29636K15051k29647m07914l6687M11175L08242k74606o04064j84904O01181
34416i31809R23816M76409k12657m75962k60211q383K896r2627r7945k9604O040
34405g00037j7770q0944j58998j90491j40547r3320j23992j18531O6722L02142
$$ y = [-1004256, -1115587, -1399536, -1497381, -1243964, -911756, -707928, -396806, 241021, 852907, 866901, 289118, -291994, -484243, -442666, -391346, -268330, -50653, -9536, -307732, -644107, -670366, -544991, -675087, -1045819, -1226613, -1004723, -620487, -348666, -204177, -128293, -136098, -179449, -158508, -173790, -473984, -1025587, -1425909, -1407650, -1154193, -931108, -702069, -373656, -151200, -291082, -656869, -887684, -923754, -998548, -1137366, -1067383, -729636, -514585, -744232, -1152146, -1188833, -777658, -469416, -744022, -1348086, -1532990, -931809, -7993, 468416, 255759, -220203, -480414, -488797, -485901, -578528, -676473, -706077, -700037, -717807, -798751, -957749, -1148240, -1288787, -1382107, -1506099, -1624630, -1557908, -1255766]
34395a255766L09037Q9042o2481r096O6966K0645o6748j43855k76649l48812p8929
34384a756646M45994O72797L38356p3007m5118J67297N136m03695m15578M3682
34374a020782L06574K5122k85246j10213K32321J48818k31920k56934J90514M70218
34364e31528J40542l94091m84561j17273K04546K55321K90187M51971M52076Q1034
34354C48224l09870k23323K45842N01015K60687j12566j98797o0980J4802M836
34344D69870N7058J14424j2599k67191l67774k25168o7090q5811j86373j82896
34334g53550p8485l2861j41350l29216m18762k74350N8051L41807L51235J07657
34324a169824j35038j52981L3114J96668J31296j30113l01743j24037K97032N34219
$$ y = [-1255766, -946729, -857687, -920168, -929264, -862298, -841653, -908401, -1052256, -1328905, -1677717, -1756646, -1310652, -637855, -299499, -372506, -417624, -250327, -245191, -648886, -1064464, -1020782, -714208, -689086, -974332, -1084545, -852224, -703406, -935326, -1192260, -1001746, -531528, -390986, -785077, -1269638, -1386911, -1182365, -927044, -636857, -184886, 267190, 348224, 38354, -184969, 60873, 561888, 822575, 710009, 511212, 450232, 465034, 469870, 526928, 641352, 628753, 361562, -6212, -231380, -298470, -384281, -570654, -753550, -832035, -864896, -1006246, -1335462, -1754224, -2028574, -1970523, -1628716, -1277481, -1169824, -1304862, -1457843, -1424729, -1228061, -1096765, -1226878, -1528621, -1652658, -1355626, -821407]
34314h21407L21591j04740k94341j42345K8875n0367k34761j89971J31866L99821
34304i55779L05835n3036l04277k79582j89671k39794k79013p1078K36023K78876
34294a551496Q5134P8119L79024N62618L35165Q090m9597q366j55054k43614J04477
34283d55500N79869M90648j49007n65470l83220j21530k44419l82496j1362N71011
34273f71476N83765j06882p66928p23436j09315M13838M12720M4241k10040q0390
34263a213903K18833K72367j7550l28648l42513r2908J66186K59509J76989L3325
34253h68313J9334K20076M26295L43000M1007q2012J04181K39099L5558k69572
34243B08653l19767k03201k43850m34189m77422k86272o1951P4452J89888L02151
$$ y = [-821407, -499816, -604556, -898897, -1041242, -1012367, -1062734, -1297495, -1487466, -1355600, -955779, -649944, -702980, -1007257, -1286839, -1476510, -1716304, -1995317, -2066395, -1830372, -1551496, -1466362, -1388243, -1009219, -446601, -111436, -103346, -152943, -161309, -316363, -559977, -455500, 124369, 615017, 466010, -99460, -482680, -604210, -848629, -1231125, -1242487, -671476, -87711, -194593, -961521, -1684957, -1794272, -1380434, -967714, -923473, -1133513, -1213903, -995070, -722703, -740253, -1068901, -1411414, -1504322, -1338136, -1078627, -901638, -868313, -848979, -628903, -202608, 140392, 181399, 99387, 203568, 442667, 478225, 208653, -111114, -314315, -558165, -992354, -1469776, -1756048, -1817999, -1743547, -1553659, -1251508]
34233a251508L41911L36655L49213K64966n2882m11835m31283q1753K29238J89816
34223e17462p8178k94223l44213k16547R6540M50104N32092K17917k10447l88730
34213g53147k86607j22575L260J55237L02627K78705O1602j08314l7449J10892
34203c95769J2956l20892m78111k00290J92693K08851q8838j51295K03771M53233
34193e63691J50238l42819l53380J03999L73685J44061j77989j94823r7212k25834
34183a183765m41376l25233J78799O75460Q09420N89146K50974J1045m2365L1851
34173E53956Q0956M469j57007l12985m39424n41614n67600m43617j68665J73355
34163a818176M62510N82536M72678J81777j54735l92108m14684j77894J92361
$$ y = [-1251508, -909597, -572942, -223729, 41237, -11645, -423480, -854763, -936516, -707278, -517462, -595640, -889863, -1234076, -1450623, -1354083, -903979, -371887, -153970, -364417, -753147, -1039754, -1162329, -1159069, -1003832, -701205, -422500, -360898, -469212, -506661, -395769, -382813, -703705, -1181816, -1382106, -1189413, -980562, -1069400, -1220695, -1016924, -563691, -413453, -756272, -1109652, -1005653, -631968, -487907, -665896, -860719, -957931, -1183765, -1625141, -1950374, -1771575, -1096115, -286695, 302451, 553425, 564470, 522105, 553956, 634912, 639381, 482374, 169389, -270035, -811649, -1379249, -1822866, -1991531, -1818176, -1355666, -773130, -300452, -118675, -273410, -665518, -1080202, -1258096, -1065735]
34154a065735M22003L55835J43748J2531m6139j44657j82112M658K35246J56740
34144a07882j42253j66791J83033L52787k4655n02881m76338p2857J47692J01082
34134g09063J57047L53882L11137l5750k49954j21514k6001k75310n69180m52928
34124a617634M218L52096L61545J61332n6458j68349q6889J27086K16591L5169
34114f71293j97664j84515R593O6639j09541l00030l13812j61408Q8057L49071
34104a424903M25466J78202j62703j64692K14693M98962L33069k3938j01268J13710
34094a13402K45281J48313P2069J76024K34068o838m00826n59035l40829l314
34084e48489J32295L7764m0623Q6009K86824K47919r1395l54413j60063L06471
$$ y = [-1065735, -643732, -287897, -144149, -131618, -177757, -322414, -504526, -499868, -264622, -107882, -250135, -416926, -233893, 118894, 94239, -408642, -884980, -957837, -810145, -709063, -552016, -198134, 113003, 77253, -172701, -294215, -320216, -595526, -1164706, -1617634, -1613416, -1261320, -899775, -738443, -794901, -963250, -1050139, -923053, -706462, -671293, -868957, -1053472, -1043879, -977240, -1086781, -1386811, -1700623, -1862031, -1773974, -1424903, -999437, -821235, -983938, -1148630, -933937, -434975, -101906, -125844, -227112, -113402, 131879, 280192, 352261, 528285, 762353, 755515, 354689, -204346, -545175, -548489, -416194, -378430, -419053, -333044, -46220, 201699, 110304, -244109, -404172, -97701]
34074i7701M32576k3666n56325n47766n4783L43139L24765Q5014j21320k68111
34064d84178l27334j67741J33549K32636J3266j69244k1824K00889J07456j78124
34054f60649k25305j2311O9514r7482j72997M1699K80119K67033J07110N643m7600
34043d45226q3123K0469K40081K60020n9253l57723k82843m1545j9538j06055
34033h74736O7397L79208L28458j20254m24974l08055j08661r0381j967L20554
34023h33411M69672R4991m02209m00362j1046J38293o6856j05676K28256M33616
34013d54732J20497l23176k95628J38200L82929J63913j78016k22880L9317L30916
34003b98660M46509L53389Q5957k79361n62693n44513j90272K29790L62846J49058
$$ y = [-97701, 334875, 311209, -245116, -792882, -847665, -504526, -179761, -94747, -216067, -484178, -811512, -979253, -845704, -613068, -599802, -769046, -790870, -589981, -482525, -660649, -885954, -898265, -828751, -926233, -1099230, -1057531, -777412, -510379, -403269, -397626, -445226, -528349, -507880, -267799, -7779, -67032, -424755, -707598, -749143, -768681, -874736, -807339, -428131, -99673, -219927, -644901, -952956, -1061617, -1151998, -1153965, -833411, -363739, -268748, -670957, -1071319, -1082365, -944072, -1010928, -1116604, -888348, -454732, -334235, -657411, -953039, -814839, -431910, -267997, -446013, -668893, -629576, -298660, 147849, 501238, 587195, 307834, -254859, -799372, -989644, -759854, -397008, -247950]
33993b47950j23864j92781j14974q1290q2945K1014J90786K26230R2620l3189
33983c46343o6441r3489r8380P3239L50681L67207j9880m15731l79383q021K78055
33972c58486L35844L20775K60284M0581k24168k47526m4860N1553n7420q1202
33962d625J08118J84313r2597l98633k87819J28675L63737K76856J71515J94202
33952F43742R0621l00530o77919o53949k86960J9448M4525n0532k1225J56335
33942a036444L15994L08657J23961j21108k67288k34982j09916q0803k37012m25583
33932a764524l69190K2062M89552O64510M77809K21594J42193J12182j22160m64560
33922e90532n23252j86768J51787J31482o1873j7662K21950K10330j72450m56051
$$ y = [-247950, -371814, -564595, -679569, -760859, -843804, -822790, -632004, -405774, -313154, -346343, -412784, -506273, -604653, -531414, -180733, 186474, 166594, -249137, -628520, -636541, -358486, -22642, 298133, 558417, 598998, 374830, 127304, 82444, 133997, 76577, -4625, 103493, 287806, 195209, -203424, -491243, -362568, 1169, 278025, 449540, 643742, 734363, 433833, -244086, -898035, -1184995, -1165547, -1121022, -1171554, -1192779, -1036444, -720450, -411793, -287832, -408940, -676228, -911210, -1021126, -1101929, -1338941, -1764524, -2133714, -2111652, -1622100, -957590, -479781, -258187, -115994, -3812, -125972, -590532, -1113784, -1300552, -1148765, -1017283, -1079156, -1096818, -874868, -664538, -836988, -1293039]
33912a293039k28909K79257N42254M36171K64532K17800J74081L4139q3624q6488
33902B56174r1808k18506l59793l14987o0561K20721L35854K52689J15459R5513
33892B30755J77882J50441r1788l22971k63314j5327N2506j34752k35390l0480
33882d82438K29366K14189o801j25796m7389Q1221J60982K06631J93350N7595
33872D80910j75207m00765n19012m34574j23083K08827K45989j734j36807M8101
33862h07355K13301k932l71969l92301k7079L19940M35948M37052L48958M9630
33852B03193l50224n31650m33793k86761j55473R5818L45758K44538j70725m05927
33842a445246k45831n1989q7907p9146K04303M24254K02064k07222k77584O997
$$ y = [-1293039, -1521948, -1242691, -700437, -264266, 266, 218066, 392147, 426286, 342662, 256174, 164366, -54140, -413933, -728920, -789481, -568760, -232906, 19783, 135242, 230755, 408637, 559078, 467290, 144319, -118995, -134322, -81816, -216568, -451958, -482438, -253072, -38883, -45684, -171480, -218869, -137648, 23334, 229965, 423315, 480910, 305703, -95062, -614074, -1048648, -1171731, -962904, -716915, -718649, -855456, -807355, -594054, -596986, -968955, -1361256, -1388335, -1068395, -632447, -195395, 153563, 203193, -147031, -678681, -1112474, -1399235, -1554708, -1458890, -1113132, -868594, -1039319, -1445246, -1691077, -1743066, -1830973, -1910119, -1705816, -1281562, -1079498, -1286720, -1564304, -1557307]
33832a557307K22476J81010Q0528Q4992J55877K33738K63008J33292j10238j52309
33822d64933J59314M31462J85799m01184o55740k90263K73148M98493K96069p6643
33812d4478l46888l53061r9919J88625K35742L097k87323m03945k66785N2920
33802a322015L34623L22732L7542j47182L8674L61192M02632J42611r8666j80692
33792a08549k33897k85782j84068Q3125L21926M17423L95781K22484j32062m39220
33782E7161l95134r2258N7086p4644j76560m2759J14685O0620q9777j01151K8844
33771f53887J39387J45234O5407l1660l3494J05333K32337J63591l6158j63722
33761f7632k05565k56631j91625J68260N73266N15136k4035m67629m48585k52937
$$ y = [-1557307, -1334831, -1153821, -1073293, -988301, -832424, -598686, -335678, -202386, -312624, -464933, -305619, 125843, 311642, -89542, -745282, -1035545, -762397, -263904, 32165, -44478, -391366, -744427, -844346, -655721, -419979, -416882, -704205, -1108150, -1374935, -1322015, -987392, -664660, -627118, -774300, -735626, -374434, 28198, 170809, 72143, -108549, -342446, -628228, -812296, -729171, -407245, 10178, 405959, 628443, 496381, 57161, -337973, -430231, -373145, -447789, -624349, -667108, -552423, -491803, -581580, -682731, -653887, -514500, -369266, -303859, -335519, -369013, -263680, -31343, 132248, 96090, -67632, -273197, -529828, -721453, -553193, 20073, 535209, 511174, 43545, -405040, -657977]
33751f57977k47221l26970k38792n2659L9760Q9648K16553L19582K66594J56086
33741d35396J30677J35539P4635j4583j06846k35643k61002M1347M92126N60022
33731C80876J46972j74022m1881J04567k07752o42035n89394j53831Q3738L175
33721a089587n3619j7415j02994j89306Q4524N91169P51889L88249m3460j58814
33711A60636n3471O7852J43999O4645k51295n13548l36812P1811R6411l04503
33701h54275m55280k3873M42708L98599J07389J04779L46570M16000K27009J9088
33691G28714r5584j43482p1860R0788Q6001j82435l52064j10025K40928J96395
33681C87376j59055l02619j14603r053j96975l58238k11134L9224P3110n2000
$$ y = [-657977, -905198, -1232168, -1470960, -1523619, -1483859, -1394211, -1177658, -858076, -591482, -435396, -304719, -169180, -94545, -109128, -215974, -451617, -712619, -671272, -179146, 380876, 527848, 353826, 311945, 416512, 208760, -433275, -1022669, -1176500, -1092762, -1089587, -1143206, -1160621, -1263615, -1452921, -1368397, -777228, -25339, 362910, 319450, 160636, 107165, 175017, 319016, 383661, 132366, -381182, -717994, -646183, -549772, -854275, -1309555, -1333428, -890720, -492121, -384732, -279953, 66617, 482617, 709626, 728714, 633130, 489648, 417788, 508576, 594577, 412142, 60078, -49947, 190981, 387376, 228321, -74298, -188901, -197954, -394929, -753167, -964301, -925077, -851967, -903967]
33671i03967p0382M1928P9067k5751j00503r492J57371K31606J86128J15208M9984
33660b48803q1474k79180l71884k06985J07912K80119J49679j59729l87974l40827
33650a539146j564M07595N21900J92800k58343l63143r4789J12628k1389k69303
33640a312754k74705k7591K14061K76333J63031m2867k07810k09332r4362m2289
33630a558285r1664q8434K3774J09225J31528K37126M01662L42740J2663j91384
33620f71049k9287J37414o8171l41095j46754L49281M60583M4040k76748p2994
33610f14780L04578L53996J34496N997K6177j599r6224q0806Q4961K19070J41549
33599D77415j58765n21918o88001m82798m0807K68178K38475M2624m3124J4779
$$ y = [-903967, -974349, -932421, -853354, -879105, -979608, -989100, -831729, -600123, -413995, -298787, -248803, -330277, -609457, -981341, -1188326, -1080414, -800295, -650616, -810345, -1198319, -1539146, -1540710, -1133115, -611215, -418415, -676758, -1039901, -1134690, -1022062, -1043451, -1312754, -1587459, -1615050, -1400989, -1124656, -961625, -1004492, -1212302, -1421634, -1515996, -1558285, -1649949, -1738383, -1714609, -1605384, -1473856, -1236730, -835068, -492328, -479665, -671049, -700336, -562922, -631093, -972188, -1118942, -769661, -309078, -265038, -541786, -614780, -310202, 43794, 178290, 184287, 210464, 208865, 112641, 31835, 116796, 335866, 477415, 318650, -203268, -891269, -1374067, -1414874, -1146696, -908221, -865597, -908721, -893942]
33589h93942O0246J6984n3595q7568p0723j40R6555J37936P2261l7537o7637M3986
33577g83174K35197L38466J96598j41300l77042k69338L2659J53238Rj25658M76
33566g39869K01618K04166M1001p1138r5231j58993k58342k24957Q843K91656
33556h01246M16917K95244r885l10252m01078k53070m6280Q4003K27853M68468
33546c29326N87153K70598l82014q19327o21446K5040N36957N23333R5434l19479
33536d33077l93881j73455K0226k8651j88298j90941j3506J18003Q3847J7638
33526a182095L9823N8186k7339r7081P942J82000J64826n9735j97102m0521K33853
33515i17243K91328O3703j84733j97376j7191J07108M5549o6156k4634J61315
$$ y = [-893942, -833696, -816712, -870307, -957875, -1028598, -1028738, -932183, -794247, -721986, -759523, -827160, -783174, -547977, -209511, -12913, -154213, -531255, -800593, -767934, -614696, -614687, -740345, -739869, -538251, -334085, -293084, -364222, -459453, -618446, -876788, -1101745, -1092902, -801246, -384329, -89085, -98970, -409222, -810300, -1063370, -1109650, -1025647, -797794, -329326, 257827, 528425, 146411, -672916, -1294362, -1269322, -732365, -209032, -113598, -433077, -826958, -1000413, -980187, -1008838, -1197136, -1388077, -1401583, -1283580, -1199733, -1182095, -1142272, -1084086, -1111425, -1208506, -1200564, -1018564, -853738, -913473, -1110575, -1151096, -917243, -625915, -562212, -746945, -944321, -961512, -854404, -808855, -875011, -899645, -738330]
33505g38330K75791J80952l209o7147J6654R0842L7859j14382k95866m54888m81363
33494a553087k36780K17456N38167M22739j2611l26602k35737J16975L81248L48816
33484c39416N5918l00397m60805k67446J27708L22746J00379k68802l44868r3883
33474a468866Q9930m1048k54485k12730L8035J70764M3633j69707k59647j68132
33464b232253Q1888M10073N97819M15193o7454m69490n11543k86834k6571K09528
33454a879644M38728N35975L72724Q9908l5727J9027J5343j52787l02808k63412
33444a162673j02698L3552J04805R3302n2873k55936k85390p4272J15667M8073
33434a538443j25232j01995Q7846J33407n2554j75279K3578M05842O04601M30130
$$ y = [-738330, -462539, -281587, -284796, -351943, -335289, -244447, -206588, -320970, -616836, -1071724, -1553087, -1789867, -1572411, -1034244, -611505, -624116, -950718, -1186455, -1069480, -688232, -339416, -283498, -583895, -1044700, -1312146, -1184438, -861692, -761313, -1030115, -1374983, -1468866, -1378936, -1419984, -1674469, -1887199, -1849164, -1678400, -1634767, -1804474, -2064121, -2232253, -2150365, -1740292, -1142473, -727280, -794734, -1264224, -1775767, -2062601, -2089172, -1879644, -1440916, -904941, -532217, -442309, -478036, -459009, -443666, -596453, -899261, -1162673, -1265371, -1231819, -1127014, -1033712, -1086585, -1342521, -1627911, -1702183, -1586516, -1538443, -1663675, -1765670, -1677824, -1544417, -1596971, -1772250, -1748672, -1342830, -738229, -308099]
33424c08099L3265k63999k72985j17172o6659j51897r1001K52187N28698L28250
33414a29412j62741l26237L2649M07111L22970k5259j49614O762Q3246j00675
33404d1200l24910l47426k23142j65041k52992l62000l04753j1622L88220O58392
33394i86474O46031L76326K4k76496k70829k217K27504J37889j33249j85181N4468
33383d12204K12594O6601j04840j4518J29427k0564l45380m42591k62360j07933
$$ y = [-308099, -274834, -538833, -811818, -928990, -995649, -1147546, -1238547, -986360, -457662, -129412, -292153, -618390, -585741, -178630, 144340, 119081, -30533, -23771, 59475, -41200, -366110, -713536, -936678, -1101719, -1354711, -1716711, -2021464, -2033086, -1644866, -986474, -340443, 35883, 35907, -240589, -511418, -513635, -286131, -148242, -281491, -466672, -412204, -199610, -133009, -237849, -252367, -122940, -143504, -488884, -931475, -1193835, -1301768]
$$ [...]
##END NTUPLES=NMR SPECTRUM
##END=
