##TITLE=31P_DE-80H_X3
 64 sc D2O
 26.2.2025
##JCAMPDX= 6.0         $$ Bruker NMR JCAMP-DX V2.0
##DATA TYPE= NMR FID
##DATA CLASS= NTUPLES
##ORIGIN= UXNMR, Bruker Analytische Messtechnik GmbH
##OWNER= root
$$ XWIN-NMR		Version 3.5
$$ Thu Apr  2 10:54:14 2026 Russian Standard Time (UT+4h)  Yarkov@DPX200
##.OBSERVE FREQUENCY= 81.013821
##.OBSERVE NUCLEUS= ^31P
##.DELAY= (6, 6)
##.ACQUISITION MODE= SIMULTANEOUS
##.ACQUISITION SCHEME= undefined
##.AVERAGES= 64
##.DIGITISER RES= 17
##SPECTROMETER/DATA SYSTEM= spect
##.PULSE SEQUENCE= zgpg30
##.SOLVENT NAME= CDCl3
##.SHIFT REFERENCE= (INTERNAL, CDCl3, 0, 243.863)
##AUDIT TRAIL= $$ (NUMBER, WHEN, WHO, WHERE, WHAT)
$$ ##TITLE= Audit trail, XWIN-NMR		Version 3.5
$$ ##JCAMPDX= 5.01
$$ ##ORIGIN= Bruker BioSpin GmbH
$$ ##OWNER= Yarkov
$$ C:/Bruker/XWIN-NMR/data/yarkov2/nmr/P31/2/audita.txt
$$ ##AUDIT TRAIL=  $$ (NUMBER, WHEN, WHO, WHERE, WHAT)
(   1,<2026-04-02 10:53:29.59 +0400>,<Yarkov>,<DPX200>,
      <created by zg, POWCHK disabled, PULCHK disabled
       configuration hash MD5:
       00 E9 B6 7A A2 85 ED C7 34 08 36 98 17 FE 4E 26
       data hash MD5: 32K
       BF A6 1E 47 33 2B 1D FB BA 58 2B 7E 03 75 5F 87>)
$$ ##END=
$$ 
$$ hash MD5
$$ DF 50 E4 68 03 52 B2 9C D4 A7 B2 BC 8D C6 D8 6C
##$RELAX= 
##$RELAX= 
##$RELAX= 
##$RELAX= 
##$RELAX= 
##$RELAX= 
##$RELAX= 
##$RELAX= 
$$ Bruker specific parameters
$$ --------------------------
##$DU= <C:/Bruker/XWIN-NMR>
##$EXPNO= 2
##$NAME= <P31>
##$PROCNO= 1
##$TYPE= <nmr>
##$USER= <yarkov2>
##$AMP= (0..31)
100 100 100 100 100 100 100 100 100 100 100 100 100 100 100 100 100 100 
100 100 100 100 100 100 100 100 100 100 100 100 100 100 
##$AQSEQ= 0
##$AQ_mod= 1
##$AUNM= <au_zg>
##$AUTOPOS= <>
##$BF1= 81.014009
##$BF2= 200.13
##$BF3= 200.13
##$BF4= 200.13
##$BF5= 200.13
##$BF6= 200.13
##$BF7= 200.13
##$BF8= 200.13
##$BYTORDA= 1
##$CFDGTYP= 0
##$CFRGTYP= 5
##$CHEMSTR= <none>
##$CNST= (0..31)
1 1 145 1 1 1 1 1 1 1 1 1 1 1 1 1 1 1 1 1 1 1 1 1 1 1 1 1 1 1 1 1 
##$CPDPRG= <waltz16>
##$CPDPRG1= <>
##$CPDPRG2= <waltz16>
##$CPDPRG3= <>
##$CPDPRG4= <mlev>
##$CPDPRG5= <mlev>
##$CPDPRG6= <mlev>
##$CPDPRG7= <mlev>
##$CPDPRG8= <mlev>
##$CPDPRGB= <>
##$CPDPRGT= <>
##$D= (0..31)
0 1 0 0 0 0 0 0 0 0.06 0 0.03 2e-05 3e-06 0 0 0.0002 0 0 0 0 0 0 0 0 0 
0 0 0 0 0 0 
##$DATE= 1775112809
##$DBL= (0..7)
120 120 120 11 120 120 24 19 
##$DBP= (0..7)
150 150 150 150 150 150 150 150 
##$DBP07= 0
##$DBPNAM0= <>
##$DBPNAM1= <>
##$DBPNAM2= <>
##$DBPNAM3= <>
##$DBPNAM4= <>
##$DBPNAM5= <>
##$DBPNAM6= <>
##$DBPNAM7= <>
##$DBPOAL= (0..7)
0.5 0.5 0.5 0.5 0.5 0.5 0.5 0.5 
##$DBPOFFS= (0..7)
0 0 0 0 0 0 0 0 
##$DE= 6
##$DECBNUC= <off>
##$DECIM= 4
##$DECNUC= <off>
##$DECSTAT= 4
##$DIGMOD= 1
##$DIGTYP= 9
##$DL= (0..7)
0 0 52 120 120 21 21 25 
##$DP= (0..7)
150 150 150 150 150 150 150 150 
##$DP07= 0
##$DPNAME0= <>
##$DPNAME1= <>
##$DPNAME2= <>
##$DPNAME3= <>
##$DPNAME4= <>
##$DPNAME5= <>
##$DPNAME6= <>
##$DPNAME7= <>
##$DPOAL= (0..7)
0.5 0.5 0.5 0.5 0.5 0.5 0.5 0.5 
##$DPOFFS= (0..7)
0 0 0 0 0 0 0 0 
$$ [...]
##$SUBNAM1= <"">
##$SUBNAM2= <"">
##$SUBNAM3= <"">
##$SUBNAM4= <"">
##$SUBNAM5= <"">
##$SUBNAM6= <"">
##$SUBNAM7= <"">
##$SUBNAM8= <"">
##$SUBNAM9= <"">
##$SW= 400.765351723535
##$SWIBOX= (0..15)
0 1 3 0 0 0 0 0 0 0 0 0 0 0 0 0 
##$SW_h= 32467.5324675325
##$TD= 32768
##$TD0= 1
##$TE= 0
##$TE2= 300
##$TE3= 300
##$TEG= 300
##$TL= (0..7)
0 120 53 12 22 120 120 120 
##$TP= (0..7)
150 150 150 150 150 150 150 150 
##$TP07= 0
##$TPNAME0= <>
##$TPNAME1= <>
##$TPNAME2= <>
##$TPNAME3= <>
##$TPNAME4= <>
##$TPNAME5= <>
##$TPNAME6= <>
##$TPNAME7= <>
##$TPOAL= (0..7)
0.5 0.5 0.5 0.5 0.5 0.5 0.5 0.5 
##$TPOFFS= (0..7)
0 0 0 0 0 0 0 0 
##$TUNHIN= 0
##$TUNHOUT= 0
##$TUNXOUT= 0
##$USERA1= <user>
##$USERA2= <user>
##$USERA3= <user>
##$USERA4= <user>
##$USERA5= <user>
##$V9= 5
##$VALIST= <valist>
##$VCLIST= <CCCCCCCCCCCCCCC>
##$VD= 0
##$VDLIST= <DDDDDDDDDDDDDDD>
##$VPLIST= <PPPPPPPPPPPPPPP>
##$VTLIST= <TTTTTTTTTTTTTTT>
##$WBST= 1024
##$WBSW= 4
##$XGAIN= (0..3)
0 0 0 0 
##$XL= 0
##$YL= 0
##$YMAX_a= 34673
##$YMIN_a= -26127
##$ZGOPTNS= <>
##$ZL1= 120
##$ZL2= 120
##$ZL3= 120
##$ZL4= 120
##$ABSF1= 60
##$ABSF2= -190
##$ABSG= 5
##$ABSL= 3
##$ALPHA= 0
##$AQORDER= 0
##$ASSFAC= 0
##$ASSFACI= 0
##$ASSFACX= 0
##$ASSWID= 0
##$AUNMP= <proc_1d>
##$AZFE= 0.1
##$AZFW= 0.5
##$BCFW= 1
##$BC_mod= 2
##$BYTORDP= 1
##$COROFFS= 0
##$CY= 9.86611175537109
##$DATMOD= 1
##$DC= 1
##$DFILT= <>
##$DTYPP= 0
##$F1P= 182.462994727601
##$F2P= 168.069089081705
##$FCOR= 0.5
##$FTSIZE= 0
##$FT_mod= 0
##$GAMMA= 1
##$GB= 0
##$INTBC= 1
##$INTSCL= 1
##$ISEN= 30
##$LB= 1.5
##$LEV0= 0
##$LPBIN= 0
##$MAXI= 11.51145
##$MC2= 0
##$MEAN= 0
##$ME_mod= 0
##$MI= 1.244541
##$NCOEF= 0
##$NC_proc= 0
##$NLEV= 6
##$NOISF1= 0
##$NOISF2= 0
##$NSP= 1
##$NTH_PI= 0
##$NZP= 1
##$OFFSET= 243.8632
##$PC= 1.4
##$PHC0= 1762.801
##$PHC1= 73.15952
##$PH_mod= 0
##$PKNL= yes
##$PPARMOD= 0
##$PSCAL= 0
##$PSIGN= 0
##$REVERSE= no
##$SF= 81.0140731611343
##$SI= 65536
##$SIGF1= 0
##$SIGF2= 0
##$SINO= 80
##$SIOLD= 65536
##$SREGLST= <31P.CDCl3>
##$SSB= 0
##$STSI= 0
##$STSR= 0
##$SW_p= 25641.0256410257
##$SYMM= 0
##$S_DEV= 0
##$TDeff= 0
##$TDoff= 0
##$TI= <>
##$TILT= no
##$TM1= 0
##$TM2= 0
##$TOPLEV= 0
##$USERP1= <user>
##$USERP2= <user>
##$USERP3= <user>
##$USERP4= <user>
##$USERP5= <user>
##$WDW= 1
##$XDIM= 64
##$YMAX_p= 0
##$YMIN_p= 0
$$ End of Bruker specific parameters
$$ ---------------------------------
##NTUPLES= NMR FID
##VAR_NAME=  TIME,          FID/REAL,        FID/IMAG
##SYMBOL=    X,             R,               I
##VAR_TYPE=  INDEPENDENT,   DEPENDENT,       DEPENDENT
##VAR_FORM=  AFFN,          ASDF,            ASDF
##VAR_DIM=   16384,         16384,           16384
##UNITS=     SECONDS,       ARBITRARY UNITS, ARBITRARY UNITS
##FACTOR=    3.08e-05,      1,               1
##FIRST=     0,             0,               0
##LAST=      0.5045964,     0,               0
##MIN=       0,             -26127,          0
##MAX=       0.5045964,     34673,           0
$$ Real data points
##PAGE= N=1
##DATA TABLE= (X++(R..R)), XYDATA
$$ plain form
0 0 0 0 0 0 0 0 0 0 0 0 0 0 0 0 0 0 0 0 0 0 0 0 0 0 0 0 0 0 0 0 0 0 -3 5 -6 11 -12 18 -17 20 -20 23 -25 33 -31 35 -45 46 -47
49 -47 49 -51 64 -69 72 -89 96 -110 123 -144 166 -195 236 -301 395 -596 1119 -1396 -22900 -26127
69 -26127 -24228 -15459 -2503 11511 20839 26185 22047 13555 685 -10857 -19005 -22177 -20667 -12311
83 -12311 -1589 9760 17281 19875 16864 10693 1612 -7879 -13080 -16437 -14598 -8490 -1690 5379 8318
98 8318 10811 8595 6156 1334 -2425 -5811 -5811 -4204 -3654 -1271 -169 -254 971 -386 226 318 1424 3592
116 3592 5262 5375 3401 828 -4422 -7104 -9149 -9749 -6835 -2030 7787 12008 14075 13661 9715 1373
132 1373 -7296 -15504 -19410 -16820 -11730 -2340 9107 16706 22173 20849 13596 2029 -10906 -18071
146 -18071 -24046 -22942 -15123 -4387 9613 19454 25480 23664 15177 3234 -10804 -19930 -25098 -22650
$$ packed form
0@%%%%%%%%%%%%%%%%%%%%%%%%%%%%%%%%lQj1J7k3L0l5L7m0M3m8N8o4O6q0R1r3
49d7R6j00J15j33J41j61J85k06K33k67L10l61M31n37O96r91J715k515k1504l227
69b6127J899Q769J2956J4014R328N346m138q492j2870j1542q148l172J510Q356
83a2311J0722J1349P521K594l011o171r081r491n201l357J839O108O800P069K939
98H318K493k216k439m822l759l386%J607N50K383J102q5J225j357O12R2J106K168
116C592J670J13j974k573n250k682k045o00K914M805R817M221K067m14l946q342
132A373q669q208l906K590N090R390J1447P599N467j324p253j1567j2935p165
146a8071n975J104P819J0736J4000R841O026j816q487j1943j4038r126n168K448
$$ plain form
160 -22650 -14791 -3999 9222 17849 23293 23355 15156 2989 -8483 -17231 -21002 -20377 -13806 -3466
174 -3466 7116 15811 19039 16001 10979 3349 -5556 -12926 -15308 -12822 -9406 -2182 3381 9184 10030
189 10030 9012 7202 1521 -2030 -4712 -4650 -4224 -3790 -1174 -786 229 12 -1139 -735 -31 1336 3403
206 3403 5283 5616 4254 640 -3465 -6624 -9503 -10991 -6981 -1508 4721 10943 14502 14074 10173 3469
222 3469 -6868 -13408 -18891 -17718 -13363 -3003 7596 16208 20884 21048 15102 3945 -6775 -17852
236 -17852 -23679 -21546 -17018 -4550 7069 17209 24266 22952 17342 5344 -6719 -18059 -24036
249 -24036 -23597 -16862 -3960 6488 17299 21917 21796 15252 5842 -6021 -16214 -19449 -19475 -14202 -4875
264 -4875 3824 13346 16458 18656 11475 4080 -3272 -10771 -13354 -13633 -8879 -2970 3118 7671 8488 9033
$$ packed form
160b2650P859J0792J3221Q627N444O2q199j2167j1472q748l771O25O571J0340
174c466J0582Q695L228l038n022p630q905p370k382K486L416P224N563N803Q46
189A0030j018j810n681l551k682O2M26M34K616L88J015k17j151M04P04J367K067
206C403J880L33j362l614m105l159k879j488M010N473O229O222L559m28l901o704
222C469j0337o540n483J173M355J0360J0599Q612M676J64n946j1157j0720j1077
236a7852n827K133M528J2468J1619J0140P057j314n610j1998j2063j1340n977
249b4036M39O735J2902J0448J0811M618j21o544r410j1863j0193l235k6N273R327
264d875Q699R522L112K198p181p395p352p499k583k79M754N909O088M553Q17N45
$$ plain form
280 9033 4957 2188 -1991 -3467 -5003 -3792 -2575 -1097 401 -627 -331 -1030 -771 182 2247 3560
296 3560 5546 5376 5318 407 -2102 -6268 -9354 -9736 -8180 -1974 3295 9730 14664 13821 11597 3691
312 3691 -4460 -12532 -17531 -18141 -12943 -5286 5742 14109 20617 20576 15110 7077 -5330 -14880 -22090
327 -22090 -23028 -16470 -6572 5646 17354 22032 24524 16652 6809 -4943 -16802 -23388 -24047 -17413
341 -17413 -7448 4912 15134 21106 22218 16073 5712 -4636 -14532 -19626 -19720 -13829 -6803 4177
355 4177 11697 17455 17597 11494 4557 -2460 -8831 -13482 -12811 -8916 -4132 2272 6145 9759 7997 5791
371 5791 1852 -1314 -3078 -3862 -3573 -2592 -232 682 -945 657 -813 -1597 -914 773 3174 4681 6291
388 6291 5470 3593 -459 -6600 -9503 -10625 -9499 -3477 2431 10178 13021 15297 11894 6484 -3590
$$ packed form
280I033m076k769m179j476j536J211J217J478J498j028K96o99K59R53K065J313
296C560J986j70n8m911k509m166l086l82J556O206N269O435M934q43k224p906
312C691q151q072m999o10N198P657J1028Q367O508m1n466q033j2407r550p210
327b2090r38O558R898J2218J1708M678K492p872r843j1752j1859o586o59O634
341a7413R965J2360J0222N972J112o145j0361j0348r896n094r4N891P026J0980
355D177P520N758J42o103o937p017o371m651O71L895M784O404L873L614j762k206
371E791l939l166j764p84K89R81K360R14j627J602j470p84O83J687K401J507J610
388F291q21j877m052o141k903j122J126O022N908P747K843K276l403n410j0074
$$ plain form
403 -3590 -11466 -17539 -18287 -15101 -6887 5492 13018 19720 20565 17271 8175 -3842 -14712 -21523 -22881
418 -22881 -18600 -8839 3416 14588 22186 24224 18772 9104 -3500 -15326 -22279 -22583 -18771 -9408
432 -9408 3316 14236 22055 22844 17711 8074 -3109 -13319 -19688 -20489 -15782 -7571 2441 10839
446 10839 16550 16899 13314 5205 -2293 -9026 -13070 -12665 -10300 -4355 1743 6071 8234 7472 6584 2507
462 2507 312 -3478 -3714 -2624 -1764 352 538 -6 -1657 -1412 -2368 -1209 1841 3132 5424 7400 6547
479 6547 3111 -603 -6114 -10301 -11047 -10236 -5623 557 7113 13195 15536 13267 7882 -1559 -10366 -16257
495 -16257 -19329 -15998 -9496 1180 11762 20843 21614 18765 10392 -2333 -13228 -22664 -24079 -19948
509 -19948 -10451 1417 13988 22683 23407 20295 9974 -1921 -12813 -21743 -23507 -20000 -10139 923
$$ packed form
403c590p876o073p48L186Q214J2379P526O702Q45l294r096j2017j0870o811j358
418b2881M281R761J2255J1172P598K038n452r668j2604j1826o953l04L812R363
432i408J2724J0920P819P89n133r637j1183j0210o369q01M707Q211J0012Q398
446A0839N711L49l585q109p498o733m044M05K365N945O098M328K163p62q88m077
462B507k195l790k36J090Q60K116J86n44j651K45r56J159L050J291K292J976q53
479F547l436l714n511m187p46Q11M613O180O556O082K341k269n385r441q807n891
495a6257l072L331O502J0676J0582R081P71k849q373j2725j0895r436j415M131
509a9948R497J1868J2571Q695P24l112j0321j1895j0892q930j764L507R861J1062
$$ plain form
523 923 12005 19924 22081 18627 10064 -150 -12421 -18616 -19535 -17063 -8552 616 10074 14948 17730
538 17730 13942 6902 -554 -7932 -11007 -12325 -10619 -6186 -211 4690 8834 8228 6246 3558 327
553 327 -4332 -3496 -3279 -2280 -519 -192 -451 -1804 -2613 -4032 -1563 -326 3146 5319 6305 7443 4733
570 4733 326 -5599 -9468 -12855 -9996 -5610 138 7134 14168 15731 14206 8323 -868 -10986 -16335
585 -16335 -18573 -17049 -9286 1341 10957 18243 22891 19859 11712 -173 -11501 -19160 -23391 -20861
599 -20861 -11732 -325 12940 21252 24920 21067 12322 718 -12723 -21119 -23146 -20751 -12595 -509
613 -509 11244 19695 22668 18413 11758 285 -9699 -16797 -19726 -16023 -10917 220 7722 14156 16480
628 16480 14507 8219 -257 -5929 -11536 -11789 -9243 -6697 -215 3520 7295 7342 6169 3672 769 -574
$$ packed form
523I23J1082P919K157l454q563j0214j2271o195r19K472Q511R168R458M874K782
538A7730l788p040p456p378l075j318J706M433N975M901M144o06j982k688l231
553C27m659Q36K17R99J761L27k59j353q09j419K469J237L472K173R86J138k710
570D733m407n925l869l387K859M386N748O996P034J563j525n883r191j0118n349
585a6335k238J524P763J0627R616P286M648l032q147j1885j1328p659m231K530
599b0861R129J1407J3265Q312L668l853q745j1604j3441q396k027K395Q156J2086
613e09J1753Q451K973m255o655j1473r984p098k929L703N106J1137P502O434K324
628A6480j973o288q476n672n607k53K546K546O482L735L775M7j173k497k903j343
$$ plain form
644 -574 -2286 -1858 -2802 279 -36 -530 -1094 -3932 -2400 -1307 1849 4411 5234 7978 7087 4718 -848
661 -848 -5423 -9855 -12693 -11781 -7873 529 6978 12768 16407 15271 9860 227 -8940 -16944 -20233 -17493
677 -17493 -11227 -775 9001 18877 21530 18837 12145 737 -9777 -19778 -22752 -21106 -13993 -1329
691 -1329 9843 19715 22618 21174 13405 3280 -10322 -19166 -23008 -20584 -13963 -1827 8892 17762
705 17762 20052 18754 13428 3359 -7158 -15747 -18995 -17078 -10769 -1765 7353 12426 15093 13684
719 13684 9202 2540 -4251 -9978 -11327 -10766 -6577 -2030 2838 5848 6122 6187 4205 1168 -918 -2200
735 -2200 -1072 -832 -159 -1817 -1759 -1785 -3277 -2249 -2453 270 3324 6701 8027 7171 5334 -286 -3662
752 -3662 -9257 -11802 -10415 -7096 -180 5887 12556 16104 15175 9998 1776 -6528 -14011 -18922 -18000 -12746
$$ packed form
644e74j712M28r44L081l15m94n64k838J532J093L156K562Q23K744q91k369n566
661h48m575m432k838R12L908Q402O449N790L639j136n411r633r167q004l289K740
677a7493O266J0452R776R876K653k693o692j1408j0514j0001k974J646P113J2664
691a329J1172R872K903j444p769j0125j3602q844l842K424O621J2136J0719Q870
705A7762K290j298n326j0069j0517q589l248J917O309R004R118N073K667j409
719A3684m482o662o791n727j349N61M189M547M868L010K74O5j982l037k086j282
735b200J128K40O73j658N8k6j492J028k04K723L054L377J326q56j837n620l376
752c662n595k545J387L319O916O067O669L548r29n177q222q304p483m911R22N254
$$ plain form
768 -12746 -2259 7651 17020 21487 20312 13811 2686 -8262 -17332 -22099 -21073 -14697 -2757 8879
782 8879 18498 22351 22026 14611 3211 -7062 -18046 -21667 -20905 -13964 -3185 6571 16180 19926 19321
797 19321 12747 3520 -6794 -14522 -16866 -16964 -10810 -2836 5263 11442 14506 14258 9001 2954 -2974
812 -2974 -7799 -10570 -9796 -5607 -2611 1780 5342 6590 5806 3035 663 -510 -2264 -2098 -1232 -1688
828 -1688 -686 -804 -2747 -2259 -3849 -3165 -1481 2238 5578 7541 7950 6529 1674 -4084 -9426 -12493
844 -12493 -12874 -8454 -1465 4958 11458 15649 16601 11356 3688 -5683 -13135 -18143 -17469 -13069 -4030 7313
860 7313 15119 19953 19591 13683 5759 -7004 -15848 -22482 -20989 -15058 -5801 5802 16062 22138 20673
875 20673 14740 5039 -7111 -16086 -20929 -20425 -14420 -5180 6294 14557 20212 17874 13085 5860 -5324
$$ packed form
768a2746J0487R910R369M467j175o501j1125j0948r070m767J026O376J1940J1636
782H879R619L853l25p415j1400j0273j0984l621P62O941J0779R756R609L746o05
797A9321o574r227j0314p728k344r8O154P974Q099O179L064k48n257o047n928
812b974m825k771P74M189K996M391L562J248p84k771k372j173j754J66Q66m56
828a688J002j18j943M88j590O84J684L719L340J963M09j421m855n758n342l067
844a2493l81M420O989O423O500M191R52n245p668r371p452n008O74M400R039J1343
860G313P806M834l62n908p924j2763q844o634J493N931R257J1603J0260O076j465
875B0673n933r701j2150q975m843N04O005R240J1474Q263N655k338m789p225j1184
$$ plain form
890 -5324 -12557 -17507 -15539 -11645 -3665 4615 10080 14648 12285 7930 3447 -3039 -7602 -9500 -9043
905 -9043 -6516 -1532 1118 4213 5697 5272 3842 677 -332 -1652 -530 -107 695 861 -185 -1308
921 -1308 -3882 -3547 -2526 -1479 1633 4653 7143 8820 7887 3697 -2431 -7649 -11729 -13051 -9508 -4132
937 -4132 3981 10839 14746 16362 12617 4149 -4160 -12915 -18350 -18457 -14187 -5792 4762 13999 19812
952 19812 20279 15235 6362 -5100 -14844 -20925 -22192 -16426 -6420 4317 14260 19751 21649 15549
966 15549 5579 -4003 -15193 -20595 -20160 -15616 -6965 3358 13142 18108 18430 14431 6184 -3564 -11373
981 -11373 -16328 -16548 -12208 -4058 3939 9945 14145 13235 8305 2917 -1997 -8029 -10076 -9116 -5581 -1126
997 -1126 1834 4155 4904 5299 2594 1222 -337 -1010 -944 -105 1021 664 -907 -1791 -3538 -4527 -4540 -1920
$$ packed form
890e324p233m950J968L894P980Q280N465M568k363m355m483o486m563j898M57
905i043K527M984K650L095J484m25j430l165j009j320J122M23Q02J66j046j123
921a308k574L35J021J047L112L020K490J677r33m190o128n218m080j322L543N376
937d132Q113O858L907J616l745q468q309q755n435j07M270Q395J0554R237N813
952A9812M67n044q873j1462r744o081j267N766J0006J0737R943N491J898o100
966A5549r970r582j1190n402M35M544Q651J0323R784M966L22l999q247r748p809
981a1373m955k20M340Q150P997O006M200r10m930n388m914o032k047R60L535M455
997a126K960K321P49L95k705j372j559o73O6Q39J126l57j571q84j747r89j3K620
$$ plain form
1015 -1920 1039 5296 7058 8304 7894 3680 -1079 -5936 -11959 -12112 -10658 -4243 2605 10044 14297
1030 14297 15901 12424 7004 -2204 -11038 -16991 -17399 -15911 -7647 3067 13058 19036 20552 17359 7673
1045 7673 -3518 -13552 -18779 -21251 -17918 -8306 2322 13632 20045 20081 16503 7801 -2344 -13310
1059 -13310 -18498 -20842 -15354 -7438 2351 12232 18056 18833 14738 6322 -2601 -10684 -14326 -16741 -12266
1074 -12266 -6155 2866 8194 11330 13787 9480 5590 -1075 -5042 -8044 -10183 -6997 -2921 2007 1594
1089 1594 5969 4399 2808 2109 -451 -432 -514 83 -304 842 -517 -1951 -3778 -4442 -5242 -1710 1072
1106 1072 4829 8238 9092 7445 3807 -1147 -6616 -11963 -12873 -10760 -5157 1660 9299 14730 16784
1121 16784 13788 7650 -1251 -10328 -16498 -18893 -15131 -8010 2358 11254 17740 20400 16968 9715
$$ packed form
1015a920K959M257J762J246m10m214m759m857o023j53J454O415O848P439M253
1030A4297J604l477n420r208q834n953m08J488Q264J0714R991N978J516l193r686
1045G673j1191j0034n227k472L333R612J0628J1310O413L6l578q702j0145j0966
1059a3310n188k344N488P916R789R881N824P77m095q416q923q083l642k415M475
1074a2266O111R021N328L136K457m307l890o665l967l002k139L186M076M928m13
1089A594M375j570j591o99k560J9q2N97l87J146j359j434j827o64q00L532K782
1106A072L757L409Q54j647l638m954n469n347r10K113N603O817P639N431K054
1121A6784k996o138q901r077o170k395L762P121J0368Q896O486K660l432p253
$$ plain form
1135 9715 -1450 -12104 -18435 -21746 -17198 -8770 1887 12057 19451 21085 17163 9384 -1374 -12213
1149 -12213 -18202 -19786 -16531 -9538 1092 9797 16884 18696 15204 8728 -1026 -7394 -14261 -15766
1163 -15766 -12823 -7372 484 7086 11846 11366 10081 4247 -324 -4204 -7435 -8130 -7566 -3746 -874
1178 -874 2370 3691 2825 2458 1190 1097 384 -282 293 988 264 -1784 -2291 -4004 -4661 -4438 -2829 1894
1196 1894 4297 8665 9482 8040 4989 -1441 -6021 -12530 -12735 -11290 -6330 895 6886 14284 15965
1211 15965 14634 8514 -412 -9911 -15972 -18973 -16811 -9602 313 10255 17083 20216 18121 10693 -1070
1226 -1070 -10584 -19591 -20987 -18444 -10484 209 9628 17777 20543 18408 9362 502 -9770 -17574
1240 -17574 -19474 -16794 -10602 -751 9121 16413 17585 15897 8806 310 -7654 -12702 -13984 -13206 -7035
$$ packed form
1135I715j1165j0654o331l311M548Q428J0657J0170P394J634l922p779j0758j0839
1149a2213n989j584L255O993J0630Q705P087J812l492o476r754o368o867j505
1163a5766K943N451P856O602M760m80j285n834m571l880l231o95N64L820K872
1178h74L244J321q66l67j268r3p13o66N75O95p24k048n07j713o57K23J609M723
1196A894K403M368Q17j442l051o430m580o509k05J445M960P225N991P398J681
1211A5965j331o120q926r499o061l001K162P209R915R942O828L133k095p428j1763
1226a070r514r007j396K543P960J0693R419Q149K766k135r046q860j0272p804
1240a7574j900K680O192R851R872P292J172j688p091q496p964n048j282P78O171
$$ plain form
1255 -7035 -483 5930 9634 11076 10659 7098 1391 -3589 -6680 -8578 -6121 -4107 -719 1380 2282
1270 2282 3888 3625 1550 834 -104 1431 -582 1500 880 -739 -1939 -5125 -5427 -4363 -3147 -71
1286 -71 4861 7223 8925 10109 5058 -287 -6715 -11078 -12717 -12216 -6723 -62 7413 13564 15325 14939
1302 14939 10309 1581 -8652 -15455 -18501 -17861 -9954 -821 8021 16363 18486 18549 10959 1339 -8924
1317 -8924 -16811 -21370 -19067 -12033 -1806 8289 17199 21072 18553 11062 2133 -8392 -16185 -19075
1331 -19075 -16896 -10661 -3364 7047 13223 16863 14187 10220 1778 -6149 -11626 -14839 -12554 -8214
1345 -8214 -1664 4753 9188 10520 9783 7328 2325 -3200 -6283 -8094 -5628 -4320 -457 -115 2492
1360 2492 5335 2119 2406 311 -325 -349 1729 1286 1408 974 -1997 -4153 -6791 -5745 -3970 123 3105
$$ packed form
1255g035O552O413L704J442m17l561n707m980l091j898K457K014L388K099R02
1270B282J606k63k075p16r38J535k013K082o20j619j200l186l02J064J216L076
1286g1M932K362J702J184n051n345o428m363j639N01N493O661P475O151J761l86
1302A4939m630q728j0233o803l046O40P907R133Q842Q342K123O3p590r620j0263
1317h924p887m559K303P034J0227J0095Q910L873k519p491q929j0525p793k890
1331a9075K179O235P297J0411O176L640k676l967q442p927n477l213K285M340
1345h214O550O417M435J332p37k455n003n525l083j811K466J308L863L42K607
1360B492K843l216K87k095o36k4K078m43J22m34k971k156k638J046J775M093K982
$$ plain form
1377 3105 6679 9942 8691 6943 1925 -4227 -10605 -13664 -12446 -8281 -2065 5906 12678 16532 14802
1392 14802 9771 2680 -6413 -13944 -18048 -17086 -11632 -2969 7868 14951 19643 18113 13277 3085
1406 3085 -7244 -15621 -20524 -18543 -13516 -3575 7012 15891 18932 18951 12595 4247 -5881 -14701 -19073
1421 -19073 -17605 -11960 -2955 5645 12972 16014 15382 10828 2658 -4990 -10228 -13833 -14732 -9377 -2618
1436 -2618 4531 9790 9542 9917 6375 1313 -2492 -5710 -6630 -6275 -3896 -2057 1087 3849 2551 2083
1452 2083 960 -329 39 -44 2167 1787 2433 -312 -665 -3190 -4582 -6135 -4235 -1037 2032 6541
1468 6541 9855 9975 6590 1327 -3836 -8223 -13045 -13299 -7621 -3842 4296 10617 15294 16647 11430
1483 11430 4520 -4920 -13045 -17562 -17499 -12072 -4676 4217 13426 19418 19357 13715 3365 -5152 -15024
$$ packed form
1377C105L574L263j251j748n018o152o378l059J218M165O216P971O772L854j730
1392A4802n031p091r093p531m104R62N454Q663J0837P083M692j530m836j0192
1406C085j0329q377m903J981N027R941J0587Q879L041J9o356q348j0128q820m372
1421a9073J468N645R005Q600P327L042o32m554q170p648n238l605q99N355O759
1436b618P149N259k48L75l542n062l805l218r20L55K379J839L144K762j298m68
1452B083j123j289L68q3K211l80O46k745l53k525j392j553J900L198L069M509
1468F541L314J20l385n263n163m387m822k54N678L779Q138O321M677J353n217
1483A1430o910r440q125m517O3N427P396Q893R209N992o1n642j0350q517r872
$$ plain form
1498 -15024 -19966 -18986 -13050 -5086 5209 13921 19315 19446 14161 4984 -3697 -13772 -17810 -17793 -12419
1513 -12419 -3502 4252 11099 15543 15947 10694 4096 -3304 -9787 -13113 -12193 -8393 -2952 3124 8471
1528 8471 10081 9329 5166 2829 -2420 -4918 -6072 -6497 -4570 -1483 2126 2246 2684 1696 1068 -601
1544 -601 -1201 1151 1071 2493 1787 1066 -834 -4122 -4306 -6592 -5493 -2669 1439 6726 8411 9398 8003
1561 8003 3052 -2734 -8978 -12839 -12972 -9493 -3329 2982 10142 15059 15483 12003 4602 -3438 -11063
1576 -11063 -17398 -17948 -12855 -5137 4220 11910 17249 18598 14770 5834 -3595 -12164 -18149 -20018 -14212
1591 -14212 -6263 4297 12105 18035 18718 13011 6545 -4491 -11073 -16834 -17064 -12451 -5738 3472 10222
1606 10222 13989 14260 10490 4964 -2918 -7563 -12087 -11974 -8497 -3240 2950 6660 10375 8722 5964
$$ packed form
1498a5024m942R80N936P964J0295Q712N394J31n285r177q681j0075m038J7N374
1513a2419Q917P754O847M444M04n253o598p400o483l326R20L800N441O076N347
1528H471J610p52m163k337n249k498j154m25J927L087L609J20M38r88o28j669
1544f01o00K352q0J422p06p21j900l288j84k286J099K824M108N287J685R87j395
1561H003m951n786o244l861j33L479O164O311P160M917M24l480p401q040p625
1576a1063o335n50N093P718R357P690N339J349l828q936r429q569n985j869N806
1591a4212P949J0560P808N930O83n707o466j1036o582n761k30M613O713R210O750
1606A0222L767K71l770n526p882m645m524J13L477N257O190L710L715j653k758
$$ plain form
1621 5964 3202 -190 -2822 -5986 -5128 -3807 -1934 -854 1129 1681 568 1087 225 52 1586 1869
1637 1869 2806 2662 1467 -1265 -2709 -5682 -6472 -5484 -2104 1635 6046 9277 10224 8000 4020 -1023
1653 -1023 -7649 -11270 -12929 -10675 -5140 1826 10307 13897 15478 12228 5580 -3125 -9900 -16262 -17353
1668 -17353 -14559 -6978 2171 10957 17820 18133 13591 5045 -2304 -10923 -17125 -18863 -15291 -7349 2295
1683 2295 11681 17087 16933 14618 7286 -2904 -9774 -16224 -15959 -13497 -6192 1019 9383 14043 13779
1698 13779 11673 4867 -1484 -7627 -11505 -11591 -10374 -3744 216 6177 8976 8860 8000 2474 541 -3362
1714 -3362 -5565 -4400 -3100 -1528 674 1199 407 1601 2 134 645 1139 2516 2296 1911 750 -1653
1731 -1653 -2557 -5537 -7162 -6184 -2321 2437 5849 8474 10352 8498 4432 -1610 -7024 -11442 -13652
$$ packed form
1621E964k762l392k632l164Q58J321J873J080J983N52j113N19q62j73J534K83
1637A869R37j44j195k732j444k973p90R88L380L739M411L231R47k224l980n043
1653a023o626l621j659K254N535O966Q481L590J581l250o648q705o775o362j091
1668a7353K794P581R149Q786O863L13m542q546p349q619o202j738L572P942R644
1683B295R386N406j54k315p332j0190o870o450K65K462P305P211Q364M660k64
1698A3779k106o806o351o143l878q6J217O630L960N961K799j16q60n526j933l903
1714c362k203J165J300J572K202N25p92J194j599J32N11M94J377k20l85j161k403
1731a653r04k980j625R78L863M758L412K625J878j854m066o042n414m418k210
$$ plain form
1746 -13652 -11887 -5913 2291 7879 14269 15003 12875 6506 -1965 -9323 -15551 -17807 -14621 -7313 1874
1761 1874 9942 16742 18532 14744 7536 -1268 -10193 -16860 -18061 -15847 -7894 -398 9945 16376 16862
1776 16862 14321 8806 -1198 -9926 -14155 -16869 -14151 -7363 -191 8062 13161 14483 12170 6356
1790 6356 -213 -5988 -11140 -12694 -9225 -5771 -223 4922 7818 9333 5858 3512 -957 -2824 -4902
1805 -4902 -5796 -3593 -2538 -894 1192 1694 565 -65 314 -821 274 2079 2372 3875 1682 -464
1821 -464 -4033 -5091 -6223 -7365 -3186 -146 5159 8327 11339 8898 4868 87 -6115 -10854 -14024
1836 -14024 -10421 -6505 679 7963 12860 16068 14266 8826 -225 -8385 -14428 -17196 -15292 -9600 -109
1851 -109 9788 16003 18221 15762 8630 1136 -9434 -14867 -18637 -16509 -8799 -228 9404 15167 17687
$$ packed form
1746a3652J765N974Q204N588O390P34k128o369q471p358o228k256L186P308R187
1761A874Q068O800J790l788p208q804q925o667j201K214P953P496J0343O431M86
1776A6862k541n515j0004q728m229k714K718O788P172Q253N099J322k313n814
1790F356o569n775n152j554L469L454N548N145K896J515l475k346m469j867k078
1805d902q94K203J055J644K086N02j129o30L79j135J095J805K93J503k193k146
1821d64l569j058j132j142M179L040N305L168L012k441m030m781o202m739l170
1836a4024L603L916P184P284M897L208j802n440r051q160o043k768J904N692R491
1851a09R897O215K218k459p132p494j0570n433l770K128P710Q571R632N763K520
$$ plain form
1866 17687 14871 8955 -105 -7297 -13731 -16471 -14210 -8868 -713 6510 12587 14442 12204 7273 830
1881 830 -5799 -10122 -11584 -9239 -5936 -555 3951 6237 7315 6725 3961 537 -1341 -3488 -4009 -4097
1897 -4097 -2709 483 -116 499 35 731 -493 78 2378 1024 3449 3202 2268 -436 -3468 -5097 -6876
1914 -6876 -6965 -4880 -1252 3962 8225 8965 10474 6401 1018 -5506 -11014 -13589 -12798 -8613 -1478 6355
1930 6355 13894 14699 14687 8754 1056 -6362 -15281 -17005 -16274 -10095 -1245 7051 15164 18869 16972 10739
1946 10739 1513 -7636 -14854 -18647 -17021 -10228 -1395 6186 13943 16967 15336 9228 2146 -5508 -12965
1961 -12965 -14893 -14631 -9327 -1534 5042 12471 12525 12064 8290 1379 -4344 -8835 -10935 -9800 -5506 -1314
1977 -1314 3533 6942 6308 7182 3450 1961 -2562 -2849 -3059 -3840 -1399 -1228 1008 543 1033 1192 -408
$$ packed form
1866A7687k816n916r060p192o434k740K261N342Q155P223O077J855k238m931o443
1881H30o629m323j462K345L303N381M506K286J078n90k764l424j878k147n21q8
1897d097J388L192n99O15m64O96j224N71K300j354K425k47r34k704l032j629j779
1914f876q9K085L628N214M263P40J509m073n383o524n508k575P91M185P135P833
1930F355P539Q05j2n933p698p418q919j724P31O179Q850Q296Q113L705j897o233
1946A0739r226r149p218l793J626O793Q833P581P757L024j631o108p082p654p457
1961a2965j928K62N304P793O576P429N4m61l774o911n723m491k100J135M294M192
1977a314M847L409o34Q74l732j489m523k87k10p81K441J71K236m65M90J59j600
$$ plain form
1994 -408 314 461 3204 2239 4466 2677 220 -2157 -7210 -7318 -8143 -4120 -1501 4116 8824 9709 9757
2011 9757 7830 1068 -4385 -10048 -12667 -12107 -8211 -2472 5779 11678 15071 14749 9538 2687 -6306
2026 -6306 -14456 -16522 -16295 -10849 -2809 6388 13812 17311 17047 11195 2880 -5389 -12279 -17530 -16485
2041 -16485 -10869 -2557 5391 13391 16467 16327 11767 3575 -4588 -11326 -14307 -14219 -9260 -3890 5040
2056 5040 10518 12106 11679 7919 3532 -4226 -7845 -9584 -8671 -6357 -1856 3587 5070 6960 6270 4128
2072 4128 1687 -1680 -2153 -4093 -3258 -1940 -260 94 -502 532 -1619 -351 -1384 981 2233 3267
2088 3267 3888 1745 1824 -2094 -3850 -7189 -7063 -5857 -1022 2237 7619 9681 9819 8035 2828 -3002
2104 -3002 -9160 -12837 -13424 -9087 -3485 4458 10930 15836 13874 10011 4284 -4743 -10345 -15641 -15426
$$ packed form
1994d08P22J47K743r65K227j789k457k377n053j08q25M023K619N617M708Q85M8
2011I757j927o762n453n663k619N60L896N739Q251N899L393l22n211o851q993
2026f306q150k066K27N446Q040R197P424L499k64n852q315q269o890n251J045
2041a6485N616Q312P948Q000L076j40m560q192q163o738k981Q8M959N370Q930
2056E040N478J588m27l760m387p758l619j739R13K314M501N443J483J890o90k142
2072D128k441l367m73j940Q35J318J680L54n96J034k151J268j033K365J252J034
2088C267O21k143P9l918j756l339J26J206M835L259N382K062J38j784n207n830
2104c002o158l677n87M337N602P943O472M906j962l863n727r027n602n296K15
$$ plain form
2119 -15426 -11121 -3260 5574 11147 16081 16415 11417 3744 -5091 -11594 -16886 -16272 -11598 -4078 4900
2134 4900 11180 15882 14765 10971 5005 -4386 -11031 -14641 -14862 -9326 -3297 4473 8320 12919 11025
2149 11025 8200 3024 -4009 -6591 -9769 -8192 -7148 -1950 1763 4625 6552 6195 3826 1117 -717
2164 -717 -2655 -2046 -2715 -1159 -375 -895 234 -823 -184 -1643 75 913 2901 3354 4263 4021 1520
2181 1520 -2019 -4419 -7275 -6924 -5785 -2549 2137 5793 10178 9084 8202 3274 -3279 -8616 -12440
2196 -12440 -11491 -9076 -4389 3236 9601 14569 14238 10678 5686 -3496 -11089 -14189 -15077 -12337 -4655
2211 -4655 4110 12046 15971 14210 12103 4653 -3589 -10630 -14800 -16650 -12050 -5101 1738 10633 14849
2226 14849 15025 11598 3254 -2102 -8926 -13604 -12857 -9513 -3577 2553 8073 10959 12043 9483 3655
$$ packed form
2119a5426M305P861Q834N573M934L34m998p673q835o503n292O14M674P520Q978
2134D900O280M702j117l794n966r391o645l610k21N536O029P770L847M599j894
2149A1025k825n176p033k582l178J577J044N198L713K862J927l57k369k709j834
2164g17j938O09o69J556P84n20J129j057O39j459J718Q38J988M53R09k42k501
2181A520l539k400k856L51J139L236M686L656M385j094q82m928o553n337l824
2196a2440R49K415M687P625O365M968l31l560m992r182p593l100q88K740P682
2211d655Q765P936L925j761k107p450q242p041m170j850M600O949O839Q895M216
2226A4849J76l427q344n356o824m678P47L344N936O130N520K886J084k560n828
$$ plain form
2241 3655 -341 -6231 -8467 -9616 -7104 -2391 1680 4475 4939 6081 2958 1600 -228 -2306 -1926
2256 -1926 -2103 -1326 -648 79 490 314 -1501 -1147 967 2 2437 4165 3697 3866 2450 -1020 -5261
2273 -5261 -5964 -8396 -6094 -3936 2077 6087 9168 9943 8204 3733 -692 -7394 -11196 -12661 -10006
2288 -10006 -5501 1171 7519 13336 14745 11633 6048 -2229 -9469 -15595 -16553 -12691 -6662 2257 8695
2303 8695 15281 17426 12597 5759 -1804 -9621 -14907 -16044 -12256 -5899 1479 8821 14048 15562 11384
2318 11384 5222 -1837 -7931 -12887 -13497 -10279 -5396 1128 7025 10356 10824 8328 4115 -863 -5076
2333 -5076 -8662 -9065 -6707 -3833 -44 3691 6576 4988 2934 1979 -855 -1839 -2330 -2372 -413 -690 -130
2350 -130 1476 -69 -1825 -2697 -1326 1221 2925 3008 5443 4280 2400 399 -3927 -6627 -8508 -7316
$$ packed form
2241C655l996n890k236j149K512M713M071K795M64J142l123j358j828k078L80
2256a926j77P77O78P27M11j76j815L54K114r65K435J728m68J69j416l470m241
2273e261p03k432K302K158O013M010L081P75j739m471m425o702l802j465K655
2288a0006M505O672O348N817J409l112n585q277p240o126r58L862O029Q919O438
2303H695O586K145m829o838p563p817n286j137L788O357P378P342N227J514m178
2318A1384o162p059o094m956o10L218M883O524N897L331M68k496m213m978m213
2333e076l586m03K358K874L789L735K885j588k054r55k834r84m91m2J959k77N60
2350a30J606j545j756q72J371K547J704Q3K435j163j880k001m326k700j881J192
$$ plain form
2366 -7316 -4717 1344 6172 8489 11556 9635 5124 -1367 -6954 -11317 -11934 -11817 -5807 1314 7868
2381 7868 13003 14536 12474 6731 -1177 -8977 -13878 -16502 -14557 -7910 970 9868 14209 15800 12842
2396 12842 7290 -259 -9284 -13727 -15665 -13699 -6627 1007 7948 13620 14618 13046 7386 -207 -7085
2411 -7085 -11394 -13013 -9718 -5718 227 6961 10379 9992 8981 4951 -192 -6064 -8222 -7248 -6072
2426 -6072 -3498 -817 2880 5098 5816 4344 1524 686 -1411 -1193 -2622 -2299 350 -622 402 -893
2442 -893 -1513 -1602 -1007 -224 2106 3865 4580 5767 2993 73 -3698 -6386 -7665 -7664 -4338 -1218 4517
2459 4517 8872 11228 10181 5384 334 -5880 -11890 -12849 -11999 -7131 -934 6237 12779 14043 13965 7590
2475 7590 475 -8753 -13255 -17188 -13997 -8510 -853 7290 12558 15882 14505 8504 587 -7048 -13629
$$ packed form
2366g316K599O061M828K317L067j921m511o491n587m363o17J17O010P121O554
2381G868N135J533k062n743p908p800m901k624J945O647Q880Q898M341J591k958
2396A2842n552p549r025m443j938J966P072P634O941N672R98j572n660p593o878
2411g085m309j619L295M000N945O734L418l87j011m030n143n872k158R74J176
2426f072K574K681L697K218P18j472k820q38k097K18j429L23K649r72J024j295
2442h93o20q9N95P83K330J759P15J187k774k920l771k688j279JL326L120N735
2459D517M355K356j047m797n050o214o010r59Q50M868O197P171O542J264p8o375
2475G590p115r228m502l933L191N487P657Q143N268L324j377o001p917p635o581
$$ plain form
2490 -13629 -15635 -13873 -8631 -1236 6445 13363 14930 12626 7347 1544 -6051 -10834 -12691 -10871 -5302
2505 -5302 -976 5798 9394 10082 8729 6149 1208 -3318 -6374 -8407 -6711 -4535 -1152 3525 4836
2520 4836 6146 3250 2035 276 -741 -604 -2806 -1320 -606 -193 -1228 -2041 -1267 -3012 -1238 545
2536 545 2181 3740 5308 5549 2357 127 -3422 -6013 -8485 -7522 -5143 -965 4786 9215 11055 10151
2552 10151 5935 245 -5783 -9804 -12609 -11590 -6699 -1537 6176 12108 14103 12820 8130 2050 -5979
2567 -5979 -12401 -15737 -14750 -9035 -2035 6247 12006 16187 13953 8613 1795 -6335 -12723 -15260 -14032
2582 -14032 -8676 -1822 6515 11563 14390 12718 8152 1186 -5371 -10718 -11887 -9985 -7261 -509 4657
2597 4657 8053 10498 8498 6088 1497 -2440 -6489 -7598 -5908 -4433 -1360 1316 3798 3670 2679
$$ packed form
2490a3629k006J762N242P395P681O918J567k304n279n803p595m783j857J820N569
2505e302M326O774L596O88j353k580m941m526l056k033J696K176L383M677J311
2520D836J310k896j215j759j017J37k202J486P14M13j035q13P74j745J774J783
2536E45J636J559J568K41l192k230l549k591k472R63K379M178N751M429J840r04
2552A0151m216n690o028m021k805J019M891N162P713N932J995j283m690o080q029
2567e979o422l336R87N715P000Q282N759M181k234n340o818q130o388k537J228
2582a4032N356O854Q337N048K827j672m566o966o557n347j169J902K724O752N166
2597D657L396K445k000k410m591l937m049j109J690J475L073K676K482j28r91
$$ plain form
2612 2679 1434 1916 -273 -2285 -760 2 -848 -295 -935 -1578 -2284 -2083 -1445 -423 2194 4115 5205
2629 5205 4773 4036 1539 -3616 -5855 -8148 -7580 -5607 -2199 4490 8603 11346 9656 6773 1611 -5852
2645 -5852 -9261 -13179 -12153 -8306 -1681 4334 10705 14219 13599 9556 2563 -4913 -11565 -15243 -14275
2660 -14275 -9808 -2570 4910 11994 15185 14425 9740 3397 -4484 -10982 -14522 -13317 -10064 -2120 4437
2675 4437 11529 13143 13260 8605 3413 -3399 -10543 -11432 -10090 -7093 -1601 3655 7263 8701 8951 6201
2691 6201 1627 -2244 -5979 -5382 -6704 -3206 -37 1060 3415 2808 3362 1657 274 -197 -1766 148
2707 148 -445 800 -916 1382 -2166 -3254 -1656 -2557 -886 2015 3662 5998 6016 4902 805 -2352
2723 -2352 -7130 -8056 -8332 -5532 -1077 2091 7773 10058 10950 7770 2503 -3518 -8639 -11996 -11602 -8647
$$ packed form
2612B679j245M82k189k012J525P62q50N53o40o43p06K01O38J022K617J921J090
2629E205m32p37k497n155k239k293N68J973L408O689M113K743j690k883n162p463
2645e852l409l918J026L847O625O015O371L514o20m043o993p476o652l678R68
2660a4275M467P238P480P084L191p60m685o343p881o498l540J205L253P944O557
2675D437P092J614J17m655n192o812p144q89J342K997N492N256L608J438K50k750
2691F201m574l871l735N97j322L498L169J097K355o07N54j705j383m71j569J914
2707A48n93J245j716K298l548j088J598r01J671K901J647K336J8j114m097l157
2723b352m778r26k76K800M455L168N682K285Q92l180n267o021n121l357L94K955
$$ plain form
2739 -8647 -2449 3806 9645 13462 14310 9781 3543 -5672 -10902 -14699 -14056 -11367 -3525 3220 11621
2754 11621 15560 15161 11070 3139 -4650 -11594 -14258 -13904 -9957 -3681 4032 10713 12566 12913 8683
2769 8683 4486 -2945 -8602 -11627 -11602 -6843 -3152 2861 7246 9126 9795 6910 1603 -2047 -4327 -8047
2785 -8047 -6576 -3386 -1200 1742 2906 4113 3069 2480 814 -1594 140 -1399 146 -269 481 262
2801 262 -1366 -2033 -2359 -2939 -1499 1535 2718 5285 6028 4593 2452 -1975 -5495 -8188 -8664 -7249
2817 -7249 -3953 2095 5504 10557 10311 8387 3689 -2678 -8429 -12288 -11991 -9814 -3983 3142 8415
2832 8415 13411 14626 10549 5045 -2709 -9513 -14151 -14225 -12398 -4734 3010 9112 15672 15154 11381 4873
2848 4873 -3168 -9675 -13467 -12762 -11268 -4863 2510 8572 13028 12705 8327 3733 -2302 -8202 -11427
$$ packed form
2739h647O198O255N839L817Q48m529o238r215n230l797O43K689P842O745Q401
2754A1621L939l99m091p931p789o944k664L54L947O276P713O681J853L47m230
2769H683m197p431n657l025K5M759L691O013M385J880O69k885n307l650k280l720
2785h047J471L190K186K942J164J207j044n89j666k408J734j539J545m15P50k19
2801B62j628o67l26n80J440L034J183K567P43j435k141m427l520k693m76J415
2817g249L296O048L409N053k46j924m698o367n751l859K97K177N831P125N273
2832H415M996J215m077n504p754o804m638p4J827P664P744O102O560n18l773o508
2848D873q041o507l792P05J494O405P373O062M456l23m378m594o035n900l225
$$ plain form
2863 -11427 -11779 -7939 -3500 2447 6556 7992 8014 5832 2068 -1875 -4469 -5665 -5848 -5056 -1429 386
2879 386 2991 3412 3490 2248 359 -612 -1068 -884 1350 714 1919 -976 -1875 -2183 -3190 -2991 -1276 1914
2897 1914 2387 6646 5233 6081 3640 -201 -5236 -8433 -8842 -7815 -3619 1385 6641 10179 11413 9190
2913 9190 4586 -2455 -7273 -11602 -13072 -10832 -5418 2013 8250 13495 14162 11789 5654 -1459 -8549
2928 -8549 -14375 -14595 -12419 -5688 1321 8676 13311 14257 11835 6004 -1604 -8713 -11957 -13893 -11635
2943 -11635 -5041 1042 7291 12104 12015 9446 5012 -994 -6985 -9593 -9200 -9382 -4079 -24 5729 8355
2959 8355 8389 6754 2578 -801 -4347 -4912 -5909 -2762 -2692 590 1975 3412 3269 1790 1171 -368 -1586
2976 -1586 564 -513 1353 312 -926 -1556 -3212 -3982 -3579 97 260 2819 5076 5823 5692 3440
$$ packed form
2863a1427l52L840M439N947M109J436K2k182l764l943k594j196j83P92L627J815
2879C86K605M21P8j242j889r71m56J84K234o36J205k895q99l08j007J99J715L190
2897A914M73M259j413Q48k441l841n035l197m09J027M196N004N256L538J234k223
2913I190m604p041m818m329j470K240N414P431O237N245O67k373o135p113p090
2928h549n826k20K176O731P009P355M635R46k422n831p608p109l244j936K258
2943a1635O594O083O249M813q9k569m434o006n991k608L93j82N303M055N753K626
2959H355L4j635m176l379l546n65r97L147P0L282J385J437j43j479o19j539j218
2976a586K150j077J866j041j238o30j656p70M03L676J63K559K257P47j31k252
$$ plain form
2992 3440 282 -5984 -7324 -7696 -8376 -4371 525 6630 9094 11928 10289 5294 792 -8019 -10868
3007 -10868 -13494 -11749 -5764 1322 7359 11825 14617 13327 7364 -1592 -8144 -13133 -14465 -12080 -6939
3022 -6939 751 7943 12035 15724 12366 6976 -38 -7375 -11639 -13521 -10525 -7033 295 7687 11938
3037 11938 12084 9980 5607 242 -6176 -9320 -10882 -8150 -5489 1063 4788 6637 8360 7070 3198
3052 3198 -10 -2993 -5316 -6117 -3400 -2447 -146 455 3285 1817 635 1422 59 1090 -155 280
3068 280 -50 1700 258 -2750 -3498 -4743 -3379 -2524 278 3555 4813 7552 5401 3410 437 -4106
3084 -4106 -7676 -9504 -7934 -4762 450 6324 8428 11537 9278 6118 -462 -5630 -10127 -11904 -10718
3099 -10718 -6724 -992 6881 12108 14121 12461 7044 -398 -6011 -12442 -14371 -12551 -8061 -1154 6930
$$ packed form
2992C440l158o266j340l72o80M005M896O105K464K834j639m995m502q811k849
3007a0868k626J745N985P086O037M466K792j290n963q956o552m989j332K385N141
3022f939P690P192M092L689l358n390p014p337m264j882K996L492P328P392M251
3037A1938J46k104m373n365o418l144j562K732K661O552L725J849J723j290l872
3052C198l208k983k323q01K717R53K301O01K830j468j182P87j363J031j245M35
3068B80l30J750j442l008p48j245J364Q55K802L277J258K739k151j991k973m543
3084d106l570j828J570L172N212N874K104L109k259l160o580n168m497j777J186
3099a0718L994N732P873N227K013j660n417p442n613o431j929J820M490O907Q084
$$ plain form
3114 6930 12010 14532 12639 7047 530 -6347 -11236 -13561 -11630 -7484 -734 5473 9962 13113 10555
3129 10555 6047 968 -4272 -9180 -9958 -8646 -6327 -660 4072 7312 7266 7456 3969 902 -1820 -4681
3145 -4681 -5523 -4257 -2671 -445 767 2014 38 2930 358 -120 -31 486 719 -41 1880 -1070 -1526
3162 -1526 -2995 -3471 -2913 -2670 -47 2240 4213 7102 5943 3998 672 -3741 -6762 -8919 -8849 -5799
3178 -5799 -1224 3438 8890 10756 11409 7811 1051 -5788 -10819 -13872 -12845 -8076 -1718 5570 11699
3193 11699 13888 12754 8267 1641 -5002 -11261 -15067 -13391 -8131 -869 5645 11413 12921 12825 7661
3208 7661 1572 -5370 -11500 -13496 -12112 -7946 -1735 4726 9875 11692 11885 5981 1861 -4169 -8252
3223 -8252 -9819 -8915 -5814 -1091 3675 6681 7633 7376 2682 1400 -2543 -3731 -5372 -4536 -2098 -1344
$$ packed form
3114F930N080K522j893n592o517o877m889k325J931M146O750O207M489L151k558
3129A0555m508n079n240m908p78J312K319N667M732L240m6J90l487l067k722k861
3145d681q42J266J586K226J212J247j976K892k572m78Q9N17K33p60J921k950m56
3162a526j469m76N58K43K623K287J973K889j159j945l326m413l021k157P0L050
3178e799M575M662N452J866O53l598o760o839n031l053J027M769O358P288O129
3193A1699K189j134m487o626o643o259l806J676N260P262O514N768J508r6n164
3208G661o089o942o130j996J384M166O211O461N149J817J93n904m120o030m083
3223h252j567R04L101M723M766L006R52k57m694j282l943j188j641Q36K438P54
$$ plain form
3239 -1344 1130 2193 2558 998 772 -373 -25 859 333 2027 1356 951 -335 -3376 -3770 -5000 -3282
3256 -3282 -1152 2061 4953 6596 7031 4403 2252 -3426 -7413 -9128 -8895 -7181 -1846 3994 8048
3271 8048 11177 11012 7210 2662 -3995 -9752 -12575 -11596 -8817 -2672 5273 10331 14092 13906 8936 2626
3287 2626 -5598 -11259 -13890 -14003 -8678 -2930 5295 10570 13512 13585 9144 2382 -5277 -9662 -13411 -12771
3303 -12771 -6396 -1188 5343 8080 11612 10692 7453 1439 -3057 -7067 -10611 -8409 -5967 -909 2695
3318 2695 5503 7242 6311 3891 2365 -1963 -3837 -4501 -4611 -2616 -560 1359 3045 2561 911 1687
3334 1687 -24 14 640 626 2213 1626 1055 -554 -1885 -4166 -3651 -3956 -1793 1613 4348 7653 7082
3351 7082 5124 2978 -1869 -5702 -9411 -9036 -7452 -2006 2286 8329 10583 11393 9022 3810 -2805
$$ packed form
3239a344K474J063L65j560k26j145L48Q84n26J694o71m05j286l041l94j230J718
3256c282K130L213K892J643M35k628k151n678l987j715K33J714N335N840M054
3271H048L129j65l802m548o657n757k823R79K779O145P945N058L761j86m970o310
3287B626q224n661k631j13N325N748Q225N275K942P3m441o762p659m385l749O40
3303a2771O375N208O531K737L532r20l239o014m496m010l544K202K442N058L604
3318B695K808J739r31k420j526m328j874o64j10J995K056J919J686m84j650P76
3334A687j711L8O26j4J587n87n71j609j331k281N15l05K163L406K735L305n71
3351G082j958k146m847l833l709L75J584N446M292O043K254Q10k371n212o615
$$ plain form
3366 -2805 -9064 -12222 -12848 -9432 -3076 3171 9744 13423 12361 9498 3327 -3124 -9452 -13334 -13798
3381 -13798 -10475 -3445 3200 10477 13048 13926 10743 3797 -3516 -9191 -12550 -12221 -9175 -2960 2574
3396 2574 8092 10295 10406 8260 2608 -2385 -7023 -9151 -9100 -5585 -1656 1910 5319 6753 7410 4800
3412 4800 459 -1183 -3369 -3933 -4716 -1303 -428 230 2628 2010 1342 165 -489 98 718 1417 450 2373
3430 2373 604 187 -1696 -4148 -4425 -4118 -1945 725 3691 7024 6898 6439 2395 -1196 -5508 -9167
3446 -9167 -9090 -7585 -2999 1214 7122 11350 11285 8581 3783 -1594 -8860 -12201 -14113 -9864 -3884 2866
3462 2866 9931 12328 13258 10342 3973 -3543 -8928 -12351 -14297 -10978 -4124 1255 8932 12142 12906
3477 12906 10147 4298 -1375 -8222 -11114 -11733 -9355 -3857 1200 7855 10161 11382 8529 2538 -1398
$$ packed form
3366b805o259l158o26L416O356O247O573L679j062k863o171o451o328l882m64
3381a3798L323P030O645P277K571Q78l183o946p313n675l359L29L046O215N534
3396B574N518K203J11k146n652m993m638k128N1L515L929L566L409J434O57k610
3412D800m341j642k186n64p83L413Q75O58K398o18o68j177o54N87O20O99r67J923
3430B373j769m17j883k452k77L07K173K670K966L333j26m59m044l591m312l659
3446i167P7J505M586M213N908M228o5k704m798n377p266l341j912M249N980O750
3462B866P065K397R30k916o369p516n385l423j946L319O854N379P677L210P64
3477A2906k759n849n673o847k892o19K378N498N057O655K306J221k853n991l936
$$ plain form
3492 -1398 -6456 -7761 -8939 -6466 -1796 1067 5153 6091 4783 3442 1685 -352 -3014 -4340 -3979
3507 -3979 -2525 -1802 1960 1121 1704 1713 -485 125 -1284 951 1706 2003 2821 1730 86 -2519 -3906
3524 -3906 -6200 -3033 -3198 487 4383 6448 7415 5229 3602 -1598 -5659 -9768 -10232 -7497 -4077 1479
3540 1479 6933 10009 11372 9187 5109 -1427 -7493 -11943 -12844 -10931 -5754 1757 7971 12449 14642
3555 14642 10831 5418 -883 -8212 -12335 -14469 -10476 -5613 1663 7973 12266 12712 10669 5346 -556
3570 -556 -7165 -11591 -11897 -9216 -4245 726 5750 9652 10178 7863 4503 -1625 -4779 -8048 -7897 -7083
3586 -7083 -4243 184 3364 5994 5542 5539 2971 -482 -2836 -4385 -2748 -3152 -689 691 1272 1986 490
3603 490 592 -283 128 150 2507 1583 2116 593 -191 -1483 -3866 -4272 -4132 -3086 1606 3023 6740 6524
$$ packed form
3492a398n058j305j178K473M670K863M086R38j308j341j757k037k662j326L61
3507c979J454P23L762q39N83Rk198O10j409K235P55K97Q18j091j644k605j387
3524c906k294L167j65L685L896K065R67k186j627n200m061m109m64K735L420N556
3540A479N454L076J363k185m078o536o066m450r01J913N177P511O214M478K193
3555A4642l811n413o301p329m123k134L993M863P276O310M293M46k043n323n902
3570e56o609m426l06K681M971M971N024L902N26k315l360o128l154l269J51Q14
3586g083K840M427L180K630m52lk568l453k354j549J637m04K463J380N81P14j496
3603D90J02q75M11K2K357r24N33j523p84j292k383m06J40J046M692J417L717k16
$$ plain form
3621 6524 6349 3864 -392 -5193 -7961 -9557 -9699 -4968 736 6346 10274 12001 10493 6174 -1840
3636 -1840 -5956 -10622 -13012 -11815 -5387 -6 6877 12211 12736 10880 6809 -592 -7108 -11485 -13449
3651 -13449 -11767 -6876 179 7412 11833 13225 10809 5585 731 -7105 -10952 -11516 -10828 -5569 388
3666 388 5879 9325 10500 9017 4419 491 -4229 -7932 -9231 -7113 -3206 142 3396 6107 5929
3681 5929 4299 2476 883 -2659 -1461 -3526 -3474 -839 220 264 -892 42 318 128 -226 -427 2692
3698 2692 2351 2920 688 616 -1563 -5330 -5159 -5654 -3198 -431 3718 7665 7281 7579 4227 -305 -4399
3715 -4399 -8068 -10777 -9799 -4925 28 4663 9115 11177 10961 6126 1331 -5608 -11403 -13428 -11427
3730 -11427 -6796 -929 6019 11687 14200 12038 7771 1177 -7176 -11518 -13764 -13889 -6252 -1599 5965
$$ packed form
3621F524j75k485m256m801k768j596j42M731N704N610L928J727j508m319q014
3636a840m116m666k390J197O428N381O883N334N25j856m071p401o516m377j964
3651a3449J682M891P055P233M421J392k416n224m854p836l847n64O88N259N957
3666C88N491L446J175j483m598l928m720l703j299K118L907L348L254K711j78
3681E929j630j823j593l542J198k065N2K635J059M4j156R34K76j90l54k01L119
3698B692l41N69k232p2k179l767J71m95K456K767M149L947l84K98l352m532m094
3715d399l669k709R78M874M953M635M452K062k16m835m795o939n795k025K001
3730a1427M631N867O948N668K513k162m267o594q353m342k246j25P637M653P564
$$ plain form
3745 5965 12022 12992 11982 6538 899 -5929 -10699 -13298 -11450 -6056 -1213 4409 9223 10641 9172
3760 9172 5694 539 -4173 -6648 -8442 -6705 -3279 -911 3375 5558 6098 4267 3383 -138 -1944
3775 -1944 -2857 -3414 -1771 -1820 63 1391 993 169 -1754 -623 -1793 1142 2916 2825 2610 1783 1248 -1690
3793 -1690 -4159 -6175 -6061 -3281 -543 4223 6024 7913 8137 5040 1194 -3524 -7905 -10764 -10528 -6451
3809 -6451 -1154 5237 9433 11264 11325 7945 1599 -5213 -9686 -13245 -11883 -8340 -2082 5414 9686
3824 9686 13107 12551 8906 1831 -6123 -11005 -13920 -13494 -8018 -2210 5584 10189 12937 12705 7524 1236
3840 1236 -4999 -9702 -12768 -10351 -7055 -490 5099 7881 10126 9157 5128 1476 -3529 -7444 -7665
3855 -7665 -6882 -4573 -628 2013 5112 5271 4657 3208 592 -1491 -2214 -2480 -2210 -1061 59 -512 -128
$$ packed form
3745E965O057R70j010n444n639o828m770k599J848N394M843N622M814J418j469
3760I172l478n155m712k475j794J737L426K368M286K183N40j831q84l521j806
3775a944r13n57J643m9J883J328l98q24j923J131j170K935J774r1k15q27n35k938
3793a690k469k016J14K780K738M766J801J889K24l097l846m718m381k859K36M077
3809f451N297O391M196J831O1l380o346o812m473l559J362L543O258P496M272
3824I686L421n56l645p075p954m882k915M26N476N808P794M605K748k32n181o288
3840A236o235m703l066K417L296O565N589K782K245r69m029l652n005l915k21
3855g665P83K309L945K641L099J59o14j449k616k083p23k66K70J149J120n71L84
$$ plain form
3872 -128 -639 -903 -928 -175 112 507 3833 2866 2153 -327 -819 -3025 -6806 -5222 -4359 -1568 2870 5220
3890 5220 8576 6881 6071 1509 -1666 -7499 -10675 -10220 -6962 -3238 3745 8940 11604 10448 7897
3905 7897 1787 -3800 -9676 -12512 -11923 -8190 -1322 4286 10374 12881 11887 8906 2609 -4048 -10220
3920 -10220 -12863 -13638 -9750 -1842 3802 10269 12303 11760 8262 956 -3073 -9295 -11728 -11151 -6579
3935 -6579 -1173 3482 7986 10900 9589 5837 2087 -3496 -6294 -7694 -6997 -5456 -777 1856 2877
3950 2877 4557 4934 2501 843 -651 -1836 -2000 -3424 -898 -1692 198 -244 -416 -1056 -837 -1059 -54
3967 -54 2501 2306 3797 3756 938 -1576 -4531 -5873 -6217 -4434 -1703 2314 5240 8079 8549 6220 2370
3984 2370 -1736 -7018 -9684 -11493 -7187 -2485 2808 7436 10872 10749 8784 4348 -3125 -9305 -12024
$$ packed form
3872a28n11k64k5P53K87L95L326r67p13k480m92k206l781J584Q63K791M438K350
3890E220L356j695q10m562l175n833l176M55L258L724O983N195K664j156k551
3905G897o110n587n876k836N89L733O868N608O088K507r94k981o297o657o172
3920a0220k643p75L888P908N644O467K034n43l498p306m029o222k433N77M572
3935f579N406M655M504K914j311l752l750n583k798j400O97J541M679K633J021
3950B877J680L77k433j658j494j185j64j424K526p94J890m42j72o40K19k22J005
3967e4K555j95J491m1k818k514k955j342l44J783K731M017K926K839M70k329l850
3984B370m106n282k666j809M306M702N293M628L436j23j965m436p473o180k719
$$ plain form
3999 -12024 -13245 -9601 -3864 3729 8967 12521 12800 9542 4042 -3890 -9686 -12364 -12835 -9036 -3759
4014 -3759 2911 9870 11911 11470 8175 2794 -3568 -7519 -10243 -9200 -7231 -1764 2102 6804 8610
4029 8610 8790 4781 2142 -2225 -4948 -7403 -6927 -4617 -1707 416 3598 5437 3911 2565 1599 -1629
4045 -1629 -2219 -2748 -1499 -582 150 1116 -586 451 -741 -781 -335 783 2145 2678 3891 4206 216
4062 216 -933 -2882 -5930 -6172 -4499 -3292 2009 5135 7428 8311 6664 2990 -1968 -6564 -9274 -10613
4078 -10613 -8642 -3605 3347 7373 11158 11740 8870 4004 -2162 -8222 -12082 -12196 -9251 -3609 2150
4093 2150 7701 11667 12911 9179 4085 -2691 -8603 -13120 -13421 -8881 -4211 1542 8416 11577 11780
4108 11780 9559 3771 -1358 -7404 -10442 -10856 -8401 -3856 1867 7098 9564 8190 5863 2878 -1944
$$ packed form
3999a2024j221L644N737P593N238L554K79l258n500p932n796k678m71L799N277
4014c759O670O959K041m41l295n381o362l951k724J043J969N467L866M702J806
4029H610J80m009k639m367k723k455M76K310K910K123L182J839j526j346r66l228
4045a629n90n29J249R17P32R66j702J037j192m0M46J118J362N33J213L15l990
4062B16j149j949l048k42J673J207N301L126K293Q83j647l674m958m596k710j339
4078a0613J971N037O952M026L785N82k870m866o166o060l860j14K945N642N759
4093B150N551L966J244l732n094o776n912m517l01M540M670N753O874L161K03
4108A1780k221n788n129o046l038m14K455M545N723N231K466j374k327k985m822
$$ plain form
4123 -1944 -4437 -6421 -5750 -4895 -1560 697 4006 4677 4562 2746 105 291 -1749 -1357 -783 -1760 -327
4140 -327 431 1060 -376 -690 -689 -1307 504 938 3061 4005 3404 1463 -1452 -3236 -5489 -5875 -5159 -2667
4158 -2667 677 4677 7928 8384 7906 3393 -1687 -6927 -8876 -11183 -8822 -4685 956 8408 10880
4173 10880 11776 9555 3852 -1391 -8640 -12524 -12587 -10947 -4400 2048 7467 10595 12902 9694 5175
4188 5175 -1248 -8255 -11921 -11700 -10849 -5617 1493 8045 10448 12600 10170 6056 -1637 -7271 -10368
4203 -10368 -10296 -9723 -4507 692 5393 7981 8478 8085 4218 -612 -5258 -5494 -7575 -4568 -2211 633
4219 633 3493 3545 4146 2723 2264 -851 -646 -1313 -1548 -379 -222 1051 224 -1152 -511 -1917 -1065 -772
4237 -772 1774 3928 4398 3276 2617 -239 -2609 -5670 -5393 -5123 -2959 1202 4344 7600 9815 7808
$$ packed form
4123a944k493j984O71Q55L335K257L309O71j15j816k641J86k040L92N74r77J433
4140c27P58O29j436l14Jo18J811M34K123R44o01j941k915j784k253l86P16K492
4158b667L344M000L251M56m78m513n080n240j949k307K361M137N641P452K472
4173A0880Q96k221n703n243p249l884o3J640O547O448N419L128K307l208m519
4188E175o423p007l666K21Q51N232P110O552K403K152k430m114p693n634l097
4203a0368P2N73N216N199M701K588M97l93l867m830m646k36k081L007K357K844
4219F33K860N2O01j423m59l115K05o67k35J169J57J273q27j376O41j406Q52K93
4237g72K546K154M70j122o59k856k370l061K77K70K164M161L142L256K215k007
$$ plain form
4253 7808 5054 135 -5856 -8240 -11356 -9382 -5590 37 6278 10131 11378 9896 6127 371 -6684
4268 -6684 -10871 -13440 -11246 -5835 -190 7592 11413 13135 11331 7064 -115 -7750 -11059 -13337 -11645
4283 -11645 -6578 1307 7292 10435 12459 10131 6812 -1264 -6952 -8579 -11310 -8308 -5489 -786 4915
4298 4915 6958 8561 6489 3746 -659 -2755 -5272 -6476 -4575 -3861 209 2795 3772 3672 2544 1232
4314 1232 -992 -660 -2009 -1201 57 -382 228 -1147 -852 -2300 -2512 -1019 -389 1220 3228 5178 4079
4331 4079 3761 53 -2294 -4540 -6765 -5171 -4362 -532 3405 7323 9294 8341 5555 965 -4464 -8399
4347 -8399 -10663 -8941 -6675 422 4846 10124 11122 10692 6200 -733 -5542 -11259 -11562 -10322 -7617 -69
4363 -69 6478 11049 13527 11770 6748 -73 -5817 -11354 -12699 -11323 -7132 -1541 5599 9708 11894
$$ packed form
4253G808k754m919n991k384l116J974L792N627O241L853J247j482l769n756p055
4268f684m187k569K194N411N645P782L821J722j804m267p179p635l309k278J692
4283a1645N067P885N985L143K024k328l319q076n688j627k731L002K819M703N701
4298D915K043J603k072k743m405k096k517j204J901P14M070K586R77j00j128j312
4314A232k224L32j349Q08J258m39O10j375K95j448k12J493O30J609K008J950j099
4331D079l18l708k347k246k225J594Q09L830L937L918J971r53k786m590n429l935
4347h399k264J722K266P097M424N278R98m30m492o933m809n717l03J240K705P548
4363f9O547M571K478j757n022o821n744n537j345J376M191N591P140M109K186
$$ plain form
4378 11894 10080 5712 517 -5768 -9122 -9280 -8805 -4290 -519 3965 8332 7634 8053 5125 42 -3018
4394 -3018 -6082 -5625 -5285 -2663 24 1606 3712 3312 3423 902 450 -1214 -1390 -193 -326 -87 -210
4411 -210 357 -1184 -2266 -1993 -1429 -324 1290 4061 4958 4240 3890 -206 -1938 -6659 -6918 -7270 -4624
4428 -4624 -1789 2590 7325 8232 9161 6023 1171 -4517 -8335 -10286 -10631 -7403 -30 4858 8978 11854
4444 11854 11627 6860 1534 -6681 -9310 -13064 -12410 -7195 -2546 4806 10596 13247 11710 7421 2243
4459 2243 -6239 -10474 -12906 -11571 -7514 -1174 4658 8941 10847 9763 7430 2100 -3483 -7529 -9202
4474 -9202 -9954 -5437 -1317 2943 5366 8537 7777 4941 1452 -2284 -5511 -6826 -5463 -3487 -388
4489 -388 1922 2152 3698 3178 2572 1130 -1526 -221 -991 -804 -533 -114 -365 -1801 -2123 -2611 -1980 -482
$$ packed form
4378A1894j814m368n195o285l354j58M75M515L771M484M367o98M19k928n083l060
4394c018l064M57L40K622K687J582K106m00J11k521m52j664j76J197j33K39j23
4411b10N67j541j082K73N64J105J614K771Q97p18l50m096j732m721k59l52K646
4428d624K835M379M735R07R29l138m852n688l818j951l45L228P373M888M120K876
4444A1854k27m767n326q215k629l754O54N215M649P352N790K651j537m289n178
4459B243q482m235k432J335M057O340N832M283J906j084k333n330n583m046j673
4474i202p52M517M120M260K423L171p60k836l489l736l227j315J363J976L099
4489c88K310K30J546n20o06j442k656J305p70J87K71M19k51j436l22m88O31J498
$$ plain form
4507 -482 1056 2345 3598 4779 2499 1168 -2902 -4798 -6286 -6439 -4382 -2764 2637 6119 9694
4522 9694 8971 5170 1318 -3966 -7829 -10361 -9926 -7475 -2279 3701 8818 11563 11028 8053 2150 -4713
4538 -4713 -9843 -13158 -12283 -8016 -2773 3715 9264 12006 11939 9775 2875 -4240 -9156 -11812 -11727 -8449
4554 -8449 -1821 4386 9200 10986 11178 6692 1358 -2878 -6777 -9964 -8854 -5844 -1975 3467 6002
4569 6002 8048 6894 5117 1041 -1787 -4265 -5549 -5512 -2602 -1884 2386 3841 3190 2894 2267 173
4585 173 156 -861 -1118 152 530 445 -975 -136 -2793 -2338 -1838 -472 1532 2692 4815 5542 4142 1956
4603 1956 -2091 -4158 -6890 -6551 -5688 -1663 2567 7748 9264 8443 7726 2089 -3195 -7502 -10582 -10564
4619 -10564 -8017 -2964 2874 7927 11152 11382 9162 2841 -2548 -8954 -12026 -11670 -8492 -2400 2094
$$ packed form
4507d82J538J289J253J181k280j331m070j896j488j53K057J618N401L482L575
4522I694p23l801l852n284l863k532M35K451N196N980N117K745n35k975n903o863
4538d713n130l315Q75M267N243O488N549K742o7k164o900p115m916k656Q5L278
4554h449O628O207M814J786J92m486n334m236l899l187J110L010L869N442K535
4569F002K046j154j777m076k828k478j284L7K910P18M270J455o51k96o27k094
4585A73j7j017k57J270L78q5j420Q39k657M55N00J366K004J160K123P27j400k186
4603A956m047k067k732L39Q63M025M230N181J516q21p17n637n284m307l080J8
4619a0564K547N053N838N053L225K30k220o321n389o406l072L56L178O092M494
$$ plain form
4634 2094 8453 12418 12044 8626 2525 -3634 -8660 -12532 -11107 -9356 -3468 2922 7892 11334 10751
4649 10751 6384 2690 -2259 -7781 -8875 -9022 -7527 -2063 3203 5750 8654 6339 6003 1389 -1511
4664 -1511 -5023 -4928 -4595 -2852 -1384 1184 2162 2202 2909 837 605 60 -205 78 -416 585 521 -710
4682 -710 -192 -3502 -2798 -2915 -734 -622 2669 4499 5617 3965 1573 -641 -3365 -6539 -7553 -6307
4698 -6307 -2720 1281 6614 8075 9893 7568 3672 -1982 -6860 -9770 -10471 -8122 -4444 2050 7011
4713 7011 11265 12681 8699 3859 -1697 -8283 -11394 -12279 -9544 -3661 2315 9316 12025 12258 8891
4728 8891 5076 -1892 -7184 -11439 -11950 -8425 -4904 3133 6865 9986 10367 8776 3275 -2791 -6246
4743 -6246 -10069 -10149 -6443 -3659 1577 5018 7059 6735 5226 2417 -1522 -3565 -5044 -5075 -3256 -1171
$$ packed form
4634B094O359L965l74l418o101o159n026l872J425J751N888O390M970L442n83
4649A0751m367l694m949n522j094j47J495N464N266K547K904k315l36m614k900
4664a511l512R5L33J743J468K568R78M0P07k072k32n45k65K83m94J001o4j231
4682g10N18l310P04j17K181J12L291J830J118j652k392k214k724l174j014J246
4698f307L587M001N333J461J818k325l896n654m878k910p01K349L678O494M961
4713G011M254J416l982m840n556o586l111q85K735N883N976P001K709K33l367
4728H891l815o968n292m255n11L525L521Q037L732L121L81j591n501o066l455
4743f246l823q0L706K784N236L441K041l24j509k809l939k043j479l1J819K085
$$ plain form
4759 -1171 1128 2358 3235 2955 2444 195 -1344 -342 -1178 796 1153 605 212 -1373 -810 -2505 -2732
4776 -2732 -1324 -158 3343 4317 7115 5334 1968 -687 -3828 -5846 -7239 -6259 -4021 954 5704
4791 5704 7326 9582 7493 4286 -1280 -6250 -9887 -11547 -9297 -4575 1922 7140 12277 11878 9825
4806 9825 4211 -2313 -5382 -11824 -12166 -10626 -5492 1808 7064 10986 12221 8694 4579 54 -6539
4821 -6539 -11048 -11529 -10028 -4486 751 5435 9266 10513 8786 4925 -2118 -6342 -8757 -8743 -7614 -3186
4837 -3186 1340 4524 6473 7564 5586 2505 -1196 -2962 -5574 -4522 -4669 -1332 833 2153 2048
4852 2048 1482 1807 -185 -339 -314 1452 140 396 1554 27 -1922 -2120 -2600 -2363 -2569 1339 2013 5076
4870 5076 5232 5363 2758 -529 -4337 -6924 -8059 -6938 -4078 881 5586 9248 9840 8776 4705 144
$$ packed form
4759a171K299J230Q77k80n11k249j539J002q36J974L57n48l93j585N63j695k27
4776b732J408J166L501R74K798j781l366k655l141k018j393R80K238M975M750
4791E704J622K256k089l207n566m970l637j660K250M722O497N218N137l99k053
4806I825n614o524l069o442l42J540N134P300N256L922J235l527m115m525o593
4821f539m509m81J501N542N237M684L831J247j727l861p043m224k415J4J129M428
4837c186M526L184J949J091j978l081l701j766k612J052j47L337K165J320j05
4852B048n66L25j992j54K5J766j312K56J158j527j949j98m80K37k06L908O74L063
4870E076J56J31k605l287l808k587j135J121K860M959M705L662N92j064m071m561
$$ plain form
4886 144 -6083 -9903 -10321 -10130 -3595 -473 6323 10108 13254 11451 4837 -242 -5903 -11096 -13660 -9789
4902 -9789 -5668 -323 6594 10551 11951 11066 5247 -653 -5673 -9597 -11309 -9343 -6604 -401 5094
4917 5094 9052 11285 8410 5540 -854 -4723 -7780 -7949 -7752 -4555 347 3649 6454 6100 5709 2631
4933 2631 270 -3585 -3795 -4914 -3427 -1444 -1258 796 2133 2255 350 432 555 -449 771 2031
4949 2031 2052 972 437 -1459 -2993 -2523 -2994 -1444 -54 2723 4944 5947 5443 3261 -40 -3910
4965 -3910 -5465 -6788 -6874 -4271 -398 5093 7264 10244 8881 5290 841 -5293 -9722 -10918 -10047 -6111
4981 -6111 -519 6298 10062 12874 10099 6284 707 -4516 -10372 -13112 -10261 -7442 -1017 5292 9707
4996 9707 12063 11393 6695 77 -5317 -9211 -11820 -9512 -5354 -163 6211 8887 11043 8717 6052
$$ packed form
4886A44o227l820m18J91O535L122O796L785L146j803o614n079n661n193k564L871
4902i789M121N345O917L957J400q85n819n900n020l924j712J966K739O203N495
4917E094L958K233k875k870o394l869l057j69J97L197M902L302K805l54l91l078
4933B631k361l855k10j119J487J983J86K054J337J22j905Q2J23j004J220J260
4949B031K1j080n35j896j534M70m71J550J390K777K221J003n04k182l301l870
4965c910j555j323q6K603L873N491K171K980j363l591m449o134m429j196Q71L936
4981f111N592O817L764K812k775l815n577n223n856k740K851K819O425O309M415
4996I707K356o70m698o618n394l894k609K308M158N191O374K676K156k326k665
$$ plain form
5011 6052 -386 -3282 -6967 -8037 -7057 -4211 -1176 1263 5133 7828 4567 2300 833 -2805 -2746 -4709
5027 -4709 -2879 -1962 -804 1844 1133 1623 1198 1379 -469 825 694 1133 1691 976 957 -1423 -2350 -4000
5045 -4000 -3011 -2334 -681 3355 4275 5745 5537 4281 430 -4780 -6242 -8319 -6551 -4886 -472 4348
5061 4348 7436 10353 9423 6157 1368 -3874 -8153 -10548 -9950 -6240 -1260 3498 8450 11630 11006 6945
5077 6945 813 -3984 -9509 -11862 -10593 -6184 -2554 4748 10129 11865 10162 5773 1429 -5198 -9420
5092 -9420 -11206 -10790 -6976 -1152 4236 8038 9565 9566 5203 1802 -2961 -7063 -8118 -5979 -4680 -1429
5108 -1429 2798 4860 5925 4808 3347 430 -1306 -4236 -3602 -2988 -1630 -502 1167 1129 1699 1496
5124 1496 820 166 956 1365 1774 1707 1343 -569 -124 -1835 -4315 -2573 -2909 -599 1734 3967 5917
$$ packed form
5011F052o438k896l685j070R80K846L035K439L870K695l261k267j467l638N9j963
5027d709J830R17J158K648p11M90m25J81j848J294j31M39N58p15j9k380r27j650
5045d000R89O77J653M036R20J470k08j256l851n210j462k077J768J665M414M820
5061D348L088K917r30l266m789n242m279k395N98L710M980M758M952L180o24m061
5077F945o132m797n525k353J269M409L630P302N381J736j703m389m344o627m222
5092i420j786M16L814N824N388L802J527Jm363l401m763m102j055K139J299L251
5108a429M227K062J065j117j461k917j736k930O34O14J358J128J669l8N70k03
5124A496o76o54P90M09M09o7l64j912M45j711k480J742l36K310K333K233J950
$$ plain form
5141 5917 5849 4858 1099 -2390 -5630 -7742 -7279 -5699 -617 2886 7933 8882 9426 6811 1724 -3727
5157 -3727 -8033 -10105 -11608 -7769 -1407 3192 8344 10768 10984 6835 1742 -3504 -8729 -11659 -11002
5172 -11002 -8529 -2566 3919 8790 12243 10694 7651 2593 -3948 -7914 -10775 -10420 -6336 -1864 3969
5187 3969 6833 9261 8402 6082 2055 -3322 -5954 -8036 -8139 -4481 -774 1240 5454 5299 6723 3116
5203 3116 274 -1409 -3964 -3817 -3277 -1554 -443 1533 1002 1907 1123 659 734 -1047 -51 1509 2745
5220 2745 1972 225 -640 -2562 -3661 -4074 -3202 -1225 1560 3008 5585 5881 4455 2295 -1415 -5425
5236 -5425 -7637 -8017 -4797 -2681 2457 6651 8594 9719 6819 3589 -3473 -6766 -9844 -11443 -7246
5251 -7246 -4134 3194 8038 11590 11342 7755 3433 -2589 -7566 -12076 -12410 -8544 -3471 2741 7649
$$ packed form
5141E917o8r91l759l489l240k112M63J580N082L503N047R49N44k615n087n451
5157c727m306k072j503L839O362M599N152K424K16m149n093n246n225k930O57
5172a1002K473N963O485M871L453j549l043n058o541l966k861L55M084M472N833
5187C969K864K428q59k320m027n377k632k082j03L658L707K014M214j55J424l607
5203C116k842j683k555J47N40J723J111J976n31R05p84m64P5j781R96J560J236
5220B745p73j747q65j922j099m13Q72J977K785J448K577K96j426k160l710m010
5236e425k212l80L220K116N138M194J943J125k900l230p062l293l078j599M197
5251g246L112P328M844L552k48l587m322o022m977m510l34L866N073O212M908
$$ plain form
5266 7649 10855 9881 8529 3728 -3307 -6363 -10969 -9699 -6636 -3223 2786 6442 8553 8295 7691 3482
5282 3482 -1510 -6605 -7442 -6939 -5542 -1966 1045 4196 6225 5138 4405 773 -1689 -2416 -3756 -2483
5298 -2483 -2409 -467 334 5 1712 1869 148 -242 -273 -150 792 1453 1672 1292 -233 -991 -3389 -3857 -3080
5317 -3080 -1160 1159 2917 6194 7605 5109 1262 -2055 -5613 -7705 -7435 -7322 -2304 2730 4828
5332 4828 9972 9986 7736 3425 -2273 -5934 -11033 -9471 -8234 -3284 2803 7324 10629 10780 9109 3465
5348 3465 -1897 -7960 -10928 -12302 -8537 -3673 1572 7855 10618 11285 7785 4065 -1348 -6753 -9365
5363 -9365 -10960 -6894 -3377 395 6910 9129 9306 6796 1785 -780 -4445 -7478 -6930 -4933 -2242
5378 -2242 1910 3017 5052 4700 3344 1871 -1374 -1928 -2333 -2643 -2096 -679 -38 416 188 1179 331
$$ packed form
5266G649L206r74j352m801p035l056m606J270L063L413O009L656K111k58o04m209
5282C482m992n095q37N03J397L576L011L151K029j087p33l632k462p27j340J273
5298b483P4J942Q01l29J707J57j721l90l1J23R42O61K19l80j525p58k398m68P77
5317c080J920K319J758L277J411k496l847l317l558k092K70J13N018N034K098
5332D828N144J4k250m311n698l661n099J562J237M950O087M521L305J51j671n644
5348C465n362o063k968j374L765M864N245O283K763O67l500l720n413n405k612
5363i365j595M066L517L772O515K219J77k510n011k565l665l033N48J997K691
5378b242M152J107K035l52j356j473l245n54m05l10N47J417O41M54k28R91q48
$$ plain form
5395 331 -1593 626 899 893 1305 1484 572 613 -2537 -3155 -4956 -3604 -1229 -222 3792 5491 5560 5819
5413 5819 2077 -586 -5629 -7201 -7403 -7501 -3568 180 7164 9684 9731 8222 2788 -1990 -6856 -10075
5429 -10075 -11418 -8660 -4337 1437 6839 9335 12314 9009 4100 -442 -7245 -10314 -12320 -9035 -4389
5444 -4389 1042 6171 10931 10966 8362 4090 -1046 -6554 -8763 -10804 -7351 -4127 -51 5305 8085
5459 8085 8835 6634 2115 -1110 -3536 -6886 -6821 -6112 -2659 735 3107 4074 5026 4011 1961 -280
5475 -280 -1088 -2483 -2639 -2084 -1744 82 113 1533 -141 52 977 -940 1983 1364 1038 1884 1642 21
5493 21 -2548 -2274 -4734 -3184 -2179 -42 3174 5423 6715 5382 3087 -1129 -5118 -6388 -7585 -6840
5509 -6840 -4502 514 4590 8377 10339 8173 4311 -1651 -6376 -9970 -10931 -9274 -4910 522 5455
$$ packed form
5395C31j924K219K73oM12J79r12M1l150o18j801J352K375J007M014J699O9K59
5413E819l742k663n043j572k02r8L933L748O984K520M7j509n434m778m866l219
5429a0075j343K758M323N774N402K496K979l305m909m542o803l069k006L285M646
5444d389N431N129M760L5k604m272n136n508k209k041L453L224M076N356K780
5459H085P50k201m519l225k426l350O5P09L453L394K372R67R52j015k050k241
5475b80q08j395j56N55L40J826L1J420j674J93R25j917K923o19l26Q46k42j621
5493B1k569K74k460J550J005K137L216K249J292j333k295m216l989j270j197P45
5509f840K338N016M076L787J962k166l862n962m725l594r61J657M364N432M933
$$ plain form
5524 5455 9688 12879 9235 5254 -739 -4782 -10486 -11347 -9338 -6006 -106 3696 9717 11122 9156
5539 9156 5360 -764 -5774 -8490 -10590 -8740 -5713 364 4501 8580 7957 6765 2987 -48 -3434
5554 -3434 -7121 -6113 -4837 -3025 342 3141 4409 3275 2702 2669 1199 -1367 -902 -1772 -1894 -799
5570 -799 -22 825 469 -261 779 -780 281 1615 1958 2728 1128 1021 -48 -1621 -3632 -5848 -4387
5587 -4387 -3370 881 2779 6052 7098 6541 3544 -1327 -3812 -7043 -8810 -7154 -4311 716 4036
5602 4036 8911 9846 8731 5281 308 -5633 -8793 -10538 -9738 -5129 -507 4988 10311 11127 10403 5744
5618 5744 899 -5449 -10170 -10555 -10632 -6122 -857 5862 8574 10336 9898 6944 1506 -4746 -7842 -9158
5634 -9158 -7944 -6532 -1289 3640 6529 7077 7652 4238 191 -2768 -5775 -6800 -5579 -2877 -44
$$ packed form
5524E455M233L191l644l981n993m043n704q61K009L332N900L802O021J405j966
5539I156l796o124n010k716k100J850L027O077M137M079o23j192l778l035l386
5554c434l687J008J276J812L367K799J268j134n73l3j470k566M65q70j22J095
5570g99P77Q47l56p30J040j559J061J334L43P70j600j07j069j573k011k216J461
5587d387J017M251J898L273J046n57k997m871k485l231j767J656K843N027L320
5602D036M875R35j115l450m973n941l160j745Q00M609M622N495N323Q16p24m659
5618E744m845o348m721l85p7M510N265O719K712J762m38k954n438o252l096j316
5634i158J214J412N243M929K889N48N75l414m047k959l007j025J221K702K833
$$ plain form
5649 -44 1754 4572 5141 3203 1268 267 -1747 -2968 -2457 -2051 -338 -257 498 -518 -357 -986 139
5666 139 669 354 1990 1634 2279 1495 -706 -1533 -3710 -5178 -4371 -2513 -831 1787 7059 5725 7770
5683 7770 4944 1458 -2643 -6624 -7317 -8513 -3473 -1883 3474 8031 8105 9149 5796 599 -4516 -8202
5699 -8202 -10689 -10044 -7097 -2233 4523 8135 10602 11367 6396 2047 -4617 -8452 -10638 -10938 -6660 -1841
5715 -1841 4498 9067 9677 8613 4924 1248 -3979 -7961 -8942 -8366 -4183 -84 3469 6513 8255 6639
5731 6639 5323 66 -2900 -5079 -6666 -6101 -3200 -1798 2256 3370 4319 3804 3307 924 -1500 -1768
5747 -1768 -3184 -1807 -1394 275 210 -195 -437 175 1185 -397 970 1085 2140 2584 1544 1261 -1962
5764 -1962 -3202 -4443 -3193 -3301 -1282 3115 5050 6670 6594 4131 593 -3218 -6370 -8738 -7627 -5279
$$ packed form
5649d4J798K818N69j938j935j001k014j221N11M06J713Q1P55j016J61o29J125
5666A39N30l15J636l56O45p84k201q27k177j468Q07J858J682K618N272j334K045
5683G770k826l486m101l981o93j196N040J590N357M557P4J044l353n197n115l686
5699h202k487O45K947M864O756L612K467P65m971m349o664l835k186l00M278M819
5715a841O339M569O10j064l689l676n227l982r81N76M183M099L553L044J742j616
5731F639j316n257k966k179j587N65K901J402M054J114R49n15m97k383k424k68
5747a768j416J377M13J669o5m05k42O12J010j582J367J15J055M44j040k83l223
5764a962j240j241J250j08K019M397J935J620p6k463l538l811l152k368J111K348
$$ plain form
5780 -5279 -2001 3545 6641 8638 8290 4687 1730 -3961 -8083 -9729 -8673 -7842 -2069 3506 7953
5795 7953 10673 10188 7769 1898 -2999 -7886 -9966 -10191 -6988 -1274 2779 7762 9602 9458 6742 2207
5811 2207 -1703 -7085 -9791 -8975 -5526 -1321 2698 6210 7614 6733 3798 808 -1289 -4420 -5304 -6085
5827 -6085 -4473 -549 1747 3004 3922 3576 2552 1257 -486 -2023 -2254 -2209 -1853 -615 -680 856 -681
5844 -681 -1069 393 549 363 1023 2611 2591 2426 1954 -1885 -3205 -5305 -4566 -4544 -556 1767 3120 6396
5862 6396 6723 5158 621 -1241 -6134 -8244 -7702 -6298 -1646 1660 7629 8679 10351 7563 2340
5877 2340 -1897 -6992 -9555 -10769 -8012 -2409 2403 7794 9982 10174 6223 2728 -1890 -7407 -8778
5892 -8778 -10231 -6741 -2535 2671 7406 7981 9634 6479 3190 -2174 -5424 -8851 -7280 -5063 -2311
$$ packed form
5780e279L278N546L096J997l48l603k957n691m122j646J056Q31N773N575M447
5795G953K720m85k419n871m897m887k080k25L203N714M053M983J840j44k716m535
5811B207l910n382k706Q16L449M205M019L512J404q81k935k990k097l131q84p81
5827f085J612L924K296J257R18l46j024j295j743j537k31M5L56J238o5J536j537
5844f81l88J462J56j86O60J588k0j65m72l839j320k100P39K2L988K323J353L276
5862F396L27j565m537j862m893k110N42J404M652L306N969J050J672k788n223
5877B340m237n095k563j214K757N603M812N391K188J92l951l495m618n517j371
5892h778j453L490M206N206M735N75J653l155l289n364l250l427J571K217K752
$$ plain form
5907 -2311 2609 5073 6961 6463 4344 1944 -1485 -4264 -4133 -5670 -3271 -1859 1310 3885 3792 2244
5923 2244 1989 973 281 -1540 -1023 -2000 -299 -427 856 -203 -1686 -788 -1176 -502 936 1397 2326
5940 2326 1997 2344 533 -1054 -2801 -4182 -4648 -4135 -1329 540 4697 5537 7305 5636 2289 -1861
5956 -1861 -5317 -6386 -8487 -6266 -3311 2377 6139 8581 10203 7593 3798 -1820 -6433 -9873 -11020
5971 -11020 -7000 -2988 2692 6120 9760 10365 7396 3768 -1594 -6696 -10034 -10110 -7708 -3566 2238
5986 2238 5469 10695 9700 7514 3913 -1905 -5051 -7313 -8057 -6061 -2924 1542 4289 6374 6250 5524
6002 5524 2680 -883 -3615 -6368 -5094 -3610 -1189 2024 2883 3712 2553 3023 1874 579 -1238 -1077
6018 -1077 -729 -919 -109 265 -645 -444 -1055 -812 -596 -298 1913 2233 3116 1380 950 -1239 -2750 -4593
$$ packed form
5907b311M920K464J888m98k119k400l429k779J31j537K399J412L169K575r3j548
5923B244k55j016o92j821N17r77J701j28J283j059j483Q98l88O74J438M61R29
5940B326l29L47j811j587j747j381m66N13K806J869M157Q40J768j669l347m150
5956a861l456j069k101K221K955N688L762K442J622k610l795n618m613l440j147
5971a1020M020M012N680L428L640O05k969l628n362n102l338p6K402M142N804
5986B238L231N226r95k186l601n818l146k262p44J996L137M466K747K085j24p26
6002E524k844l563k732k753J274J484K421L213Q59Q29j159M70j149j295j817J61
6018a077L48j90Q10L74r10K01o11K43K16K98K211L20Q83j736m30k189j511j843
$$ plain form
6036 -4593 -5039 -3093 -2969 869 3567 6271 6765 5354 2955 -966 -4247 -7315 -7720 -6418 -3988 2032
6052 2032 5284 8835 9117 7537 3976 -1135 -5494 -9611 -9866 -9363 -3681 1544 5937 9594 9644 8620
6068 8620 3883 -816 -5647 -9349 -9544 -8086 -3621 1185 6319 7931 9064 8119 4361 -603 -5186
6083 -5186 -7809 -9470 -5777 -3274 126 4611 5447 6381 5793 2765 -383 -2843 -4637 -4959 -4219 -1521
6099 -1521 8 1644 2041 3481 1497 1271 51 -1627 -201 -1265 -753 -793 -738 649 -505 -305 -1683
6116 -1683 10 929 1553 3051 3169 3167 1713 -921 -1940 -5344 -4769 -5331 -1705 32 3598 5527 7156
6133 7156 5464 1631 -490 -4061 -6819 -7508 -7857 -4798 15 5350 8008 8799 8787 4401 -562 -5099
6149 -5099 -8857 -9740 -8372 -4341 -256 5534 8967 10285 8777 5048 -1051 -5773 -7487 -10257 -7109
$$ packed form
6036d593m46J946J24L838K698K704M94j411k399l921l281l068m05J302K430O020
6052B032L252L551K82j580l561n111m359m117k55N03N682N225M393L657N0j024
6068H620m737m699m831l702j95J458M465M806N134J612J133r45l758m964m583
6083e186k623j661L693K503L400M485Q36R34n88l028l148k460j794l22P40K698
6099a521J529J636L97J440j984k26j220j678J426j064N12m0N5J387j154K00j378
6116a683J693R19O24J498J18kj454k634j019l404N75n62L626J737L566J929J629
6133G156j692l833k121l571k758o89l49L059M813N335K658P91j2m386m963m537
6149e099l758q83J368M031M085N790L433J318j508l729o099m722j714k770L148
$$ plain form
6164 -7109 -4459 121 4523 8340 9278 7691 4892 57 -4756 -7205 -8143 -6974 -3349 859 3091
6179 3091 6589 8369 4781 4004 898 -2100 -3531 -5267 -3951 -2692 353 2189 1374 2469 2455 638
6195 638 586 -919 -402 -1006 -36 23 -69 -1584 -1146 -1521 -1643 -1118 -570 1283 2962 2844 2622 574 90
6214 90 -2467 -4918 -5944 -5217 -1949 104 3778 4545 7501 5674 4670 431 -4292 -5956 -7874 -7335
6230 -7335 -3715 -1321 3954 6767 9702 6825 4521 1071 -4705 -7650 -10750 -8354 -6004 -574 5400
6245 5400 7476 8511 8685 6454 438 -2942 -8617 -9529 -8068 -6135 -1392 4200 8865 8579 7487 5295
6261 5295 670 -3463 -6784 -7461 -6145 -4509 -572 3505 5698 5645 5608 3253 454 -2535 -3677 -5101
6277 -5101 -3870 -1889 -635 2063 2576 2500 1885 867 496 -578 -850 -252 -353 52 799 -224 -94 -1710
$$ packed form
6164g109K650M580M402L817R38j587k799m835m813k449r38J169L625M208K232
6179C091L498J780l588p77l106k998j431j736J316J259L045J836q15J095j4j817
6195F38n2j505N17o04R70N9r2j515M38l75j22N25N48J853J679j18k22k048m84
6214I0k557k451j026P27L268K053L674P67K956j827j004m239m723j664j918N39
6230g335L620K394N275K813K935k877k304l450n776k945l100K396K350N430N974
6245E400K076J035J74k231o016l380n675r12J461J933M743N592M665k86j092k192
6261E295m625m133l321o77J316J636L937M077K193n3l7k355k799k989j142j424
6277e101J231J981J254K698N13p6o15j018l71j074k72N98j01M05P47j023J30j616
$$ plain form
6295 -1710 -1579 -1217 -182 1210 2736 3811 2194 3151 403 -1662 -3822 -4622 -3968 -3114 -141 3077
6311 3077 4625 7679 5749 5036 -325 -3486 -5865 -7733 -6695 -4585 -359 3601 7348 8292 8629 6016
6327 6016 1662 -2812 -7627 -8609 -7937 -5594 -1625 3204 6575 7901 9503 5675 1437 -3890 -7838
6342 -7838 -8388 -9242 -5984 -1366 3762 7050 8025 7237 4297 692 -1781 -6587 -6493 -6328 -3548 -1076 2485
6359 2485 5053 6427 4973 3179 712 -1887 -3270 -3105 -2575 -2084 -399 285 1621 1584 2562 675 30
6376 30 -253 -342 -465 -441 579 808 -109 -1216 -1599 -2322 -1657 79 524 2155 3533 3776 2333 -1105 -1991
6395 -1991 -4519 -4940 -5154 -3851 19 1563 5456 6069 6753 3910 445 -3341 -7034 -7666 -7569 -4559 -2684
6412 -2684 3828 6009 7693 8674 4869 2596 -3535 -7445 -9363 -9461 -5266 -2382 3092 7210 9329 8664
$$ packed form
6295a710J31L62J035J392J526J075j617R57k748k065k160q00O54Q54K973L218
6311C077J548L054j930p13n361l161k379j868J038K110M226L960L747R44L37k613
6327F016m354m474m815r82O72K343L969M829L371J326J602l828m238n327l948
6342g838n50q54L258M618N128L288R75p88k940l605k473m806R4J65K780K472L561
6359B485K568J374j454j794k467k599j383J65N30M91J685O84J336l7R78j887o45
6376C0k83q9j23K4J020K29r17j107l83p23O65J736M45J631J378K43j443l438q86
6395a991k528m21k14J303L870J544L893O13O84k843l465l786l693o32R7L010J875
6412b684O512K181J684R81l805k273o131l910j918r8M195K884N474M118K119o65
$$ plain form
6428 8664 5465 2743 -2055 -6516 -8017 -7987 -4950 -1720 2035 5732 7503 7327 5233 2247 -2340 -5090
6444 -5090 -7186 -6361 -5197 -961 1783 3546 5994 5776 3830 796 -1273 -3321 -3811 -3210 -1937 -1148
6460 -1148 462 623 2251 1234 1527 635 -641 -393 -187 -275 -1166 198 -353 -1265 -1196 -1653 -520 -828
6478 -828 1658 3323 2979 4008 2869 1481 -1387 -3303 -4402 -5666 -3143 -585 1696 3960 5561
6493 5561 5031 3462 2040 -3098 -5145 -7185 -7559 -5297 -2730 2465 4755 8560 8290 6365 2258 -2809
6509 -2809 -6020 -7650 -8476 -5374 -2479 3110 6467 8578 8059 7235 1940 -1601 -6133 -8112 -8365 -6536
6525 -6536 -1610 2283 6396 7856 7388 6081 2481 -1201 -5119 -6853 -6416 -5191 -2210 727 3736
6540 3736 5792 4979 3675 1347 -906 -1634 -2899 -2826 -1634 -1147 256 1415 2038 1989 1172 179 509 -439
$$ packed form
6428H664l199k722m798m461j501L0L037L230L755L697J771j76k094k986m587k750
6444e090k096Q25J164M236K744J763K448k18j946l034k069k048m90O01J273P89
6460a148J610J61J628j017K93q92j276K48K06q8q91J364n51r12O9m57J133l08
6478h28K486J665l44J029j139j388k868j916j099j264K523K558K281K264J601
6493E561n30j569j422n138k047k040l74K262K567N195K290L805k70j925m107n067
6509b809l211j630q26L102K895N589L357K111n19q24n295l541m532j979k53J829
6525f536M926L893M113J460m68j307l600l682l918j734M37J225K981K937L009
6540C736K056q13j304k328k253p28j265P3J192M87J403J159O23m9q17r93L30r48
$$ plain form
6558 -439 862 -152 554 302 -943 -1267 -1108 -1522 -2131 -639 861 2047 3609 3990 2826 301 -626
6575 -626 -2781 -4914 -5040 -4637 -2090 2224 4420 6165 6385 5089 2494 -2174 -5641 -7391 -8392 -7210
6591 -7210 -2361 834 5657 7031 8567 5930 1575 -1542 -5582 -8348 -9159 -6561 -2948 1517 5745
6606 5745 8098 8728 6462 2386 -1171 -5336 -7296 -8411 -6501 -2859 770 4141 7446 8221 4899
6621 4899 2863 -1071 -3769 -6311 -6770 -4471 -2667 840 3200 4572 4933 4822 1360 -964 -2098 -3508
6637 -3508 -4535 -2488 -618 395 754 1362 1431 563 825 -247 -653 -91 -227 1254 420 -107 -592 -1630
6655 -1630 -2123 -1665 -1350 202 2985 3660 4232 3752 650 -428 -3533 -4322 -3853 -5105 -1767 -632 4730
6672 4730 5953 7368 5295 2736 -604 -4074 -6910 -7710 -6888 -2845 2482 5530 7380 8199 6212 3673
$$ packed form
6558d39J301j014P06k52j245l24J59m14o09J492J500J186J562L81j164k525r27
6575f26k155k133j26M03K547M314K196J745K20j296k595m668l467j750j001J182
6591g210M849L195M823J374J536k637m355l117m040k766q11K598L613M465M228
6606E745K353O30k266m076l557m165j960j115J910L642L629L371L305P75l322
6621D899k036l934k698k542m59K299J804L507K360J372L61j11l462k324j134j410
6637c508j027K047J870J013L59O08O9q68K62j072m06N62j36J481q34n27m85j038
6655a630m93M58L15J552K783O75N72m80l102j078l105p89M69j252L338J135N362
6672D730J223J415k073k559l340l470k836q00Q22M043N327L048J850Q19j987k539
$$ plain form
6688 3673 -493 -5100 -8047 -9706 -6341 -4132 446 5269 8924 8231 6581 4407 -779 -4708 -7314
6703 -7314 -8436 -6796 -4454 958 3035 6759 7436 6162 3829 -1073 -4574 -6150 -6744 -5570 -2714
6718 -2714 946 2892 4774 4616 2796 2482 319 -1653 -2715 -3611 -2599 -614 242 965 1792 73
6734 73 1644 743 -93 80 -191 820 467 130 838 -117 -1928 -1992 -2487 -975 517 2250 3687 3514
6752 3514 3153 2127 -389 -2915 -5052 -5831 -4688 -2478 -165 4119 4486 6920 5878 3078 -166 -4853
6768 -4853 -7199 -7927 -6113 -3229 1061 5371 8105 7328 7106 3789 -395 -3485 -7172 -8496 -8154 -4994
6784 -4994 -245 4404 7245 8452 7145 5017 -494 -3620 -7553 -8029 -6917 -3627 427 4538 6004
6799 6004 6628 5578 3809 857 -3706 -5294 -5500 -4869 -2877 431 2445 3506 5115 3444 1464 -925
$$ packed form
6688C673m166m607k947j659L365K209M578M823L655o93j650k174n186l929k606
6703g314j122J640K342N412K077L724O77j274k333m902l501j576n94J174K856
6718b714L660J946J882j58j820l14k163j972j062q96J012J985Q56P23Q27j719
6734G3J571r01q36J73k71J011l53l37P08r55j811o4m95J512J492J733J437j73
6752C514l61j026k516k526k137p79J143K210K313M284L67K434j042k800l244m687
6768d853k346p28J814K884M290M310K734p77k22l317m184l090l687j324L42L160
6784d994M749M649K841J207j307k128n511l126l933m76J112L290M054M111J466
6799F004O24j050j769k952m563j588k06O31J992L308K014J061J609j671j980k389
$$ plain form
6815 -925 -1270 -2214 -2287 -2512 -1078 -454 -56 1162 763 721 88 70 104 -234 -124 99 1453 -551 316 -1849
6835 -1849 -3146 -1505 -1731 -118 1451 2598 3351 3698 2209 -63 -2106 -5214 -5456 -5271 -4029 -81
6851 -81 2253 6439 6634 6340 4028 -876 -2035 -6826 -7209 -7082 -4058 199 4210 7233 7140 8406 3903
6868 3903 873 -3867 -7146 -7263 -7130 -4678 98 4358 6519 7714 7164 4101 173 -3610 -5800 -7552
6884 -7552 -7004 -3329 -647 3450 5671 6850 4965 3900 440 -2899 -4664 -6900 -4742 -2731 -639
6899 -639 2921 3325 4083 3680 2806 -403 -1552 -2331 -2355 -2179 -1307 -1594 1014 652 1115 795 580 411 -210
6918 -210 518 417 1224 872 323 -787 -808 -2437 -3273 -1031 103 2503 3610 3815 4518 2220 602 -2939
6936 -2939 -3695 -5512 -5352 -2906 -744 1653 5216 6336 6135 3273 831 -2761 -6555 -7549 -7366 -4765
$$ packed form
6815i25l45r44p3k25J434O24L98J218l99m2o33j8L4l38J10K23J354k004Q67k165
6835a849j297J641k26J613J569J147P53L47j489k272k043l108k42J85J242L948
6851h1K334M186J95k94k312m904j159m791l83J27L024M257M011L023r3J266m503
6868C903l030m740l279j17J33K452M776M260K161J195n50l063l928l783k190j752
6884g552N48L675K682M097K221J179j885j065l460l339j765k236K158K011K092
6899f39L560M04P58m03q74l209j149p79k4J76Q72k87K608l62M63l20k15j69o21
6918b10P28j01Q07l52n49j110k1j629q36K242J134K400J107K05P03k298j618l541
6936b939p56j817J60K446K162K397L563J120k01k862k442l592l794r94J83K601
$$ plain form
6952 -4765 -623 3325 5687 7981 6421 4343 1160 -4700 -6797 -8092 -7491 -4505 -970 3326 5917
6967 5917 7889 6986 5083 582 -2669 -5803 -8273 -6734 -4707 -1316 2733 4698 6699 5612 4393
6982 4393 1790 -2634 -4927 -5478 -5079 -4228 -997 1088 3326 4129 3574 2380 -722 -1200 -2337 -2859 -2154
6999 -2154 -1239 -185 574 930 1514 469 720 -938 -149 -587 301 612 572 -101 -2042 -1585 -2180 -2147 -2329
7018 -2329 -872 2223 2636 4147 3298 2335 1493 -1773 -3415 -4329 -4800 -3933 -1416 1234 3714 6543 6051
7035 6051 3772 1318 -2318 -4650 -7085 -6430 -4894 -1016 1462 7092 7677 6587 5261 857 -1932
7050 -1932 -5700 -6693 -8076 -5524 -1658 1742 7037 6874 6080 5915 651 -2406 -5756 -6221 -6475 -4386
7066 -4386 -571 1357 4777 6855 6418 3616 1493 -959 -4520 -5162 -5008 -3217 -2146 455 3003 2912
$$ packed form
6952d765M142L948K362K294j560k078l183n860k097j295O01K986L535M296K591
6967E917J972r03j903m501l251l134k470J539K027L391M049J965K001j087j219
6982D393k603m424k293n51L99Q51L231K085K238Q03n55j194l102m78j137n22P05
6999b154R15J054P59L56N84j045K51j658P89m38Q88L11m0o73j941M57n95L3j82
7018b329J457L095M13J511q49r63q42l266j642r14m71Q67K517K650K480K829m92
7035F051k279k454l636k332k435O55J536L878K478N630N85j090j326m404k789
7050a932l768r93j383K552L866L400N295j63p94j65n264l057l350m65k54K089
7066d386L815J928L420K078m37k802k123k452l561o42J54J791J071K601K548r1
$$ plain form
7082 2912 2341 2547 499 -968 -1861 -2892 -2298 -898 -510 -177 1307 160 113 94 20 924 1826 1783 1200
7101 1200 263 835 -519 -1863 -1731 -1703 -1449 81 -155 2981 3521 3778 2907 534 -1399 -3679 -4064 -4897
7119 -4897 -5044 -1966 1205 4616 5503 6510 4492 2122 -1468 -5232 -6810 -7742 -5706 -1077 1766 5455
7135 5455 6675 7831 4562 1438 -2350 -5791 -7397 -7917 -5291 -1547 1419 4856 7571 8031 4439
7150 4439 2603 -2164 -4887 -5553 -7527 -5337 -1930 1788 4128 6738 7327 5131 761 -743 -3287
7165 -3287 -4923 -4578 -3229 -1513 1306 3241 4041 2464 2109 55 -1634 -2864 -1843 -2785 -1675 -602
7181 -602 812 1444 -126 690 -368 292 -771 777 354 1219 520 -262 450 -1533 -2624 -3041 -994
7198 -994 -806 173 2339 4084 4509 3789 1503 -722 -3069 -5417 -5365 -3286 -2296 1989 3358 6469 6443
$$ packed form
7082B912n71K06k048j467q93j031N94J400L88L33J484j147m7j9p4R04R02m3n83
7101A200r37N72j354j344J32K8K54J530k36L136N40K57q71k373j933k280l85q33
7119d897j47L078L171L411Q87J007k018k370l590l764j578r32K036M629K843L689
7135E455J220J156l269l124l788l441j606n20K626L744K966L437K715M60l592
7150D439j836m767k723o66j974K190L407L718K340K610N89k196m370j504k544
7165c287j636L45J349J716K819J935Q00j577l55k054j689j230J021r42J110J073
7181f02J414O32j570Q16j058O60j063J548m23Q65o99p82P12j983j091m17K047
7198i94J88R79K166J745M25p20k286k225k347k348N2K079R90M285J369L111k6
$$ plain form
7215 6443 4290 2818 103 -3278 -7541 -6518 -5400 -3736 1412 4406 5763 6710 5894 3787 -1927
7230 -1927 -4445 -6253 -6857 -6006 -2786 1464 3818 7308 6361 5714 1976 -895 -3925 -5851 -6303 -5244
7246 -5244 -2543 302 2878 6643 7565 3618 1510 -616 -3465 -5694 -4043 -2673 -1202 569 2364
7261 2364 2233 3646 2010 544 -598 -2301 -1032 -1517 -1864 289 176 1493 395 556 763 -459
7277 -459 -77 755 1535 1539 958 1037 -287 -154 -2107 -3497 -2424 -689 503 3073 3548 4378 3644 1843
7295 1843 -1309 -2189 -5441 -5068 -3733 -1095 1345 2989 5629 5525 5450 2582 -817 -3142 -5748 -7279
7311 -7279 -7171 -3094 511 4214 7309 6731 5906 2630 274 -4158 -6572 -7060 -6852 -2860 -403 4124
7327 4124 5181 6350 7206 2589 -926 -4318 -5447 -6040 -5184 -2825 -893 4710 4563 5492 3463 1892
$$ packed form
7215F443k153j472k715l381m263J023J118J664N148K994J357R47q16k107n714
7230a927k518j808o04Q51L220M250K354L490r47o47l738k871l030j926m52J059
7246e244K701K845K576L765R22l947k108k126k849k229J651J370J471J771J795
7261B364j31J413j636j466j142j703J269m85l47K153j13J317j098J61K07j222
7277d59L82Q32P80Mn81P9j324J33j953j390J073J735J192K570M75Q30p34j801
7295A843l152q80l252L73J335K638K440J644K640j04p5k868l399k325k606j531
7311g279J08M077L605L703L095n78q25l276k356m432k414m88K08L992K457M527
7327D124J057J169Q56m617l515l392j129n93Q56K359J932N603j47R29k029j571
$$ plain form
7343 1892 77 -2476 -3644 -4018 -3836 -2130 92 2224 2716 3686 2611 993 603 -1450 -1863 -2013 -1603
7360 -1603 -1179 -925 592 -484 942 -188 -96 392 345 747 1533 1184 1218 -489 -1077 -2379 -3257 -2916 -1909
7379 -1909 63 1767 2625 3921 4250 2188 421 -2602 -5120 -5541 -5017 -1847 -489 3375 4776 6726
7395 6726 5809 2980 -84 -4179 -5570 -6331 -6634 -3687 -621 4387 6716 6246 6673 3311 -841 -2446
7411 -2446 -4766 -7653 -6152 -4062 37 4024 6332 7693 5358 4256 -384 -4160 -4926 -7178 -5483
7426 -5483 -3531 520 3736 4546 5445 5389 3415 175 -2046 -3559 -3881 -3739 -1709 -14 2047 3104
7442 3104 1918 2141 205 -300 -1503 -1809 -1441 -1151 -317 255 790 817 220 -765 -251 -682 93 853 1058
7461 1058 1773 824 -589 -1240 -1953 -2845 -2784 -2026 -1061 1997 2506 4924 3120 2402 15 -2833 -3477 -6126
$$ packed form
7343A892j815k553j168l74J82J706K222K132M92R70j075j618l90k053m13j50M10
7360a603M24K54J517j076J426j130R2M88m7M02P86l49L4j707n88j302q78L41J007
7379a909J972J704Q58J296L29k062j767l023k518m21N24L170J358L864J401J950
7395F726r17k829l064m095j391p61l03K947L066N008K329m70M27l362m152j605
7411b446k320k887J501K090M099L987K308J361k335j102m640l776p66k252J695
7426e483J952M051L216Q10Q99n6j974l240k221j513l22J42K030J695K061J057
7442C104j186K23j936n05j203l06L68K90Q34N72N35K7n97r85N14m31P75P60K05
7461A058P15r49j413o51p13q92O1P58R65L058N09K418j804p18k387k848o44k649
$$ plain form
7479 -6126 -4559 -4810 -168 2050 4325 6848 6160 3455 -130 -3461 -4856 -6855 -5263 -4441 -258 3116
7495 3116 5944 7128 5818 4385 -481 -2576 -5469 -6436 -5961 -3727 -220 1804 5641 7032 6609 4228
7511 4228 1187 -1647 -4699 -6221 -4732 -3169 -201 2488 4586 3763 4854 2625 1489 -1722 -3519
7526 -3519 -3990 -4060 -2266 -323 587 2548 2419 2407 1718 -76 -1410 -1343 -1718 -1846 309 -669 -509 320 -303
7545 -303 386 -1112 -138 200 679 1232 936 1894 516 218 -1611 -3394 -2746 -1244 485 896 3341 3206
7563 3206 3529 3509 365 -1529 -3801 -5310 -4998 -3968 -722 1857 5311 5282 5334 3459 212 -2182 -5270
7580 -5270 -5860 -6057 -3999 -889 1553 5272 6027 5476 4171 1265 -1763 -6073 -6149 -6940 -2869 -230 2536
7597 2536 5926 6413 5648 3420 671 -2009 -4659 -5263 -4606 -3694 -924 2571 3488 4929 4359 2218 184
$$ packed form
7479f126J567k51M642K218K275K523o88k705l585l331j395j999J592Q22M183L374
7495C116K828J184j310j433m866k095k893r67M75K234L507K024L837J391m23k381
7511D228l041k834l052j522J489J563K968K689K098q23J091k229j136l211j797
7526c519m71p0J794J943R10J961j29j2o89j794j334O7l75j28K155r78J60Q29o23
7545c03O89j498R74L38M79N53k96R58j378k98j829j783O48J502J729M11K445j35
7563C206L23k0l144j894k272j509L12J030L246K579L454k9N2j875l247k394l088
7580e270n90j97K058L110K442L719P55n51j305k906l028m310p6p91M071K639K766
7597B536L390M87p65k228k749k680k650o04O57R12K770L495R17J441n70k141k034
$$ plain form
7614 184 -1733 -2921 -4499 -3133 -1581 -1535 1553 2767 3272 3133 1712 203 -299 -1314 -1579 -1376 4
7631 4 517 732 -649 -152 -568 -634 173 -391 1478 895 1239 905 355 -994 -2498 -2081 -2715 -2229 -1144
7650 -1144 268 2970 3787 3612 2186 1701 41 -2873 -4945 -5569 -3046 -1419 2555 4324 5663 6794
7666 6794 4242 1544 -1939 -3557 -6436 -6295 -3833 -1059 2470 5447 7612 6251 4410 358 -1916
7681 -1916 -4552 -5976 -6252 -3840 -1365 2000 3476 5417 5442 3020 1487 -2279 -3434 -5729 -5454 -3348
7697 -3348 -2238 2381 3181 4158 4815 3010 -552 -1387 -2481 -2849 -3635 -2046 -1044 787 1751 1991 1759
7714 1759 1384 109 -1109 -814 -353 -625 -797 116 -1102 389 -556 -1170 -624 -62 651 1925 1313 2344
7732 2344 2077 669 -729 -1039 -3822 -3382 -2227 -1106 1566 2719 4426 3907 4119 1674 -1492 -3132
$$ packed form
7614A84j917j188j578J366J552M6L088J214N05j39j421j509n02j015k65K03J380
7631DN13K15j381M97m16o6Q07n64J869n83L44l34n50j349j504M17o34M86J085
7650a144J412K702Q17j75j426m85j660k914k072o24K523J627L974J769J339J131
7666F794k552k698l483j618k879J41K462K774L529K977K165j361j841m052k274
7681a916k636j424k76K412K475L365J476J941K5k422j533l766j155k295K75K106
7697c348J110M619Q00R77O57j805l562q35j094l68p86J589J002J831R64K40k32
7714A759l75j275j218K95M61k72j72R13j218J491r45o14N46N62P13J274o12J031
7732B344k67j408j398l10k783M40J155J121K672J153J707n19K12k445l166j640
$$ plain form
7748 -3132 -4682 -4604 -4047 -1158 1761 3475 5819 5075 4456 1495 -860 -4807 -6124 -5613 -4838 -1795 860
7765 860 4431 5347 6496 6274 2046 -1147 -4689 -7120 -5335 -6096 -746 685 4453 5254 4993 4391 575
7782 575 -271 -2909 -4848 -5942 -4070 -1011 756 3029 3784 3182 2878 1324 -1049 -3438 -2811 -3039 -1944
7799 -1944 -592 224 2185 1011 2373 1658 754 820 -817 -533 -684 494 67 -138 1358 152 -625
7816 -625 -431 -1081 823 467 1444 1349 1997 155 -468 -576 -2586 -3115 -3122 -1608 -132 2218 3942 3118 2480
7835 2480 416 -195 -3371 -4034 -4778 -4077 -1204 461 3737 4934 5654 5275 1707 -1229 -4043 -5220
7851 -5220 -7113 -4883 -2400 494 4242 5914 6089 5521 1973 -970 -3778 -4837 -6105 -4749 -1654
7866 -1654 579 3630 5014 4974 4664 3184 -684 -3650 -4586 -6019 -4223 -2298 537 2736 2862 3832
$$ packed form
7748c132j550P8N57K889K919J714K344p44o19k961k355l947j317N11P75L043K655
7765H60L571R16J149k22m228l193l542k431J785p61N350J431L768Q01k61o02l816
7782E75q46k638j939j094J872L059J767K273P55o02l04j554k373k389O27k28J095
7799a944J352Q16J961j174J362p15r04O6j637K84j51J178m27k05J496j206p77
7816f25J94o50J904l56R77r5O48j842o23j08k010n29pJ514J476K350J724q24o38
7835B480k064o11l176o63p44P01K873J665L276J197P20l79l568k936k814j177
7851e220j893K230K483K894L748J672J75n68l548k943k808j059j268J356L095
7866a654K233L051J384m0l10j480l868k966r36j433J796J925K835K199J26R70
$$ plain form
7882 3832 2415 1368 -501 -1745 -1925 -2435 -1954 -786 -244 508 1233 1584 -39 1049 1318 -792 -69
7899 -69 -149 44 -1104 -762 -265 -889 -870 -24 -475 -14 864 1541 1840 193 395 156 -1822 -2300 -3224 -2124
7919 -2124 -1436 230 2053 3933 4362 3440 1210 473 -2615 -4262 -4761 -4733 -1809 838 3619 3980 5645
7936 5645 4499 3265 -144 -2637 -5414 -6779 -5553 -3831 131 4526 5257 6008 5517 2948 -1094 -3187
7952 -3187 -5113 -6686 -4901 -3269 204 2139 4650 5803 4803 2221 -458 -3204 -4797 -3205 -3640
7967 -3640 -1999 -83 1848 3671 3562 2902 1859 -164 -1490 -3283 -3716 -2935 -2154 821 1299 2423
7983 2423 2180 715 438 511 -413 -2183 -261 -583 -1277 -1039 -76 -962 -833 -653 -1457 51 9 1500 828
8002 828 1319 961 -538 -1475 -2517 -3728 -3187 -1679 383 1199 4059 4302 2445 2443 522 -3291 -5022
$$ packed form
7882C832j417j047j869j244j80n10M81J168N42P52P25L51j623J088K69k110P23
7899f9q0J93j148L42M97o24J9Q46m51M61Q78O77K99j647K02k39j978m78r24J100
7919b124O88J666J823J880M29r22k230p37l088j647m99K8K924K647K781L61J665
7936E645j146j234l409k493k777j365J226J722L962M395P31P51m91k569m042k093
7952c187j926j573J785J632L473J935K511J153j000k582k679k746j593J592m35
7967c640J641J916J931J823j09o60j043k023j326j793m33P81P81K975M78J124
7983B423k43j465k77P3r24j770J922l22o94K38R63q86J29J80q04J508m2J491o72
8002H28M91l58j499r37j042j211N41J508K062Q16K860K43j857kj921l813j731
$$ plain form
8019 -5022 -4198 -5065 -3056 371 1880 4230 4948 4034 3165 -1113 -3415 -5439 -7093 -5122 -3161 720
8035 720 2739 5621 5812 5393 2897 483 -2749 -4618 -6455 -4162 -2280 106 2455 4511 5368 4603
8051 4603 2330 570 -1797 -3640 -5002 -4158 -1963 269 1580 3547 3217 3800 1977 -773 -2294 -2224
8067 -2224 -1949 -2676 -921 169 329 942 1981 1419 801 -125 -1510 -519 -564 623 -748 -220 668 -379
8085 -379 -883 65 -746 -694 1297 1351 1406 1340 2261 -711 -501 -2997 -3519 -2854 -3044 -185 1845 3948 3149
8104 3149 4506 2165 707 -2120 -4242 -4805 -5323 -1590 -402 1858 4579 5134 5526 3092 -511 -2733
8120 -2733 -4257 -6092 -5818 -1708 -843 2818 5362 5548 4486 1860 1068 -3089 -4572 -5935 -4482 -3442
8136 -3442 -320 2967 3423 4883 4557 2654 1011 -2028 -4086 -4264 -3392 -3120 -338 2484 3110 3711 3463
$$ packed form
8019e022Q24q67K009L427J509K350P18r14q69m278k302k024j654J971J961L881
8035G20K019K882J91m19k496k414l232j869j837K293J882K386K349K056Q57p65
8051D603k273j760k367j843j362Q44K195K232J311J967l30N83j823k750j521P0
8067b224K75p27J755J090J60O13J039n62o18r26j385R91m5J187j371N28Q88j047
8085c79n04R48q11N2J991N4N5o6R21k972K10k496n22O65j90K859K030K103p99
8104C149J357k341j458k827k122n63n18L733J188K260K721N55L92k434l603k222
8120b733j524j835K74M110Q65L661K544J86j062k626p92m157j483j363J453J040
8136c442L122L287M56J460l26j903j643l039k058j78Q72K72K782K822O26O01k48
$$ plain form
8153 3463 1646 -242 -362 -2878 -3495 -2002 -770 -1021 1216 1195 2354 544 885 208 -781 -953 207
8170 207 128 420 315 -160 -544 -1997 -756 -1347 -1726 943 573 2208 1679 286 -468 -808 -1656 -3102
8188 -3102 -2874 -1869 -1462 1465 3025 3941 3598 2499 509 -1427 -3098 -3882 -4891 -3074 15 2625
8204 2625 4418 5644 5261 3616 701 -1526 -4488 -4734 -4281 -4187 -1736 2115 4966 5532 6066 3097 586
8221 586 -1425 -5326 -5878 -4354 -2978 -702 1406 4381 4482 4708 2775 299 -1638 -3894 -4668 -4198
8237 -4198 -2173 -737 833 3697 3206 3524 1666 834 -945 -2747 -1882 -1864 -1256 -316 1283 1902 1342
8254 1342 1035 281 268 279 -624 -288 -834 -438 -182 598 -616 -393 -1532 -786 -646 1210 1152 2482 1814
8273 1814 1608 820 147 -1467 -4314 -3485 -2622 -608 1080 3703 4562 4419 3159 525 -2366 -3953 -4759
$$ packed form
8153C463j817j888j20k516o17J493J232k51K237k1J159j810L41o77r89j72J160
8170B07p9K92j05m75l84j453J241n91l79K669l70J635n29j393p54l40q48j446
8188c102K28J005M07K927J560R16l43j099j990j936j671p84j009J817L089K610
8204B625J793J226l83j645k915k227k962k46M53R4K451L851K851N66N34k969k511
8221E86k011l901n52J524J376K276K108K975J01K26j933k476j937k256p74M70
8237d198K025J436J570K864m91L18j858q32j779j802Q65J8O08R40J599O19n60
8254A342l07p54j3J1r03L36n46L96K56P80j214K23j139P46J40J856n8J330o68
8273A814k06p88o73j614k847Q29Q63K014J688K623Q59j43j260k634k891j587q06
$$ plain form
8290 -4759 -4379 -3640 -186 846 4318 4775 4232 3088 957 -994 -4543 -5092 -6818 -3747 -1568 866
8306 866 3892 4670 5642 3461 616 -489 -4165 -5347 -5259 -3016 -1109 2084 3298 3507 5078 3220
8322 3220 1543 -1993 -3920 -3760 -3543 -2356 -1757 1559 3244 4275 2440 2268 -582 -2085 -3680 -1504
8338 -1504 -2585 -1470 -968 331 1659 1436 1233 156 572 -807 127 274 -1407 200 779 -163 -612
8355 -612 -945 -750 -963 -609 842 631 2349 2419 2125 1065 634 -2373 -2369 -3950 -3137 -1537 590 2420
8373 2420 3735 4136 3880 1348 -1466 -2914 -4207 -4961 -3811 -1573 898 3931 4786 5150 3397 2401
8389 2401 -2099 -3722 -5687 -4945 -3458 -1248 1860 3984 5401 6354 3322 1956 -522 -3393 -4882
8404 -4882 -5255 -3267 -2072 557 2598 5019 3827 3571 1405 -1413 -2497 -3696 -3814 -2410 -543 -301
$$ packed form
8290d759L80P39L454J032L472M57n43j144k131j951l549n49j726L071K179K434
8306H66L026P78R72k181k845j105l676j182Q8K243J907L193J214K09J571j858
8322C220j677l536j927J60K17J187N99L316J685J031j835j72k850j503j595K176
8338a504j081J115N02J299J328k23k03j077M16j379R34J47j681J607N79r42m49
8355f12l33J95k13L54J451k11J718P0k94j060m31l007Mj581Q13J600K127J830
8373B420J315M01k56k532k814j448j293p54J150K238K471L033Q55L64j753r96
8389B401m500j623j965P42J487K210L108K124J417R53l032j366k478k871j489
8404d882l73J988J195K629K041K421j192k56k166k818j084j199j18J404J867K42
$$ plain form
8420 -301 2281 4771 2736 2149 632 -651 -1102 -2018 -1883 -1263 79 -338 1047 1169 -82 1617 745
8437 745 -186 114 -699 977 190 118 -350 -275 -1019 -2041 -1231 -669 -766 2227 1279 2368 1569 1574 65 -2760
8457 -2760 -3246 -3228 -1863 -2398 -369 1600 3517 4699 3759 2058 -1475 -2737 -3556 -4864 -3628 -1705
8473 -1705 516 2458 4473 4465 3285 1928 -860 -2551 -6202 -5400 -5155 -1815 1014 2487 5420 4561
8489 4561 5174 1864 -545 -2534 -4856 -5022 -3935 -1149 622 3254 4349 4004 2676 1543 -824 -2690
8505 -2690 -3400 -3633 -2884 -834 -285 2190 3108 2496 2082 1775 478 -2124 -1296 -2313 -2621 -242 927
8522 927 1454 740 21 1123 1288 -472 -1405 -61 727 631 444 230 -588 -1404 -1035 -1300 -939 93 708
8541 708 2879 2698 2865 269 -657 -1120 -1731 -3233 -2507 -1533 -498 1839 3711 3607 4542 1516 -739
$$ packed form
8420c01K582K490k035n87j517j283m51r16J35O20J342m17J385J22j251J699q72
8437G45r31L00q13J676p87p2m68P5p44j022Q10N62r7K993r48J089p99Nj509k825
8457b760m86J8J365n35K029J969J917J182r40j701l533j262q19j308J236J923
8473a705K221J942K015qj180j357k788j691l651Q02K45L340K829J473K933q59
8489D561O13l310k409j989k322j66J087K786J771K632J095l45j328j133k367j866
8505b690p10k33P49K050N49K475R18o12m14l07j297k602Q28j017l08K379J169
8522I27N27p14p19J102J65j760r33J344P88r6j87k14q18q16L69k65L61J032O15
8541G08K171j81J67k596r26m63o11j502P26R74J035K337J872j04R35l026k255
$$ plain form
8558 -739 -2821 -4710 -3875 -3341 -2522 1229 3555 4410 4834 3749 2245 -1030 -1846 -5376 -4218 -5912 -1782
8575 -1782 117 2865 4538 5223 4645 2547 -526 -2453 -3956 -3804 -3905 -2028 495 2031 2964 4917
8591 4917 4265 1263 -435 -2228 -3033 -4136 -3428 -778 -330 2687 1933 3072 2913 941 81 -927 -2321
8608 -2321 -2271 -2219 -688 -218 342 1586 951 496 309 -470 238 743 1146 571 800 549 -967 -1407 -436
8627 -436 -1413 -155 -714 761 1108 2274 2788 1032 679 -1522 -2430 -3318 -2810 -1444 213 1598 2837
8644 2837 3659 3753 2231 -336 -3145 -2933 -5048 -2992 -2667 811 2147 3134 5941 4449 2539 303
8660 303 -3635 -5334 -6018 -4453 -2968 6 2403 4032 4697 3592 3727 -492 -1322 -2815 -4415 -3292
8676 -3292 -3217 584 1534 4141 4541 2635 1920 -642 -1287 -3109 -3907 -2132 -2376 -535 1497 1604 2209
$$ packed form
8558g39k082j889Q35N34Q19L751K326Q55M24j085j504l275q16l530J158j694M130
8575a782J899K748J673O85n78k098l073j927j503J52j01J877K523J536R33J953
8591D917o52l002j698j793q05j103P08K650M48L017p54J139j59j972q60j008j394
8608b321N0N2J531M70N60J244o35m55j87p79P08N05M03n75K29k51j516m40R71
8627d36r77J258n59J475L47J166N14j756l53k201r08q88N08J366J657J385J239
8644B837Q22R4j522k567k809K12k115K056L25L478J336R87K807j492j910k236
8660C03l938j699o84J565J485K974K397J629O65j105J35m219q30j493j600J123
8676c292P5L801R50K607M00j906p15k562o45j822p98J775k44J841K032J07O05
$$ plain form
8693 2209 2410 140 10 -439 -1835 -1839 -1624 -1639 -12 874 806 1238 -221 395 -622 552 391 655 -373
8712 -373 580 -135 -951 -704 -2324 -1391 -1322 -687 847 926 1577 2396 1158 292 -1999 -2456 -3520 -2716 -2632
8731 -2632 65 1574 2859 4174 3561 2581 -67 -876 -3206 -3787 -3298 -1969 490 1471 3942 4923 4308
8748 4308 3335 -417 -3285 -4451 -5249 -4224 -2518 -1269 1228 4461 4806 3802 2562 224 -2028 -3960
8764 -3960 -4136 -4630 -3127 -174 1750 3420 4013 3611 1528 355 -1170 -1984 -3292 -3513 -1377 -859 1809
8781 1809 2110 3399 2080 922 465 -1403 -1646 -1121 -803 747 -925 320 412 -22 34 -366 624 -291
8799 -291 646 1445 16 385 332 -226 -2025 -2530 -901 -1400 -434 846 1798 1440 1899 1347 -41 -423 -2812
8818 -2812 -2861 -2858 -3022 -1086 1453 3019 3125 2521 3135 1030 -931 -3441 -4702 -4739 -1993 -1249 1795 3994
$$ packed form
8693B209K01k270j30m49j396mK15j5J627Q86o8M32j459O16j017J174j61K64j028
8712c73R53p15q16K47j620R33O9O35J534P9O51Q19j238q66k291m57j064Q04Q4
8731b632K697J509J285J315o13r80k648q09k330n81M89J329K459R81K471R81o15
8748D308r73l752k868j166p98J025J706J249K497L233L45j004j240k338k252j932
8764c960j76m94J503K953J924J670N93m02k083j173j525q14j308k21K136N18K668
8781A809L01J289j319j158m57j868k43N25L18J550j672J245R2m34N6m00R90r15
8799b91R37P99j429L69n3n58j799n05J629m99R66J280R52l58M59n52j388l82k389
8818b812m9Lj64J936K539J566J06o04O14k105j961k510j261l7K746P44L044K199
$$ plain form
8836 3994 4099 4816 2865 352 -2387 -3788 -4700 -6030 -2264 -1212 1881 4059 3795 5272 2473 2195
8852 2195 -1919 -1653 -4157 -2998 -2718 -2023 2521 2431 3833 2763 2579 658 -579 -2625 -3972 -1892
8868 -1892 -1922 -255 937 1628 2374 1483 1487 840 -596 -1544 -1282 -1219 -698 152 496 451 735 177 164 -194 -394
8889 -394 760 854 -291 661 -424 -16 -1088 -1132 -1421 -1951 -360 -13 1172 749 2598 1250 1327 -1010
8907 -1010 -1912 -3153 -3866 -1596 -1353 605 2557 2547 5264 2403 1181 -726 -2641 -4524 -4107 -2338
8923 -2338 -1509 1433 2493 3408 4518 3082 1913 -899 -3520 -5548 -4190 -3817 -1379 778 2107 4482
8939 4482 4030 3360 1456 129 -2892 -3389 -3638 -3460 38 1034 2056 4276 2787 2521 1100 171 -1976
8956 -1976 -2631 -2588 -875 -1534 1001 2152 1588 2189 1230 896 -960 -1696 -1874 -1617 -1834 -136 -489 124
$$ packed form
8836C994J05P17j951k513k739j401r12j330L766J052L093K178k64J477k799k78
8852B195m114K66k504J159K80O95M544r0J402j070j84j921j237k046j347K080
8868a892l0J667J192O91P46q91Mo47j436r48K62O3N21Q50L44m5K84n58j3l58k00
8889c94J154R4j145R52j085M08j072m4k89n30J591L47J185m23J849j348P7k337
8907a010r02j241p13K270K43J958J952j0K717k861j222j907j915j883M17J769
8923b338Q29K942J060R15J110j436j169k812k621k028J358L73K438K157J329K375
8939D482m52o70j904j327l021m97k49J78L498R96J022K220j489k66j421r29k147
8956a976o55M3J713o59K535J151n64O01r59l34j856p36j78K57k17J698l53O13
$$ plain form
8974 124 1620 -383 1058 -1197 -79 -1067 -434 799 1979 1278 -2038 324 -1320 -2259 -1335 -1043 38
8991 38 1506 2253 1588 1582 1054 -526 -1248 -3744 -3540 -2787 -1682 879 2242 4072 4350 4211 903 238
9009 238 -2627 -4722 -3612 -4026 -2050 525 2756 4172 4054 3099 1279 -863 -2802 -3656 -3918 -3228 -682
9026 -682 255 3550 3655 3339 3752 1113 -1497 -2676 -3655 -4381 -3224 -1405 400 2008 2909 3845 2849
9043 2849 1078 -1292 -2600 -2700 -2698 -1889 162 1145 1754 1519 2993 1208 1079 -1291 -487 -174 -126 -491
$$ packed form
8974A24J496k003J441k255J118r88O33J233J180p01l316K362j644r39R24K92J081
8991C8J468P47o65on28j580p22k496K04P53J105K561J363J830K78j39l308o65
9009B38k865k095J110m14J976K575K231J416j18r55j820k142j939q54k62O90K546
9026f82R37L295J05l16M13k639k610j179r79p26J157J819J805J608R01R36r96
9043B849j771k370j308j00KQ09K051R83O09k35J474j785j29k370Q04L13M8l65
$$ [...]
##END NTUPLES=NMR FID
##END=
